##TITLE=1H_EC-3291-x
 DMSO
 8 sc, 
 13.3.2023
##JCAMPDX= 6.0         $$ Bruker NMR JCAMP-DX V2.0
##DATA TYPE= NMR SPECTRUM
##DATA CLASS= NTUPLES
##ORIGIN= UXNMR, Bruker Analytische Messtechnik GmbH
##OWNER= root
$$ XWIN-NMR		Version 3.5
$$ Mon Mar 13 14:21:26 2023 Russian Standard Time (UT+4h)  she@DPX200
##.OBSERVE FREQUENCY= 200.13135
##.OBSERVE NUCLEUS= ^1H
##.ACQUISITION MODE= SIMULTANEOUS
##.ACQUISITION SCHEME= undefined
##.AVERAGES= 8
##.DIGITISER RES= 18
##SPECTROMETER/DATA SYSTEM= spect
##.PULSE SEQUENCE= zg30
##.SOLVENT NAME= DMSO
##.SHIFT REFERENCE= (INTERNAL, DMSO, 0, 15.7403)
##AUDIT TRAIL= $$ (NUMBER, WHEN, WHO, WHERE, WHAT)
$$ ##TITLE= Audit trail, XWIN-NMR		Version 3.5
$$ ##JCAMPDX= 5.01
$$ ##ORIGIN= Bruker BioSpin GmbH
$$ ##OWNER= she
$$ F:/spectra/data/she/nmr/H-F/1/pdata/1/auditp.txt
$$ ##AUDIT TRAIL=  $$ (NUMBER, WHEN, WHO, WHERE, WHAT)
(   1,<2023-03-13 14:20:01.50 +0400>,<she>,<DPX200>,
      <created by zg, POWCHK disabled, PULCHK disabled
       configuration hash MD5:
       00 E9 B6 7A A2 85 ED C7 34 08 36 98 17 FE 4E 26
       data hash MD5: 16K
       8F A2 C1 04 D9 15 70 8E 33 67 C9 83 AC 55 D1 62>)
(   2,<2023-03-13 14:20:05.21 +0400>,<she>,<DPX200>,
      <Start of raw data processing
       efp BC_mod = 2 LB = 0.24 FT_mod = 6 PKNL = 1 PHC0 = -19104.69 PHC1 = 12.80074 SI = 16K 
       data hash MD5: 16K
       39 48 0D 2A AB 65 34 44 15 45 96 E8 AA 63 76 3F>)
(   3,<2023-03-13 14:20:21.96 +0400>,<she>,<DPX200>,
      <pk PHC0 = -2.00057 PHC1 = -2.6 
       data hash MD5: 16K
       58 A6 53 7D 90 AC 25 0E 11 F7 9D 48 06 1E 90 A7>)
(   4,<2023-03-13 14:20:25.28 +0400>,<she>,<DPX200>,
      <abs ABSG = 5 
       data hash MD5: 16K
       4A 95 A2 CD 32 09 D7 51 05 00 00 0D D5 41 D0 2F>)
$$ ##END=
$$ 
$$ hash MD5
$$ 15 47 0D CA 33 97 74 EB 31 A1 80 05 65 4E 1D 47
##$RELAX= 
##$RELAX= 
##$RELAX= 
##$RELAX= 
##$RELAX= 
##$RELAX= 
$$ Bruker specific parameters
$$ --------------------------
##$DU= <F:/spectra>
##$EXPNO= 1
##$NAME= <H-F>
##$PROCNO= 1
##$TYPE= <nmr>
##$USER= <she>
##$AMP= (0..31)
100 100 100 100 100 100 100 100 100 100 100 100 100 100 100 100 100 100 
100 100 100 100 100 100 100 100 100 100 100 100 100 100 
##$AQSEQ= 0
##$AQ_mod= 1
##$AUNM= <au_zg>
##$AUTOPOS= <>
##$BF1= 200.13
##$BF2= 200.13
##$BF3= 200.13
##$BF4= 200.13
##$BF5= 200.13
##$BF6= 200.13
##$BF7= 200.13
##$BF8= 200.13
##$BYTORDA= 1
##$CFDGTYP= 0
##$CFRGTYP= 5
##$CHEMSTR= <none>
##$CNST= (0..31)
1 1 145 1 1 1 1 1 1 1 1 1 1 1 1 1 1 1 1 1 1 1 1 1 1 1 1 1 1 1 1 1 
##$CPDPRG= <>
##$CPDPRG1= <>
##$CPDPRG2= <>
##$CPDPRG3= <>
##$CPDPRG4= <mlev>
##$CPDPRG5= <mlev>
##$CPDPRG6= <mlev>
##$CPDPRG7= <mlev>
##$CPDPRG8= <mlev>
##$CPDPRGB= <>
##$CPDPRGT= <>
##$D= (0..31)
0 1.2 0 0 0 0 0 0 0 0.06 0 0.03 0 0 0 0 0.0002 0 0 0 0 0 0 0 0 0 0 0 0 
0 0 0 
##$DATE= 1678702800
##$DBL= (0..7)
120 120 120 120 120 120 120 120 
##$DBP= (0..7)
150 150 150 150 150 150 150 150 
##$DBP07= 0
##$DBPNAM0= <>
##$DBPNAM1= <>
##$DBPNAM2= <>
##$DBPNAM3= <>
##$DBPNAM4= <>
##$DBPNAM5= <>
$$ [...]
##$SUBNAM3= <"">
##$SUBNAM4= <"">
##$SUBNAM5= <"">
##$SUBNAM6= <"">
##$SUBNAM7= <"">
##$SUBNAM8= <"">
##$SUBNAM9= <"">
##$SW= 18.05172834244
##$SWIBOX= (0..15)
0 0 2 0 0 0 0 0 0 0 0 0 0 0 0 0 
##$SW_h= 3612.71676300578
##$TD= 16384
##$TD0= 1
##$TE= 0
##$TE2= 300
##$TE3= 300
##$TEG= 300
##$TL= (0..7)
0 120 120 120 120 120 120 120 
##$TP= (0..7)
150 150 150 150 150 150 150 150 
##$TP07= 0
##$TPNAME0= <>
##$TPNAME1= <>
##$TPNAME2= <>
##$TPNAME3= <>
##$TPNAME4= <>
##$TPNAME5= <>
##$TPNAME6= <>
##$TPNAME7= <>
##$TPOAL= (0..7)
0.5 0.5 0.5 0.5 0.5 0.5 0.5 0.5 
##$TPOFFS= (0..7)
0 0 0 0 0 0 0 0 
##$TUNHIN= 0
##$TUNHOUT= 0
##$TUNXOUT= 0
##$USERA1= <user>
##$USERA2= <user>
##$USERA3= <user>
##$USERA4= <user>
##$USERA5= <user>
##$V9= 5
##$VALIST= <valist>
##$VCLIST= <CCCCCCCCCCCCCCC>
##$VD= 0
##$VDLIST= <DDDDDDDDDDDDDDD>
##$VPLIST= <PPPPPPPPPPPPPPP>
##$VTLIST= <TTTTTTTTTTTTTTT>
##$WBST= 1024
##$WBSW= 4
##$XGAIN= (0..3)
0 0 0 0 
##$XL= 0
##$YL= 0
##$YMAX_a= 101133
##$YMIN_a= -141563
##$ZGOPTNS= <>
##$ZL1= 120
##$ZL2= 120
##$ZL3= 120
##$ZL4= 120
##$ABSF1= 15.74028
##$ABSF2= -2.311569
##$ABSG= 5
##$ABSL= 3
##$ALPHA= 0
##$AQORDER= 0
##$ASSFAC= 0
##$ASSFACI= 0
##$ASSFACX= 0
##$ASSWID= 0
##$AUNMP= <proc_1d>
##$AZFE= 0.1
##$AZFW= 0.1
##$BCFW= 0
##$BC_mod= 2
##$BYTORDP= 0
##$COROFFS= 0
##$CY= -3
##$DATMOD= 1
##$DC= 0
##$DFILT= <>
##$DTYPP= 0
##$F1P= 0
##$F2P= 0
##$FCOR= 1
##$FTSIZE= 16384
##$FT_mod= 6
##$GAMMA= 0
##$GB= 0
##$INTBC= 1
##$INTSCL= 3.70164e-10
##$ISEN= 128
##$LB= 0.24
##$LEV0= 0
##$LPBIN= 0
##$MAXI= 10000
##$MC2= 0
##$MEAN= 0
##$ME_mod= 0
##$MI= 1.114404
##$NCOEF= 0
##$NC_proc= -8
##$NLEV= 6
##$NOISF1= 3.799351
##$NOISF2= 2.8
##$NSP= 0
##$NTH_PI= 0
##$NZP= 0
##$OFFSET= 15.74028
##$PC= 1
##$PHC0= -19106.69
##$PHC1= 10.20074
##$PH_mod= 1
##$PKNL= yes
##$PPARMOD= 0
##$PSCAL= 0
##$PSIGN= 0
##$REVERSE= no
##$SF= 200.13000625576
##$SI= 16384
##$SIGF1= 3
##$SIGF2= 2
##$SINO= 5.538805
##$SIOLD= 16384
##$SREGLST= <1H.CDCl3>
##$SSB= 0
##$STSI= 16384
##$STSR= 0
##$SW_p= 3612.71676300578
##$SYMM= 0
##$S_DEV= 0
##$TDeff= 16384
##$TDoff= 0
##$TI= <>
##$TILT= no
##$TM1= 0
##$TM2= 0
##$TOPLEV= 0
##$USERP1= <user>
##$USERP2= <user>
##$USERP3= <user>
##$USERP4= <user>
##$USERP5= <user>
##$WDW= 1
##$XDIM= 16384
##$YMAX_p= 357592874
##$YMIN_p= -5745397
$$ End of Bruker specific parameters
$$ ---------------------------------
##NTUPLES= NMR SPECTRUM
##VAR_NAME=  FREQUENCY,     SPECTRUM/REAL,   SPECTRUM/IMAG
##SYMBOL=    X,             R,               I
##VAR_TYPE=  INDEPENDENT,   DEPENDENT,       DEPENDENT
##VAR_FORM=  AFFN,          ASDF,            ASDF
##VAR_DIM=   16384,         16384,           16384
##UNITS=     HZ,            ARBITRARY UNITS, ARBITRARY UNITS
##FACTOR=    0.220516191357247, 1,           1
##FIRST=     3150.10236516053, 0,            0
##LAST=      -462.61439784525, 0,            0
##MIN=       -462.61439784525, -5745397,     0
##MAX=       3150.10236516053, 357592874,    0
$$ Real data points
##PAGE= N=1
##DATA TABLE= (X++(R..R)), XYDATA
$$ [...]
8193F85538k658711l772224M970224J136765J35277M79146k0059J50506p3533
8184A032929k61177j38412l3091J57432J0159k88451P2178L19579j05535j04724
8174F60887L36531r6011J11299j13786k79533l25923J63932N49223j15655m94971
8164C95993L0181l3535O06278n99950J81571L49973J14223j61819l67983j26175
8154C88757k07383K44109M1435J20856K65030J4919R3131m24401L04440N34104
8144A374997j43682L1717n7831J40999j86058K98572O2646n60043j10928r8919
8134G51470r9236K85617J85430k58190K00507Q1013K60895n81809o1308M40454
8124A204843o6250k20867M4034P11168K73868k56381R5629m01636k92213L48779
$$ y = [685538, -1973173, -5745397, -775173, 361592, 496869, 976015, 955956, 1106462, 1032929, 771752, 633340, 600249, 757681, 767840, 479389, 551567, 871146, 765611, 660887, 997418, 901407, 1012706, 898920, 619387, 293464, 457396, 1006619, 890964, 395993, 426174, 392639, 998917, 398967, 580538, 930511, 1044734, 882915, 514932, 388757, 181374, 425483, 466918, 587774, 852804, 867723, 960854, 536453, 840893, 1374997, 1231315, 1263032, 1205201, 1346200, 1160142, 1458714, 1521360, 961317, 850389, 751470, 652234, 937851, 1123281, 865091, 1065598, 1146611, 1407506, 825697, 764389, 1204843, 1138593, 917726, 961760, 1672928, 1946796, 1690415, 1786044, 1384408, 1092195, 1440974]
8114A440974R8777K42421M20498k17416m14071J65780n7337k46188J76643n921
8104A604160j15172M240K67124M4558m98329r5501l77293K47152K09437J6356
8094A306732L75196L05703o0878m82982k91862o9310J03121K34443L56425Q7220
8084A863808o8942K27265m31948m8203J50987r5938l01636m8232k8129K92140
8074A511172l81672n9809q9652L98767l7623m09080j11994p0364J72311j30190
8064G91866k17933K21514m5667o6846k05084j37174K64506M4774L29150k08829
8054G70277p81713Q2095L39753J16219J39128j14106J2078l25351j90672K06834
8044B54542L6103P4776j70250j00193J194J53025K42068M6938l64313k60937O5999
$$ y = [1440974, 1539751, 1782172, 2202670, 1985254, 1571183, 1736963, 1679626, 1433438, 1610081, 1604160, 1488988, 1493228, 1760352, 1804910, 1306581, 1211080, 833787, 1080939, 1290376, 1306732, 1681928, 1987631, 1926753, 1443771, 1151909, 1082599, 1185720, 1420163, 1776588, 1863808, 1794866, 2022131, 1590183, 1541980, 1692967, 1597029, 1295393, 1247161, 1219032, 1511172, 1129500, 1069691, 980039, 1378806, 1341183, 932103, 820109, 749745, 922056, 791866, 573933, 795447, 749780, 682934, 477850, 340676, 605182, 649956, 979106, 770277, -11436, 70659, 410412, 526631, 665759, 551653, 563731, 238380, 47708, 254542, 290645, 365421, 195171, 94978, 96172, 249197, 491265, 538203, 173890, -87047, -21048]
8033b1048k5195k17094k42958O53497n9207O8666k77235j85621K67311J37439
8023I8555k02370K31432j95576M7383j70897K08818K62618l75515K7094r345k95919
8012c73722o3431j64196r973K51311P967K3069K26536P897q4837R06L2336r1878
8000b38015j70501J76463J06721j53968J43677k74456J31118k94373m90903N05287
7990e58950K68931J54003K39153k74716m56662J5036L31473L0985Q3473k40534
7980d07808k40353L19702K22966J34913n30685j5296M4456j62279J25935J93309
7970c15140l08281m24720M17267K74568k6716j34446k8883L85280j77922j57728
7960d96721N4946j52671J00169k52307K02700J67887J34659Q319j66892R3781
$$ y = [-21048, -46243, -263337, -506295, 147202, 87995, 156661, -120574, -306195, -38884, 98555, -103815, 127617, -67959, -20576, -191473, 17345, 279963, -95552, -68458, -77803, -373722, -437153, -601349, -611322, -360011, -352044, -328975, -102439, -94542, -179379, -178473, -146137, -238015, -408516, -232053, -125332, -279300, -135623, -410079, -278961, -573334, -1064237, -558950, -290019, -136016, 103137, -171579, -628241, -613205, -281732, -250747, -167274, -407808, -648161, -328459, -105493, 29420, -501265, -516561, -472105, -634384, -508449, -315140, -623421, -1048141, -630874, -356306, -383022, -517468, -546351, -161071, -338993, -496721, -441775, -594446, -494277, -746584, -543884, -375997, -241338, -233019, -399911, -306130]
7950c06130m23504K23258k53646M7269J792J28463K51007P0935l54685M07363
7940b07878k79923k77682J35324r2691K12504l05997p6011O3039K04319J70665
7930d54331J25300k79625j88994J21183o0709l22371K41786N97275K84960M7303
7920A11777n5220k97661n32714k0375Q9K10041N522k31729J90800P960m78617
7909a090127k22853M50297M11801j28168k3381M7696r4931J76631k99714L3959
7899g38790J7482m2569R6343K70364l34335j17904P1844P6010N5378j54375m40188
7888a240740L44873J93455j60022j9272j97296J11929O2269L49021k24879n0726
7878h31388L07021K90151k75419L19713J32053k87561J74298O8712k52445j15926
$$ y = [-306130, -729634, -506376, -760022, -712753, -710961, -582498, -331491, -260556, -615241, -207878, -487801, -765483, -630159, -722850, -510346, -816343, -892354, -829315, -624996, -454331, -329031, -608656, -797650, -676467, -737176, -1059547, -817761, -220486, 64474, 111777, 56557, -241104, -773818, -794193, -794104, -584063, -578541, -810270, -619470, -611510, -1090127, -1312980, -862683, -450882, -579050, -602431, -554735, -649666, -473035, -772749, -738790, -721308, -763877, -667534, -397170, -731505, -849409, -777565, -701555, -646177, -800552, -1240740, -895867, -702412, -862434, -881706, -1079002, -967073, -904804, -555783, -780662, -831388, -524367, -234216, -509635, -189922, -57869, -345430, -171132, -102420, -354865, -470791]
7868d70791K05179m53039K55228J86150o37l408q8453m4406k92124N97463l38334
7857d47172j98013J76497j69998k48980n7872k4282l5464K08717J09505k77375
7847i64437l5640L84821M7376O9545J22631K9139K57317k38254l32386L05413
7837c54475J5976R0997J50697r2465q991l91707M1661J15726K885K4973k29663
7826f34386J13261J12347k6384m8946K1015j39229k7681J0300n4528J68963o4596
7815e69864k83724R9229N58449o67656l86272J074356k30093k50237K18738K99303
7805a37771l101j35982J85230j26732k47440p528O3788J6201K9703J94916m65018
7794f33734J06322j8450j12635R8195R1585L28803k55839l60376K26455P3680
$$ y = [-470791, -265612, -718651, -463423, -277273, -277910, -281318, -369771, -414177, -706301, -108838, -447172, -645185, -468688, -638686, -887666, -945538, -969820, -1005284, -796567, -687062, -964437, -1000077, -615256, -567880, -498335, -375704, -346565, -89248, -327502, -659888, -354475, -338499, -247502, -96805, -189270, -198261, -589968, -548307, -432581, -429696, -404723, -634386, -521125, -408778, -435162, -484108, -463093, -602322, -630003, -619703, -674231, -505268, -569864, -853588, -754359, -195910, -863566, -1249838, -175482, -405575, -655812, -437074, -137771, -140872, -276854, -91624, -218356, -465796, -473324, -409536, -393335, -363632, -168716, -633734, -527412, -545862, -658497, -560302, -468717, -139914, -395753, -756129, -529674, -455994]
7784d55994J88049j47005j79817J89964j76910J31051K52270J99303m72880J43086
7774c28883k0289q4817J27045j73884k84166K18386p6976J58161L22757j74964
7764c17630n5510o5083R7065j88802m11779L40219N52294m18135J0886k18825
7754f75300P5510J79526j50406L52454k96046r7359j47336J94784L20733n19675
7744g63115n674j35084L85878m5193j00947J63165o7093J79894p7183J25269J1641
7733c28442q8686K90352J07023m83612K25231N70112k98230l40350R0330L76408
7723A20136o6003m52915L2801K13489k13855j14416L85164L50405k130j23687
7713A28989L6010P957J36841j86335q4641J16666j19044M3950O7605J40349k29233
$$ y = [-455994, -267945, -414950, -594767, -404803, -581713, -450662, -198392, 911, -471969, -328883, -349172, -433989, -306944, -480828, -764994, -546608, -623584, -465423, -142666, -317630, -373140, -438223, -341158, -529960, -941739, -601520, -49226, -467361, -456475, -675300, -599790, -420264, -570670, -218216, -514262, -611621, -758957, -564173, -243440, -763115, -768789, -903873, -517995, -563188, -664135, -500970, -568063, -388169, -465352, -340083, -328442, -417128, -126776, -19753, -503365, -278134, 291978, -6252, -346602, -256272, 120136, 54133, -398782, -365981, -152492, -366347, -480763, -95599, 254806, 252676, 128989, 164999, 172956, 309797, 123462, 38821, 155487, 36443, 80393, 147998, 288347, 59114]
7702E9114L36151j14287m65619q942K94617L11489J4114j42736J68809r1639k11951
7691A49120k4616P1338R7050R9110J30952k6449M14125P7890o156k98064L81008
7680A065308J42300n52845q325Q5415k1166J4972Q2646l83800m2318M72363N02063
7669A356613q0899k40715L88684L35006K03039N3133J18974m593J87848j73488
7659B143602K61614R5841q2038L99680J58024K05919J83485m14626q138j71282
7649B772081J2821J082j74219j87663K50238j29269k25328j53011J52944r2364
7639B227312o25465j26512j28691P7689N78381J22612k50767k59620j66469j01600
7629A346870J06604l65176K08486o2347l30739k61666l1776k33396r8935m8920
$$ y = [59114, 395265, 280978, -184641, -193583, 101034, 412523, 426637, 283901, 452710, 361071, 149120, 124504, 195842, 292892, 392002, 522954, 496505, 910630, 988520, 982364, 684300, 1065308, 1207608, 654763, 646438, 731853, 710687, 725659, 808305, 424505, 382187, 854550, 1356613, 1275714, 1034999, 1423683, 1758689, 1961728, 2014861, 2133835, 2129242, 2317090, 2143602, 2405216, 2501057, 2419019, 2818699, 2976723, 3182642, 3366127, 2951501, 2943363, 2772081, 2784902, 2785984, 2611765, 2424102, 2674340, 2545071, 2319743, 2166732, 2319676, 2227312, 1601847, 1475335, 1346644, 1424333, 2002714, 2125326, 1874559, 1614939, 1448470, 1346870, 1453474, 1088298, 1296784, 1234437, 903698, 642032, 610256, 376860, 277925, 229005]
7619B29005K104N44022j09023o8229k0983J69472k53376L16837p81183j13235
7609h4589p3530M2362J87379m13658j93477K45920J30576L41153j74153l59133
7599c51150l96795N82533m2180l01825J06554K01806k67290l55686P45217l72799
7589d51615J14124p6422j20136Q4745p8593R223O2100n0411l6637l04601J6297
7578h31926n6084J09199P58235j99920K4122J50997k79763m0019J86339l17338
7568d96158k80797N2947N43287N0725L79425o35105K07361J74443j05989k77406
7558c87267j33631K58514l68673k17515K3340K65216K16811j10229K24784K45246
7548A6596m68601R0534J06388m7618K47857K23510J1646k82295o67705K70201
$$ y = [229005, 231109, 775131, 666108, 597879, 576896, 746368, 492992, 809829, 28646, -84589, -158119, -115757, 71622, -342036, -535513, -289593, -159017, 182136, 7983, -351150, -747945, -165412, -207592, -509417, -402863, -201057, -468347, -824033, -78816, -451615, -337491, -413913, -534049, -449304, -527897, -518674, -456574, -506985, -543622, -848223, -831926, -888010, -778811, -20576, -220496, -196374, -45377, -325140, -365159, -178820, -496158, -776955, -724008, -180721, -129996, 249429, -385676, -178315, -3872, -109861, -387267, -520898, -262384, -631057, -848572, -825232, -560016, -343205, -453434, -228650, 16596, -452005, -361471, -255083, -302701, -54844, 168666, 180312, -101983, -769688, -499487]
7538d99487L87768l6053l27361J65599m26595J20457L32171j42121m69587j98871
7528a094080N96119j7913k46683K18407j99440O36863J6355q0396n9417q2691
7518c12876l38240J71345J62268j2075k06893j7318q4564l77489n8290L1152L34607
7507g08373J39569N6637j34904k12703J52276j34409K86805J9932p1275P4753
7497e31692J86423l6792j04831O5598r5062m882j98676K05425K46675K62319p59235
7486g64730j57799P7387L52796l09012J55544l2414j01857O8528O4505L64223
7476b82829l2397P2306j83685O0174L50609J2493o1697m7011k32316l80604j783
7465g26740J44331j5677J56992j62016J20759M07175l34811j56622K4026J8582
$$ y = [-499487, -111719, -147772, -475133, -309534, -736129, -615672, -283501, -425622, -895209, -1094080, -497961, -515874, -762557, -544150, -743590, -106727, -90372, -170768, -230185, -312876, -651116, -479771, -317503, -329578, -536471, -553789, -638353, -1015842, -1074132, -1042980, -708373, -568804, -512167, -647071, -859774, -707498, -841907, -555102, -535170, -606445, -531692, -345269, -382061, -486892, -421294, -516356, -521238, -719914, -514489, -267814, -5495, -764730, -922529, -845142, -492346, -801358, -645814, -678228, -780085, -711557, -647052, -282829, -315226, -242920, -426605, -366431, -15822, -3329, -65026, -112037, -344353, -724957, -726740, -582409, -598086, -441094, -603110, -482351, -75176, -409987, -566609, -542583, -524001]
7455e24001J16353J25359j18770J13349j00857L59198J33462K5784J0458J3805
7445A54140K83237k05323m82442j90894M10956P2781l95374K78074K25220k85000
7435a34625j52934L93654Q2607l90637j43869k0356J128M6550N48140k92966n3685
7424a16993N8082L6038l22043L12127K31308l6647j23326K41438j61269K53286
7414C72001j30585J95937K26154j31066L46434j42709L5360J22875n99880l5108
7404B59413K3646r3608N94011K29247j18434k78621O34819L3149j18001k46277
7394I19344J66003N525m03901k55258m2938N37816m42940K06182p0874J56042
7384G75001L87200K2656j14589l30741K94439j6483r9396m61177K17279k34269
$$ y = [-524001, -407648, -282289, -401059, -287710, -388567, -29369, 104093, 129877, 140335, 154140, 437377, 232054, -250388, -441282, -30326, 42455, -352919, -74845, 150375, -134625, -287559, 106095, 188702, -201935, -345804, -366160, -365032, -318482, 229658, -63308, -116993, -58911, -22873, -344916, -32789, 198519, 161872, 38546, 279984, 118715, 372001, 241416, 437353, 663507, 532441, 878875, 736166, 771526, 894401, 294521, 259413, 283059, 189451, 783462, 1012709, 894275, 615654, 1250473, 1283622, 1165621, 919344, 1085347, 1090872, 686971, 431713, 388775, 926591, 483651, 689833, 618959, 775001, 1162201, 1184857, 1070268, 739527, 1033966, 1017483, 918087, 456910, 674189, 439920]
7374D39920J71068O877p7590K85487L41492P6410k68587O1127n7047J66594L95569
7363A541320o4800j3959k61055j40008L51258j8642l6597L01281k17741k76791
7353A164266L10014J07564m79655J89344K21234j96772l84P1037k74968j86867
7343I24813k76778L33279L46823k05912l20893j11350L32963L13952n9629q865
7333A268403j47798k17405J71004q5021q9836J42335K984o12897j14787O77611
7323I94593j23441p7120n8535l19095L25380N33275r9663l21116J8061m0326L7657
7312H69670p120R3814l55387l79392k377L71690k70627j2055J47658K00761J08851
7301G65486l0943k37110k15243o2506L01543k55303J8295R4456j55356J87580
$$ y = [439920, 610988, 617865, 540275, 825762, 1167254, 1243664, 975077, 1036204, 979157, 1145751, 1541320, 1476520, 1462561, 1201506, 1061498, 1412756, 1394114, 1357517, 1658798, 1441057, 1164266, 1474280, 1581844, 1102189, 1291533, 1512767, 1315995, 1315611, 1386648, 1111680, 924813, 648035, 981314, 1328137, 1122225, 801332, 689982, 1022945, 1336897, 1277268, 1268403, 1120605, 903200, 1074204, 989183, 899347, 1041682, 1044666, 431769, 316982, 994593, 871152, 794032, 735497, 416402, 741782, 1275057, 1175394, 854278, 872339, 832013, 869670, 862550, 956364, 600977, 221585, 219208, 590898, 320271, 308216, 455874, 656635, 765486, 734543, 497433, 282190, 219684, 521227, 265924, 284219, 378675, 223319, 410899]
7291D10899j13953k4254k12272m8305L29785j05904M20613q0370l53925k09453
7281A2861j07357P3049L99359Q1219k1039k56437k5923L85414l85518k51422m4995
7270a40789k07707L16008m106l1597o1067j8855J15685M0606l08800J22925K58625
7259H0928j78815J29309l85910J20593j47508L4590J15095p3240L34795l81960
7249c52123l42433K9200K45011R1172J36147M18368l06823K17717j99465J31283
7239F8054J4126J77258m40107j97777K40867J83105k15113j72029K33289k99547
7229d07874K6588K6781k94270j99999Q5837J43912L68030q328K13173j22600l49453
7218e18203j39361l2678K25836K15186J24090m03035o1734N2216K10383m2793
$$ y = [410899, 296946, 272692, 60420, 12115, 341900, 235996, 656609, 576239, 222314, 12861, -94496, -21447, 377912, 459131, 438092, 181655, 155732, 541146, 155628, -95794, -140789, -348496, -32488, -36594, -68191, -129258, -148113, -32428, 8178, -300622, -177697, 80928, -97887, 31422, -354488, -233895, -381403, -346813, -231718, -304958, 29837, -352123, -694556, -665356, -420345, -329173, -193026, 225342, -81481, 136236, -63229, 68054, 82180, 259438, -180669, -378446, -137579, 45526, -169587, -341616, -108327, -407874, -381286, -354505, -648775, -848774, -762937, -619025, -250995, -259323, -46150, -168750, -518203, -657564, -690242, -464406, -249220, -125130, -528165, -589899, -537683, -327300, -370093]
7208c70093L11295j1153l78748J08673L02306j36870l734l51269M8112N26613
7198D5132k37685n5639k7599J61108j48184k74801j00754J97808N11011R8812
7188A69209k80920M933J10201k00007K30725k67787j08284J94133J41337j91047
7178a97507K2021J54681K60116j5653j44945j76420j30524L10832r1509J46960
7168A38052k29143k16578K94862m5318j81142K74691p1582q4691p0778N03216
7158C11589K54067n21160L3566J38743K6649O6231k20312L06378j4609j55205
7148B25937Q2797J32470l8593J08327R893l2606n7658L54200n23047Q2648K55105
7137E99473L13932r2960l34098K14440N9648J2150m9114j71896k7250l06556J54513
$$ y = [-370093, -58798, -69951, -448699, -340026, -37720, -174590, -178324, -529593, -481481, 45132, -192553, -248192, -275791, -114683, -262867, -537668, -638422, -440614, 70397, 169209, -111711, -106778, 3423, -196584, 34141, -233646, -341930, -147797, -6460, -197507, -175486, -20805, 239311, 223658, 78713, -97707, -228231, 82601, -8908, 138052, -91091, -307669, -12807, -58125, -239267, 35424, -36158, -120849, -191627, 311589, 565656, 44496, 78062, 216805, 243454, 309685, 89373, 395751, 381142, 225937, 308734, 441204, 402611, 510938, 520831, 488225, 430567, 784767, 261720, 344368, 599473, 913405, 820445, 486347, 700787, 760435, 772585, 723471, 551575, 524325, 217769, 372282]
7126C72282L53257j7647O703k897j11901J16928K91545j3609k73130k95581Q3234
7115E09184L08800J01920q7658J97443m705M2549K57883l84726q6300M02003j06526
7104A149867K28829J14870k46231m21891J00231J09293k1630O9800K14250O5531
7094A362919p9760o53501l5182M68405K44499k42923k08093m9441K89277J8684
7084A114884Q5621K25224j08544m34980L37814J20419j72244J04725k49984l05998
7074G16937L9426K67168L59385j17195j32082K7444N5476K21816K82345j06720
7064A614000m07793N2437n15756j19259j7972L58773K90507k37074q9909k13288
7054G14666j21423l27172k32111J85420L54647P6130O2572m63815j9958J79022
$$ y = [372282, 725539, 707892, 714595, 711698, 599797, 716725, 1008270, 994661, 721531, 425950, 509184, 817984, 919904, 832246, 1029689, 1024984, 1067533, 1325416, 940690, 854390, 1256393, 1149867, 1378696, 1493566, 1247335, 825444, 925675, 1034968, 1013338, 1083138, 1297388, 1362919, 1283159, 629658, 594476, 1062881, 1307380, 1064457, 856364, 806923, 1096200, 1114884, 1200505, 1425729, 1317185, 882205, 1220019, 1340438, 1168194, 1272919, 1022935, 716937, 756363, 1023531, 1382916, 1265721, 1133639, 1161083, 1216559, 1438375, 1720720, 1614000, 1206207, 1258644, 742888, 623629, 605657, 964430, 1254937, 1017863, 927954, 714666, 593243, 266071, 33960, 219380, 574027, 650157, 712729, 248914, 228956, 407978]
7044D07978K9543r4748j25500J26525J77771J35649l01074o0025j63680j861j2364
7033A18214K47619j54002J0445M01172L70779k87136k37959K47484j02812j96820
7023D16984O5361q0645l97368n45350O89916N61895m4088k33164r4785R3842m89943
7012e7345J90903K58935M47130k52600l32165k19253L7028L30696j46742k10639
7002D5948n9790M7291J05751J24354n33473N6644K49174k75423K9740Q4571q5663
6991b10876o0812N4456k48936N83432M4614n98011R2126J3555J76446j33658j61968
6980d49632K08905J93462l4308j63998k48721J66525j97976M38565J84565j31690
6970c4303M40005n433k38005m39328K69347j77080K12950k03862J36517M85944
$$ y = [407978, 437521, 342773, 217273, 343798, 521569, 657218, 356144, 296119, 132439, 130578, 118214, 365833, 211831, 222276, 623448, 994227, 707091, 469132, 716616, 613804, 416984, 482345, 401700, 4332, -541018, 148898, 710793, 666705, 433541, 338756, 432598, -57345, 133558, 392493, 839623, 587023, 254858, 35605, 72633, 403329, 256587, 45948, -13842, 33449, 139200, 263554, -269919, -213275, 35899, -239524, -209784, -125213, -210876, -271688, -217232, -466168, 117264, 161878, -436133, -344007, -330452, -154006, -287664, -449632, -240727, -47265, -81573, -245571, -494292, -327767, -525743, -87178, 97387, -34303, 405702, 400269, 162264, -277064, -7717, -184797, 28153, -175709, -39192, 446752]
6960D46752l37431j60783j34346J06543l80232o867Q9528N5623l2911L11849j96604
6949b38879J93302L26228o1542n73378k08357L15686n6951J55411j11638L1794
6939b28324J49689L09219p7261J561j58846M8656k03394J283k9030m42036m9720
6928f78203J61218K63691j2073J85482r2178k84994J85371K74642K66425k50097
6918A9284l11083j06607N9264J23715j50788l39668K6589P3585n6696K10799L40145
6907a11461p9141j85338M29306k35566l93137L81682k0563K13529n918n05942
6897e12549l17443K31595L83667K42265R5810j43836j16244j68300M51023J95949
6887C41937m55518k67551J01976m0876K89247K21505q980m82957M94654q6156
$$ y = [446752, 109321, -51462, -185808, -79265, -459497, -466364, -376836, -321213, -354124, -42275, -238879, -45577, 280651, 219109, -354269, -562626, -246940, -303891, -148480, -260118, -228324, -78635, 230584, 153323, 154884, -3962, 44694, -158700, -157417, -186447, -628483, -678203, -516985, -253294, -265367, -79885, -172063, -457057, -271686, 2956, 269381, 19284, -291799, -398406, -339142, -215427, -366215, -705883, -679294, -605709, -662405, -451606, -111461, -190602, -375940, 53366, -182200, -575337, -193655, -214218, -689, -6607, -512549, -829992, -598397, -214730, 27535, 123345, -20491, -136735, -305035, 145988, 341937, -113581, -381132, -279156, -320032, -30785, 190720, 181740, -301217, 193437, 107281]
6877A07281k96834N2057j61756J27523j8780J12855k33322J45655J37241M10j70136
6866a97806k15661L0561M13788o5884l55146J2614L09150K80111l07270j53245
6856b48788L13344K6755m78565J99969Q2750L18L13842l52819j41872P5806M45030
6845B35770M61938j40484j17300m44025O5887L10002k11886J24812l4974j43476
6835A06264J48447L58014l15735k02143j46423J13502N03605j26916l30444j11265
6825c094j60416Q5578J25021J03409j3177L77007o57197l56232K41351Q5977L32468
6814A60695J35940l19426l25153L77015l05754l10009M69169Q7604k42836L15994
6804D3239J84497j93240L7293r7926m7592m8953J57078K42230J23105k29590J92346
$$ y = [107281, -189553, -137496, -299252, -171729, -190509, -77654, -310976, -165321, -28080, -27670, -197806, -413467, -382906, 30882, -35002, -390148, -377534, -68384, 211727, -95543, -248788, 64556, 91311, -387254, -187285, -104535, -104217, 209625, -143194, -285066, -209260, 235770, 697708, 557224, 439924, -4101, 61786, 371788, 159902, 284714, 249740, 106264, 254711, 612725, 296990, 94847, -51576, 61926, 565531, 438615, 108171, -3094, -163510, -77932, 47089, 150498, 137321, 514328, -142869, -499101, -257750, -171773, 160695, 296635, -22791, -347944, 29071, -276683, -586692, -117523, -29919, -272755, 43239, 227736, 34496, 71789, -26137, -73729, -122682, 34396, 276626, 399731, 170141, 362487]
6793C62487l0494j77287j51814j27814J76818j2218l3344m55941P8657l0732M3665
6782c58017n0841J25775j72905L78648L17986Q0938n82643l00328o6076L79818
6772b47645j30449j96265N90330M32261j59469k02216l23180R1620L9956p5732
6762a80789j8122j5796l0409p5888J64278J74987M55177j41285J10808j91119
6752B51842j61850o3123j02374k73914P9119J2041Q6902K35990K12598r9665m12144
6741b34578o9997K62026L44378k37778k41009Q2178o9206J55839q8552l28790
6731d25489J03434J47668q978J15202N2520k76656j03535K51238n7758O5455Q4104
6720e2795l01484J13916J46632r0389J09402k99567M50745K15643l20129j90177
$$ y = [362487, 331993, 154706, 2892, -124922, 51896, 39678, 6334, -449607, -370950, -401682, -358017, -408858, -283083, -455988, -77340, 240646, 321584, -261059, -561387, -627463, -247645, -378094, -574359, 15971, 448232, 288763, 86547, -236633, -145013, -105057, -180789, -198911, -214707, -245116, -321004, -156726, 18261, 473438, 332153, 442961, 251842, 89992, 26869, -75505, -349419, -270300, -258259, -171357, 64633, 277231, 177566, -234578, -304575, -42549, 301829, 64051, -176958, -94780, -163986, -8147, -96699, -425489, -322055, -174387, -183365, -68163, -15643, -292299, -395834, -144596, -202354, -136899, -52795, -354279, -240363, -93731, -184120, -74718, -374285, 76460, 292103, -28026, -218203]
6710b18203K03455J94415j47509J6352K80275l60181j43080K542M1782J56459
6700B6307M23876L5349q7535k49526k54429J73184n2561J44858J5569n64455j63827
6689e53190N95323M16296m72022m78267M30545l14554M26555N9317l47743L44844
6679A07104k34554k66865O82567K37086J74134l86459j79976K64466k22493r0826
6669H4184K70776k58820j47171J88764P7714K4226R1662L95973k36061k62618
6659B28629J67611J07559l72660l904K85469k63048j90972M63706K40690K57413
6649I20493k49891L1572k16781J40353N68474j38607k76283l76201K9470j93592
6639B39007J98666J37911o7344l05649M68875j8838j15163L53371j99534m9748
$$ y = [-218203, -14748, 179667, 32158, 48510, 328785, -31396, -174476, -171934, -130152, 26307, 450183, 485532, 397997, 148471, -105958, 67226, 14665, 159523, 175092, -389363, -553190, 42133, 458429, -13593, -491860, -61315, -375869, 50686, 110003, -237740, 107104, -127450, -394315, 288252, 525338, 699472, 313013, 133037, 397503, 175010, 84184, 354960, 96140, -51031, 137733, 215447, 239673, 331335, 727308, 491247, 228629, 396240, 503799, 131139, 127235, 412704, 149656, -41316, 422390, 663080, 920493, 670602, 702174, 485393, 625746, 1194220, 1055613, 779330, 403129, 432599, 239007, 437673, 575584, 508240, 202591, 671466, 652628, 537465, 890836, 691302, 641554]
6629F41554k09037m7676O05732k03639m30772q2578J19735O3337k90153P43733
6619I10236q8045j47851n9047j81679N76916m2176p8862L5131l18294j09150l40412
6608A56767J73106M42812K32994j41415n02006O4709L39611K5201k80699L5148
6598E46228L68183J10282p7973J36002K75686M59198k47495m71536q5219j7189
6588I96167j31327N65178r384J11043N0585l692j9681m2868j15418J23169K37392
6577A761164j5903L15742M0867L356k17213J01566l86499k4246L94839J70323
6567B143996k33514r1778O3119M49076M06776K78499l13930j04537k3493P6768
6557B650982q0354J27963m92896j27922J26050K56029k54985L48350K66666K51358
$$ y = [641554, 432517, 384841, 990573, 786934, 356162, 273584, 393319, 456656, 166503, 910236, 822191, 674340, 615293, 433614, 1010530, 968354, 889492, 924623, 606329, 497179, 156767, 329873, 772685, 1005679, 864264, 362258, 426967, 766578, 791779, 511080, 546228, 914411, 1024693, 946720, 1082722, 1358408, 1817606, 1570111, 1098575, 1013356, 996167, 864840, 1430018, 1420634, 1531677, 1582262, 1578570, 1558889, 1516021, 1400603, 1523772, 1761164, 1745261, 2061003, 2101870, 2105226, 1888013, 1989579, 1603080, 1578834, 1973673, 2143996, 1910482, 1818704, 1881823, 2330899, 2737675, 3016174, 2702244, 2597707, 2574214, 2650982, 2570628, 2698591, 2205695, 2077773, 2203823, 2459852, 2204867, 2553217, 2819883, 3071241]
6547C071241M53197k85169j36466k22148j25526q8903L98913J18969K97108j21323
6537C359893q4177J35058O68028l8190p1049j41167j2142j85176K86609J14130
6527D031817L85503M33668P9214m9560R5815L4622K70519J14272l26777L43546
6517E412639l20989J08558k46353P6646O25895L556j54922k27L23927j04557N0526
6506E774699K01632j91093j45009L33262P33355p031k80957J82488j07602L9242
6496F532986M43726K01647j23000J04742n64451k98086Q26067Q3214j52930K54286
6486G308201m25679j38614l1286m9344N16270r0917k73191L68224k1088k50043
6476F912533l6706J79709K97350k13146k0263K09278J77518k68486J33181j52474
$$ y = [3071241, 3524438, 3239269, 3102803, 2880655, 2755129, 2666226, 3065139, 3184108, 3481216, 3359893, 3275716, 3410774, 4078802, 4040612, 3969563, 3828396, 3816254, 3631078, 3917687, 4031817, 4417320, 4850988, 4930202, 4880642, 4976457, 5011079, 5281598, 5395870, 5069093, 5412639, 5091650, 5200208, 4953855, 5030501, 5656396, 5659952, 5505030, 5504803, 5828730, 5724173, 5774699, 5976331, 5785238, 5640229, 5973491, 6706846, 6699815, 6418858, 6601346, 6493744, 6532986, 6976712, 7178359, 7055359, 7160101, 6595650, 6297564, 7123631, 7206845, 7053915, 7308201, 6882522, 6743908, 6712622, 6663278, 7179548, 7088631, 6815440, 7183664, 7162576, 6912533, 6875827, 7055536, 7352886, 7139740, 7119477, 7328755, 7506273, 7237787, 7370968, 7218494]
6466G218494n7001o8272K30340J35769l95607O8460K33441p9765m40046r7209
6456F748604K48723M4349Q7611N7128m0027k47832l44322k02128n1957K63142
6446F563291L21285l2301m93815l5028O1215o8074L01231l13437j34500L32093
6436F501960k81442N76574L9871k63596n01669j53622L17561J01806j69499p3692
6426F094252j38236J66562j59662k04952j6919J78583K40568M9087K63862r2728
6416F380417L82525k92320n1879O0317j40276m4601r3744j76490J33698J15983
6406F273630n5225M1808k8408K59675L12547k09994J37200K57200m59411J01321
6396F630343q464j1145K59800J05371j36863J21323J43430l87045l39898j18783
$$ y = [7218494, 7161493, 7093221, 7323561, 7459330, 7063723, 7132183, 7365624, 7285859, 6845813, 6748604, 6997327, 7041676, 7129287, 7186415, 7146388, 6898556, 6554234, 6352106, 6300149, 6563291, 6884576, 6852275, 6358460, 6323432, 6384647, 6316573, 6617804, 6304367, 6169867, 6501960, 6220518, 6797092, 6836963, 6573367, 6071698, 5918076, 6235637, 6337443, 6167944, 6094252, 5956016, 6122578, 5962916, 5757964, 5741045, 5919628, 6160196, 6209283, 6473145, 6380417, 6762942, 6470622, 6418743, 6479060, 6338784, 6294183, 6200439, 6023949, 6157647, 6273630, 6218405, 6260213, 6231805, 6491480, 6804027, 6594033, 6731233, 6988433, 6529022, 6630343, 6621879, 6610734, 6870534, 6975905, 6839042, 6960365, 7103795, 6716750, 6376852, 6258069]
6386F258069J09791N0798M18045n8713j69085m38834j18022O08905J9739p6185
6376F604508l00475j82590K34445J31530l0822L65442K65486K16387k20327j96796
6366F886788k33551j94581K52078R4103J11026m11290L05798L42396r0252l83029
6356F679486j21578M71534O33852k87477j67715L34827j21518m68112L39450n5809
6346G236940k06935P1205l4701J88613M2198k67127l1299J34553J25169J39041
6336G397657M0854l34167j676M86355m32249l1125k22108k19350L8198K04406
6326F926795j19773O0778R1873l13734n3135k51540n7109O2229l02587L77002
6316F420799J83006K0782k07602K531J39733M9110L90106r1286o5701j76218l54789
$$ y = [6258069, 6367860, 6418658, 6836703, 6777990, 6608905, 6170071, 6052049, 6660954, 6680693, 6604508, 6304033, 6121443, 6355888, 6487418, 6456596, 6822038, 7087524, 7303911, 7083584, 6886788, 6653237, 6458656, 6710734, 6804837, 6915863, 6504573, 6810371, 7152767, 7062515, 6679486, 6557908, 7029442, 7663294, 7375817, 7208102, 7542929, 7421411, 6953299, 7292749, 7236940, 7030005, 7101210, 7066509, 7255122, 7297320, 7030193, 6998894, 7133447, 7258616, 7397657, 7438511, 7104344, 7102668, 7589023, 7156774, 7125649, 6903541, 6684191, 6722389, 6926795, 6807022, 6867800, 6959673, 6645939, 6592804, 6341264, 6284155, 6346384, 6043797, 6420799, 6603805, 6624587, 6416985, 6419516, 6559249, 6608359, 6998465, 6907179, 6841478, 6665260, 6310471]
6305F310471k6285J27202n2560O5833k16017K63006q8028l20020K44667l72989
6295E935280l09523R4037P28665J62974o22783k5541J09546j19898K7412K52215
6285F232384Q4650n80391o9976q9278N1386Q3403p1940L84238k18235m02998J19409
6274E522652L01246N6677m37747j61572L61189N07688j48877n37123M5215K23169
6264E732517j92988k05240l75609M06133K32107J7236j48590N5895o8208n16236
6254D937017j0304j15811K91408L88326k04235K6966j51770k14516j61522R73
6244D786532l5054p0315j97903J45931J11880L06479M28582j10205l65043m31761
6234D569123o7542m90345J77707m1054L24903k59214k14060j27147n3134M28448
$$ y = [6310471, 6284186, 6411388, 6358828, 6424661, 6208644, 6471650, 6383622, 6063602, 6308269, 5935280, 5625757, 5719794, 6448459, 6611433, 5988650, 5963109, 6072655, 5952757, 5980169, 6232384, 6317034, 5736643, 5666667, 5577389, 5628775, 5712178, 5640238, 6024476, 5806241, 5403243, 5522652, 5823898, 5880575, 5442828, 5281256, 5642445, 6150133, 6001256, 5464133, 5509348, 5732517, 5539529, 5334289, 4958680, 5364813, 5596920, 5614156, 5465566, 5521461, 5453253, 4937017, 4926713, 4810902, 5102310, 5490636, 5286401, 5313367, 5161597, 4947081, 4785559, 4786532, 4751478, 4681163, 4483260, 4629191, 4741071, 5047550, 5476132, 5365927, 5000884, 4569123, 4501581, 4011236, 4188943, 4147889, 4472792, 4213578, 3999518, 3872371, 3819237, 4247685]
6224D247685m7420j26052q3757k07262J91118J92938m94317m96930J64422L13689
6214C654114k11039L5257L02040J0756o8109m57556m04190J92238K14447O0807
6204C328765J0020l42889O09334K80931L52054k34459n52376k32222J37685J51224
6194C508067K4648l8653K89137k43388p47782J48224K24742l6805K10966j45712
6184C193444k8685J83651j90341J27437K99123L19565k08780k25516k12463j67087
6174C090348J76320Q540J74594J90277j21460J58734m31140j40201n6623L99564
6164C448953K44584j56510P0645J15358n2829J64180L46194o8930k11786k68395
6154C631464K85985j578j65014J54589M0276r6343k15177L34828L85195R10l95660
$$ y = [4247685, 4200265, 4074213, 3990456, 3783194, 3974312, 4167250, 3672933, 3176003, 3340425, 3654114, 3443075, 3478332, 3780372, 3791128, 3723019, 3265463, 2861273, 3053511, 3267958, 3328765, 3338785, 2995896, 3605230, 3886161, 4238215, 4003756, 3451380, 3219158, 3356843, 3508067, 3532715, 3494062, 3783199, 3539811, 2792029, 2940253, 3164995, 3128190, 3339156, 3193444, 3164759, 3348410, 3158069, 3285506, 3584629, 3904194, 3695414, 3469898, 3257435, 3090348, 3266668, 3275208, 3449802, 3640079, 3518619, 3677353, 3246213, 3106012, 3049389, 3448953, 3693537, 3537027, 3607672, 3723030, 3670201, 3834381, 4180575, 4111645, 3899859, 3631464, 3917449, 3915871, 3750857, 3905446, 3945722, 3849379, 3634202, 3969030, 4354225, 4355135, 3959475]
6143C959475l76638L68191K6670j27724K61436J61391L14350m1924r6334l96456
6133D052437Q4587L79610j71089K0383L81224n9662j28825j62809Q1756k49539
6123D228073N1273j70304J53715k84257K06004N5253j29855K65681j36176Q2215
6113D321622j17731k72587J05901k21941K1163L30911L56884j30150m97627n25641
6103C370804j66716K06161J11683M75583j08980j4657j6885K66041R1147J48570
6093D362751l91816k55514L33451R4694k1422K73473K73466M2055k77555j45602
6083D287981k42079K15293j56093K0454j56528K02792O0093k51302K00321K361
6073D183293o294M062n8047k23157l905L73623j3502O4743M29638j91923o00185
$$ y = [3959475, 3582837, 3951028, 3977698, 3849974, 4111410, 4272801, 4587151, 4545227, 4448893, 4052437, 4137024, 4516634, 4345545, 4365928, 4747152, 4687490, 4558665, 4395856, 4477612, 4228073, 4279346, 4109042, 4262757, 3978500, 4184504, 4239757, 4109902, 4375583, 4239407, 4321622, 4203891, 3931304, 4037205, 3815264, 3836427, 4167338, 4524222, 4394072, 3896445, 3370804, 3204088, 3410249, 3521932, 3997515, 3888535, 3873878, 3856993, 4123034, 4214181, 4362751, 3970935, 3715421, 4048872, 4143566, 4122144, 4395617, 4669083, 4711138, 4433583, 4287981, 4045902, 4261195, 4105102, 4125556, 3969028, 4171820, 4231913, 3980611, 4180932, 4183293, 4176999, 4181061, 4123014, 3899857, 3895952, 4269575, 4256073, 4320816, 4750454, 4558531, 3958346]
6062C958346k16865K10510L53793L83505l87475J05057L6000n95263N8208L4770
6052C940586k61323K42779L6711n84944L32128M3714k81218l81251j32317M9493
6042C004358N5428J8074J29600K3093R139J84086j51907J06980j76362j53015
6032C049474j23870j64060j9676r8395j39113M66184J37068J21557J51950K3221
6022C404340l11779l33808o2925M99893K39520j51563k6763m9539l90001L854
6012B821229M88978M175n1114n19636J05503M02443l22873j7734j94961J61484
6002B877494L97507l3482o37470l22709l2399M90032p6677n44586O39206L5366
5992B792282l99094J22514R2891j21816r1130l4888J38514l2191j03779J60009
$$ y = [3958346, 3741481, 3951991, 4305784, 4689289, 4301814, 4406871, 4442871, 3847608, 3905816, 3940586, 3679263, 3922042, 3958753, 3373809, 3705937, 3749651, 3468433, 3087182, 2954865, 3004358, 3059786, 3077860, 3207460, 3230553, 3239692, 3423778, 3271871, 3378851, 3202489, 3049474, 2925604, 2761544, 2741868, 2643473, 2504360, 2970544, 3107612, 3229169, 3381119, 3404340, 3092561, 2758753, 2695828, 3195721, 3435241, 3283678, 3256915, 3207376, 2817375, 2821229, 3310207, 3314382, 3263268, 2743632, 2849135, 3251578, 2928705, 2910971, 2716010, 2877494, 3275001, 3241519, 2604049, 2281340, 2248941, 2738973, 2662296, 2117710, 2756916, 2792282, 2393188, 2515702, 2608593, 2486777, 2395647, 2360759, 2499273, 2467082, 2363303, 2523312]
5982B523312L2129j78761K01408o1342Q6741j51250p9848N4782K14685l30821
5972B311035m756k52410n1780L72549n9461P4236j1605Q2582J31556j6362j13897
5961B461687m96217p4202M90156N4134k07891J9998j96736j11985k4559K67177
5951B181562q7485N53565j11116l77877J0276j6740P5752J96087J72395l92045
5941B204374J63267j26425M1407l90232K91207L86202j30911J8640k90012k44729
5931A922788M22004j89740L35098K61801L4181k97374l36196J86108J97622j48534
5921B387758J6944l85514L74781j73283k8374J00492J6602n8756j13031K26062
5911B363681M5020j84101L6283K43429j93873j04292n24333k16L2253k9652L46539
$$ y = [2523312, 2555441, 2376680, 2578088, 2516746, 2603487, 2452237, 2372389, 2427171, 2641856, 2311035, 2306279, 2053869, 2002089, 2374638, 2315177, 2389413, 2377808, 2460390, 2591946, 2575584, 2461687, 1965470, 1891268, 2381424, 2435558, 2227667, 2247665, 2050929, 1938944, 1914385, 2181562, 2094077, 2647642, 2536526, 2158649, 2168925, 2152185, 2227937, 2424024, 2596419, 2204374, 2367641, 2241216, 2282623, 1892391, 2183598, 2569800, 2438889, 2457529, 2167517, 1922788, 2344792, 2155052, 2490150, 2751951, 2786132, 2488758, 2152562, 2338670, 2536292, 2387758, 2404702, 2019188, 2393969, 2220686, 2192312, 2292804, 2309406, 2250650, 2137619, 2363681, 2408701, 2224600, 2260883, 2504312, 2310439, 2206147, 1681814, 1681598, 1713851, 1684199, 2030738]
5900B030738J06178j17110Q4876K54259j66124n6004Q0967l8690j55681m4464
5890A978945K64351l00974P39r1580l70197R8882M43059L14476m48666J04064
5880A993099L12611k10456j38672k43572L51810j93335l00594J5190j80207L95429
5870A801303M36309p790k21742q7383L97682j64517k7496l78607l03682J93953
5860A638030j05444l60701P97180L96410l50783J55949J72109j80483r0008k37594
5850A834665Q3453K43646j36416q3510L91240m59041p0240o2127p9109O09211
5840B271772K6224j52817K22529q3766j71072k60885J9462N96994q0200m2013
5830B346228n26240J97866K59050q502k55695j60186K33730N5981j7024k74984
$$ y = [2030738, 2136916, 2019806, 2104682, 2358941, 2192817, 2136813, 2217780, 2179090, 2023409, 1978945, 2243296, 1942322, 1943061, 1851481, 1481284, 1580166, 2023225, 2337701, 1889035, 1993099, 2305710, 2095254, 1956582, 1713010, 2064820, 1871485, 1570891, 1586081, 1405874, 1801303, 2237612, 2229822, 2008080, 1920697, 2318379, 2153862, 2126366, 1747759, 1444077, 1638030, 1532586, 1171885, 1969065, 2365475, 2014692, 2170641, 2342750, 2162267, 2072259, 1834665, 1918118, 2161764, 2025348, 1941838, 2333078, 1874037, 1803797, 1741670, 1662561, 2271772, 2297996, 2145179, 2367708, 2283942, 2112870, 1851985, 1871447, 2468441, 2388241, 2346228, 1819988, 2017854, 2276904, 2268402, 2012707, 1852521, 2086251, 2142232, 2125208, 1850224]
5820A850224j25622k1153M32364J09443m13306j3543J69756l43120J66880J16739
5810A928662j5611r1781q2952K06432N53956j09417n76180K78139j03637j54900
5800A832711J0667K18925K49021k0230m2183K2370j11354j82660j7166L9757j1183
5789A988675J48727J92192L06229O9796N6226n9559j98305j35988j63314J02595
5779B307274K43583q6812J42772m16264L72558j9581Q9019j75280M64765r569
5769B912465l45999L96642q960m42047j83805N404k64094M95273R7939k6430K33780
5758B870168l5776L45849k82137r532J828l93329J76713j54012m1999J67650K34110
5747B879533J14792J26274k49363l22860j29512o1335p3908R5429j71713J38970
$$ y = [1850224, 1724602, 1703449, 2135813, 2245256, 1831950, 1818407, 1988163, 1645043, 1811923, 1928662, 1913051, 1821270, 1738318, 1944750, 2498706, 2389289, 1813109, 2091248, 1987611, 1832711, 1843378, 2062303, 2311324, 2291094, 2248911, 2271281, 2159927, 1977267, 1960101, 1999858, 1988675, 2137402, 2329594, 2635823, 2705619, 2761845, 2702286, 2503981, 2367993, 2204679, 2307274, 2550857, 2464045, 2606817, 2190553, 2563111, 2543530, 2632549, 2457269, 2922034, 2912465, 2566466, 2963108, 2954148, 2512101, 2328296, 2333700, 2069606, 2564879, 2662818, 2636388, 2870168, 2834392, 3180241, 2898104, 2888572, 2890400, 2497071, 2673784, 2519772, 2477773, 2645423, 2879533, 2994325, 3120599, 2871236, 2548376, 2418864, 2357529, 2283621, 2379050, 2207337, 2346307]
5737B346307J74339K19493o1781L09052K06082o8262k36942P5862J22835m19184
5727B667801k01921O54M66243M6044j45627O7811N8203q6011N3643L30136k86621
5716B970355j06859j13395M93852L73568l47l20878P7007N6459k76051j30985
5706C022726J91418O305r4904r8844k51101J28920k34808j93903m3406L75859
5696B808262N81410j6826J46330n718J41029M5546o43603k71049K0308J58696
5686B964385K25561K72677N4698m96795j25489K05555l96626L47748M04655q4892
5676C371477k0624J36498O6162L9512K53082l07858P6927R2316j3664J2340l15348
5665C390820j21720N24004n0638k34490K46596q8411J22812j45215m3922K51471
$$ y = [2346307, 2520646, 2740139, 2678358, 2987410, 3193492, 3125230, 2888288, 2964150, 3086985, 2667801, 2465880, 2466534, 2932777, 2978821, 2833194, 2901005, 2959208, 2873197, 2926840, 3256976, 2970355, 2863496, 2750101, 3243953, 3617521, 3617174, 3296296, 3373303, 3429762, 3153711, 3022726, 3214144, 3220449, 3125545, 3026701, 2775600, 2904520, 2669712, 2475809, 2432403, 2808262, 3389672, 3372846, 3519176, 3513458, 3654487, 3700033, 3056430, 2785381, 2805689, 2964385, 3189946, 3462623, 3517321, 3020526, 2895037, 3100592, 2703966, 3051714, 3456369, 3371477, 3350853, 3487351, 3553513, 3593025, 3846107, 3538249, 3615176, 3707492, 3693828, 3706168, 3390820, 3269100, 3793104, 3742466, 3507976, 3754572, 3666161, 3788973, 3643758, 3599836, 3851307]
5655C851307n1949o4570j63692K56192J6242k80419J85640J67785p7470k8931
5645C810135L19263k75795J01358j38185J18989M22645r5042K19935j52381l64679
5635C966243K67611k2448r8659L89998n3739l11026k14562O5279K77127J34671
5625D400495j89773k1585J32277j67453L86143K26533j65284L05672K27238k86661
5615D847602m84154o21679L75860M79952L60275n41400P5349m5900j69219p1484
5605D205202J0992K48300J47168n1111L16474k47365l44337J40846k11601J47983
5595D362551J74167J99731K18408n2752J4042K48768j87326K90906J11573l03455
5585E076613N2769K55721m65611K00348J42857O7606J88442j63417J60909j95893
$$ y = [3851307, 3799358, 3734788, 3571096, 3827288, 3843530, 3563111, 3748751, 3916536, 3839066, 3810135, 4129398, 3853603, 3954961, 3816776, 3935765, 4358410, 4263368, 4483303, 4330922, 3966243, 4233854, 4211406, 4112747, 4502745, 4449006, 4137980, 3923418, 3988697, 4265824, 4400495, 4210722, 4189137, 4321414, 4153961, 4540104, 4766637, 4601353, 4907025, 5134263, 4847602, 4363448, 3741769, 4117629, 4597581, 4957856, 4416456, 4491805, 4445905, 4276686, 4205202, 4216194, 4464494, 4611662, 4560551, 4877025, 4629660, 4285323, 4426169, 4214568, 4362551, 4536718, 4736449, 4954857, 4902105, 4916147, 5164915, 4977589, 5268495, 5380068, 5076613, 5129382, 5385103, 4919492, 5119840, 5262697, 5330303, 5518745, 5355328, 5516237, 5320344]
5575E320344K75200K77237r1843K5352l61267p683J99629J66434l56763M70490
5565E917130J33377j09340M4746j81726K04334L09049L02417l8847n67404L74192
5555F387928L6342M2537j50097J29829K94859l2867l082J40763K56351k85861
5545F816702J73048J39607k43788j12012L54548K5613p327R5337q3237N5192K12379
5534G426062o5910j26640K42631j1187k57982L00181K08441j86972J86119j25898
5524G588845J86091M40852j43009J21010L81486P6605L38253j6908l09340l0392
5514H633493j5102J68266K34125n70746K49557O09455L2339P4587o0188N1108
5504I406894L42796M6172m09021K84133J40603J26095J39783M30639M9295K27015
$$ y = [5320344, 5595544, 5872781, 5780938, 5806290, 5445023, 5437340, 5636969, 5803403, 5446640, 5917130, 6050507, 5941167, 5985913, 5804187, 6008521, 6317570, 6619987, 6581140, 6013736, 6387928, 6424270, 6466807, 6316710, 6446539, 6741398, 6708531, 6705449, 6846212, 7102563, 6816702, 6989750, 7129357, 6885569, 6773557, 7128105, 7153718, 7146391, 7241728, 7158491, 7213683, 7426062, 7360152, 7233512, 7476143, 7464956, 7206974, 7507155, 7715596, 7528624, 7714743, 7588845, 7774936, 8215788, 8072779, 8193789, 8575275, 8651880, 8990133, 8973225, 8663885, 8633493, 8618391, 8786657, 9020782, 8450036, 8699593, 9309048, 9341387, 9415974, 9355786, 9406894, 9749690, 9795862, 9386841, 9670974, 9811577, 9937672, 10077455, 10508094, 10557389, 10784404]
5494A0784404j43684j5795L69973J19123M4098Q4538J66074J97730j61289k1343
5484A1423829N6295L88542M8639K4158K34491J80652P7236J12858L62088p656
5474A2901132J04253M07911J21171j48000j75690j40795l00162L94887L70179
5465A3534886K03516J78426R0045J38459L05435L64087K4013J31371n3923L75854
5455A5292169K61181j174L15269K74700j1190N41201L47721Q1411o2317O5897
5445A7104868J09028L63785k18539M68162O74494K34320L45845P3508R9406L37540
5435A9592417J05039j3333O10666L23257K56150O2729R7438J29444M83574K31475
5425B1878856J42326M12031L96222J53134J12898N96765J33829N29909O23883
$$ y = [10784404, 10640720, 10624925, 10994898, 11114021, 11158119, 11242657, 11408731, 11606461, 11445172, 11423829, 11480124, 11868666, 11917305, 11941463, 12175954, 12356606, 12433842, 12546700, 12908788, 12901132, 13005385, 13413296, 13534467, 13386467, 13210777, 13069982, 12769820, 13164707, 13534886, 13738402, 13916828, 14006873, 14145332, 14450767, 14814854, 14838867, 14970238, 14916315, 15292169, 15553350, 15552176, 15867445, 16142145, 16130955, 16672156, 17019877, 17101288, 17038971, 17104868, 17213896, 17577681, 17359142, 17827304, 18501798, 18736118, 19081963, 19155471, 19254877, 19592417, 19697456, 19684123, 20294789, 20618046, 20874196, 20936925, 21034363, 21163807, 21647381, 21878856, 22021182, 22433213, 22829435, 22982569, 23095467, 23692232, 23826061, 24355970, 24979853]
5416B4979853J85430M13080O51983M97577L52811K51591M99635M17185P80800
5407B9029945L43726M10911M61428P01424N59793N93719L16191M92971Q98480
5398C3808588L87724M37750N81117N60663P74842R65734N90855R36093K64018
5389C9307384N81074R00509J178043P72125J016136Q53903P15287P06628P24071
5380D6755160J451818J254321Q39133J088335R81533O50745J255986J186025J201578
5371E6664634J560257J089419J437957J207906J657451J582994J121673J708121
5363F8030412J778381J383213K052498J495764J353567J658152J705466J883627
5355H1341080J969289J849001J913537K231932J890647K320475K296099K197632
$$ y = [24979853, 25165283, 25578363, 26230346, 26727923, 27080734, 27332325, 27831960, 28249145, 29029945, 29373671, 29784582, 30246010, 30947434, 31507227, 32100946, 32417137, 32910108, 33808588, 34196312, 34634062, 35215179, 35775842, 36550684, 37516418, 38107273, 39043366, 39307384, 39888458, 40788967, 41967010, 42739135, 43755271, 44609174, 45324461, 46031089, 46755160, 48206978, 49461299, 50300432, 51388767, 52370300, 53021045, 54277031, 55463056, 56664634, 58224891, 59314310, 60752267, 61960173, 63617624, 65200618, 66322291, 68030412, 69808793, 71192006, 73244504, 74740268, 76093835, 77751987, 79457453, 81341080, 83310369, 85159370, 87072907, 89304839, 91195486, 93515961, 95812060, 98009692]
5347I8009692K200108K595182K800204K478787L208503K747017K774341L231407
5339A20045241L266038K960594L181883L451983L585527M178292M137191M318874
5331A49125623M263435M662012M338290M454975N278684N834609N487162N570049
5323A89014839N986654O155878O776995P004193O751275P125212P368164P568089
5315B43751299P781648Q058443Q185872Q207872Q323488Q089924Q153429Q793296
5307C09345271P684963P510619O513348O229146N582645M962084L665419K990909
5299C54484404K275172Q33298k71953j629102k656947l801888n039986n400796
5291C38792202o213307p478361q126688q075113q747241q991815q670138r087538
$$ y = [98009692, 100209800, 102804982, 105605186, 108083973, 111292476, 114039493, 116813834, 120045241, 123311279, 126271873, 129453756, 132905739, 136491266, 140669558, 144806749, 149125623, 153389058, 158051070, 162389360, 166844335, 172123019, 177957628, 183444790, 189014839, 195001493, 201157371, 207934366, 214938559, 221689834, 228815046, 236183210, 243751299, 251532947, 259591390, 267777262, 275985134, 284308622, 292398546, 300551975, 309345271, 317030234, 324540853, 331054201, 337283347, 342865992, 347828076, 351493495, 354484404, 356759576, 357592874, 357320921, 355691819, 353034872, 349232984, 344192998, 338792202, 332578895, 325100534, 316973846, 308898733, 300151492, 291159677, 282489539, 273402001]
5283B73402001r143199r220478q554611r050609q269862p784469p864351p790712
5275B05723710p319603p076834p000489o783000n847793n725155n585245n611643
5267A54773948n572307m827948m901102m408717m582253m111048l817672l931397
5259A18621504m090841l616407l668518l398354k696910k350127l069840l517809
5251I2212698k792437k224053k468873k499073k596947k270521j840242k312133
5243G3208419k142209j895703j811716j547383j215548j881881j410623j361834
5235E9941522j815539j566953p21295j187655j277895j662547j279281j458802
5227D8971555j017060o73269j348677n76416j056363j012317q47943q55378r50473
$$ y = [273402001, 264258802, 255038324, 246483713, 237433104, 229163242, 221378773, 213514422, 205723710, 198404107, 191327273, 184326784, 177543784, 171695991, 165970836, 160385591, 154773948, 149201641, 144373693, 139472591, 135063874, 130481621, 126370573, 122552901, 118621504, 114530663, 110914256, 107245738, 103847384, 101150474, 98800347, 95730507, 92212698, 89420261, 87196208, 84727335, 82228262, 79631315, 77360794, 75520552, 73208419, 71066210, 69170507, 67358791, 65811408, 64595860, 62713979, 61303356, 59941522, 58125983, 56559030, 55837735, 54650080, 53372185, 51709638, 50430357, 48971555, 47954495, 47281226, 45932549, 45356133, 44299770, 43287453, 42439510, 41584132, 40633659]
5218D0633659j330392o64727q03182m69132p35608p83836p06766q68940m18256
5209C3852820r38670n33120q11277o87967o12341j114863k64198k71267o16495
5200B8002622o28862n24633r21023l19415K0452l82580o79424j11330o63785l76428
5190B3415594n24079p6955j75854o05215o51232n02855j98284k25670q8290p83542
5180A9583618l45396j55772J89099o74324l94057j88296n10390m71207l54685
5171A6678590k25121q2323k76955j06264Q8639m13018k74798k77036k95345l58617
5161A4457752l26906J56485j81977j01899n69129p97659P6662k57867J41241j35105
5151A2461598l18650j4810P6198J87282m45382l70276N1929p4290l01391k01921
$$ y = [40633659, 39303267, 38638540, 37835358, 37366226, 36630618, 35846782, 35140016, 34271076, 33852820, 32914150, 32381030, 31569753, 30881786, 30269445, 29154582, 28890384, 28619117, 28002622, 27373760, 26849127, 25928104, 25608689, 25629141, 25246561, 24567137, 24455807, 23792022, 23415594, 22891515, 22814560, 22638706, 22033491, 21382259, 20879404, 20681120, 20455450, 20367160, 19583618, 19238222, 19082450, 19271549, 18597225, 18203168, 18014872, 17504482, 17033275, 16678590, 16453469, 16371146, 16094191, 15987927, 16076566, 15663548, 15388750, 15111714, 14816369, 14457752, 14130846, 14287331, 14105354, 14003455, 13434326, 12636667, 12713329, 12455462, 12596703, 12461598, 12142948, 12128138, 12204336, 12391618, 11946236, 11575960, 11627889, 11553599, 11252208, 11050287]
5141A1050287j96708P1098k16724J16906M8995k80329j12768k899K466k78902
5131A0201422j83991k43745p6184K7014K65732k21274l56937J80591l65115m14339
5121H813174J41829k41812k24369j90769k71219L41370J9867m33780k46607Q3201
5111G790885J0779J81779k70076k53108k47756m80821K49540q9431J06231j37540
5101F860482m16940j7289l5451P9059j16053O1392J26919j47456l84471N25294
5091F535486n27469k04261J44145J93399k59969m28755L72874j59724l66818L17062
5081E615970k44914j60633j58183j30256L73673j97311k74299K00852r2927j60815
5071D771157j46163J71547m65059J67241K57103m7853L65914n75238M4426k74020
$$ y = [11050287, 10853579, 10924677, 10707953, 10824859, 10873854, 10593525, 10480757, 10477858, 10480324, 10201422, 10017431, 9773686, 9697502, 9724516, 9990248, 9768974, 9412037, 9592628, 9227513, 8813174, 8955003, 8713191, 8488822, 8298053, 8026834, 8368204, 8388071, 7954291, 7707684, 7790885, 7801664, 7983443, 7713367, 7460259, 7212503, 6731682, 6981222, 6891791, 6998022, 6860482, 6443542, 6426253, 6390802, 6469861, 6353808, 6415200, 6542119, 6394663, 6010192, 6535486, 6008017, 5803756, 5947901, 6141300, 5881331, 5452576, 5825450, 5665726, 5298908, 5615970, 5371056, 5210423, 5052240, 4921984, 5295657, 5098346, 4824047, 5024899, 4931972, 4771157, 4624994, 4796541, 4331482, 4498723, 4755826, 4707973, 5073887, 4498649, 4543075, 4269055]
5061D269055j69060J69831J97332k13199m27831l8338L15134K04805K0458K6213
5051D354400k03197j82088r1743K54403l54621J43031R6093k54563j68927K16409
5041C809197k0089p0368Q6560k87126N5181j70732K27377m314k8449J55256N9177
5030C811670l39974j36437j55567m506j56194j02498K88775M66322l15399n22538
5020B833654Q8705J32603k90498Q3548J47123J08859m57502k10386K39684J51881
5010B827671j16369j58036M44191J5410l24025K71860n36967J11396L3417o9502
5000B499046L23345J88296k57443O01138K2145p26832j62844J60387n0967N0798
4990B647069J90758l5936k93646J41133M4551j48373j25087j12071K13372n5344
$$ y = [4269055, 4099995, 4269826, 4467158, 4253959, 3826128, 3787790, 4102924, 4307729, 4328187, 4354400, 4151203, 3969115, 3877372, 4131775, 3777154, 3920185, 4016278, 3761715, 3592788, 3809197, 3789108, 3718740, 3805300, 3518174, 3573355, 3402623, 3630000, 3625686, 3597237, 3752493, 3811670, 3471696, 3335259, 3179692, 3175186, 3018992, 2916494, 3205269, 3671591, 3356192, 2833654, 2922359, 3054962, 2764464, 2848012, 2995135, 3103994, 2646492, 2436106, 2675790, 2827671, 2711302, 2553266, 2997457, 3012867, 2688842, 2960702, 2423735, 2535131, 2568548, 2499046, 2822391, 3010687, 2753244, 3354382, 3376527, 2649695, 2486851, 2647238, 2596271, 2647069, 2837827, 2801891, 2508245, 2649378, 2693929, 2545556, 2420469, 2308398, 2521770, 2466426]
4980B466426K78130m55842J98871N15401J7620l06188k17389n3364K28350j35626
4970B536389j94666j22434n44496N65089j15972R2417J15918n4171K82642J67993
4960B728709K58058o20576K29542K0652K00579k93221j93207N5758j32245K1898
4950B275947L10086R914P0592k83000Q7511q1730k44993L8797J95760k16832M56368
4939B618420J21893l12786L46783j33901K86707k95681J99932l78702j53536J59792
4929B458921l14104K59529O1917O2694R6773J6650j41260j5936J05065m77587
4919B112662j28378N44107L96417l4900j16414n0141k85054L03865P5168J5671
4909B833003P1915J49173j31669L8232m3213m29271K12359J98094N5000r9196
$$ y = [2466426, 2744556, 2288714, 2487585, 3002986, 3020606, 2714418, 2497029, 2443665, 2672015, 2536389, 2341723, 2219289, 1674793, 2239882, 2123910, 2216327, 2332245, 2278074, 2560716, 2728709, 2986767, 2366191, 2595733, 2616385, 2816964, 2523743, 2330536, 2386294, 2254049, 2275947, 2586033, 2595947, 2666539, 2383539, 2471050, 2389320, 2144327, 2183124, 2378884, 2162052, 2618420, 2740313, 2427527, 2774310, 2640409, 2927116, 2631435, 2831367, 2452665, 2299129, 2458921, 2144817, 2404346, 2466263, 2528957, 2625730, 2642380, 2501120, 2485184, 2590249, 2112662, 1984284, 2528391, 2924808, 2889908, 2773494, 2723353, 2438299, 2742164, 2817332, 2833003, 2904918, 3054091, 2922422, 2960654, 2917441, 2488170, 2700529, 2898623, 2953623, 2854427]
4899B854427o3768j72075J97203J99857j3245j26201M15613K45275k59565j1387
4889C266134k13309L77326J53909r8008m6127P8011k7777J19272Q3194m31504
4879C261121Q0400L46043J85508O6053R0918j21872K58640J37497J05613L22428
4869D732349N14855k80333k17742k28507M24949J32074j17246J86684M03578L73108
4859E923769q23710Q6710K09094L24678K00435L2777L43584Q17141j69288K45674
4849G190864K42916K18821N28408N73514Q50296K37588P10011J73309j56928J26766
4839A0695565l00671l79659k65671k92576j58985p19915j093593J81566o4594
4830G601467r9051q01314o10185r3599k1359m9191J28532l48760l49503j4320
$$ y = [2854427, 2790659, 2618584, 2815787, 3015644, 3002399, 2876198, 3291811, 3537086, 3277521, 3266134, 3052825, 3430151, 3584060, 3486052, 3439925, 3517936, 3490159, 3609431, 3692625, 3261121, 3341521, 3687564, 3873072, 3939125, 4030043, 3908171, 4166811, 4304308, 4409921, 4732349, 5247204, 4966871, 4749129, 4520622, 4945571, 5077645, 4960399, 5147083, 5550661, 5923769, 5100059, 5186769, 5395863, 5720541, 5920976, 5953753, 6297337, 7114478, 6945190, 7190864, 7433780, 7652601, 8181009, 8754523, 9604819, 9842407, 10552418, 10725727, 10568799, 10695565, 10394894, 10015235, 9749564, 9456988, 9298003, 8578088, 7484495, 7666061, 7601467, 7502416, 6701102, 6090917, 5997318, 5975959, 5926768, 6055300, 5706540, 5357037, 5342717]
4820E342717j50224n0322j16365j84892r3403r1738J45860k33006K39857m6124
4810D762360m94667J91303J99291M86301n38991j08656M0470j68835j60835k93203
4800C914538k93519L25766M39796j20149j78540M0253j05724q1440N0973j03040
4790C888914l5761J88160n32936L39317J15598m86044K85233L80671k16462l8686
4780C888004M4482P4634j63276q4761l45921M39940N4124J88364J75221K82574
4770D553385j43808n40461M6751O3959L14666o1745k11891j32325j39479k51163
4760C497889Q7371O8381J01757l4644o82327j63808J19170N67813j50167k29420
4750C182015l22082j64792L04632k5580m10743K20953j3365j51179l4848j4681
$$ y = [5342717, 5192493, 5142171, 5025806, 4840914, 4747511, 4655773, 4801633, 4568627, 4808484, 4762360, 4267693, 4458996, 4658287, 5144588, 4605597, 4496941, 4537411, 4368576, 4207741, 3914538, 3621019, 3946785, 4386581, 4266432, 4087892, 4128145, 4022421, 3940981, 3991954, 3888914, 3853153, 4041313, 3508377, 3847694, 3963292, 3477248, 3762481, 4143152, 3926690, 3888004, 3932486, 4007120, 3843844, 3759083, 3413162, 3853102, 3907226, 4095590, 4270811, 4553385, 4409577, 3869116, 3915867, 3979826, 4294492, 4232747, 4020856, 3888531, 3749052, 3497889, 3585260, 3653641, 3755398, 3720754, 3038427, 2874619, 2993789, 3561602, 3411435, 3182015, 2859933, 2695141, 2999773, 2974193, 2563450, 2784403, 2771038, 2619859, 2585011, 2570330]
4740B570330J0347l53620K61161J65764J76310l26706M02090k59934m69385P398
4730B183755J78837L9991j35419J5840k31664K26133J38829R1084k98719k30530
4720A978137K6218J87796J3469j18346M00761N7313k32332k98872K2462k4435
4710B012171L67607k82221L158J07721j40102m2620L46817J6517m86675r1000
4700A811373q4632K6717J44351j56414j9470L58067K68191l60903J74935L88324
4690B550539J4040q3941l61887J33251j43887j09129L14265l19126j48939K71363
4680B116549M1229M18658J63358n32818j18507j00269k42096L46775M09474o18832
4670A883521K68525l02114j31240R1684K60247J45236k44492m24056J06143P1922
$$ y = [2570330, 2580677, 2227057, 2488218, 2653982, 2830292, 2503586, 2905676, 2645742, 2176357, 2183755, 2362592, 2402583, 2267164, 2283004, 2051340, 2277473, 2416302, 2507386, 2208667, 1978137, 2004355, 2192151, 2205620, 2087274, 2488035, 2545348, 2313016, 2014144, 2036606, 2012171, 2379778, 2097557, 2100715, 2208436, 2068334, 2025714, 2372531, 2389048, 1902373, 1811373, 1726741, 1753458, 1897809, 1741395, 1721925, 2079992, 2348183, 1987280, 2162215, 2550539, 2564579, 2480638, 2118751, 2252002, 2108115, 1998986, 2313251, 1994125, 1845186, 2116549, 2157778, 2576436, 2739794, 2206976, 2088469, 1988200, 1746104, 2092879, 2502353, 1883521, 2152046, 1849932, 1718692, 1810376, 2070623, 2215859, 1971367, 1547311, 1653454, 1725376]
4660A725376K07426L81015j32277O2374j24645k72672j53290K09252j951j14329
4650A786279N01349k69946N79470k12911m02725M27970j59704K58148o9361l57473
4640B081096j0083L74325l68758J60420J27287q9134Q0694j9083n63206K71016
4630B044574K95118q7012k63396J85805n8100l60905J39103K48531P4431j47679
4620B070470j78289o695K36265J34494J22121P7930m5790L23993J51070L7034
4610B922603j03838J64275n07065K27129P9083j61410K76249p8469j15119l7161
4600B666277M49525p9956l80755l9077J85504l68460k55135P22660k40362j23472
4590B536749K79694J16484r4209k66571k67061j33739L81275K15184q5002m72125
$$ y = [1725376, 1932802, 2313817, 2181540, 2243914, 2119269, 1846597, 1693307, 1902559, 1900608, 1786279, 2287628, 2017682, 2597152, 2384241, 1981516, 2409486, 2249782, 2507930, 2438569, 2081096, 2071013, 2445338, 2076580, 2237000, 2364287, 2275153, 2355847, 2336764, 1773558, 2044574, 2339692, 2252680, 1989284, 2175089, 2116989, 1756084, 1895187, 2143718, 2218149, 2070470, 1892181, 1885486, 2121751, 2256245, 2378366, 2456296, 2410506, 2734499, 2885569, 2922603, 2818765, 2983040, 2475975, 2703104, 2782187, 2620777, 2897026, 2818557, 2703438, 2666277, 3115802, 3035846, 2655091, 2616014, 2801518, 2433058, 2177923, 2900583, 2660221, 2536749, 2816443, 2932927, 2838718, 2572147, 2305086, 2171347, 2552622, 2767806, 2682804, 2210679]
4580B210679k12478L22974J76056K49639L01935k50660m6630j61079k27821J1875
4570B374490N22476j13600l41243l91188K27254k59352K54196L50724q2776N72
4560B541553P3577Q4677J42002K9823O2005r7678n25016L34089K50047R4076m81927
4549B507228O7632Q5752J48170j14812m71025J99843N13612j12217n4465m1098
4539B728620j55992o8687P10Q5227q1867n78782L23860K17969m23083n531J94308
4528B236752q1985J4694n8429j55216N34348M27436m56895j1379K21421J58187
4518B828934q7029K23240J19716l75473R15J84880k49933O2657l19789k53043
4508B135075K79788J33545R9373L3199o8356k11830K35029L51963o2415K96654
$$ y = [2210679, 1998201, 2321175, 2497231, 2746870, 3048805, 2798145, 2751515, 2590436, 2362615, 2374490, 2896966, 2783366, 2442123, 2050935, 2278189, 2018837, 2273033, 2623757, 2540981, 2541553, 2615130, 2699807, 2841809, 2871632, 2933637, 2835959, 2310943, 2645032, 2895079, 2989155, 2507228, 2574860, 2660612, 2808782, 2693970, 2222945, 2422788, 2936400, 2824183, 2769718, 2728620, 2572628, 2503941, 2504651, 2589878, 2508011, 1929229, 2253089, 2471058, 2047975, 2042444, 2236752, 2154767, 2169461, 2111032, 1955816, 2490164, 2917600, 2460705, 2449326, 2670747, 2828934, 2741905, 2965145, 3084861, 2709388, 2710303, 2895183, 2645250, 2707907, 2388118, 2135075, 2414863, 2548408, 2647781, 2680980, 2612624, 2400794, 2635823, 2987786, 2925371, 3222025]
4498C222025j32938N1002M433l0085j46035j5043j63689l11337M48770N199P1882
4487C004184J5193K22460R0371k8778J78205k11763K24214K3530M866j27511j94234
4476C200737K15267Q589j24265K646J12137l34571O34305j24404m66967n6497
4466C066977J58950L15730L33129l13610J05250N11108L00069k72891K31105l5996
4456D399821o1888r1364L81044o8343o1291M17360L41459l28088o9282J99409
4446E058837L20343m52824K72237J19019m3035K49969N96221Q1489M39538l3986
4436F607808M2905J00538J34874R3155J72316K59619N1470K2776j63276L23926
4426G646111L55002O74428J94142L87141O6944J45664J69311Q9159J05050K58903
$$ y = [3222025, 3089087, 3140089, 3144522, 3114437, 2968402, 2953359, 2789670, 2478333, 2927103, 2932302, 3004184, 3019377, 3241837, 3332208, 3303430, 3481635, 3269872, 3494086, 3517616, 3522482, 3394971, 3200737, 3416004, 3424593, 3300328, 3302974, 3415111, 3080540, 3714845, 3590441, 3123474, 3066977, 3225927, 3541657, 3874786, 3561176, 3666426, 4177534, 4477603, 4204712, 4435817, 4399821, 4337933, 4246569, 4627613, 4559270, 4497979, 4915339, 5256798, 4928710, 4859428, 5058837, 5379180, 4926356, 5198593, 5317612, 5274577, 5524546, 6120767, 6202256, 6641794, 6607808, 6650713, 6751251, 6886125, 6979280, 7151596, 7411215, 7462685, 7485461, 7322185, 7646111, 8001113, 8675541, 8869683, 9256824, 9323768, 9469432, 9638743, 9727902, 9832952, 10091855]
4416A0091855L18766L51183p5567N84690L34815K69395O76387N31723L89726J99517
4406A3672490J77287K38053j4723Q3606O78187Q73650L45033N28214N21805O15832
4396A7719434N98959P96260J138974J382949P06112J115315J375101J800067J469000
4387B8102171J530764J819247J712513J871775K070381J833916J898722J630298
4379D2469787K091133J812729J858050K248364J989322J435712J532939J245588
4371E6683624R52578J104018J638204O70771R67702O14851j54527m15311q27400
4362F1234510o92292r36868j393324j127750j540976j990837j600456j810723
4354E0141284k124178k396445k092279j768545k180465k413073j546199j731486
$$ y = [10091855, 10410621, 10761804, 10686237, 11270927, 11605742, 11875137, 12551524, 13083247, 13472973, 13672490, 13849777, 14087830, 14073107, 14156713, 14834900, 15708550, 16053583, 16581797, 17103602, 17719434, 18318393, 19114653, 20253627, 21636576, 22342688, 23458003, 24833104, 26633171, 28102171, 29632935, 31452182, 33164695, 35036470, 37106851, 38940767, 40839489, 42469787, 44560920, 46373649, 48231699, 50480063, 52469385, 53905097, 55438036, 56683624, 57636202, 58740220, 60378424, 61049195, 62016897, 62631748, 62477221, 62061910, 61234510, 60542218, 59605350, 58212026, 57084276, 55543300, 53552463, 51952007, 50141284, 48017106, 45620661, 43528382, 41759837, 39579372, 37166299, 35620100, 33888614]
4346C3888614k020935j878733j719012j398493k137912j638129j250695j206632
4338B0638073j200734j401570p62709j161500m00986o85112n2232p33717p94743
4329A3444770k96220n44272l36667n97152l86439n37286k16605K32552q25036
4320I937645j92946K9242l38630q13760k34214J15146k22577l61363l98534L33858
4310G853867l46688j64935L8490k48893k14633k62244k7874k94984k69565j64247
4300E898294K04974j53539o5828p6631k53204j54266M7198j65780J19384j07902
4290E292700k41131J90250l90590P8306K41014J59510N9438J42n61384q9189P9504
4279D818570L5895R7416m17700J35500Q2647J48707j84673K6144K24961J8919
$$ y = [33888614, 31867679, 29988946, 28269934, 26871441, 24733529, 23095400, 21844705, 20638073, 19437339, 18035769, 17273060, 16111560, 15710574, 15025462, 14973230, 14239513, 13444770, 13148550, 12604278, 12267611, 11670459, 11284020, 10746734, 10530129, 10762681, 9937645, 9744699, 9773941, 9435311, 8621551, 8387337, 8502483, 8279906, 7918543, 7520009, 7853867, 7507179, 7342244, 7380734, 7131841, 6917208, 6654964, 6627090, 6332106, 6062541, 5898294, 6103268, 5949729, 5883901, 5807270, 5554066, 5399800, 5446998, 5281218, 5400602, 5292700, 5051569, 5241819, 4851229, 4929535, 5170549, 5330059, 5389497, 5389639, 4828255, 4739066, 4818570, 4854465, 4951881, 4534181, 4669681, 4752328, 4901035, 4716362, 4742506, 4967467, 4986386]
4269D986386k979k2080r8676k88312L14567J04774K39860m67560q2031k28542
4259D455407R6848j27806J05357K27785J03036m03183m2503L42195n26354J66868
4249D397650L676K44617l45988K05377K82980k27432j34349K22624L71088M62686
4239E482929l64770p3861N9211O06859K13825k59668l15104k30493N08943k21792
4229E406079j24422j53053m53810K74419O15062k84071m47349J35181L05160k73832
4219D999364j78024p3155j14909n52249k47157P94060p663j84964j43216k90675
4209D001412J45293J08791J27899J25023J94898l29976J40692N60806k79538k69876
4199D525424N01928K19571k56268P4338J68968L01357k38088L59636n06126J8411
$$ y = [4986386, 4983407, 4961327, 4862651, 4574339, 4888906, 4993680, 5233540, 4765980, 4683949, 4455407, 4552255, 4424449, 4529806, 4757591, 4860627, 4457444, 4414941, 4757136, 4230782, 4397650, 4401326, 4645943, 4299955, 4505332, 4788312, 4560880, 4426531, 4649155, 5020243, 5482929, 5118159, 5044298, 5103509, 5710368, 5924193, 5664525, 5349421, 5118928, 5627871, 5406079, 5281657, 5128604, 4674794, 4949213, 5564275, 5280204, 4832855, 4968036, 5273196, 4999364, 4821340, 4748185, 4633276, 4081027, 3833870, 4627930, 4620267, 4435303, 4292087, 4001412, 4146705, 4255496, 4383395, 4508418, 4703316, 4373340, 4514032, 5074838, 4795300, 4525424, 5027352, 5246923, 4990655, 5064993, 5233961, 5535318, 5297230, 5656866, 5150740, 5169151]
4189E169151O65929K8443J04531K34724k59847m57959Q19057k6722J19306j10384
4179F286229p5215L75322j3204q7274J62176j59998k07388O6550Q1798n1375k06524
4168F171097K50659J62993L82634j53578Q9893l23344o1845K96108l17332j8078
4158F479207O68327J32412j43209k58590L35731P0032p9365k24168m77598L67666
4148F870445J45840J68265j79754J56866N4157J4571L0226j16890M28086R523
4138G581335m87988K67833K53559j6803k44885M6301K9255J19909J4495J54224
4128G717235K44023j28898j88745K94093M5439L55820l21708k20851L82912Q8727
4118H268047O93076M28309m9931j57072n9560m9437J5784L14265k441n2652K37370
$$ y = [5169151, 5835080, 5863523, 5968054, 6202778, 5942931, 5484972, 6304029, 6277307, 6396613, 6286229, 6211014, 6586336, 6573132, 6485858, 6648034, 6488036, 6280648, 6347198, 6428996, 6377621, 6171097, 6421756, 6584749, 6967383, 6813805, 6903698, 6580354, 6518509, 6814617, 6497285, 6479207, 7147534, 7279946, 7136737, 6878147, 7213878, 7283910, 7204545, 6980377, 6502779, 6870445, 7016285, 7184550, 7004796, 7161662, 7215819, 7230390, 7260616, 7143726, 7571812, 7581335, 7093347, 7361180, 7614739, 7597936, 7353051, 7399352, 7428607, 7548516, 7563011, 7717235, 7961258, 7832360, 7643615, 7937708, 7983147, 8338967, 8017259, 7796408, 8179320, 8268047, 8961123, 9389432, 9339501, 9182429, 9122869, 9073432, 9089216, 9403481, 9401040, 9348388, 9585758]
4107I585758M7941m64285J18499k50968N7882j09481k12173n105k67503J88312
4097H688877R6559m3617L139M9157j53485q5452J94911K8005q2595Q2932L60380
4086I138811l11451m93428k9885j45033K09360N86784k93492k87227n19947J55130
4076H009622L60677q3974J11446M81944j77622l02769M40301L93382K5086j21168
4066I136925l15624k24009J73396p0390K4095j80348K31477J87633L920j823p5693
4055H889559M06306J92185k20341K66369K29840L49690J82862P3192k54225K95743
4045A0411180J66212K72543J4859M09110M23130J60128q7K47817J28240M22311
4035A2655443J94781K39578M77222M02577L98231M84501L78248P24132P55832
$$ y = [9585758, 9633699, 9169414, 9287913, 9036945, 9094827, 8985346, 8773173, 8768068, 8500565, 8688877, 8785436, 8741819, 8744958, 8794115, 8640630, 8555178, 8750089, 8778094, 8695499, 8778431, 9138811, 8827360, 8333932, 8304047, 8159014, 8368374, 8955158, 8661666, 8374439, 7854492, 8009622, 8370299, 8286325, 8397771, 8879715, 8702093, 8399324, 8839625, 9233007, 9258093, 9136925, 8821301, 8597292, 8770688, 8700298, 8724393, 8544045, 8775522, 8963155, 8967075, 8965252, 8889559, 9295865, 9488050, 9267709, 9534078, 9763918, 10113608, 10296470, 10369662, 10115437, 10411180, 10577392, 10849935, 10864794, 11273904, 11697034, 11857162, 11857075, 12104892, 12233132, 12655443, 12850224, 13089802, 13567024, 13969601, 14367832, 14852333, 15230581, 15954713, 16710545]
4026A6710545R98555L87819J020680J024234J031537P98572N33199O70343Q44789
4017B4020273M2239m1923J53997m79927l15224n35196o1047m85537k19494j84078
4007B1894083J95859j81401J96261L20109M15733J83993R14499Q70345J101856
3998B5911337J690411J640260J606382J415917J776470J972597K096583J443739
3990C9553696J250655J172595J098796J066674J016294J270710J399943J773932
3982D9603295J176852p69592j895199j833108j957614k625053k864951k386918
3974C6447712k350917k227512j699750j331797j127637j310046j346177p55541
3966B4298335o13553o27815p58422j60113k03412j70504o41978n19965j02261
$$ y = [16710545, 17709100, 18096919, 19117599, 20141833, 21173370, 21971942, 22505141, 23175484, 24020273, 24062512, 24020589, 24174586, 23694659, 23379435, 22844239, 22783192, 22297655, 22078161, 21894083, 22089942, 21908541, 22104802, 22424911, 22840644, 23024637, 23939136, 24809481, 25911337, 27601748, 29242008, 30848390, 32264307, 34040777, 36013374, 38109957, 39553696, 40804351, 41976946, 43075742, 44142416, 45158710, 46429420, 47829363, 49603295, 50780147, 50010555, 48115356, 46282248, 44324634, 41699581, 38834630, 36447712, 34096795, 31869283, 30169533, 28837736, 27710099, 26400053, 25053876, 24298335, 23684782, 23056967, 22298545, 22138432, 21935020, 21764516, 21122538, 20602573, 20500312]
3957B0500312J86096J1559k6331O1787J63656N58034L65327M26249j5020J95978
3947B2427647M48165r7080l8641m02505n73120n88949l43505p63328j219700m06838
3937A8442146o46476p74489r38904q29249o04610n00711o54775l57632n79917
3928A2555383n79021m23000k20196n32457J59963j28955k34855l42653m97l29361
3918I924351K69952l3349l68205j48810m9597P8073n24785Q447m6868L45448l99666
3907I054991J99078J44314O8274k74551J44554Q416l97103N43826L15979J39619
3897I947397J68694N5671k46690L09144L06327L6773q464k41038j80454N25281
3887A0672641k06223n65416k84678l17927Q9965n83552j87668j48577M7392r9350
$$ y = [20500312, 20686408, 20697967, 20671636, 20733423, 20897079, 21455113, 21820440, 22246689, 22231669, 22427647, 22875812, 22778732, 22740091, 22337586, 21764466, 21175517, 20832012, 20068684, 18848984, 18442146, 17795670, 17021181, 16082277, 15253028, 14648418, 14147707, 13492932, 13135300, 12555383, 11976362, 11553362, 11333166, 10800709, 10960672, 10831717, 10596862, 10254209, 10253712, 9924351, 10194303, 10160954, 9792749, 9643939, 9594342, 9672415, 9147630, 9156077, 9109209, 9454657, 9054991, 9254069, 9398383, 9466657, 9192106, 9336660, 9345076, 8947973, 9491799, 9807778, 9947397, 10116091, 10171762, 9925072, 10234216, 10540543, 10577316, 10568852, 10327814, 10147360, 10672641, 10466418, 9901002, 9616324, 9298397, 9388362, 8804810, 8617142, 8468565, 8515957, 8416607]
3877H416607n0725R3542K90603q0336k6469l293L17296j06437Q8780j25005o7878
3866H746685j05038K2807M88506l34143j1360n4314M8700j44452K06960M3603
3856H907954j64086o2891J0094P2554J44690J50900l1713k59919j07262M50835
3846I111156j68279K54910l72172K00637J85142K33693K27689l93055L22667J06457
3836I708845M8094P36702M60571l34439M2527L09040K39333K32210L31387L16444
3826A2090714L9368N17636L62674M4231K19172L20222O76016M75632k5524m2115
3816A4678026K64377K2141K86316K33220k01049L70639K96161k4415P9222q4932
3806A5919706n1072r5768J70266k40864J52537k33486j96796o1080K00395j66171
$$ y = [8416607, 8365882, 8459424, 8750027, 8669691, 8643222, 8639929, 8957225, 8850788, 8939568, 8814563, 8746685, 8641647, 8664454, 9152960, 8818817, 8807457, 8753143, 8801843, 8657391, 8864351, 8907954, 8743868, 8680977, 8691071, 8763625, 8908315, 9059215, 9027502, 8767583, 8660321, 9111156, 8942877, 9197787, 8825615, 9026252, 9211394, 9445087, 9672776, 9279721, 9602388, 9708845, 9756939, 10493641, 10954212, 10619773, 10662300, 10971340, 11210673, 11442883, 11774270, 12090714, 12130082, 12647718, 13010392, 13054623, 13273795, 13594017, 14270033, 14745665, 14720141, 14678026, 14942403, 14964544, 15250860, 15484080, 15283031, 15653670, 15949831, 15925416, 16004638, 15919706, 15868634, 15772866, 15943132, 15702268, 15854805, 15621319, 15424523, 15363443, 15563838, 15397667]
3796A5397667l14549M2529l92665l7809r1478l84924K38995M1438J18621l23294
3786A4294531K16843O5519m46770J86381l8641J05767L36820o1396L85546M69447
3776A5514047K84959M51974K94317K67410k37567L69664N70925M70852R66357
3767A8952938O74252L86003L32051M21354O14947Q91080N99190N13455j78597
3758B3206673P3032l59779l97058n25355q15924n61546m60929m98314j078007
3749A8582793r89384q86943q24902n97065n09436r63321o75882o37781J36262
3740A2634341j11260p25505p3249l6820k89146K0879l69825K3958j59819k24821
3730A0688733K41263o3733j40660J14218R0586k26240L2661k76235J84293j66878
$$ y = [15397667, 15083118, 15125647, 14732982, 14695173, 14603695, 14218771, 14457766, 14499204, 14617825, 14294531, 14511374, 14576893, 14130123, 14316504, 14277863, 14383630, 14720450, 14659054, 15044600, 15514047, 15799006, 16250980, 16545297, 16812707, 16575140, 16944804, 17515729, 17986581, 18952938, 19627190, 20013193, 20345244, 20766598, 21381545, 22272625, 22871815, 23385270, 23206673, 23279705, 22919926, 22522868, 21997513, 21181589, 20620043, 20159114, 19660800, 18582793, 17593409, 16706466, 15881564, 15284499, 14775063, 13811742, 13135860, 12498079, 12634341, 12523081, 11797576, 11724327, 11687507, 11398361, 11419240, 11049415, 11073373, 10913554, 10688733, 10929996, 10866263, 10725603, 10839821, 10930407, 10704167, 10736828, 10460593, 10644886, 10478008]
3720A0478008n3852J22970K36074l39005J21648K52263l94329J80405K52923L02954
3710A1160059q8346J6576N85408j30243n4863K57861r0724K30971P9381K06331
3700A2172411L00486K60686Q2580l5540L95982K46074J41305K56597j28383K14940
3690A3907138K30904R5451L89347K42635J04082p5546J61355K38804j01972O60476
3680A5852674J60398K81478k53016j56126M16723J00699J88090k93180l70250
3671A5927490L82503J06311Q3521R0265l4516J2882L21778k3370L39l9280J23672
3660A6951595P369j0545j07179p8447Q9757j21865J57366J46010M0273L60875
3650A7435209j870j42591R5046M18373k292M2232K93959n5386J02459L06323n003
$$ y = [10478008, 10424156, 10547126, 10783200, 10444195, 10565843, 10818106, 10423777, 10604182, 10857105, 11160059, 11071713, 11088289, 11673697, 11543454, 11488591, 11746452, 11655728, 11886699, 11966080, 12172411, 12472897, 12733583, 12816163, 12780623, 13176605, 13422679, 13563984, 13820581, 13692198, 13907138, 14138042, 14233493, 14622840, 14865475, 14969557, 14894011, 15055366, 15294170, 15192198, 15852674, 16013072, 16294550, 16041534, 15885408, 16302131, 16402830, 16590920, 16297740, 15927490, 16309993, 16416304, 16499825, 16590090, 16555574, 16568456, 16890234, 16866864, 16867203, 16827923, 16951595, 16958964, 16948419, 16841240, 16762793, 16852550, 16730685, 16888051, 17034061, 17074334, 17435209, 17433339, 17290748, 17385794, 17804167, 17801875, 17844107, 18138066, 18082680, 18185139, 18491462, 18486459]
3639A8486459J44358J99498L04633O71142L39186P7476k39835L17348O67306k41981
3629B0725590K09843L97654J74718M50256K58153J79670p1399R4961P5315M69503
3619B2964264K27477L54355J70405R7831K81615N6117j31799m9733p7179K19292
3609B4112645J93473P1480R9166M53211K91531J46924L28467M18863L11222M12844
3599B6839826P55254J34018M56385N17408N43865Q17037M34562O97359J161124
3590C2356838N06502J024368J184196N98716P41508O62173O16002P56271P29090
3581C9175664J049268l370l33570p66486j631795j528093j582896j672948k262622
3572C0443152j405482j412651j576331j018754o91323j291741j543255m65991
$$ y = [18486459, 18630817, 18830315, 19134948, 19806090, 20145276, 20222752, 19982917, 20300265, 20967571, 20725590, 20935433, 21333087, 21507805, 21958061, 22216214, 22395884, 22324485, 22419446, 22494761, 22964264, 23191741, 23546096, 23716501, 23814332, 24095947, 24152064, 24020265, 23970532, 23893353, 24112645, 24306118, 24377598, 24476764, 24929975, 25221506, 25368430, 25696897, 26115760, 26426982, 26839826, 27595080, 27729098, 28185483, 28702891, 29246756, 30063793, 30498355, 31195714, 32356838, 32863340, 33887708, 35071904, 35670620, 36412128, 37074301, 37690303, 38446574, 39175664, 40224932, 40221562, 39887992, 39121506, 37489711, 35961618, 34378722, 32705774, 30443152, 29037670, 27625019, 26048688, 25029934, 24338611, 23046870, 21503615, 21037624]
3564B1037624l32122n76934J8265m20122p19557j060259k33273j8736k51685l79469
3554A7063732O852j37869l58151k90948p25877K71347l55072j47769r1379M86557
3544A5721423K2979j53711N8481k18405l93770n7479N58041n49925l00955Q8172
3534A4774851L26377m03961k07492J15711l44959M9456l8799j62213O43799l13669
3524A4439101J90531l9487K49362J65954j54867K60090N81247J20370J40488l36104
3514A5616685r3113O65828M08197O5560K81821J23195J46660j59968N5983J44275
3504A7255123J57013O5323j16258O3691L99077l17599l74300m5301m46547J36460
3494A6776682j44799j38488p1397O0892j92711l24544j5398R5269m01195l85405
$$ y = [21037624, 20705502, 20128568, 20146833, 19726711, 19007154, 17946895, 17713622, 17694886, 17443201, 17063732, 17070584, 16932715, 16574564, 16283616, 15557739, 15829086, 15474014, 15326245, 15234866, 15721423, 15744402, 15590691, 15649172, 15430767, 15036997, 14979518, 15537559, 14987634, 14686679, 14774851, 15101228, 14697267, 14489775, 14605486, 14260527, 14309983, 14271184, 14108971, 14752770, 14439101, 14629632, 14590145, 14839507, 15005461, 14850594, 15110684, 15691931, 15812301, 15952789, 15616685, 15523572, 16189400, 16597597, 16663157, 16944978, 17068173, 17214833, 17054865, 17110848, 17255123, 17412136, 17477459, 17361201, 17424892, 17823969, 17506370, 17132070, 17086769, 16640222, 16776682, 16631883, 16493395, 16421998, 16482890, 16290179, 15965635, 15950237, 16045506, 15644311, 15258906]
3484A5258906J817k18749j99220l1247p43565j63820J3503Q4708k03036j0167
3474A3789130j24285k34294K37916j4713r02781J66513M51531j63889k17559l00242
3464A2687327k83721m96045j67929N68033J51008j92599k26847M13819J64060
3455A2617106k24937k24824J99127p3468n49729l5507M10534K3350k20889J62669
3445A2083432L67764R2759k69204k23064K26572j83868L2356j65504J58533L9031
3435A2158807Q3221M24529m66636k65254K56375M39285K72187q9925j98397k72784
3425A2341408K36523k7998K59037K66940j64978M06426k60500m09492L93988K325
3415A3043679J52297M64595P0376j81311Q7629q4595p1620J93825K05692J16054
$$ y = [15258906, 15260723, 15041974, 14842754, 14811507, 14067942, 13904122, 13917625, 14002333, 13799297, 13789130, 13664845, 13430551, 13668467, 13653754, 12750973, 12917486, 13369017, 13205128, 12987569, 12687327, 12403606, 11907561, 11739632, 12307665, 12458673, 12266074, 12039227, 12453046, 12617106, 12392169, 12167345, 12366472, 12293004, 11743275, 11707768, 12118302, 12141652, 11920763, 12083432, 12451196, 12543955, 12274751, 12051687, 12278259, 12094391, 12126747, 11961243, 12119776, 12158807, 12242028, 12666557, 12199921, 11934667, 12191042, 12630327, 12902514, 12812589, 12614192, 12341408, 12577931, 12549933, 12808970, 13075910, 12910932, 13317358, 13056858, 12647366, 13041354, 13043679, 13195976, 13660571, 13730947, 13549636, 13637265, 13552670, 13481050, 13674875, 13880567, 13996621]
3405A3996621j0086j0159O48964k12373J81922K27255J14017r4646J92973j7031
3395A5017457R7990J52496j04454K74203M97688J80506K69680K13196m65333j01614
3385A6031815K81469j83628l83699O46373Q5460L94828m60690n2259m6091K14186
3375A6527764J62187k38835K65873L09117Q7078K10110K01008k0188L33864j32851
3365A7705127K84313M29256j18945L69268L72002L77834K6925Q0075M14157L02292
3355B0242304m4762O87811N85677L26373K77363O83617M86163N50470p1714K63180
3345B3986482L91046K37507L75179J9498o758R50836K54406P7897J48233q7916
3335B6346410K26180N27970J01092J79966M65151K11364j49657k82315J65882
$$ y = [13996621, 13986535, 13976376, 14625340, 14412967, 14594889, 14822144, 14936161, 14841515, 15034488, 15017457, 15115447, 15267943, 15163489, 15437692, 15935380, 16115886, 16385566, 16598762, 16133429, 16031815, 16313284, 16129656, 15745957, 16392330, 16477790, 16872618, 16411928, 16359669, 16313578, 16527764, 16689951, 16451116, 16716989, 17026106, 17113184, 17323294, 17524302, 17504114, 17837978, 17705127, 17989440, 18418696, 18299751, 18669019, 19041021, 19418855, 19445780, 19525855, 19940012, 20242304, 20197542, 20885353, 21471030, 21797403, 22074766, 22758383, 23244546, 23795016, 23723302, 23986482, 24377528, 24615035, 24990214, 25009712, 25002954, 25953790, 26208196, 26286093, 26434326, 26346410, 26572590, 27100560, 27201652, 27381618, 27846769, 28058133, 27908476, 27626161, 27792043]
3326B7792043L17252N61024j05021k86279K68900k94614q5012L09272k35016m29678
3316B7812871K89042k38317k41384l93257J04335L24510m66236Q3992L94081j93634
3306B7476003l79788q1175K28951J71886q0835J12606l35751j95193L98411j68976
3296B7146139L78900L03491K57456K35797J26114J46786K56069r6752J75814N41831
3286B9471645J73010K87686L08730J070874P51769j8872J33061N85651P80586
3277C3544140M28374J67894J76057J80336L45299N04028O20477M0120J58482K02168
3267C6367375J80001J24101K05067q6332M07246M16318O3463p3204L79020l22539
3257C7660516P7718R9614K67513L77406N2776k23642p8481J57189M60401k1192
$$ y = [27792043, 28109295, 28670319, 28565298, 28279019, 28547919, 28253305, 28168293, 28477565, 28242549, 27812871, 28101913, 27863596, 27622212, 27228955, 27333290, 27657800, 27191564, 27275556, 27669637, 27476003, 27096215, 27015040, 27243991, 27415877, 27335042, 27447648, 27111897, 26916704, 27315115, 27146139, 27525039, 27828530, 28085986, 28321783, 28447897, 28594683, 28850752, 28754000, 28929814, 29471645, 29644655, 29932341, 30241071, 31311945, 32063714, 32044842, 32177903, 32763554, 33544140, 33972514, 34140408, 34316465, 34496801, 34842100, 35346128, 35966605, 36006725, 36165207, 36367375, 36547376, 36671477, 36876544, 36790212, 37197458, 37613776, 37677239, 37604035, 37983055, 37660516, 37738234, 37837848, 38105361, 38482767, 38535543, 38311901, 38233420, 38390609, 38851010, 38829818]
3247C8829818J80830r4396J93748j76360O5361P21548J87794o95424J87209O08961
3237D0009089j079P2544K00231J44146N11270m8116J85220K29203j17679P74809
3227D1959638O09730N25986J30851K63649L15234J85438N72003N75754K42897
3218D5381180J10069O68899O4867J7852N08296O22034J202096L76470j10944N93108
3208D9433927M68941N09070Q73800J260772M60456J38189Q16244Q55809J210766
3199E6027974J065429M82517J015149J101762M95688M53489R40985J017203Q20812
3190F3421008Q37548P12624P5723M48149K46139p2666M62200L92481m848K28027
3180F6746385J61579J08513O58395J05910m53239j93919j45997o57492n21475
$$ y = [38829818, 39010648, 38916252, 39110000, 38933640, 38999001, 39720549, 39908343, 39212919, 39400128, 40009089, 40008010, 40080554, 40280785, 40424931, 40936201, 40888085, 41073305, 41302508, 41184829, 41959638, 42569368, 43095354, 43226205, 43489854, 43805088, 43990526, 44562529, 45138283, 45381180, 45491249, 46160148, 46225015, 46242867, 46751163, 47373197, 48575293, 48951763, 48840819, 49433927, 49902868, 50411938, 51285738, 52546510, 53006966, 53145155, 53961399, 54817208, 56027974, 57093403, 57575920, 58591069, 59692831, 60188519, 60642008, 61582993, 62600196, 63421008, 64258556, 64971180, 65046903, 65495052, 65741191, 65668525, 66130725, 66523206, 66518358, 66746385, 66907964, 67016477, 67674872, 67780782, 67327543, 67133624, 66987627, 66330135, 65808660]
3171F5808660l03550m82284o71033m36335o022k98999q30301o86223p95877m58030
3161F0840006p64392q07123m34429n35647r14530o01884o46292m59668q49361
3152E4826680m81639l91948m62517m02074Q501n46866m96698m36238k17439k25071
3142E1174691p38746n75909L6053j74295j97374k18148R1404p5751n54449m41667
3132D8325809l57581l34701k69027m82476p49955o69185k69603k73757k35971
3123D4683553j80481l61296j48428l9235p07643j37049j59192J79024l91062J2803
3113D2750994j88765l45006n31996Q3929j4741j13847l76599m46834o9258q19922
3103C9927955n03295l57989Q1541n51000n31193m94788n58373k11496k88307m65605
$$ y = [65808660, 65505110, 65022826, 64351793, 63915458, 63909436, 63610437, 62780136, 62093913, 61298036, 60840006, 60075614, 59268491, 58834062, 58298415, 57383885, 56782001, 56135709, 55676041, 54826680, 54345041, 53953093, 53490576, 53088502, 53097003, 52550137, 52053439, 51617201, 51399762, 51174691, 50435945, 49860036, 49896089, 49721794, 49524420, 49306272, 49397676, 49321925, 48767476, 48325809, 47968228, 47633527, 47364500, 46882024, 46132069, 45462884, 45193281, 44919524, 44683553, 44503072, 44141776, 43993348, 43954113, 43246470, 43109421, 42950229, 43129253, 42738191, 42750994, 42562229, 42217223, 41685227, 41769156, 41754415, 41640568, 41263969, 40817135, 40747877, 39927955, 39424660, 39066671, 39148212, 38597212, 38066019, 37571231, 37012858, 36801362, 36513055, 36047450]
3093C6047450m00271l39355l66367k03524k39265n99263j45293o46552l25192
3084C2782368l37112p43781k80362m5404n8506n17492l05416l87490q31840m50026
3074B8824939j16268l17684m46192n57904J4100K37901m86313k17400j48461P4468
3064B6861186k7014n67631J60290J61065j22198k02265K05529J12268m42480j03517
3054B6035233k41558Q2109j54662j71876l56134L70752K69419r6366Q1774L05172
3044B6123863n96337l93660j67303K15409m16982o5583j29298j94838k75575q7866
3034B4011830k9556n47875m39288K22640J9630j64639k81707j72231j14990k18010
3024B2285804k12561j15075J67480m2416q536N39207m39680l86877J10027j32087
$$ y = [36047450, 35647179, 35307824, 34941457, 34737933, 34498668, 33899405, 33754112, 33107560, 32782368, 32445256, 31701475, 31421113, 31375709, 31317203, 30799711, 30494295, 30106805, 29274965, 28824939, 28708671, 28390987, 27944795, 27386891, 27400991, 27638892, 27152579, 26935179, 26786718, 26861186, 26834172, 26266541, 26426831, 26587896, 26465698, 26263433, 26468962, 26581230, 26138750, 26035233, 25793675, 25875784, 25721122, 25549246, 25193112, 25563864, 25833283, 25736917, 25818691, 26123863, 25527526, 25133866, 24966563, 25181972, 24764990, 24699407, 24570109, 24375271, 24099696, 24011830, 23982274, 23434399, 22995111, 23217751, 23237381, 23072742, 22791035, 22618804, 22503814, 22285804, 22073243, 21958168, 22125648, 22083232, 22074696, 22613903, 22174223, 21787346, 21897373, 21765286]
3014B1765286j26991j74699K4653n20921J75296M86252l40309r5041M35193K17910
3004B1846629m79546l32871k0950j73114j32436J91682M11227L03468j72301J41954
2994B1583742j51067K51587J09520j26863J65739j29412K85408O38750k54945
2985B2372459j86859J39956q5819J40919o3969L51932K13141J92993k62535M36291
2975B3248509O43620O48649K12927K3609k72970J51072N92578M01861N84992N47818
2965B6782665O75953J30310K06464P64352R69717N31167O24026Q44684P07686
2956C2237024Q83297Q45046J035561O45926J584888J242203J239958J177626J622507
2947D2514036J492536P72626J185745R10273Q68633M32299m3451j49413m39109
$$ y = [21765286, 21638295, 21463596, 21488249, 20967328, 21142624, 21628876, 21288567, 21193526, 21628719, 21846629, 21367083, 21034212, 21013262, 20840148, 20707712, 20899394, 21310621, 21614089, 21441788, 21583742, 21432675, 21684262, 21793782, 21666919, 21832658, 21703246, 21988654, 22627404, 22372459, 22185600, 22325556, 22239737, 22380656, 22316687, 22668619, 22881760, 23074753, 22812218, 23248509, 23892129, 24540778, 24753705, 24777314, 24504344, 24655416, 25247994, 25649855, 26234847, 26782665, 27458618, 27588928, 27795392, 28559744, 29529461, 30060628, 30684654, 31529338, 32237024, 33120321, 33965367, 35000928, 35646854, 37231742, 38473945, 39713903, 40891529, 42514036, 44006572, 44779198, 45964943, 46875216, 47743849, 48176148, 48132697, 47983284, 47544175]
2938D7544175o59929r15453j142975j462808j217823j380378o22579q69814j215420
2929C8056996j281809q75952r83828k15600m51323p26059j63484l35220p89491
2920C2234230n4437j91054n23050k02873j60010M1860M55360k56987k27055Q8231
2910C1204215q8500K8073j41582P7209r8899m6476j51486q5504M09999O72893
2900C1779942l30019L72331M36393j4853K56161K00371J16525L28678P2088L28330
2890C3545947J45562N01718M75860J66843P09830q1103L34761N23457N73046N22652
2880C7418573O97177P18303R77495J017665R68593P19931R81117J099687R05625
2871D5504166P50232O44084J010753P39380K81437q320J69450l11288l11166n94587
$$ y = [47544175, 46884246, 45968793, 44825818, 43363010, 42145187, 40764809, 40142230, 39272416, 38056996, 36775187, 35899235, 34915407, 34699807, 34248484, 33522425, 33358941, 33023721, 32234230, 32179793, 31988739, 31465689, 31262816, 31102806, 31144666, 31600026, 31343039, 31115984, 31204215, 31115715, 31143788, 31002206, 31079415, 30980516, 30934040, 30782554, 30697050, 31107049, 31779942, 31449923, 31822254, 32258647, 32243794, 32499955, 32700326, 32816851, 33145529, 33217617, 33545947, 33691509, 34193227, 34669087, 34835930, 35545760, 35464657, 35799418, 36322875, 36895921, 37418573, 38115750, 38834053, 39811548, 40829213, 41797806, 42517737, 43498854, 44598541, 45504166, 46254398, 46898482, 47909235, 48648615, 48930052, 48921732, 49091182, 48779894, 48468728, 47874141]
2861D7874141p17692q54217p49898q41246o42142q05030K07590j103838m75283
2852D1892385k41042p83257m91064j30076j37868o71163q3144L75291k96615k24809
2842C9208638j33592N36718j00195L617K66555L06899L62805L33528P85159J98032
2832D1768164Q67327Q11709O57562P37576O96252M70604J52330j7667j98816l82949
2822D5562092n05127n90992l8516J6881j6056k04948n4801P7280j97179p39118
2812D3309516m78176j03742q6110k92258k61365n79340R1324J01745k51362k29378
2802D1220854L48361k37717l3126L61171k1657J44041K1214l15567n85910o26736
2792D0274928n72748m83449j087211j37126p76529o37574q44477j101208o53553
$$ y = [47874141, 47156449, 46302232, 45552334, 44711088, 44068946, 43263916, 43471506, 42367668, 41892385, 41651343, 40868086, 40377022, 40246946, 40109078, 39437915, 39354771, 39730062, 39433447, 39208638, 39075046, 39611764, 39511569, 39515186, 39781741, 40088640, 40451445, 40784973, 41570132, 41768164, 42635491, 43447200, 44104762, 44842338, 45538590, 46009194, 46161524, 46143857, 45945041, 45562092, 45056965, 44465973, 44427457, 44444338, 44428282, 44223334, 44168533, 44245813, 44048634, 43309516, 42831340, 42727598, 42641488, 42349230, 42087865, 41508525, 41599849, 41701594, 41450232, 41220854, 41569215, 41331498, 41298372, 41659543, 41637886, 41781927, 41803141, 41487574, 40901664, 40274928, 39702180, 39218731, 38131520, 37994394, 37217865, 36580291, 35735814, 34634606, 33981053]
2783C3981053q88505n16549p42513n82116q65865l89719p39605l38100q01342
2774B8116739j005091k41211l55202m07219j033692k83310l46379j93290m11991
2765B3839354j72688m44407j40845n61204m64586m09904l08220l05503m04223
2756B0627774o76618l85117k64441k76780j54364j27043j40316m01772k54174
2747A7947149n07817k65558q4090k30980l00871M6920p30562m38144k88709j63226
2737A4984112k65980q2821j93178m7334n19882l82854J58884j92036l16217L7442
2727A3180136j83073N0140m20469j42076R7768j02441k89444l73516o2137r6323
2717A1658565k33685o2442k32753M75269j64021l75849j25721o73974p3337j20484
$$ y = [33981053, 33092548, 32575999, 31833486, 31251370, 30385505, 29995786, 29256181, 28918081, 28116739, 27111648, 26870437, 26515235, 26108016, 25074324, 24791014, 24444635, 24251345, 23839354, 23666666, 23222259, 23081414, 22520210, 22055624, 21645720, 21337500, 21031997, 20627774, 19951156, 19566039, 19301598, 19024818, 18870454, 18743411, 18603095, 18201323, 17947149, 17439332, 17173774, 17089684, 16858704, 16557833, 16604753, 15874191, 15436047, 15147338, 14984112, 14718132, 14635311, 14442133, 14394799, 13874917, 13492063, 13650947, 13458911, 13142694, 13180136, 12997063, 13047203, 12626734, 12484658, 12582426, 12479985, 12190541, 11817025, 11754888, 11658565, 11424880, 11362438, 11129685, 11604954, 11440933, 11065084, 10939363, 10265389, 10192052, 10071568]
2707A0071568l0914P1582j8178l93627j85065K15306k07068r51256J51178K78344
2697I001870j58820m40970m7915J77960M9044l88462j53879J52133J27722k74489
2687H044194m57955J36281l59178l91526k5458m3196j187P8700m77280o061J11634
2676F608968k37426O0382j42624K4150m82972r2815N01748l66662j39397j48995
2666E584357m53099k35762O1895j62100o5428J41146J77940K36677r1457j52386
2656E041783j18373L98396K17906j64939l18409K6021K65052l53785r3362j04598
2646D795692q5168j85346N4559p3332m63999j21960K31533j5854J53266m13226
2636C876165m80722L01854L49663M728p7729k27663j44687K3691K9620L22165
$$ y = [10071568, 10040654, 10112236, 10094058, 9700431, 9515366, 9730672, 9523604, 8572348, 8723526, 9001870, 8843050, 8402080, 8354165, 8532125, 8581169, 8192707, 8038828, 8190961, 8318683, 8044194, 7586239, 7722520, 7363342, 6971816, 6946358, 6903162, 6901975, 6980675, 6503395, 6497334, 6608968, 6371542, 6431924, 6289300, 6313450, 5830478, 5737663, 6239411, 5872749, 5733352, 5584357, 5131258, 4895496, 4957391, 4795291, 4729863, 4871009, 5048949, 5285626, 5194169, 5041783, 4923410, 5321806, 5539712, 5374773, 5056364, 5082385, 5347437, 4993652, 4900290, 4795692, 4710524, 4525178, 4579737, 4506405, 4042406, 3920446, 4151979, 4136125, 4289391, 3876165, 3395443, 3697297, 4046960, 4051688, 3973959, 3746296, 3601609, 3625300, 3654920, 3977085]
2626C977085j03025n63641K46051j07826m15921k58426L99488L27069J50102k30195
2616C420761k91993O5615J67239j02988L14243p8347m64638j7737k9365K80380
2606C263170R6371K09617j72340m47832k96377O1941M8965L04435l54752j33622
2596B579576K24721J34635P270K6320n0316j46418j990o437m6093k67647L76766
2585B830387J7745j49549M79566Q8965k79126o15187L08114o5047M08162o1893
2575B962137j52625l00758J20019j83824K31357j43317l06288k0616K42699l35739
2565B113045L3889q8813p1228n8299K78701K29727j67413K31877J80669k50461
2555B431694K44813k77057k96582J11688J95333l54842K18190L44183k11372O5293
$$ y = [3977085, 3874060, 3310419, 3556470, 3448644, 3032723, 2774297, 3173785, 3500854, 3650956, 3420761, 3128768, 3194383, 3361622, 3258634, 3572877, 3494530, 3029892, 3012155, 2982790, 3263170, 3359541, 3569158, 3396818, 2948986, 2652609, 2714550, 2763515, 3067950, 2713198, 2579576, 2804297, 2938932, 2946202, 2972522, 2922206, 2775788, 2773798, 2767361, 2721268, 2453621, 2830387, 2848132, 2698583, 3178149, 3267114, 2987988, 2372801, 2680915, 2615868, 3024030, 2962137, 2809512, 2508754, 2628773, 2444949, 2676306, 2532989, 2226701, 2206085, 2448784, 2113045, 2146934, 2058121, 1986893, 1928594, 2207295, 2437022, 2269609, 2501486, 2682155, 2431694, 2676507, 2399450, 2102868, 2214556, 2409889, 2055047, 2273237, 2617420, 2406048, 2471341]
2545B471341o89646P8959J49042J18252j11214J07839j33907J54203k18774L60724
2535B286819k37040k19050k37496k006j50637K51161J66654K42534k55249j19585
2525A726105J95898o2585J3895l07513l57847M27332n2211m3585j04990l4869
2515A399630J21549J47797J01793J21676l69481K17922P9774J97n2042q4213l00891
2504A383711m1005l5703Q3237M31207k37925K01752J720K65406q9741l46995k28242
2493A387422k07968P755J00800J23371M25919k74365k2775l9132J4113J49077
$$ y = [2471341, 1781695, 1860654, 2009696, 2127948, 2016734, 2124573, 1990666, 2144869, 1926095, 2286819, 2049779, 1830729, 1593233, 1591227, 1440590, 1691751, 1858405, 2100939, 1845690, 1726105, 1922003, 1859418, 1873313, 1565800, 1207953, 1635285, 1583074, 1539489, 1434499, 1399630, 1521179, 1668976, 1770769, 1892445, 1522964, 1740886, 1820660, 1820857, 1768815, 1684602, 1383711, 1342706, 1307003, 1390240, 1821447, 1583522, 1785274, 1786994, 2052400, 1962659, 1615664, 1387422, 1179454, 1187209, 1288009, 1411380, 1837299, 1562934, 1540159, 1501027, 1515140, 1664217]
$$ [...]
##END NTUPLES=NMR SPECTRUM
##END=
