##TITLE=1H_EC-3290(II-2)
 CDCl3
 8 sc, 
 21.2.2023
##JCAMPDX= 6.0         $$ Bruker NMR JCAMP-DX V2.0
##DATA TYPE= NMR SPECTRUM
##DATA CLASS= NTUPLES
##ORIGIN= UXNMR, Bruker Analytische Messtechnik GmbH
##OWNER= root
$$ XWIN-NMR		Version 3.5
$$ Wed Feb 22 14:32:21 2023 Russian Standard Time (UT+4h)  she@DPX200
##.OBSERVE FREQUENCY= 200.13135
##.OBSERVE NUCLEUS= ^1H
##.ACQUISITION MODE= SIMULTANEOUS
##.ACQUISITION SCHEME= undefined
##.AVERAGES= 8
##.DIGITISER RES= 18
##SPECTROMETER/DATA SYSTEM= spect
##.PULSE SEQUENCE= zg30
##.SOLVENT NAME= DMSO
##.SHIFT REFERENCE= (INTERNAL, DMSO, 0, 15.7612)
##AUDIT TRAIL= $$ (NUMBER, WHEN, WHO, WHERE, WHAT)
$$ ##TITLE= Audit trail, XWIN-NMR		Version 3.5
$$ ##JCAMPDX= 5.01
$$ ##ORIGIN= Bruker BioSpin GmbH
$$ ##OWNER= she
$$ F:/spectra/data/she/nmr/H-F/1/pdata/1/auditp.txt
$$ ##AUDIT TRAIL=  $$ (NUMBER, WHEN, WHO, WHERE, WHAT)
(   1,<2023-02-22 14:30:05.62 +0400>,<she>,<DPX200>,
      <created by zg, POWCHK disabled, PULCHK disabled
       configuration hash MD5:
       00 E9 B6 7A A2 85 ED C7 34 08 36 98 17 FE 4E 26
       data hash MD5: 16K
       29 47 1F 2F C4 AD AA D2 47 CC 88 04 BF 1F 38 71>)
(   2,<2023-02-22 14:30:08.51 +0400>,<she>,<DPX200>,
      <Start of raw data processing
       efp BC_mod = 2 LB = 0.24 FT_mod = 6 PKNL = 1 PHC0 = -19102.02 PHC1 = 6.20074 SI = 16K 
       data hash MD5: 16K
       D5 32 13 E4 2B 7E 50 2F 6C 55 A3 8C 4C 9C 9A 2F>)
(   3,<2023-02-22 14:30:24.71 +0400>,<she>,<DPX200>,
      <pk PHC0 = -4.345026 PHC1 = 6.4 
       data hash MD5: 16K
       82 F4 BE C9 BC 63 3B 8B CD 1E 1D 18 C8 A2 54 81>)
(   4,<2023-02-22 14:30:27.89 +0400>,<she>,<DPX200>,
      <abs ABSG = 5 
       data hash MD5: 16K
       1F FF 54 2D 55 7F 35 84 6F 8C B4 B6 A7 5D CB B6>)
$$ ##END=
$$ 
$$ hash MD5
$$ 69 E6 D8 37 E8 D2 64 A7 DB C8 20 4C 35 3F C3 EF
##$RELAX= 
##$RELAX= 
##$RELAX= 
##$RELAX= 
##$RELAX= 
##$RELAX= 
$$ Bruker specific parameters
$$ --------------------------
##$DU= <F:/spectra>
##$EXPNO= 1
##$NAME= <H-F>
##$PROCNO= 1
##$TYPE= <nmr>
##$USER= <she>
##$AMP= (0..31)
100 100 100 100 100 100 100 100 100 100 100 100 100 100 100 100 100 100 
100 100 100 100 100 100 100 100 100 100 100 100 100 100 
##$AQSEQ= 0
##$AQ_mod= 1
##$AUNM= <au_zg>
##$AUTOPOS= <>
##$BF1= 200.13
##$BF2= 200.13
##$BF3= 200.13
##$BF4= 200.13
##$BF5= 200.13
##$BF6= 200.13
##$BF7= 200.13
##$BF8= 200.13
##$BYTORDA= 1
##$CFDGTYP= 0
##$CFRGTYP= 5
##$CHEMSTR= <none>
##$CNST= (0..31)
1 1 145 1 1 1 1 1 1 1 1 1 1 1 1 1 1 1 1 1 1 1 1 1 1 1 1 1 1 1 1 1 
##$CPDPRG= <>
##$CPDPRG1= <>
##$CPDPRG2= <>
##$CPDPRG3= <>
##$CPDPRG4= <mlev>
##$CPDPRG5= <mlev>
##$CPDPRG6= <mlev>
##$CPDPRG7= <mlev>
##$CPDPRG8= <mlev>
##$CPDPRGB= <>
##$CPDPRGT= <>
##$D= (0..31)
0 1.2 0 0 0 0 0 0 0 0.06 0 0.03 0 0 0 0 0.0002 0 0 0 0 0 0 0 0 0 0 0 0 
0 0 0 
##$DATE= 1677061805
##$DBL= (0..7)
120 120 120 120 120 120 120 120 
##$DBP= (0..7)
150 150 150 150 150 150 150 150 
##$DBP07= 0
##$DBPNAM0= <>
##$DBPNAM1= <>
##$DBPNAM2= <>
##$DBPNAM3= <>
##$DBPNAM4= <>
$$ [...]
##$SUBNAM3= <"">
##$SUBNAM4= <"">
##$SUBNAM5= <"">
##$SUBNAM6= <"">
##$SUBNAM7= <"">
##$SUBNAM8= <"">
##$SUBNAM9= <"">
##$SW= 18.05172834244
##$SWIBOX= (0..15)
0 0 2 0 0 0 0 0 0 0 0 0 0 0 0 0 
##$SW_h= 3612.71676300578
##$TD= 16384
##$TD0= 1
##$TE= 0
##$TE2= 300
##$TE3= 300
##$TEG= 300
##$TL= (0..7)
0 120 120 120 120 120 120 120 
##$TP= (0..7)
150 150 150 150 150 150 150 150 
##$TP07= 0
##$TPNAME0= <>
##$TPNAME1= <>
##$TPNAME2= <>
##$TPNAME3= <>
##$TPNAME4= <>
##$TPNAME5= <>
##$TPNAME6= <>
##$TPNAME7= <>
##$TPOAL= (0..7)
0.5 0.5 0.5 0.5 0.5 0.5 0.5 0.5 
##$TPOFFS= (0..7)
0 0 0 0 0 0 0 0 
##$TUNHIN= 0
##$TUNHOUT= 0
##$TUNXOUT= 0
##$USERA1= <user>
##$USERA2= <user>
##$USERA3= <user>
##$USERA4= <user>
##$USERA5= <user>
##$V9= 5
##$VALIST= <valist>
##$VCLIST= <CCCCCCCCCCCCCCC>
##$VD= 0
##$VDLIST= <DDDDDDDDDDDDDDD>
##$VPLIST= <PPPPPPPPPPPPPPP>
##$VTLIST= <TTTTTTTTTTTTTTT>
##$WBST= 1024
##$WBSW= 4
##$XGAIN= (0..3)
0 0 0 0 
##$XL= 0
##$YL= 0
##$YMAX_a= 589593
##$YMIN_a= -883743
##$ZGOPTNS= <>
##$ZL1= 120
##$ZL2= 120
##$ZL3= 120
##$ZL4= 120
##$ABSF1= 15.79317
##$ABSF2= -2.258681
##$ABSG= 5
##$ABSL= 3
##$ALPHA= 0
##$AQORDER= 0
##$ASSFAC= 0
##$ASSFACI= 0
##$ASSFACX= 0
##$ASSWID= 0
##$AUNMP= <proc_1d>
##$AZFE= 0.1
##$AZFW= 0.1
##$BCFW= 0
##$BC_mod= 2
##$BYTORDP= 0
##$COROFFS= 0
##$CY= -3
##$DATMOD= 1
##$DC= 0
##$DFILT= <>
##$DTYPP= 0
##$F1P= 0
##$F2P= 0
##$FCOR= 1
##$FTSIZE= 16384
##$FT_mod= 6
##$GAMMA= 0
##$GB= 0
##$INTBC= 1
##$INTSCL= 3.70164e-10
##$ISEN= 128
##$LB= 0.24
##$LEV0= 0
##$LPBIN= 0
##$MAXI= 10000
##$MC2= 0
##$MEAN= 0
##$ME_mod= 0
##$MI= 1.114404
##$NCOEF= 0
##$NC_proc= -6
##$NLEV= 6
##$NOISF1= 3.799351
##$NOISF2= 2.8
##$NSP= 0
##$NTH_PI= 0
##$NZP= 0
##$OFFSET= 15.76121
##$PC= 1
##$PHC0= -19106.37
##$PHC1= 12.60074
##$PH_mod= 1
##$PKNL= yes
##$PPARMOD= 0
##$PSCAL= 0
##$PSIGN= 0
##$REVERSE= no
##$SF= 200.130002067188
##$SI= 16384
##$SIGF1= 3
##$SIGF2= 2
##$SINO= 5.538805
##$SIOLD= 16384
##$SREGLST= <1H.CDCl3>
##$SSB= 0
##$STSI= 16384
##$STSR= 0
##$SW_p= 3612.71676300578
##$SYMM= 0
##$S_DEV= 0
##$TDeff= 16384
##$TDoff= 0
##$TI= <>
##$TILT= no
##$TM1= 0
##$TM2= 0
##$TOPLEV= 0
##$USERP1= <user>
##$USERP2= <user>
##$USERP3= <user>
##$USERP4= <user>
##$USERP5= <user>
##$WDW= 1
##$XDIM= 16384
##$YMAX_p= 429559934
##$YMIN_p= -287392
$$ End of Bruker specific parameters
$$ ---------------------------------
##NTUPLES= NMR SPECTRUM
##VAR_NAME=  FREQUENCY,     SPECTRUM/REAL,   SPECTRUM/IMAG
##SYMBOL=    X,             R,               I
##VAR_TYPE=  INDEPENDENT,   DEPENDENT,       DEPENDENT
##VAR_FORM=  AFFN,          ASDF,            ASDF
##VAR_DIM=   16384,         16384,           16384
##UNITS=     HZ,            ARBITRARY UNITS, ARBITRARY UNITS
##FACTOR=    0.220516191357247, 1,           1
##FIRST=     3154.29107825666, 0,            0
##LAST=      -458.425684749117, 0,           0
##MIN=       -458.425684749117, -287392,     0
##MAX=       3154.29107825666, 429559934,    0
$$ Real data points
##PAGE= N=1
##DATA TABLE= (X++(R..R)), XYDATA
$$ [...]
5584E860081q3655q6016j19473j67975j16728j06857r315j44575k2981j57177
5574D845329L1176m9087j72916M3726j58928k7586n0077K6709j08672p1583L3489
5563D341580N0513K5743j9672j8572o2277R9688J88381O6711K6005R9535j0950
5552D786685M1625l4459J07718K2824R5661m0835J16195J00815J12888O5475K92173
5541E666765K48775J18363K68078K95262L02417L42277L93243N44096P49030R81228
5531I909534J253073J354572J138296K19542m94580r24345j110106j176832j081615
5522I087539r60862o26784l32331k89084l07010l20060j21378o7623p9842l3378
5512E949187q3809r2681J05740J10040q6179M4120Q5645J74421R7395J29998J18752
$$ y = [5860081, 5776426, 5690410, 5570937, 5402962, 5286234, 5179377, 5170062, 5025487, 5002506, 4845329, 4876505, 4827418, 4654502, 4698228, 4539300, 4511714, 4461637, 4488346, 4379674, 4308091, 4341580, 4392093, 4417836, 4398164, 4379592, 4317315, 4417003, 4605384, 4672095, 4698100, 4797635, 4786685, 4828310, 4793851, 4901569, 4924393, 5020054, 4979219, 5095414, 5196229, 5309117, 5374592, 5666765, 5915540, 6033903, 6301981, 6597243, 6899660, 7241937, 7635180, 8179276, 8928306, 9909534, 11162607, 12517179, 13655475, 13875017, 13380437, 12456092, 11345986, 10169154, 9087539, 8126677, 7499893, 7167562, 6878478, 6571468, 6251408, 6130030, 6062407, 5982565, 5949187, 5865378, 5772697, 5878437, 5988477, 5902298, 5946418, 6032063, 6206484, 6303879, 6433877, 6552629]
5501F552629K07921K48622M6328k4245J0797j48691l7042l3209j15559j2131N7795
5490F753215P2928j8645P0039K04655J74401J95068J50548Q1873L21442K76730
5480H282254L11386L25871K23959K61372K37203L63868L14750M09580L24758M11094
5470A1466095K14610o368J2378K71401K21053J96521K97143L35214M14264N87976
5460A4010287N74117N49316O55358N74053M96982N78616N50540M49142M03872
5451A8842283M20323K07721J08867o029O2545n4798r4131O6154k3566O7779K07546
5440A9804694K46810j93005o86955q59002p39575p32030o19735m82242l35354
5431A5403606q5679r1422O2700J83563J33572K98126M25099P43784O97897O92203
$$ y = [6552629, 6760550, 7009172, 7055500, 7031255, 7042052, 6893361, 6856319, 6823110, 6707551, 6695420, 6753215, 6826143, 6807498, 6877537, 7082192, 7256593, 7451661, 7602209, 7684082, 8005524, 8282254, 8593640, 8919511, 9143470, 9404842, 9642045, 10005913, 10320663, 10730243, 11055001, 11466095, 11680705, 11674337, 11686715, 11958116, 12179169, 12375690, 12672833, 13008047, 13422311, 14010287, 14584404, 15133720, 15789078, 16363131, 16860113, 17438729, 17989269, 18438411, 18842283, 19262606, 19470327, 19579194, 19573165, 19635710, 19580912, 19486781, 19552935, 19529369, 19597148, 19804694, 20051504, 19858499, 19171544, 18312542, 17572967, 16840937, 16221202, 15738960, 15403606, 15317927, 15226505, 15289205, 15472768, 15606340, 15904466, 16329565, 17073349, 17771246, 18463449]
5421A8463449P61046R00527Q10268Q63351O76647M49288L10656R1640K15370K91242
5411B3833484J19447L42359O56571N56388K4753k11023k04332k01824j16791O6286
5401B4865318J49596L87982O85834O54930P78540Q30732Q86624P18268O43877
5392C0601701M82567K33755L73689l9462k83915m29918n37000p48017j100921
5383B8552479j050996j004598r53112q70883q04851o54211m72776n33371m89134
5374B1718547l71748n11314m09905l03496j49318j72153p6684j02149N0609n1787
5364A9620602j45636j68287k74732l47440l99888l94168j85127l37282l03503
5355A7064539l27868m30525m44121l73457m21110m41075k08964k69635k56571
$$ y = [18463449, 19224495, 20125022, 20935290, 21798641, 22475288, 22924576, 23235232, 23326872, 23542242, 23833484, 23952931, 24295290, 24951861, 25508249, 25533002, 25321979, 25117647, 24915823, 24799032, 24865318, 25014914, 25402896, 26088730, 26743660, 27522200, 28352932, 29239556, 29957824, 30601701, 31084268, 31318023, 31691712, 31652250, 31368335, 30938417, 30401417, 29653400, 28552479, 27501483, 26496885, 25543773, 24672890, 23868039, 23213828, 22741052, 22207681, 21718547, 21346799, 20835485, 20425580, 20122084, 19972766, 19800613, 19723929, 19621780, 19672389, 19620602, 19474966, 19306679, 19031947, 18684507, 18284619, 17890451, 17705324, 17368042, 17064539, 16736671, 16306146, 15862025, 15488568, 15067458, 14626383, 14417419, 14147784, 13891213]
5346A3891213j68370j90190j46568r2325j03263o5758m1423j29914k12236m9003
5336A2692163j15452j08066r3610o0735j43368l7771o7888Q8762j11193L630N995
5325A2052467J6214J49498J98155J65097K27207L08152K95748K24217L64516L09032
5315A4310303M96787O13583N34000O32258Q49833Q38018O92314P02060Q48176
5306B0517332P86258P28683O13640M87177L98693Q4473j88109k08380m33174o03693
5296B2182900o66604p75136r01051p51689q07973o83306o24320q63755o10769
5287A5498297n37572o67839n01434m44092l97931l42164l46165k37019k73052
5278A1751029l09605k40160o8985k43781k27483j20271j8735p7314j54434N7329
$$ y = [13891213, 13722843, 13532653, 13386085, 13293760, 13190497, 13124739, 13083316, 12953402, 12741166, 12692163, 12576711, 12468645, 12375035, 12314300, 12170932, 12133161, 12065273, 12154035, 12042842, 12046472, 12052467, 12068681, 12218179, 12416334, 12581431, 12808638, 13116790, 13412538, 13636755, 14001271, 14310303, 14807090, 15420673, 15954673, 16586931, 17436764, 18274782, 18967096, 19669156, 20517332, 21303590, 22032273, 22645913, 23133090, 23531783, 23616256, 23428147, 23219767, 22786593, 22182900, 21516296, 20741160, 19840109, 19088420, 18280447, 17597141, 16972821, 16109066, 15498297, 14960725, 14292886, 13791452, 13347360, 12949429, 12607265, 12261100, 12024081, 11751029, 11441424, 11201264, 11132279, 10888498, 10661015, 10540744, 10522009, 10444695, 10290261, 10347590]
5268A0347590J30257k606k1869M8876R6429l6479m3151P5960J21351J00292Q4425
5257A0901075K42776L40231J39290J86351J39875L29236L67556M23821L15392
5248A3385603L92055M79558M96166L66481L88383L88631L40356L39347K32629
5239A6809209K21901P0750p0589n5834m8749k75214j86303r4112k9277K6890M4067
5228A6412739J29081J64306L28760M07155M78939N50816P05710Q34198Q79700
5219B0891404P58464P89354O66788N71919N35911K78899J88237J66022K6458k79632
5209B4593824k04308l33291l81197l43698k39172J4957K15060M42455P32130N58565
5199B5055325L3959O0387p9562o21K34471M64773P52469Q91690J023970R87176
$$ y = [10347590, 10477847, 10475241, 10453372, 10502248, 10598677, 10562198, 10519047, 10595007, 10716358, 10816650, 10901075, 11143851, 11484082, 11623372, 11809723, 11949598, 12278834, 12646390, 13070211, 13385603, 13777658, 14257216, 14753382, 15119863, 15508246, 15896877, 16237233, 16576580, 16809209, 17031110, 17101860, 17031271, 16975437, 16926688, 16651474, 16465171, 16371059, 16341782, 16368672, 16412739, 16541820, 16706126, 17034886, 17442041, 17920980, 18471796, 19177506, 20011704, 20891404, 21649868, 22439222, 23106010, 23677929, 24213840, 24492739, 24680976, 24846998, 24873456, 24593824, 24389516, 24056225, 23675028, 23331330, 23092158, 23107115, 23322175, 23764630, 24496760, 25055325, 25089284, 25149671, 25070109, 25069488, 25303959, 25768732, 26521201, 27412891, 28436861, 29424037]
5189B9424037R01752O98725N25641L84833J51741n3120m01716p05547p36503j043602
5179B9146241j144186j318143j309488j312328j226538j090394q92146p79108
5171B0073910o40431n02925n16969k18616l3490M1753J70829J38101K26694L02223
5161A9041079J70522J24933J45132L6392J12954J98821J11646j13021k94967m03988
5151A9129503o16484p85975p98528r14168r88573p73116p35552p08012o16277
5142A2192818m36877m70050n11783k85659j70583k49788k43359j95293j20126
5133I509300k24011K2786j13913j97468j07821k9214m6507n9821l8232j12776
5123H602323j56616l9847p4715l0201p6087p9683j3981q484j17354j08977m9926
$$ y = [29424037, 30325789, 31024514, 31550155, 31934988, 32086729, 32033609, 31631893, 30926346, 30189843, 29146241, 28002055, 26683912, 25374424, 24062096, 22835558, 21745164, 20853018, 20073910, 19433479, 18930554, 18413585, 18194969, 18161479, 18203232, 18374061, 18512162, 18738856, 19041079, 19211601, 19336534, 19481666, 19518058, 19631012, 19829833, 19941479, 19828458, 19533491, 19129503, 18513019, 17727044, 16928516, 16014348, 15025775, 14252659, 13517107, 12809095, 12192818, 11755941, 11285891, 10774108, 10488449, 10317866, 10068078, 9824719, 9629426, 9509300, 9285289, 9308075, 9194162, 8996694, 8888873, 8859659, 8813152, 8753331, 8715099, 8602323, 8445707, 8405860, 8331145, 8300944, 8224857, 8145174, 8131193, 8122709, 8005355, 7896378, 7846452]
5112G846452K4493M0191r4451Q7382m1122j02069M2499n7224j5771M1017l9581
5101G731816N8152J4770Q2785l8743L2k1394L6737N0870r520O1269J37530M7433
5089H151737J7766J45412j1146J4799Q5751J8882O4428n5415l9679l7600o1485
5078H293450J60396R8451K3266J18424O1228L9870J6186O1440M9472j0786O4148
5067H975545R8637Q1609J53749J7904N5781J64635J4067m8646M5927Q8773J60795
5056I808776M6964R2420J05948P7376P7727J13738P1069J23298N3988J08223J41435
5045A0820962R9543J29269J69703N7794P1279K04213J42120K3098J35471J58550
5035A2012002R042J73981R2865K16521J63392J85319O4188M4530J17202J30673
$$ y = [7846452, 7870945, 7911136, 7816685, 7904067, 7862945, 7760876, 7803375, 7746151, 7730380, 7771397, 7731816, 7789968, 7804738, 7887523, 7848780, 7848812, 7827418, 7864155, 7915025, 7905505, 7966774, 8104304, 8151737, 8169503, 8314915, 8303769, 8318568, 8404319, 8423201, 8487629, 8432214, 8392535, 8354935, 8293450, 8453846, 8552297, 8575563, 8693987, 8755215, 8795085, 8811271, 8872711, 8922183, 8911397, 8975545, 9074182, 9155791, 9309540, 9327444, 9383225, 9547860, 9561927, 9513281, 9559208, 9647981, 9808776, 9855740, 9948160, 10054108, 10131484, 10209211, 10322949, 10394018, 10517316, 10571304, 10679527, 10820962, 10920505, 11049774, 11219477, 11277271, 11348550, 11552763, 11694883, 11717981, 11853452, 12012002, 12021044, 12195025, 12287890, 12504411, 12667803, 12853122, 12917310, 12961840, 13079042, 13209715]
5025A3209715J91385K08499N2337J45501K36795J00570R2592K28297J73153J44035
5015A4782879K56750J51057K80418J08257J88084J92449J32686J68990K21521
5006A6483091K09237K52791L39860K78026K13943J02544K61141J52971K96833
4997A8590437K99970L98029L25358K52004J69283K54686L92895M16583L93152
4988B1492397L20833L48070K50553M23200M84000M51580L00012M74448N49411
4979B5094504K93548L55171L94048M56731M02133N09657N38139N05458M56060
4970B9005449O00818O20636O33726O75044O19210N74851O62589O91057O85820
4961C4769200O63813M71205O68471N77100N89433N46159N56425M40018M84757
$$ y = [13209715, 13401100, 13609599, 13661936, 13807437, 14044232, 14144802, 14237394, 14465691, 14638844, 14782879, 15039629, 15190686, 15471104, 15579361, 15767445, 15959894, 16092580, 16261570, 16483091, 16692328, 16945119, 17284979, 17563005, 17776948, 17879492, 18140633, 18293604, 18590437, 18890407, 19288436, 19613794, 19865798, 20035081, 20289767, 20682662, 21099245, 21492397, 21813230, 22161300, 22411853, 22835053, 23319053, 23770633, 24070645, 24545093, 25094504, 25388052, 25743223, 26137271, 26594002, 26996135, 27505792, 28043931, 28549389, 29005449, 29606267, 30226903, 30860629, 31535673, 32154883, 32729734, 33392323, 34083380, 34769200, 35433013, 35904218, 36572689, 37149789, 37739222, 38285381, 38841806, 39281824, 39766581]
4952C9766581L27244M54628M78189K76662K09205J03004K1301k9461m5504r7446
4942D1464403j80047j77132o3754j19159j4293q0720j20928q0867n5248K2755
4932D0595010P6094P4383J39773J75302J49599K22484J28317J24951Q7117l4809
4922D1738221J29827r1589k07983k58837l92913l68722l51816k85956k97185k27804
4912C9385243k32980k03753k48796o35724o10083p51788r62465r54859j054487
4903C3730308j032184j003517j028874r00436p12026q10844p05959n00106m90505
4894B6545857m20945l73590l62977j78805j40846j7444l6303O5972N0918k10027
4884B4921810k71274l77600m56235o03667m79710o30563o52330o43023m08101
$$ y = [39766581, 40093825, 40548453, 41026642, 41303304, 41512509, 41615513, 41636814, 41607353, 41561849, 41464403, 41284356, 41107224, 41043470, 40924311, 40910018, 40829298, 40708370, 40627503, 40572255, 40595010, 40671104, 40745487, 40885260, 41060562, 41210161, 41432645, 41560962, 41685913, 41773030, 41738221, 41868048, 41776459, 41568476, 41309639, 40916726, 40548004, 40196188, 39910232, 39613047, 39385243, 39152263, 38948510, 38699714, 38063990, 37453907, 36702119, 35739654, 34784795, 33730308, 32698124, 31694607, 30665733, 29765297, 29053271, 28242427, 27536468, 27036362, 26545857, 26124912, 25751322, 25388345, 25209540, 25068694, 25051250, 25014947, 25080919, 25131837, 24921810, 24650536, 24272936, 23816701, 23213034, 22733324, 22102761, 21450431, 20807408, 20399307]
4875B0399307l43853m43405l22532k81825l32408l35692l88073k25498j59892
4866A7566129k35202k61346p2668k36785j62570j05493k35076j9721j18228o0314
4856A6058726l677j14180m7515m2842q1500l8595o2921J4336j59429p9309N1773
4845A5494867J3548j29475j68461q3447j0458j2518o9855j42766k7893j11916
4835A4751626q3727p6179J41802Q2840K1092P0278L1188M3397M1213J80640J03949
4824A5308119M1478P3251R2905J55468J68948J56326J37713L11830J74948J46031
4814A6767017K22101J50069L68175M64686N37383N47337L69155M62338J46214
4805B0034475l45124l92421l05014l99599l04711k42073k95912j12243L9124O3537
$$ y = [20399307, 20055454, 19612049, 19289517, 19007692, 18675284, 18339592, 17951519, 17726021, 17566129, 17330927, 17069581, 16996913, 16760128, 16597558, 16492065, 16256989, 16237268, 16119040, 16058726, 16055049, 15940869, 15893354, 15850512, 15769012, 15730417, 15667496, 15681832, 15522403, 15443094, 15494867, 15508415, 15378940, 15210479, 15127032, 15116574, 15104056, 15034201, 14891435, 14863542, 14751626, 14667899, 14591720, 14733522, 14816362, 14837454, 14907732, 14938920, 14982317, 15023530, 15204170, 15308119, 15349597, 15422848, 15515753, 15671221, 15840169, 15996495, 16134208, 16446038, 16620986, 16767017, 16989118, 17139187, 17507362, 17972048, 18509431, 19056768, 19425923, 19888261, 20034475, 19689351, 19296930, 18991916, 18592317, 18287606, 18045533, 17749621, 17637378, 17676502, 17740039]
4795A7740039K292K828N4548Q972J20762K77491K53219J58045Q8659K06905K54254
4784A9168014K38191K06149J01024J96622K95004J55903J87612K92501K16352
4775B1057372K67322L50276K79397L21359L80563M55358M02851M63552N03133
4766B4481183M35113N33190M30003L23042L24435K62801K60123J82352K65815
4757B7498057L70367L46087L40286M14213O31561O32511N30109P39600Q85839
4748C2388630R34375R72478J228839J194680J277171J148597J250944J092169
4740D1487883R92819P44710P13761M94513L08003K92947K29865M65517L23939
4731D6053957M49365M93106P03877O17104P48810R48961R50046J287895J398287
$$ y = [17740039, 17742331, 17745159, 17799707, 17808679, 17929441, 18206932, 18460151, 18618196, 18706855, 18913760, 19168014, 19406205, 19612354, 19713378, 19910000, 20205004, 20360907, 20548519, 20841020, 21057372, 21324694, 21674970, 21954367, 22275726, 22656289, 23111647, 23514498, 23978050, 24481183, 24916296, 25449486, 25879489, 26202531, 26526966, 26789767, 27049890, 27232242, 27498057, 27868424, 28214511, 28554797, 28969010, 29600571, 30233082, 30763191, 31502791, 32388630, 33323005, 34295483, 35524322, 36719002, 37996173, 39144770, 40395714, 41487883, 42480702, 43225412, 43939173, 44433686, 44741689, 45034636, 45264501, 45730018, 46053957, 46503322, 46996428, 47700305, 48317409, 49066219, 50015180, 50965226, 52253121, 53651408]
4722E3651408J619221J758132J933904K136144K237297K287161K326201K378963
4714G0328431K303028K051525J755479J590689J151646J030325P23546M11478
4706H1346147j67185o31695q13720j104955j279876j427723j524360j342354j330002
4697G1724277j281687j188943j146626j063386q77460r38922q32814n26586n49444
4688F3318409l94983l52617k42929q7039J90160K57602K71523N10364N15355M87232
4678F4473077O05415O38674N50099N66003L66293N3507Q7430l62724j072926j590559
4668F4314289j808355j957534k015003k086749j930280j850100j803180j512090
4660D9350998j428386j340029j133421j027687q89550r28102p97773o78599o69639
$$ y = [53651408, 55270629, 57028761, 58962665, 61098809, 63336106, 65623267, 67949468, 70328431, 72631459, 74682984, 76438463, 78029152, 79180798, 80211123, 80934669, 81346147, 81178962, 80547267, 79733547, 78628592, 77348716, 75920993, 74396633, 73054279, 71724277, 70442590, 69253647, 68107021, 67043635, 66166175, 65227253, 64394439, 63867853, 63318409, 62923426, 62570809, 62327880, 62240841, 62431001, 62688603, 62960126, 63470490, 63985845, 64473077, 65078492, 65717166, 66267265, 66833268, 67199561, 67253068, 67340498, 66977774, 65904848, 64314289, 62505934, 60548400, 58533397, 56446648, 54516368, 52666268, 50863088, 49350998, 47922612, 46582583, 45449162, 44421475, 43531925, 42603823, 41806050, 41127451, 40457812]
4651D0457812n53236l95856m03869m07034l47048l09792k66426l91536l81357
4642C7001658l84389m35054n15407n16158n71802m48128m84971l29380l28729
4633C2987640k13964j90209k12929l3521r327l7773o159L3314J23790K67233J67389
4622C2875484m2186J04808L5140r7946o6729k49576k87480k29466l63124l90383
4612C1288542l24394l28058k01246j67197j23621N2549Q9620J6198n6723J9263
4602C0264933j67304j62089l04854l65391m68154n04727n37446o03582l80450
4593B6770936m76258l78868l82460k19199l17569k06193k45052k74573l15230
4584B3955534l50321m50379m27748k65309k77728k89795m03128n12736l79296
$$ y = [40457812, 39904576, 39508720, 39104851, 38697817, 38350769, 38040977, 37774551, 37383015, 37001658, 36617269, 36182215, 35666808, 35150650, 34578848, 34130720, 33645749, 33316369, 32987640, 32773676, 32583467, 32370538, 32337017, 32327690, 32289917, 32283758, 32317072, 32440862, 32708095, 32875484, 32833298, 32938106, 32973246, 32875300, 32808571, 32558995, 32271515, 32042049, 31678925, 31288542, 30964148, 30636090, 30434844, 30267647, 30144026, 30196575, 30286195, 30302393, 30245670, 30264933, 30097629, 29935540, 29630686, 29265295, 28797141, 28292414, 27754968, 27151386, 26770936, 26294678, 25915810, 25533350, 25314151, 24996582, 24790389, 24545337, 24270764, 23955534, 23605213, 23154834, 22727086, 22461777, 22184049, 21894254, 21491126, 20978390, 20599094]
4575B0599094j41164k92058k93880l31564k30400j29591j57939k0297j12669k42186
4565A8647346k06699k48025j75801l59762l69867l28577l67459l45709k64650
4556A5980797j76306k01950l23704l54391k41079k14385k93625j77873k28801
4547A3768683k27831k31213p9448l8815k58342k23360j30716r1280k17668q2212
4537A2187798j37783m4587p7168j38975j11492k05321k58567j15649L7943k6657
4527A1109542j27874k34483p1556l6016q6065j01766n1649L903k10226q1140N9903
4516A0172573j42332q3945j2722p5094q6052k2103p4963q946o4450j12172n9569
4505I430225k856J01274N9587L0394l7109p4970n5647k4966p089K6063p7742O8948
$$ y = [20599094, 20457930, 20165872, 19871992, 19540428, 19310028, 19180437, 19022498, 19002201, 18889532, 18647346, 18440647, 18192622, 18016821, 17657059, 17287192, 16958615, 16591156, 16245447, 15980797, 15804491, 15602541, 15278837, 14924446, 14683367, 14468982, 14175357, 13997484, 13768683, 13540852, 13309639, 13230191, 13191376, 12933034, 12709674, 12578958, 12487678, 12270010, 12187798, 12050015, 12005428, 11928260, 11789285, 11677793, 11472472, 11213905, 11098256, 11136199, 11109542, 10981668, 10747185, 10675629, 10639613, 10553548, 10451782, 10400133, 10404036, 10193810, 10112670, 10172573, 10030241, 9946296, 9933574, 9858480, 9772428, 9750325, 9675362, 9666416, 9601966, 9489794, 9430225, 9427369, 9528643, 9588230, 9618624, 9581515, 9506545, 9450898, 9425932, 9418843, 9444906, 9367164, 9436112]
4493I436112L8304N5126R1254J4373M1775J76973Q0831J14081K8052N3690J15369
4482A0245940J73027J87050J25289P4814J3964J53290L00035K05716K52555J31779
4472A1863459Q7709J09499P6587N7375J11518R268o2477J06752M8384K11466L11755
4461A2931295J19022J42107K39152K36400K87855K73312K07502K84180M58782
4452A5179607M74961M49052N11376K89767J03921Q4737l5760k5003R425J07477
4442A7149560J92151K74472L75625N05770L66110N02824M80260M50758M18107
4433B0715637M57479M06220N23012O81934P87172P55876R72708R35654R72652
4424B7208344J158034J259799J376611J553682J724273J784373K046772K056013
$$ y = [9436112, 9474416, 9529542, 9620796, 9635169, 9676944, 9853917, 9934748, 10048829, 10076881, 10130571, 10245940, 10418967, 10606017, 10731306, 10806120, 10820084, 10973374, 11273409, 11479125, 11731680, 11863459, 11951168, 12060667, 12137254, 12194629, 12306147, 12315415, 12252938, 12359690, 12408074, 12619540, 12931295, 13050317, 13192424, 13431576, 13667976, 13955831, 14229143, 14436645, 14720825, 15179607, 15654568, 16103620, 16614996, 16904763, 17008684, 17093421, 17057661, 17032658, 17042083, 17149560, 17341711, 17616183, 17991808, 18497578, 18863688, 19366512, 19846772, 20297530, 20715637, 21173116, 21579336, 22102348, 22784282, 23571454, 24327330, 25300038, 26235692, 27208344, 28366378, 29626177, 31002788, 32556470, 34280743, 36065116, 38111888, 40167901]
4416D0167901K138130K023743J736702J594967J616146J721818J991238K291438
4408E5282083K797705L477437M072050M670274N217218N653830O155130O524951
4400I3850678O481858O418800N840331M834821K584318l83391l357848n814250
4392A10455317p352587q081409q180307p747625o934467n945619n071928m316909
4384E6824466l566605l045213k471289k092717j644273j360433j107972q38329
4376D0697635o03685o01367o69782o61915p97602r39992j109555j218070j205678
4367C2889989j170811j181336j160870q90066q81471q21265p18410o44185m93484
4358B4928091m58626l68954m41959m42192m20414l69219m03945l59321k51283
$$ y = [40167901, 42306031, 44329774, 46066476, 47661443, 49277589, 50999407, 52990645, 55282083, 58079788, 61557225, 65629275, 70299549, 75516767, 81170597, 87325727, 93850678, 100332536, 106751336, 112591667, 117426488, 120010806, 119627415, 116269567, 110455317, 103102730, 95021321, 86841014, 79093389, 72158922, 66213303, 61141375, 56824466, 53257861, 50212648, 47741359, 45648642, 44004369, 42643936, 41535964, 40697635, 40093950, 39492583, 38822801, 38160886, 37363284, 36423292, 35313737, 34095667, 32889989, 31719178, 30537842, 29376972, 28486906, 27605435, 26784170, 26065760, 25421575, 24928091, 24469465, 24100511, 23658552, 23216360, 22795946, 22426727, 22022782, 21663461, 21412178]
4349B1412178l24379j57544r8042j64367p0799l5445L1227J48675J19356J9644
4339B0880504N6069J40739J07860J32410J55382J54084K6842J18970K14034L34981
4329B2321875J46409K65696L89119L00858L81783M71425K55207L03455M43522
4320B5279349L70835M64159M18537M19903K35406J37688J27946K1677J83521K67788
4310B7926809K50043J94726L91996M30168M38636N25696M83191N95237O29774
4301C1866276N53002P42030Q10425P88213Q87035R39102R56937J015698J162326
4292C9721044J084769J235608J182024J044834J013873Q01649P82950O92184O60462
4283D8219397N87655L74254L32522Q4224k2326J44086o9061k11443k91916k84588
$$ y = [21412178, 21087799, 20930255, 20832213, 20667846, 20597047, 20561602, 20592829, 20741504, 20860860, 20880504, 20936573, 21077312, 21185172, 21317582, 21472964, 21627048, 21653890, 21772860, 21986894, 22321875, 22468284, 22733980, 23123099, 23423957, 23805740, 24277165, 24532372, 24835827, 25279349, 25650184, 26114343, 26532880, 26952783, 27188189, 27325877, 27453823, 27475500, 27659021, 27926809, 28176852, 28371578, 28763574, 29193742, 29632378, 30158074, 30641265, 31236502, 31866276, 32419278, 33161308, 33971733, 34759946, 35646981, 36586083, 37543020, 38558718, 39721044, 40805813, 42041421, 43223445, 44268279, 45282152, 46083801, 46866751, 47558935, 48219397, 48807052, 49181306, 49513828, 49598052, 49575726, 49719812, 49650751, 49439308, 49147392, 48862804]
4273D8862804m04847l44654j68365k84576J6512J20703K55706O82380P29726P64287
4263E0229676J189152J458440J849103K181770K574832K766094L113747L067403
4255F8430217K602124J039235j316159l383011m702025n196146n196188m974990
4247D7303057m351614l614914l068223k432422k014035j690126j440211j290081
4239B7401431j098428r63892q59612q91901p61745n82378o00524n87521o31757
4230B0423673l00464k46639l90701l52308k38048j43382j06845k8757J02198J23636
4220A8842363M8323L00441L23088L03944R3932k52721n31229p30966o78268p42214
4210A6976693n92277n28411l73903l59004l01548k14866o0247o7114m7220j07005
$$ y = [48862804, 48457957, 48113303, 47944938, 47660362, 47676874, 47797577, 48053283, 48735663, 49465389, 50229676, 51418828, 52877268, 54726371, 56908141, 59482973, 62249067, 65362814, 68430217, 71032341, 72071576, 70755417, 67372406, 62670381, 57474235, 52278047, 47303057, 42951443, 39336529, 36268306, 33835884, 31821849, 30131723, 28691512, 27401431, 26303003, 25339111, 24479499, 23587598, 22825853, 22243475, 21642951, 21055430, 20423673, 20123209, 19876570, 19485869, 19133561, 18895513, 18752131, 18645286, 18616529, 18718727, 18842363, 18890686, 19191127, 19514215, 19818159, 19912091, 19659370, 19128141, 18397175, 17718907, 16976693, 16384416, 15856005, 15482102, 15123098, 14821550, 14606684, 14546437, 14479323, 14432103, 14325098]
4200A4325098k68999k68895l47247m73806l01132m32279m24638j68092k63233
4191A1376777k17793l13137j62154o388j18936q4501p1684p9185r1449n1643l7110
4180A0142797q5932J3778J38731J52696K7888M0205o8321o5833j68893k60848
4170I866268j36304j89865j46885l7633j7700m8300p0869J05750J41193p7093
4160I388562O7505p4961k23942p5308k38345k71254k61454j35524m4221o3687
4150H067371M072l0745p7620o3592R7339R9377J59159O2301N8379J00220j03048
4139H373213p370J35992K2503n5559q5943J5803r2900r6931k19220j04050J6864
4128G902402q0936k2434m6306j54702L1195O8235n919l5745p4342J13661J9306
$$ y = [14325098, 14056099, 13787204, 13439957, 12966151, 12665019, 12232740, 11808102, 11640010, 11376777, 11158984, 10845847, 10683693, 10677305, 10558369, 10473868, 10402184, 10322999, 10231550, 10179907, 10142797, 10056865, 10070643, 10209374, 10362070, 10389958, 10430163, 10361842, 10296009, 10127116, 9866268, 9729964, 9540099, 9393214, 9355581, 9337881, 9289581, 9218712, 9324462, 9465655, 9388562, 9456067, 9381106, 9157164, 9081856, 8843511, 8572257, 8310803, 8175279, 8131058, 8067371, 8071443, 8040698, 7963078, 7899486, 7996825, 8096202, 8255361, 8317662, 8376041, 8476261, 8373213, 8365843, 8501835, 8524338, 8468779, 8382836, 8398639, 8305739, 8208808, 7989588, 7885538, 7902402, 7821466, 7799032, 7752726, 7598024, 7629219, 7697454, 7691535, 7655790, 7581448, 7695109, 7714415]
4117G714415L4823l4337N1374Q4880L746O025J24523N9268O6873R3617J63427
4106H368634P1530P8762J54159J02520P5074O0427P984P7071K46824O2326Q5061
4095I390372R9155O6376J56498K9930J10378J17418K2112j1175J39732O5240M2633
4084A0228669P2432L0909J19940Q2283J9504J37034J06450J23706K66855J09807
4074A1297589J80775K23609J04212K27959L76333K93049K01479L09841K41532
4065A3456378L62167K49331L23988M78507L78369M82814L95446L26831M33572
4056A6887403O77380N67766N56963P31718O97261O19177O77410P62512Q09531
4047B2987121P61766Q19535P99413P12339P09115Q53272Q33052P51911Q32964
$$ y = [7714415, 7749238, 7714901, 7766275, 7851155, 7854901, 7860926, 7985449, 8044717, 8111590, 8205207, 8368634, 8440164, 8518926, 8673085, 8775605, 8850679, 8911106, 8919090, 8996161, 9242985, 9305311, 9390372, 9489527, 9555903, 9712401, 9742331, 9852709, 9970127, 9992239, 9981064, 10120796, 10186036, 10228669, 10301101, 10332010, 10451950, 10534233, 10553737, 10690771, 10797221, 10920927, 11187782, 11297589, 11478364, 11701973, 11806185, 12034144, 12410477, 12703526, 12905005, 13214846, 13456378, 13818545, 14067876, 14391864, 14870371, 15248740, 15731554, 16127000, 16453831, 16887403, 17564783, 18132549, 18689512, 19421230, 20118491, 20737668, 21415078, 22177590, 22987121, 23748887, 24568422, 25367835, 26080174, 26789289, 27642561, 28475613, 29227524, 30060488]
4038C0060488Q85552R05501J092587J104587R62711R89513R77039Q68915O65674
4029C8512567O30194M21334M86876L87872M49588M75362M93908O16110O17494
4020D3091305O09069N27669N34724L02407J96682j37760k29278k68065l00264
4011D4326489k76544k11407k32032q0096j35172l2029J33883K8670j55242k77456
4001D3089064m52494m91073o61643p65754r45578p57257m98440m34936m07019
3992C7674870l30418k53989k43127k40199l11585l53841n14730p79134o92210
3983C3955637p54021p27766n62042n61194l05571k20838k32865j90288o8027l3677
3973C0299348k73007n17063n26415n75748n60432o36992o02725n14341l11868
$$ y = [30060488, 30946040, 31851541, 32944128, 34048715, 35011426, 36000939, 36977978, 37846893, 38512567, 39142761, 39564095, 40050971, 40438843, 40888431, 41363793, 41857701, 42473811, 43091305, 43700374, 44228043, 44762767, 45065174, 45261856, 45124096, 44894818, 44626753, 44326489, 44049945, 43838538, 43606506, 43526410, 43391238, 43359209, 43493092, 43521762, 43366520, 43089064, 42636570, 42145497, 41483854, 40718100, 39772522, 39015265, 38516825, 38081889, 37674870, 37344452, 37090463, 36847336, 36607137, 36295552, 35941711, 35426981, 34647847, 33955637, 33201616, 32473850, 31911808, 31350614, 31045043, 30824205, 30591340, 30401052, 30333025, 30299348, 30026341, 29509278, 28982863, 28407115, 27846683, 27209691, 26606966, 26092625, 25780757]
3964B5780757n12586k99352j15740k75536k64251k81306l88069k52389k29331
3955B3162197m20358m54739k37242k82042k33890k30600l27533k76055k72754
3946B0426984k83031k01244k19348k04321j73441l12616k42629j33544j87561
3937A8469249k21143k47850k61977l03982k54288l53981l57922l57077m30497
3928A5680532l49779k79565l53081k17827k83721k48080j12168j03647n6117n8152
3918A3618395n1448r221O457q2812n6034k9434j95259l51390k97454m03747m11640
3907A1736413m00267m93500l86888l90016m39538k56951j75392k50266k75793
3898H667802q2972M2041J9666O7251Q415o4033m8881o0029j12785N210Q92j09479
$$ y = [25780757, 25268171, 24968819, 24853079, 24577543, 24313292, 24031986, 23643917, 23391528, 23162197, 22741839, 22287100, 22049858, 21767816, 21533926, 21303326, 20975793, 20699738, 20426984, 20143953, 19942709, 19723361, 19519040, 19345599, 19032983, 18790354, 18656810, 18469249, 18248106, 18000256, 17738279, 17434297, 17180009, 16826028, 16468106, 16111029, 15680532, 15330753, 15051188, 14698107, 14480280, 14196559, 13948479, 13836311, 13732664, 13676547, 13618395, 13566947, 13557726, 13564183, 13481371, 13425337, 13395903, 13200644, 12849254, 12551800, 12148053, 11736413, 11336146, 10842646, 10455758, 10065742, 9626204, 9369253, 9193861, 8943595, 8667802, 8584830, 8626871, 8646537, 8713788, 8722203, 8658170, 8609289, 8549260, 8436475, 8441685, 8442577, 8333098]
3886H333098o5785j78972j13050p597R3375j4418o7490O7904L6659r3600Q8037
3875H078161j32497j32380j32695k34734k18506j26130k75547j78404j68792k22184
3865F256292q0943j11615m0533p2309J9974r3836j21742k3337K0681K26524N3513
3854F032669r9124J7945N4168m9151j47001k33440k02351j41234r2551k7150j37348
3843D975432j51099j55219L0564P8247j08003j64159L2887R1229J12201J267j1427
3832D731920o3649j512k3662k0505q991K1353J4355k687P0933N2083l48K5551
3820D794841J8995q1495o4823j05444j20342q5683j32358j54175n5492j29544
3810C884480j63428O1435j07031o4495P7275j76987o1958k6629l906L2682L4751
$$ y = [8333098, 8267313, 8088341, 7975291, 7967694, 8061069, 8046651, 7979161, 8047065, 8083724, 7990124, 8078161, 7945664, 7813284, 7680589, 7445855, 7227349, 7101219, 6825672, 6647268, 6478476, 6256292, 6175349, 6063734, 6023201, 5950892, 5970866, 5877030, 5755288, 5731951, 5752632, 5979156, 6032669, 5933545, 5951490, 6005658, 5956507, 5809506, 5576066, 5373715, 5232481, 5139930, 5112780, 4975432, 4824333, 4669114, 4699678, 4777925, 4669922, 4505763, 4538650, 4629879, 4742080, 4743347, 4731920, 4668271, 4666759, 4643097, 4622592, 4613601, 4634954, 4649309, 4646622, 4717555, 4769638, 4769290, 4794841, 4813836, 4732341, 4667518, 4562074, 4441732, 4356049, 4223691, 4069516, 4014024, 3884480, 3721052, 3782487, 3675456, 3610961, 3688236, 3511249, 3449291, 3422662, 3418756, 3451438, 3486189]
3799C486189n5820m2929p6442p0127O42r9578p8645J00714K1666N738o8676j01471
3787C021261k5630l1787L0387K3089j03697k4814O5657l6226Q6944R599j02674
3776B912109r065K6693J7964k2826n4870N3298p6729j07701J77941n985j28335
3765B782494K1631J5862j9171M9019m1369j09300N7341L3795k8316L8047K4419
3754B824452j2614m3744M5357K7506q0850n602P780m65j31396j4126J06044J1304
3742B733646n3116p6577K9382L5050K7993j9028o6991m9600O751J47687m1528
3731B673669L987O4496l127J1719p1511r420J3419J3073L8955m699n1970Q1990
3719B760581Q0602n2599n5355o9150O799J07734M6186o8950R504O5547n627J8044
$$ y = [3486189, 3430369, 3387440, 3310998, 3240871, 3241513, 3141935, 3063290, 3164004, 3185670, 3191408, 3122732, 3021261, 2995631, 2963844, 2994231, 3017320, 2913623, 2888809, 2954466, 2918240, 3005184, 3014783, 2912109, 2903044, 2929737, 2947701, 2924875, 2870005, 2923303, 2846574, 2738873, 2916814, 2910829, 2782494, 2804125, 2819987, 2800816, 2849835, 2808466, 2699166, 2756507, 2790302, 2761986, 2800033, 2824452, 2811838, 2768094, 2813451, 2840957, 2760107, 2754505, 2762285, 2761820, 2630424, 2616298, 2722342, 2733646, 2680530, 2603953, 2633335, 2668385, 2696378, 2677350, 2610359, 2560759, 2567510, 2715197, 2673669, 2677656, 2742152, 2739025, 2750744, 2679233, 2669813, 2683232, 2696305, 2735260, 2730561, 2678591, 2760581, 2841183, 2788584, 2733229, 2664079, 2670878, 2778612, 2824798, 2755848, 2765352, 2830899, 2825272, 2843316]
3707B843316O7203K3044n792l2569J00590J08957J0147j57527N4301M5392k2220
3696C034842K244q5397k3519O9778M7405m7577k3635K7599r4002o2691Q2909Q114
3684B936070O9493K9625j16252l2394l2207J16420N1992j00311O3533k74o1950
3673B923745j5476P6070J9568o4907k171P9817j3976l2050J4407J20256J5616
3662C120899J5927k7168P6842N5130r415N237j1899Q5263Q9335l0537j5015J0832
3650C365431M5339p5854N3987K1828q3417Q8345k2734o222R0634M3130j2676J8353
3638C526144Q4926J9402n6364J1099J1775q7304N2519O1214j66790J16209J43269
3627C716099o830Q6438N0370j45426J7435R7380j0134K8814J4908l5111O6221
$$ y = [2843316, 2910519, 2933563, 2927771, 2895202, 2995792, 3104749, 3114896, 2957369, 3011670, 3057062, 3034842, 3037086, 2951689, 2928170, 2997948, 3045353, 2997776, 2974141, 3001740, 2907738, 2845047, 2927956, 2936070, 3005563, 3035188, 2918936, 2886542, 2854335, 2970755, 3022747, 2922436, 2985969, 2985695, 2923745, 2908269, 2984339, 3003907, 2939000, 2936829, 3016646, 3002670, 2970620, 2985027, 3105283, 3120899, 3136826, 3109658, 3186500, 3241630, 3232215, 3237452, 3225553, 3310816, 3400151, 3369614, 3354599, 3365431, 3410770, 3334916, 3388903, 3410731, 3327314, 3415659, 3392925, 3386703, 3477337, 3520467, 3507791, 3526144, 3611070, 3630472, 3574108, 3585207, 3596982, 3509678, 3562197, 3623411, 3456621, 3572830, 3716099, 3709269, 3795707, 3846077, 3700651, 3718086, 3815466, 3805332, 3834146, 3849054, 3813943, 3880164]
3616C880164J44843O4999q7457P879j4280N5660J41624l1754j6173J14754Q5850
3605D346109J1205J9086J5590o0431K9167J7252K1685l6370J0728Q8970M5405
3594D508396n7933j014J14903J21423J02652o9003K5751o9194J29188P7873M7628
3583D930670l7061R6743n9681K4197M6703l6487R0128m4936P0549Q8388J2954
3572E182167M4336R1262K1301O6759N8405M7428m2661M2342J949o05N7564Q6450
3560E656697Q0072k8043O0477K247P964j1101J44866R0488j4792l1854q4357J45478
3548F018142P2939M8755L3012j5898J07034J70937q628J08474K2333m2025J41235
3537F656310J82196R3713J8076J57621Q6310N3372N4256J26761J04467J9248Q4248
$$ y = [3880164, 4025007, 4090006, 4002549, 4010428, 3996148, 4051808, 4193432, 4161678, 4145505, 4260259, 4346109, 4357314, 4376400, 4391990, 4331559, 4360726, 4377978, 4399663, 4363293, 4374021, 4462991, 4508396, 4450463, 4449449, 4564352, 4685775, 4788427, 4719424, 4745175, 4675981, 4805169, 4883042, 4930670, 4893609, 4990352, 4930671, 4954868, 5001571, 4965084, 5055212, 5010276, 5080825, 5169213, 5182167, 5226503, 5317765, 5339066, 5405825, 5464230, 5511658, 5468997, 5511339, 5513288, 5512683, 5570247, 5656697, 5736769, 5708726, 5769203, 5771450, 5779414, 5768313, 5913179, 6003667, 5988875, 5957021, 5872664, 6018142, 6091081, 6139836, 6172848, 6156950, 6263984, 6434921, 6426293, 6534767, 6557100, 6515075, 6656310, 6838506, 6932219, 6950295, 7107916, 7194226, 7247598, 7301854, 7428615, 7533082, 7552330, 7636578]
3526G636578J55956M6551J75253Q1205J66990K29839m9779N0828J72745J44314
3516H810480L5084J93033J34909L835Q1841J43953M2882M8538J96289K01307R9810
3505I991961Q4787J4990J74345J39516J08399J9617K18471J66598O5714J02215
3495A1086613J57357J69996K67014K80209J52005K65191K54649K25559K46753
3486A3105346K08924K91672J18202K57021K29743L3727p053J65960J2180O9459
3476A4485181J71510N1074J48506Q7581J50498J0164R1094M7398n6356n4350R587
3465A5141887n3771J00601j41840o1723n786j09228o5626j4444K8988J32465Q4434
3454A5035957l4027N8600Q4542q233J14255J06247J90548Q6341J23082K00141
$$ y = [7636578, 7792534, 7839085, 8014338, 8095543, 8262533, 8492372, 8442593, 8493421, 8666166, 8810480, 8845564, 9038597, 9173506, 9177341, 9259182, 9403135, 9446017, 9494555, 9690844, 9892151, 9991961, 10076748, 10091738, 10266083, 10405599, 10513998, 10533615, 10752086, 10918684, 10984398, 11086613, 11243970, 11413966, 11680980, 11961189, 12113194, 12378385, 12633034, 12858593, 13105346, 13314270, 13605942, 13724144, 13981165, 14210908, 14244635, 14237582, 14403542, 14415722, 14485181, 14656691, 14707765, 14856271, 14943852, 15094350, 15104514, 15195608, 15243006, 15186650, 15132300, 15141887, 15088116, 15188717, 15046877, 14985154, 14979368, 14870140, 14804514, 14790070, 14819058, 14951523, 15035957, 15001930, 15060530, 15145072, 15136839, 15251094, 15357341, 15547889, 15634230, 15757312, 15957453]
3444A5957453K10478J71338J86143Q0509J97223J91311R7679L00503K72987J23170
3434A7788794J39936L56339L82000Q4034J33581K34378K07733K64901L10666L77841
3424B0280203K03521L53680K42284K21957K47029K90090L45569J90017K39080
3415B2613430L90121K48630L02650L74543L98419L59202L34340K87110L57354
3406B5665799L73447M28105M26327M23415N23562M97913O86919N38568M27628
3397B9991683M31154L71868N03394N96555N43709O20755O33903Q12607Q08052
3388C5313680R03808J095732J086451J365333J421979J593092J815448J927797
3380D6523320K084129K193246K289167K359814K196079K126348J817848J514592
$$ y = [15957453, 16167931, 16339269, 16525412, 16605921, 16803144, 16994455, 17092134, 17392637, 17665624, 17788794, 17928730, 18285069, 18667069, 18751103, 18884684, 19119062, 19326795, 19591696, 19902362, 20280203, 20483724, 20837404, 21079688, 21301645, 21548674, 21838764, 22184333, 22374350, 22613430, 23003551, 23252181, 23554831, 23929374, 24327793, 24686995, 25021335, 25308445, 25665799, 26039246, 26467351, 26893678, 27317093, 27840655, 28338568, 29025487, 29564055, 29991683, 30422837, 30794705, 31298099, 31894654, 32438363, 33059118, 33693021, 34505628, 35313680, 36217488, 37313220, 38399671, 39765004, 41186983, 42780075, 44595523, 46523320, 48607449, 50800695, 53089862, 55449676, 57645755, 59772103, 61589951, 63104543]
3372F3104543J325226J101453O34059M35635L82716K27640J70267P4478Q0036
3363F7536053J26281K37881K47925J97372p4216k86559m41194q45249j060695
3354F5637599j322409j363174j522150j539470j441310j356134j054131j039057
3346E4999764p72673n69906m20604k77153r5659o199J45762L70051N16024O80132
3336E4569539Q04140R40431J037015J120452J307069J577169J650979J749946
3328F4756740J911791J916537K047442J935040J863202J633074J359188J078950
3320G8501964P83516O34649M26463M21059N16525N59983O05832P27855Q78715
3311H4056561R25660R08644P55902N75818K96631L8420l44375n28678o24273p24838
$$ y = [63104543, 64429769, 65531222, 66165281, 66600916, 66983632, 67211272, 67381539, 67456017, 67536053, 67662334, 67900215, 68148140, 68345512, 68271296, 67984737, 67543543, 66698294, 65637599, 64315190, 62952016, 61429866, 59890396, 58449086, 57092952, 56038821, 54999764, 54227091, 53657185, 53236581, 52959428, 52863769, 52857570, 53003332, 53373383, 53889407, 54569539, 55373679, 56314110, 57351125, 58471577, 59778646, 61355815, 63006794, 64756740, 66668531, 68585068, 70632510, 72567550, 74430752, 76063826, 77423014, 78501964, 79285480, 79920129, 80346592, 80767651, 81284176, 81844159, 82449991, 83177846, 84056561, 84982221, 85890865, 86646767, 87222585, 87519216, 87557636, 87213261, 86684583, 86060310, 85335472]
3301H5335472o36234o39457m98786k73872m564J66676K42409K89857L84790N94451
3291H4960742O35049O48158O50378O53225P30854P38654Q02619Q36104Q01044
3282I1456827Q06367P11896Q26060Q42603Q21625P96176P98268Q83628Q55469
3273I8798919Q81999Q18837Q24764R77575J028887J079411J170683J260022J487171
3264A08328268J338442J595787J782581J978490K181764K352229K565528K835043
3256A24958132L225379L410796L783313M232221M694654N177788N837938O314268
3248A61634489O832809P450933Q193180Q960195R680425J0532558J0999451J1404120
3240B35688160J1633845J1737315J1255151J0361728Q998313P367466N659003
$$ y = [85335472, 84699238, 84059781, 83560995, 83287123, 83282559, 83449235, 83691644, 83981501, 84366291, 84960742, 85595791, 86243949, 86894327, 87547552, 88278406, 89017060, 89819679, 90655783, 91456827, 92263194, 92975090, 93801150, 94643753, 95465378, 96261554, 97059822, 97943450, 98798919, 99680918, 100499755, 101324519, 102302094, 103330981, 104410392, 105581075, 106841097, 108328268, 109666710, 111262497, 113045078, 115023568, 117205332, 119557561, 122123089, 124958132, 128183511, 131594307, 135377620, 139609841, 144304495, 149482283, 155320221, 161634489, 168467298, 175918231, 184111411, 193071606, 202752031, 213284589, 224284040, 235688160, 247322005, 259059320, 270314471, 280676199, 289674512, 297041978, 302700981]
3233C02700981L938544K238444P46693n3142l36650l06476j02983K14136K79528
3224C09319075Q7171q91377k242970l575804n211917o724485q257204r620758
3216B72881731j0524933j1054740j1301550j1167295j0723788j0105209r259344
3209A98744872q401078p641105o842670o119139n458858m940418m269980l688609
3201A51383015l132820k612235k070725j484496o99990j60950M99471J117778
3193A42839048J778396K070638J054551O11709O30679Q88594J281867J845299
3185A53000781K141482K593147K924910L164232L038324K974744K695482K494866
3177A75027968K201218J565917J173244P00246K90211K0562k99251n86239n79326
$$ y = [302700981, 306639525, 308877969, 309624662, 309571520, 309234870, 308928394, 308825411, 309039547, 309319075, 309406246, 308514869, 306271899, 302696095, 297484178, 290759693, 282502489, 272881731, 262356798, 251302058, 240000508, 228833213, 218109425, 208004216, 198744872, 190343794, 182702689, 175860019, 169740880, 164282022, 159341604, 155071624, 151383015, 148250195, 145637960, 143567235, 142082739, 141382749, 141221799, 141721270, 142839048, 144617444, 146688082, 147742633, 148354342, 148985021, 149873615, 151155482, 153000781, 155142263, 157735410, 160660320, 163824552, 166862876, 169837620, 172533102, 175027968, 177229186, 178795103, 179968347, 180668593, 180958804, 180979366, 180680115, 180093876, 179514550]
3168A79514550m42744m64060m40412k04905k51768k74459j61102j00708n14499
3159A76659893j492735k156831k505446k678797l078543l197382l311278l276514
3151A54962367l205977k919510k769304k518524k244965j998246j532609j319187
3143A36454045r02619o15270l31091N9777M17453P22717J052962J443617J796370
3134A40097961K203395K553536K895918L229941L239222L305255L419779L443426
3126A64388433K922519K586442K350150J796753J287166Q55092K57348Q3934j28112
3117A76399725m27162n35442n61741o73832p10291q58405r81911j163547j398258
3108A69089136j590529j914202k241755k220591k349310k525222k580684k419306
$$ y = [179514550, 179071806, 178607746, 178167334, 177962429, 177710661, 177436202, 177275100, 177174392, 176659893, 175167158, 173010327, 170504881, 167826084, 164747541, 161550159, 158238881, 154962367, 151756390, 148836880, 146067576, 143549052, 141304087, 139305841, 137773232, 136454045, 135551426, 134936156, 134605065, 134664842, 135082295, 135805012, 136857974, 138301591, 140097961, 142301356, 144854892, 147750810, 150980751, 154219973, 157525228, 160945007, 164388433, 167310952, 169897394, 172247544, 174044297, 175331463, 176186555, 176443903, 176527837, 176399725, 175972563, 175437121, 174875380, 174201548, 173491257, 172632852, 171650941, 170487394, 169089136, 167498607, 165584405, 163342650, 161122059, 158772749, 156247527, 153666843, 151247537]
3100A51247537k383641k184696j924693j622634j306792j153107r44638o62543
3092A39064793l31823n1192r519L48376M03469N85006J067668J053535J161548
3083A43291861J289622J399898J698667J483786J540726J503203J157020J157904
3075A54522687R48614P17412N87142K62941j05094j85999m63927p36103j179408
3066A54368265j243321j331863j303323j334518j318982j342010j235640j231533
3058A44027075j335506j435978j852026j983154k305270k726715l079615l529826
3050A25778985l694976l999741m206075m105764m167449l936918l545900l573691
3042I4548471l244020k867007k635582k492749k082714j886286j743795j636795
$$ y = [151247537, 148863896, 146679200, 144754507, 143131873, 141825081, 140671974, 139727336, 139064793, 138732970, 138681778, 138672259, 139020635, 139424104, 140009110, 141076778, 142130313, 143291861, 144581483, 145981381, 147680048, 149163834, 150704560, 152207763, 153364783, 154522687, 155471301, 156188713, 156775855, 157038796, 156933702, 156747703, 156283776, 155547673, 154368265, 153124944, 151793081, 150489758, 149155240, 147836258, 146494248, 145258608, 144027075, 142691569, 141255591, 139403565, 137420411, 135115141, 132388426, 129308811, 125778985, 122084009, 118084268, 113878193, 109772429, 105604980, 101668062, 98122162, 94548471, 91304451, 88437444, 85801862, 83309113, 81226399, 79340113, 77596318, 75959523]
3034G5959523j457877j368528j379849j270134j283162j254755j280195j307968
3026F5357055j228399j329689j205147j250243j290378j115043j016679j022071
3018E5899406j020532q57231j126431r92080r03575q46554p53844o45694o14107
3009D8139358n78635l86517l72501j67644j67396j19727j95347k53078k71466
3000D5627047k69035k50872m57236k99305l98355m79524n83886o94105n58913
2991D1635816o41884n85188n97270n83320o53937n25976l30332o05419m70846
2982C6641644l12005l56213l36546k49986k19345k4313p4483j72653o1458l0868
2972C4803774N418P0965m4023q0128j17385j9794R5572q1356l9478K05j35387
$$ y = [75959523, 74501646, 73133118, 71753269, 70483135, 69199973, 67945218, 66665023, 65357055, 64128656, 62798967, 61593820, 60343577, 59053199, 57938156, 56921477, 55899406, 54878874, 54021643, 52895212, 51903132, 50999557, 50153003, 49399159, 48753465, 48139358, 47560723, 47174206, 46801705, 46634061, 46466665, 46346938, 46151591, 45898513, 45627047, 45358012, 45107140, 44649904, 44350599, 43952244, 43472720, 42888834, 42194729, 41635816, 40993932, 40408744, 39811474, 39228154, 38574217, 38048241, 37717909, 37112490, 36641644, 36329639, 35973426, 35636880, 35386894, 35167549, 35143236, 35068753, 34896100, 34834642, 34803774, 34809192, 34880157, 34836134, 34756006, 34638621, 34618827, 34714399, 34633043, 34593565, 34593770, 34458383]
2961C4458383m8938p1387j39521j53303j23204q5469Q540j5336k18601o1007o4137
2950C3486020m0362m438k21152j2191o7508j44615j13671j54078j06341o3583
2940C2558081j8978N8831m0543j0451J42247P2831J34160K44489J81482K55279
2930C3577428K24514K23179K63179L31506L55637L50878L43881L52403M56842
2921C6479447M81404M05465M19720M68473M49826N59522N64845O41505N85026
2912D1055233O82632O11100O78598O81725O90021P13241P22639P16986P88643
2903D7340818Q06918Q21285P96844Q51895R10171J110509J062272R77911R20361
2894E5598984J024946J164279J170650J193041J189139J398335J335354J529796
$$ y = [34458383, 34409445, 34338058, 34198537, 34045234, 33922030, 33836561, 33845101, 33829765, 33611164, 33550157, 33486020, 33445658, 33441220, 33220068, 33207877, 33140369, 32995754, 32882083, 32728005, 32621664, 32558081, 32539103, 32597934, 32557391, 32546940, 32689187, 32762018, 32896178, 33140667, 33322149, 33577428, 33801942, 34025121, 34288300, 34619806, 34975443, 35326321, 35670202, 36022605, 36479447, 36960851, 37366316, 37786036, 38254509, 38704335, 39263857, 39828702, 40470207, 41055233, 41737865, 42348965, 43027563, 43709288, 44399309, 45112550, 45835189, 46552175, 47340818, 48147736, 48969021, 49765865, 50617760, 51527931, 52638440, 53700712, 54678623, 55598984, 56623930, 57788209, 58958859, 60151900, 61341039, 62739374, 64074728, 65604524]
2886F5604524J625945J726216J910937J981642K268209K427711K512087K517399
2878H2574670K775778K913733L000822L102907L167194L301581L489178L804473
2870A08130336M106189M543220M967844N494270N924774O585038P217769Q095024
2862A55064464Q970999J0029248J1115495J2403094J3968412J5413821J6940469
2855B43906002J8580553J9896437K1025127K1732692K1515053K0830788J9289295
2848C86775947J7045277J4042740R317459K378511o151154j3896549j9106043
2841C90406188k1657428k2161668k1032198j8843070j6083855j3325368j0824233
2834B66478368q219939n711541k944112J79804L473763O871247R871281J1298472
$$ y = [65604524, 67230469, 68956685, 70867622, 72849264, 75117473, 77545184, 80057271, 82574670, 85350448, 88264181, 91265003, 94367910, 97535104, 100836685, 104325863, 108130336, 112236525, 116779745, 121747589, 127241859, 133166633, 139751671, 146969440, 155064464, 164035463, 174064711, 185180206, 197583300, 211551712, 226965533, 243906002, 262486555, 282382992, 303408119, 325140811, 346655864, 367486652, 386775947, 403821224, 417863964, 427181423, 429559934, 423408780, 409512231, 390406188, 368748760, 346587092, 325554894, 306711824, 290627969, 277302601, 266478368, 258258429, 252546888, 249602776, 249782580, 253256343, 260127590, 269998871, 281297343]
2826B81297343J0298879N785419k107045j0358546j6280929j9560315k0793108
2819B28281698k0160988j8327437j5837042j3236661j1169003r416003p866378
2812A32268186o674859n787107n019473m324764l755594l354337k825129k479175
2804I8047748k136228j782200j583009j337868q95780o38591m47724j62599K7648
2795H9091397M22712O44243P76118R22905J032579J375442J561317J676601K033282
2786I9536596K259011K391844K548154K699361K694910K879204K842513K636280
2778A20487873K335672K130246J500368Q68764K78200l98288j406688k167355
2770A23628792k801977l570034l987679m226976m414699m575682m497052m601304
$$ y = [281297343, 291596222, 297381641, 295274596, 284916050, 268635121, 249074806, 228281698, 208120710, 189793273, 173956231, 160719570, 149550567, 140134564, 132268186, 125593327, 119806220, 114786747, 110461983, 106706389, 103352052, 100526923, 98047748, 95911520, 94129320, 92546311, 91208443, 90312663, 89674072, 89226348, 89063749, 89091397, 89514109, 90158352, 90934470, 91857375, 92889954, 94265396, 95826713, 97503314, 99536596, 101795607, 104187451, 106735605, 109434966, 112129876, 115009080, 117851593, 120487873, 122823545, 124953791, 126454159, 127322923, 127601123, 127202835, 125796147, 123628792, 120826815, 117256781, 113269102, 109042126, 104627427, 100051745, 95554693, 90953389]
2762I0953389m233749m156198l956475l850164l594581l405411l121678k867054
2754F1768079k799813k513163k441151k238438k072601k089168j885939j615327
2746D4112479j594789j672938j490555j242194j292572j193066j099913j077790
2738C3448662j082401r68185q28003q11254q46699q33515p32588p14870n80541
2729B6050606o09261o11179p28903n42543n51023o83336n41624m66469m68736
2720B0847532m48129m00684m68010m19091l72435l62300l81316l60163k81872
2711A7353532l58540l26302k71340k50336l42851l93000l39016l69618k21928
2702A4480601l14134j96839j92934k63695j88754l06043j89545j39041k09119
$$ y = [90953389, 86719640, 82563442, 78606967, 74756803, 71162222, 67756811, 64635133, 61768079, 58968266, 56455103, 54013952, 51775514, 49702913, 47613745, 45727806, 44112479, 42517690, 40844752, 39354197, 38112003, 36819431, 35626365, 34526452, 33448662, 32366261, 31398076, 30570073, 29758819, 28912120, 28078605, 27346017, 26631147, 26050606, 25441345, 24830166, 24101263, 23558720, 23007697, 22324361, 21782737, 21316268, 20847532, 20399403, 19998719, 19530709, 19111618, 18739183, 18376883, 17995567, 17635404, 17353532, 16994992, 16668690, 16397350, 16147014, 15804163, 15411163, 15072147, 14702529, 14480601, 14166467, 13969628, 13776694, 13512999, 13324245, 13018202, 12828657, 12689616, 12480497]
2693A2480497j70463k30309k41540k06871j79075j54256j75361k04612k33471
2684A0684539j41635j46208j87957j73052l39692j11490k03194j99648j12100
2675I069563n9500j15170j28092j59146O7043j48179j69131o9215j94907k8913
2665H064353k9409j22841k38681j36779r3132o5849j54008o5273k6315j56063
2655F976003j97313l8544l9365n9058k6177m8588r0717j72760j11668J8853J8394
2644F229060j17807p0990k7927j25518p1053P8530k7468o8028j03805L8722L6238
2633E769954n4165L701j00697j8574m2260k7976o0763J3807K8679o0405j14878
2622E336423j20502M8905K5915k1599N8767j56605N4848Q0868o5706j0795N341
$$ y = [12480497, 12310034, 12079725, 11838185, 11631314, 11452239, 11297983, 11122622, 10918010, 10684539, 10542904, 10396696, 10208739, 10035687, 9695995, 9584505, 9381311, 9181663, 9069563, 9010063, 8894893, 8766801, 8607655, 8674698, 8526519, 8357388, 8288173, 8093266, 8064353, 8034944, 7912103, 7673422, 7536643, 7443511, 7377662, 7223654, 7158381, 7132066, 6976003, 6778690, 6740146, 6700781, 6641723, 6615546, 6566958, 6476241, 6303481, 6191813, 6210666, 6229060, 6111253, 6040263, 6012336, 5886818, 5815765, 5894295, 5866827, 5798799, 5694994, 5733716, 5769954, 5715789, 5719490, 5618793, 5600219, 5557959, 5529983, 5469220, 5483027, 5511706, 5451301, 5336423, 5215921, 5264826, 5290741, 5269142, 5327909, 5171304, 5226152, 5307020, 5241314, 5230519, 5235860]
2611E235860L6038P510l8263M002K3716J0603o6930P1133J40926J018p4096J2636
2599E364153j839P9472N9109J20978O9270M103M9849J14603o489j09364M8787
2588E792632Q4911j3076j20334n6984J02317Q3442K0890o3261n7801R683m5545
2577E736874J05678o083J06541J00500k041P4489O6684L6463M2257L01J29825
2566F391488L5264k6501O1168P545j04365j48596r9190k1240j83655k04332j34632
2555E572954j12968j29008k21346j62504p3759q3975m5356L8115n3524l6791M1061
2544D732899K833p9562L8845K9210n5515r9310j09998j65607j01407j68369j85722
2533C838297j11486j58937q9804p7031j06228o5540j1769m5524o2437j14080n6510
$$ y = [5235860, 5271898, 5279408, 5241145, 5245147, 5268863, 5279466, 5212536, 5283669, 5424595, 5425613, 5351517, 5364153, 5362314, 5441786, 5500895, 5621873, 5691143, 5695246, 5745095, 5859698, 5853209, 5743845, 5792632, 5877543, 5864467, 5744133, 5687149, 5789466, 5872908, 5893798, 5830537, 5772736, 5782419, 5736874, 5842552, 5836469, 5943010, 6043510, 6041469, 6115958, 6182642, 6219105, 6261362, 6261663, 6391488, 6426752, 6400251, 6461419, 6468964, 6364599, 6216003, 6116813, 6095573, 5911918, 5707586, 5572954, 5459986, 5330978, 5109632, 4947128, 4873369, 4789394, 4744038, 4782153, 4728629, 4691838, 4732899, 4735732, 4656170, 4695015, 4724225, 4668710, 4569400, 4459402, 4293795, 4192388, 4024019, 3838297, 3726811, 3567874, 3478070, 3401039, 3294811, 3229271, 3217502, 3171978, 3109541, 2995461, 2938951]
2522B938951q2222K4938o09M8746n9032k51378r6443N1503n7816q5071n083R4343
2510B520827o0333n8835j33864r6137N0471l8538J0210J0180j52556o3313M5810
2499B033922n387M8233n202m7587m1068K4953q9235M0311K7254n9291k9922j18897
2487A778084O9317M3939N7188j16813j09265M7218L9121k5091j66309l5913l5825
2476A545651J15181J13705j58327j32554l6862l2932L3510j7619O1955o5276o6107
2465A360325J0143n076O1463p78q2745K4930K9334p1354p8516n500J0175M9116
2453A301517j04888p2551j2912k8431o9189P5047l3667J0417j6528n3940l4206
2442I60669M937J363k9145n0038M0767J2022j6802K6146r3386L945k0866J6850
$$ y = [2938951, 2856729, 2881667, 2881058, 2929804, 2870772, 2619394, 2522951, 2574454, 2516638, 2431567, 2426484, 2520827, 2460494, 2401659, 2267795, 2171658, 2222129, 2183591, 2193801, 2203981, 2051425, 1988112, 2033922, 2028535, 2076768, 2071566, 2023979, 1982911, 2007864, 1918629, 1958940, 1986194, 1926903, 1896981, 1778084, 1847401, 1891340, 1948528, 1831715, 1722450, 1769668, 1808789, 1783698, 1617389, 1581476, 1545651, 1660832, 1774537, 1616210, 1483656, 1446794, 1413862, 1447372, 1429753, 1491708, 1426432, 1360325, 1370468, 1365392, 1426855, 1426077, 1343332, 1368262, 1397596, 1326242, 1247726, 1242226, 1252401, 1301517, 1196629, 1124078, 1111166, 1082735, 1013546, 1088593, 1054926, 1065343, 1048815, 994875, 960669, 965606, 966969, 937824, 887786, 928553, 940575, 923773, 949919, 856533, 860478, 839612, 856462]
2430H56462k532m1844r7182P0300K8017j1260M048K9132k3917o6873k6555k7233
2418F90563R5652j484Q373o4517K5023p0374J385M2238q3468J17601q3502k8631
2406F48859K061M685m9445p1441Q7862L552m4471P938m7698Q4631p1996o3699
2394D90838J3873N7492M0127k1511J6186J8845l6251n9923j7928N913K9180j477
2382E35364l6573L9874n8560o4849L9112N1924M7448R0324j59313M1167M1211
2371E67129m1121m3102l7313l3513J8443Q612k6855J6318M0381j3926J0307Q2348
2359E47708n7421N708m1502p294J9496O2875o7177O2404m6400J747j2028J03749
2347E71865J6069j23904O9826R0303n9500j34620j04249J2592P6130k0089R745
$$ y = [856462, 853930, 812086, 714904, 785204, 813221, 801961, 806009, 835141, 811224, 744351, 717796, 690563, 786215, 784731, 793104, 728587, 753610, 683236, 684621, 726859, 643391, 760992, 677490, 648859, 650920, 655605, 606160, 534719, 622581, 626133, 581662, 589600, 541902, 626533, 554537, 490838, 504711, 562203, 602330, 580819, 597005, 615850, 579599, 519676, 501748, 507661, 536841, 535364, 498791, 538665, 480105, 415256, 454368, 506292, 553740, 644064, 484751, 525918, 567129, 526008, 482906, 445593, 412080, 430523, 439135, 412280, 428598, 468979, 455053, 465360, 547708, 490287, 495995, 454493, 447199, 466695, 529570, 462393, 524797, 478397, 480144, 468116, 571865, 587934, 464030, 533856, 624159, 564659, 430039, 325790, 338382, 414512, 394423, 404168]
2336D04168n4840R5294J2385J1150m1526k7428k6428J6779q027L6188L8575n9489
2324C96801O4021j4990J6375j48298K2573N2770o4817O168J4281n8867N5039n9554
2312B81502p9098J13759O6897p9235q0337N1352Q3217j02324k0617L2680N6828
2301C24624p5377m6116N4887J01960P4901o4245J0371j0798J8646o9269K8225
2290C47809j7037q1417K3012N8243m5276n18M8330p228n8569n2881K9345J57187
2278D01000j1705j16541l4362R979N1030o5339n82K1959n666n5034J018j0628
2266A85129J4060q3626j1965N5827j5929K4109Q4433M1264q6849k4508K0733M0678
2254B43356N7581R891M6749R4416l0152o1366o1055L9700o2921q5560K0770p1261
$$ y = [404168, 349328, 444622, 457007, 468157, 426631, 399203, 372775, 389554, 381527, 417715, 456290, 396801, 460822, 445832, 462207, 313909, 336482, 389252, 324435, 330603, 344884, 286017, 341056, 281502, 202404, 316163, 383060, 303825, 223488, 274840, 358057, 255733, 235116, 267796, 324624, 249247, 203131, 258018, 359978, 434879, 370634, 381005, 370207, 388853, 319584, 347809, 330772, 249355, 272367, 330610, 285334, 284816, 333146, 325918, 267349, 214468, 243813, 401000, 389295, 272754, 238392, 248371, 299401, 234062, 233480, 255439, 249773, 194739, 195757, 185129, 199189, 115563, 103598, 159425, 143496, 167605, 252038, 293302, 206453, 181945, 202678, 243356, 300937, 310828, 357577, 451993, 421841, 360475, 299420, 339120, 276199, 190639, 211409, 140148]
2242A40148M8350J13476p5820K8692M7269l0169K4377j2337j18431J20916k1082
2231B65389J307P0317k89n7275l2369P0261k7223p3457Q5073N602o6502O666L0524
2218B78024R7910o8188r8760j9642R2051j2777K3623k1599J35474O6335m9071
2207D23380n4207K8402J600m2581p9812M0063P1106k6307n2368k4654q168J4406
2195B90860M6996m2039l8815j9200R8292L005M0544J9870J6989n8811q965M5361
2183C94087P6583m7113j9885K6706J4449K4001L0558o0356N204q5916p33O9844
2171D27429O2771Q1513j6271o2462N399K8008M7466N8948J05842L5741j3467j0989
2159G49928k4929l7748N51L8307p265n2737J04067P0265j08219O4515Q1237q5093
$$ y = [140148, 188498, 301974, 226154, 254846, 302115, 271946, 296323, 283986, 165555, 286471, 265389, 266696, 337013, 336724, 279449, 247080, 317341, 290118, 216661, 301734, 307336, 240834, 247500, 278024, 375934, 307746, 208986, 189344, 281395, 268618, 292241, 270642, 406116, 472451, 423380, 369173, 397575, 399175, 356594, 276782, 316845, 387951, 361644, 309276, 284622, 276454, 290860, 337856, 295817, 257002, 237802, 336094, 339099, 379643, 399513, 416502, 357691, 348726, 394087, 470670, 423557, 403672, 430378, 444827, 468828, 499386, 439030, 444234, 358318, 357585, 427429, 490200, 571713, 555442, 492980, 498379, 526387, 573853, 632801, 738643, 774384, 760917, 749928, 724999, 687251, 687802, 726109, 718844, 666107, 770174, 840439, 732220, 796735, 877972, 792879]
2147G92879m6869J04496M8530K7349q9211J88929Q9902j46960j913O1553N3434
2136A082119O0777n6912J14677M2448K4870m7302N5246K1245J12336M8084r339
2125A448249n1751M5499R4475R3880R901J25439J57033K2551O2909Q3605J6796
2114B108586J01133M8950P3746K24367P7200K29206Q3440K01047J44458J76094
2104C468227K55404J66948J0964K18539L41515L12718K66709L42067M64229N48058
2094F395378N26641M96165O11400O09180O92991P04613R16129R99997J362237
2085A3314731J821740K686627L570459M284759N314717N807803K918584k442889
2077C7276531l972903m374594m590531m191307l894711k802879k127590j663679
$$ y = [792879, 746010, 850506, 899036, 926385, 837174, 1026103, 1116005, 969045, 967132, 1028685, 1082119, 1142896, 1085984, 1200661, 1243109, 1267979, 1220677, 1275923, 1297168, 1409504, 1457588, 1448249, 1396498, 1441997, 1536472, 1630352, 1640253, 1765692, 1922725, 1945276, 2008185, 2091790, 2108586, 2209719, 2258669, 2332415, 2556782, 2633982, 2863188, 2946628, 3147675, 3292133, 3468227, 3723631, 3890579, 3901543, 4120082, 4461597, 4774315, 5041024, 5383091, 5847320, 6395378, 6922019, 7418184, 8029584, 8638764, 9331755, 10036368, 10952497, 11952494, 13314731, 15136471, 17823098, 21393557, 25678316, 30993033, 36800836, 39719420, 37276531, 33303628, 28929034, 24338503, 20147196, 16252485, 13449606, 11322016, 9658337]
2069I658337j180207q61881o81033n31149l40111l24233l88028m17617m11430
2060D522648l69465l98334k70378j99260j87338j78444k33934j68194l1037j68186
2050B318078j34935m5541k4132j26355n6875p3809j47697o8787R31j95339o9670
2039A375869l3287o7984j33443N0359M1943j54192j41682N175O3676o5776j3400
2028I27258j05505P4819m0318m2993J0522n1839m3051r0301L0003Q7554k3308
2017G32841K0405q8303M8847q0858j36740J4049q861n9838N8203M0774j1379j50675
2005C78465m4742J35713O4692q9823r6946M3315o0203m4681K4575l1250K2867
1994C01982O130K5807K55o5316J3004K4800R736j52863K4165N8452p998k2024
$$ y = [9658337, 8478130, 7616249, 6935216, 6404067, 6063956, 5739723, 5351695, 4934078, 4522648, 4153183, 3754849, 3484471, 3285211, 3097873, 2919429, 2685495, 2517301, 2486264, 2318078, 2183143, 2137602, 2113470, 1987115, 1930240, 1856431, 1708734, 1639947, 1640878, 1445539, 1375869, 1342582, 1274598, 1141155, 1191514, 1233457, 1079265, 937583, 942758, 1006434, 940658, 927258, 821753, 896572, 856254, 813261, 823783, 771944, 728893, 638592, 668595, 756149, 732841, 753246, 664943, 713790, 632932, 496192, 510241, 501380, 441542, 499745, 540519, 529140, 378465, 333723, 469436, 534128, 444305, 347359, 390674, 330471, 285790, 310365, 279115, 301982, 308112, 333919, 334174, 268858, 281862, 306662, 316398, 163535, 187700, 246152, 238154, 216130]
1982B16130j06562J5736J2010L1135L4136p7136L9986p857o6044j5256M19o4957
1970A1740J03031O0719n299N1859l8945M9431j51037L9747p7857K087M9477k1312
1958G3641J5681j8678K1126r6113m1547J0423O3203q322M0560R3780J03626j03685
1946A53695M6553n5501k2562K6362k8415n4171j1236l2804J5637k1578O3113K7828
1934A06921j17379M1437N7013M0017M1054l0553l247L7204k3328j5877o3079k9792
1922D0391m2905K4544n3720O3128n2183j5088M4420l2341l2998n4489P9017N4099
1910B1875N5183j8917j9448M3787r4241l6706J3315O8019L3628j286Q1255o1494
1898H4970J0605j8381o4836j7545k9100o5618M8990O6956q2755m0204J02287m1377
$$ y = [216130, 109568, 125304, 137314, 168449, 202585, 125449, 165435, 157578, 91534, 76278, 76697, 11740, 114771, 175490, 170191, 222050, 183105, 232536, 81499, 121246, 43389, 45476, 94953, 73641, 89322, 70644, 91770, -4343, -45890, -35467, 27736, 19414, 59974, 153754, 257380, 153695, 200248, 144747, 122185, 148547, 120132, 65961, 54725, 21921, 37558, 15980, 79093, 106921, -10458, 30979, 87992, 128009, 169063, 138510, 135263, 172467, 149139, 133262, 70183, 40391, -2514, 22030, -31690, 31438, -20745, -35833, 8587, -23754, -56752, -111241, -32224, 21875, 77058, 58141, 38693, 82480, -11761, -48467, -35152, 32867, 66495, 65209, 146464, 84970, 95575, 77194, 12358, -5187, -34287, -99905, -50915, 16041, -66714, -106918, -4631, -46008]
1886d6008j12148J9029q6547O2516J67308k7274l5746o4051O5948l5092k9900
1875a21965j9894N5166R5414j6612J0217p0174r4028k1985R959J09355J1486n0997
1863a04058J73642n7974n2971R7207J3671r9842R042j9890Q88J5020J844k8546
1851e1967K3622k603q9941M1222R7159N0743k8128j02825l3394J08L6271j04405
1839a64138K3844J82377l553k3032o4492l3300J07495R5168P1115k03355r7122
1828a08993J07897m3298R921l600N9918m6255n6077Q8050O1093j48594l1323J09984
1816a277J3108r465J08574J01555j1379m0074m3812n6527K1198p9112Q3113N6050
1804A41952l6560K3610r3234m5514l5084o4404N5788N4220k7505k7930N2548P0990
$$ y = [-46008, -158156, -139127, -225674, -163158, 4150, -23124, -58870, -122921, -56973, -92065, -121965, -141859, -86693, 8721, -7891, 2326, -67848, -161876, -183861, -173902, -64547, -53061, -104058, 69584, 11610, -41361, 55846, 69517, -30325, -21283, -41173, -40285, -25265, -23421, -51967, -28345, -30948, -120889, -79667, 17492, 68235, 40107, -62718, -96112, -96004, -59733, -164138, -140294, 42083, 38530, 15498, -48994, -82294, 25201, 120369, 191484, -11871, -108993, -1096, -44394, -34473, -38073, 21845, -24410, -80487, 7563, 68656, -79938, -111261, -1277, 11831, 2366, 110940, 212495, 201116, 161042, 117230, 60703, 81901, 2789, 85902, 141952, 105392, 129002, 35768, -9746, -44830, -109234, -53446, 774, -26731, -54661, -2113, 68877]
1792F8877j36563k9683M6296n039M3575j4495K1275k2089l9482J83952p9711r7041
1780f0128n7300M07Q5943K9293J5378k103q5689o3333M5713R2382n3004l0087
1768h2528j7154L6193j4993N826N8785o8299p5558o370m6901K1758J32026J2999
1756d4216J2246j8223p1588Q0409J0919j1118R18q6951j604Q1899M7993j5846
1744a5162k642j1567o7739l475P2866j7340M3241k3716k5709q9755L0799j3509
1732a23708o433q5112J10801J27292r5025j9197M8625J23205q2113j16881k984
1721a21530J00900M2181r7338n3337J50185R0711r3574P200n7978p2174p3957
1710a78711N9218P0481k0381m7229j2536O6271Q2776n7057k8540j2072k1412N6810
$$ y = [68877, -67686, -97369, -51073, -56112, -12537, -27032, -5757, -27846, -67328, 116624, 36913, -60128, -117428, -117021, -31078, -1785, 13593, 11490, -74199, -137532, -91819, 563, -52441, -82528, -99682, -63489, -78482, -72656, -13871, -82170, -157728, -164098, -210999, -189241, -57215, -44216, -31970, -50193, -121781, -41372, -30453, -41571, -40653, -127604, -129208, -47309, 684, -15162, -17804, -29371, -97110, -100585, -27719, -45059, -1818, -25534, -51243, -140998, -110199, -123708, -130141, -215253, -104452, 22840, -72185, -91382, -42757, 80448, -1665, -118546, -121530, -20630, 21551, -75787, -129124, 21061, 111772, 18198, 25398, -32580, -104754, -178711, -119493, -49012, -69393, -116622, -129158, -62887, 19889, -37168, -65708, -77780, -99192, -42382]
1698d2382p1376L8187R0920r3961o1332M5576N2290o6768q056L400o1582N3846
1686a21238J07838k5288O9518J1351r2682l3893l1770j7796k3440J0913L1314
1675a15173O4742P6875j19366j16262R3135m734n8767Q8578K7407M9260K7734
1664A3429n5256j7555m0470J13599j7742L594n2238r810k9551m3232N7767M8474
1652b8991o6756J9683N2053L881p7417M3625n0130l9891R4130p8751O3762L3811
1640c0991m1430M5344l5346l8398M5861o3451l1697O5296K3208L9007J15756k5677
1628F7482p4427q8442n4833k5173O0001M0317o2419R092j289O8936K9889j8439
1616d9305k5212n152J9908n7520K4504N5974k3199O276o1664q5410R1694k4523
$$ y = [-42382, -113758, -75571, 15349, -78612, -139944, -94368, -42078, -108846, -116902, -113502, -175084, -121238, -13400, -38688, 30830, 42181, -50501, -84394, -116164, -133960, -157400, -146487, -115173, -50431, 26444, -92922, -209184, -116049, -120783, -179550, -90972, -63565, -14305, 13429, -41827, -59382, -99852, 13747, -3995, -401, -52639, -62449, -92000, -135232, -77465, -28991, -95747, -76064, -24011, -20130, -97547, -53922, -104052, -143943, -49813, -128564, -64802, -30991, -72421, -27077, -62423, -100821, -54960, -118411, -150108, -84812, -61604, -22597, 93159, 67482, -6945, -95387, -150220, -175393, -115392, -75075, -137494, -128402, -129691, -60755, -30866, -49305, -74517, -79669, -59761, -117281, -92777, -36803, -60002, -53726, -115390, -200800, -109106, -133629]
1604a33629L1300R4614M2107q2768r9164K1126l2596L0340j9592N6356K7533J716
1592f2657O3258L5210j20287p7365O7300m2083K9989R4290m2704l7058N7577J04898
1580G0368r1480n5901k4714m435K7445q5774K4525j8345l4145N5461N509N5346
1568g6140L0481q9764n7967J9841O6323N9615j1852m9675P013K5891k3186p8396
1556a77816M8849k4471M8728p058L1246J00709o9583J5815l4709N5638p7612M9068
1544d1196Q3825j3093l0290L9619q0436J1752q8200j4826m0270o252Q7040N5951
1532c6376J0708m1053N5291l1597K5576l1896q7769R3672R489j66409O0078k155
1520a42441r105P6661Q3197Q130N363j0889m350J3415o6631j3275P2285k1384
$$ y = [-133629, -102329, -7715, 34392, -48376, -147540, -126414, -159010, -128670, -148262, -91906, -64373, -62657, 601, 35811, -84476, -161841, -94541, -136624, -106635, -12345, -55049, -92107, -34530, 70368, -21112, -77013, -101727, -106162, -78717, -164491, -139966, -158311, -192456, -136995, -131486, -76140, -45659, -135423, -193390, -173549, -107226, -47611, -59463, -109138, -102125, -76234, -99420, -177816, -128967, -153438, -104710, -111768, -80522, 20187, -49396, -33581, -68290, -12652, -90264, -41196, 42629, 29536, -754, 38865, -41571, -29819, -118019, -132845, -173115, -179367, -92327, -36376, -25668, -66721, -11430, -43027, -17451, -49347, -137116, -43444, -33955, -200364, -140286, -142441, -151546, -74885, 8312, 16442, 21805, 10916, 6566, 19981, -46650, -59925, 12360, -9024]
1508i024K5734j05508j9851L0311Q9116M173N8392j15425p4117N7998N6133n1856
1496e3924j4416n0075M5747L0307J6445r3687p4135O3133R5745n9349J7851J1335
1484f5023M5111l6617k2273L9853M6812q4242L8836J06740j00160l7777l5676
1473a04416r085o873N6042m6779q169J24544L2548O134l7870o0919Q4882j25372
1461i5333n2328p787J41043o4613p500o003k3174L4683j28113R4569K5931j1377
1449a00002M3506J2912j9673L3803p5255o4955R0641r3349R3935J7543N2948J760
1437f186o9276j1402Q9513k7538N3557m1975j0194J9991k2242J162k7646P8505
1425B6269L8223n1654r1879j01420J16772L0317L5522n215Q7801N1453n1526j24382
$$ y = [-9024, 16710, -88798, -108649, -78338, 10778, 14951, 73343, -42082, -116199, -58201, -2068, -53924, -68340, -118415, -72668, -42361, -25916, -119603, -193738, -130605, -34860, -94209, -76358, -65023, -19912, -56529, -78802, -38949, 7863, -76379, -37543, 69197, -30963, -68740, -104416, -113501, -120374, -64332, -111111, -119280, 5264, 37812, 43946, 6076, -54843, 30039, -95333, -147661, -155448, -14405, -79018, -86518, -92521, -115695, -81012, -209125, -114556, -88625, -100002, -56496, -43584, -63257, -29454, -104709, -169664, -79023, -172372, -78437, -60894, -7946, -6186, -75462, -86864, 2649, -24889, 28668, -13307, -23501, -3510, -25752, -24590, -52236, 26269, 64492, 12838, -79041, -180461, -63689, -33372, 2150, -3065, 84736, 136189, 84663, -39719]
1413c9719n1213L3157R8672L119o4299Q806n0509m0629j5946P8159O3581J947
1401B5126p8K553m5702m1464l6445K1398j2731M1545M351K2607o0495k525m1286
1388a23146K1060J03547k4780R377o0377L8811l5230r0393M9855J56368k5608
1377A9484j4679r6052m6826l0410p1598J09740L2098N8040l9830O4934k1493L3831
1365b761J7221j08476M9181P8822R6791o5190o5656K514M619p5354m9230k5633
1353a43152K6011Q9044K393L1313o5793L1972n4439q6267K030N2128N1983k9828
1341i2605o1872J62697r2448P8120r9274N0835K4234K6919n9291L6356J32855
1330A06526j53152l1167K7519Q8880K6965J6888j9736r2073N935o5505J4732R966
$$ y = [-39719, -90932, -57775, 40897, 44016, -20283, -11477, -61986, -102615, -118561, -40402, 23179, 25126, 25048, 27601, -18101, -59565, -96010, -74612, -87343, -45798, -41447, -18840, -79335, -81860, -123146, -102086, 1461, -23319, -13942, -74319, -35508, -70738, -161131, -111276, 45092, 19484, 4805, -91247, -138073, -168483, -240081, -130341, -98243, -40203, -80033, -15099, -36592, -2761, 14460, -94016, -44835, 33987, 130778, 65588, -68, 2446, 7065, -68289, -117519, -143152, -117141, -28097, -25704, 5609, -60184, -28212, -82651, -168918, -166888, -114760, -62777, -92605, -154477, 8220, -84228, -6108, -105382, -54547, -30313, -3394, -62685, -26329, 106526, -46626, -77793, -50274, 38606, 65571, 82459, 62723, -29350, -23415, -88920, -74188, -64222]
1318f4222j8631J5509k278j3982M976K6499M1337L541l9546N230k5268l6762j0500
1305a14097J0452j8934O6087L9619K5226j50143l6328l4807Q8571P7338P2184
1294B5168L658m3974Q474j8361l0029l4764n0228P7534K3462R791N0460n4255
1282c3064n8635M2693M53j04827N5730q849P0J352m5848l44O2404J9618j5648
1269h4895q626J03500j3472j06454r2392Q3810L0486n9574N0779l8059Q407O0915
1257f5575P4080J0074J1791k6639O6880k2293o0594M48Q0982o0383J668j6186
1245e747P2326n1607j15278P4584p628k6410j317j04174R6048n3004K65n9172
1233a81114r0240M9553O4041R3235k0415L3264O8788k5533L1086q8865m9151J08929
$$ y = [-64222, -82853, -67344, -69622, -83604, -78628, -52129, -10792, -7251, -46797, -41567, -66835, -103597, -114097, -103645, -122579, -56492, -16873, 8353, -141790, -178118, -212925, -124354, -47016, 25168, 28826, -15148, -6674, -25035, -55064, -89828, -140056, -62522, -39060, -29269, 21191, -33064, -91699, -49006, -48553, -153380, -97650, -106499, -106429, -105077, -150925, -151269, -88865, -69247, -84895, -93521, 9979, -3493, -109947, -202339, -118529, -88043, -147617, -96838, -134897, -126490, -65575, 8505, 18579, 30370, 3731, 70611, 48318, -12276, -11828, 69154, 8771, 10439, -5747, 66579, 14972, -100306, -25722, -33350, -59760, -61077, -165251, -69203, -122207, -121942, -181114, -271354, -221801, -157760, -64525, -84940, -51676, 17112, -8421, 22665, -66200, -115351, -6422]
1221f422n4618J8755n5439P8374j5090j07622N923N6084M4051Q020j998L2386
1209B404p8654J1113p0003L4076O4823j7573O48J9203q964O7713n6339q7922o1639
1196a81114K551M8360l1737O8121M2628O9083r0996K3237m3644j06610k1559J15243
1184a06437K7104L2887K0229J19988m9657k7314l0790n4267n8539M5171Q6369
1173D744o2352N2278j2974Q0426J2043l2651j9916m4321j3909J159K4887J3664
1161C078l7065k1954N4944m7048L242R6776j0422n7136l0976J8336J2059o4185
1149h0351k5750J13773P5079k0500m9918k7286n5906L559J2638J19259J8538l6091
1137D7044j03446K8602K3878K3451J981n0543M7617j8505k5582L663N3174J4014
$$ y = [-6422, -61040, -42285, -97724, -19350, -34440, -142062, -136139, -80055, -36004, -27984, -29982, 2404, -76250, -65137, -135140, -101064, -36241, -53814, -53166, -33963, -42927, 24786, -31553, -119475, -181114, -178563, -130203, -161940, -93819, -51191, 17892, -73104, -49867, -93511, -200121, -221680, -106437, -79333, -46446, -26217, 93771, 44114, 16800, -13990, -68257, -126796, -81625, 4744, -57608, -5330, -18304, 62122, 74165, 41514, 21598, -22723, -36632, -35473, -10586, 3078, -33987, -55941, -997, -48045, -44803, 51973, 41551, -15585, -46561, -28225, -16166, -80351, -106101, 7672, 82751, 62251, 12333, -14953, -70859, -67300, -54662, 64597, 83135, 47044, -56402, -27800, -3922, 19529, 21510, -29033, 18584, 79, -25503, -21840, 31334, 45348]
1125D5348j01399M2306q6567O3153k5846k7765Q1504k9517o8793M9703n6917J11973
1113b817q6867q9186J69576j4518L4558K9157k6483J2274l9603p5663k8876J16270
1101b178j6352J6174J35315m6002l9775j11044N2421k9361J2512N4028l7121n3384
1089f4767l6225M9802J01087M2576P86r019l3932O5691M3764j10739o5300j6520
1077c2796k0863O9657r155p4018Q2381M5108m4450q7214O9039L6654l5580l5138
1065c6375J8646J8259l9195M2270J2102l6049l1859O8282Q0961k13003m2019P6767
1053h1213r0655J07733J01386p7840j0941N2863K5945n1198m1199N0934q7446
1042a01631J7045R4514j08267K304J09254m9375o3269J1671N8639J5458j14223
$$ y = [45348, -56051, -13745, -100312, -37159, -63005, -90770, -9266, -38783, -107576, -57873, -114790, -2817, -89684, -178870, -9294, -23812, 10746, 39903, 13420, 25694, -13909, -89572, -118448, -2178, -18530, -2356, 132959, 86957, 47182, -63862, -11441, -40802, -28290, 25738, -11383, -64767, -100992, -51190, 49897, 92473, 93259, 84240, 50308, 115999, 159763, 49024, -16276, -32796, -53659, 15998, 6843, -67175, 15206, 60314, 15864, -71350, -2311, 34343, -1237, -36375, -17729, 530, -38665, 3605, 15707, -20342, -52201, 16081, 97042, -115961, -157980, -81213, -171868, -64135, 37251, -40589, -51530, 1333, 27278, -23920, -65119, -14185, -101631, -84586, 9928, -98339, -96035, 13219, -36156, -99425, -87754, -29115, -13657, -127880]
1031a27880L2911M1785R1560p907O217k6860j3449k528M8583j1697O217n4246
1019a7294L0315m5557K8552M2514k7592j05997K1370K6376O593l9852r8570k5953
1007b05095N8953R6857L7323L3080J24860j5784j17929j6021m508p1783k5264
996a05311J67300j44455M8237P0099o7651N009O8108J0846k0084k8800j301n3679
984e1682M7735k9795j8474M0175k2610R6939j6440o5139J18384L4681j39024m8142
972e3392J23J47452R9516q0960R167L2866l3937k6155l1161n4785j3464o4278
960f9008M5747q7533P170R7500P0221k6893p4913M7414O0527J0284P4989o5065
948I0440p1962j7828l2490l7963N7757o9083o725J11814o0435m4560R7149j3974
$$ y = [-127880, -94969, -53184, 38376, 30469, 36686, 9826, -3623, -6151, 42432, 30735, 36952, -17294, 13021, -32536, -3984, 38530, 10938, -95059, -73689, -47313, -40720, -80572, -179142, -205095, -146142, -49285, -11962, 21118, 145978, 130194, 12265, -3756, -8264, -80047, -105311, 61989, -82466, -34229, 35870, -31781, -26772, 41336, 52182, 32098, 3298, 1997, -51682, -3947, -33742, -52216, -12041, -34651, 62288, 45848, -19291, 99093, 133774, -5250, -53392, -53269, 94183, 193699, 112739, 121906, 154772, 120835, 94680, 63519, 8734, -4730, -69008, -23261, -110794, -103624, -6124, 64097, 37204, -37709, 9705, 70232, 80516, 155505, 90440, 18478, 650, -31840, -69803, -12046, -81129, -87854, 23960, -36475, -81035, 16114, 2140]
936B140r2609l795P4413k5098j03777Q6852O2175R2510n1916m6612j04982R3394
924a7305J9369r3303J00695q1463L3559J08072j0763l4187k1826L5477M208j37217
912i4684J19149K9422p107j9128J1742L212j09551K6901J8966O5494O921m3645
900G692N409M4002l3016m6199k7301r3833J35608K3866o5337P1798k4570J02633
888A00752q32p4063J4610l5711m6746O7178l0185M6150j660j0531L5249N1383
876A15594K2200j78987M473P8849K4463m959j33931o5503P7897Q4144P3513m4694
864E3059j13538Q0554J08357p7988r2111p588J14946o0013N5336j4121j7501L9808
852F9200j00105j9342N1828P4642r2442l4738O9000o590j17591O3439R5716n6306
$$ y = [2140, -90469, -94264, -19851, -44949, -148726, -61874, 301, 92811, 40895, -5717, -110699, -17305, 2064, -91239, 9456, -72007, -38448, 69624, 58861, 24674, 2848, 38325, 42533, -94684, 24465, 53887, 46780, 27652, 39394, 42606, -66945, -40044, -21078, 44416, 51337, 7692, 13101, 57103, 24087, -22112, -49413, -143246, -7638, 16228, -49109, 22689, -1881, 100752, 99920, 25857, 40467, 4756, -41990, 25188, -4997, 41153, 39493, 28962, 64211, 115594, 137794, -41193, -36720, 42129, 66592, 61633, -72298, -137801, -59904, 24240, 97753, 53059, -60479, 20075, 128432, 50444, -41667, -49255, 65691, 5678, 61014, 46893, 29392, 69200, -30905, -50247, 1581, 76223, -16219, -50957, 18043, 11453, -106138, -42699, 53017, -3289]
840c289m2496K4828p0796K5942K035N8616N3118n9481k1299K8694J11350m1574
828F5648m5859l1215O807M4285J1872J1110p1444k2872m06L7758J2457n8964L7725
815c098M6958n7001N285Q500Q9122q186k47o6354R301l0435k9185n4917O5820
802b4437j1536N8834J6378q0839j7660J20426R777q0298M3257k8933k1029j120
790a7180j8471q2545N454Q7378k911j12327Q4940J05179L602j7156N2751p4780
778A3934K0238N6407M5243n0690n5640p2182M1866J07023o8568J6593K6688q4083
766c171M9034k1086m1168Q0710K865j4686r1168j2234P7858K367K5399m5115p5791
753f6186L2524N9009k1810n4357N5062M4614k3931k7468J8783J13855j00263j8598
$$ y = [-3289, -45785, -20957, -91753, -65811, -63776, -5160, 47958, -11523, -32822, -4128, 107222, 65648, 19789, -11426, -4619, 39666, 51538, 62648, -8796, -31668, -32074, 5684, 18141, -40823, -3098, 43860, -13141, -7856, 644, 89766, 81580, 81333, 14979, 24280, -6155, -35340, -90257, -24437, -35973, 22861, 39239, -41600, -59260, 61166, 70943, -9355, 33902, 4969, -16060, -17180, -35651, -118196, -112742, -25364, -28275, -140602, -55662, 49517, 53119, 35963, 88714, 13934, 34172, 90579, 135822, 85132, 29492, -42690, -824, 106199, 37631, 54224, 80912, -3171, 45863, 24777, -16391, 64319, 67184, 52498, -38670, -50904, 26954, 29321, 54720, 9605, -66186, -33662, 25347, 3537, -50820, 4242, 48856, 24925, -2543, 16240, 130095, 29832, 11234]
741A1234j2529m154J7061K7432L7331J8210m4809O1330r6344l9870O1531J5007
729E1430M559J7042J5591p5050K7537q152m3033o306L9662n873j13387O5119N5382
716B4521k7226L0458j0276k2460M944Q6018q280K8233p2019k6163p724N0003l0561
703A9468J347l8937K2201P0977K5425N8765l9957O517p4185m2444M09q1586k2887
690i4887J21127R6938q9506J8416j9826M917O0579n3044l8180L2090n0799K5951
678A3776L8526o1601L6792J6573J14843q6014p8012N454p1214N9660P2429M3387
666A04599O7186p8963j31373q1785N9073L344J236K4571Q9365K5127n0774M612
654C6218N5465o804j3075m8316m1754M2435N1808j811j272o8347m0488l840K3852
$$ y = [11234, -1295, -5449, 11612, 39044, 76375, 94585, 49776, 111106, 14762, -25108, 36423, 51430, 55989, 73031, 88622, 13572, 41109, 32957, -10076, -16382, 23280, 17407, -95980, -30861, 24521, -2705, 27753, 17477, -4983, -39, 85979, 77699, 105932, 33913, 7750, 26, 50029, 19468, 20815, -18122, 4079, 75056, 100481, 159246, 119289, 125806, 51621, 9177, 9586, -72000, -94887, 26240, 123178, 33672, 52088, 32262, 37179, 97758, 44714, 6534, 38624, -12175, 13776, 52302, -9299, 27493, 44066, 158909, 72895, -5117, 337, -70877, -11217, 61212, 104599, 171785, 92822, -38551, -120336, -61263, -57919, -56683, -32112, 57253, 82380, 31606, 36218, 91683, 84879, 71804, 23488, -18266, 24169, 75977, 74166, 72894, 4547, -35941, -39781, -15929]
641a5929q35r476q72J00205J4726l5720n3208l8911L3740N3959J0476j27029k2995
628i1869J64928R01l7052j15251R1402L9765K2510Q6157j34695L6807l1937K6721
616E8387k1631p850L7907R8558r9901Q2659m8366n5540j714O7261k8342k674M171
603H2925p4954R665L1106r0346l719N0492R892K5042O3768m5208n6211K6258l3486
590d776j7601n4572j3994J32104p4413M1915J00792p4725P7471m3773l3185N843
578D1086o7679L3987m0358O0851n285M8133m2744l3279P1466O933j20618L457
566d4050J32906J4887m1826J12248j7461j42828m7944R344L5167Q77M6497m6385
554A1432J9773k9092L0914O9871j4218j12395J1265M4533R8561j05990n2596L0371
$$ y = [-15929, -16764, -26240, -27112, 73093, 87819, 52099, -1109, -40020, -6280, 47679, 58155, -68874, -91869, 73059, 73960, 36908, -78343, 13059, 52824, 75334, 161491, 26796, 63603, 31666, 58387, 36756, 28906, 66813, 165371, 65470, 148129, 99763, 44223, 42509, 109770, 81428, 78754, 82925, 7971, 17636, 48742, -41604, -45323, 5169, 15061, 40103, 103871, 58663, 2452, 28710, -4776, -22377, -76949, -90943, 41161, -33252, 8663, 109455, 34730, 112201, 68428, 35243, 41086, -26593, 7394, -32964, 27887, 22602, 70735, 27991, -5288, 66178, 73111, -47507, -44050, 88856, 103743, 61917, 174165, 156704, 13876, -34068, -24724, 10443, 11320, 57817, 11432, 31205, 2113, 33027, 102898, 88680, -23715, -12450, 32083, 130644, 24654, -27942, 2429]
542B429K2890L4121O76r2237p284J61258j0588r3739K5207Q9806L150p2190j8107
529D5392o5026Q6691K8881m3018m1142l2355R431R1696M812j1633P1788q5291
517F0226o5864m6883J47541O8330l9305j0386k3367m0295K97N7206j69930m5469
505a07899P3260M8909o846P0872M5027j22947L6346R790j7710K1965o6519P6506
493F0754K5978K4603n7593l5714P4945p4248j4703Q2977p2526p3163J36891J4462
481I2663q9376L9278m3543J03852K7035o9181q0926P45J16872R012m24L0693l3476
468A03224Q0876l5925Q52Q469Q4492j90000l80N0352k8454R0337j7520q7039o732
455E2552M6174k9312N765j23272k0870O2764L0006K2520l6162M913R9996o0928
$$ y = [2429, 25319, 59440, 60116, -32121, -39405, 121853, 111265, 17526, 42733, 132539, 135689, 63499, 45392, -19634, 67057, 95938, 52920, 11778, -20577, -11146, 80550, 85362, 73729, 145517, 60226, -5638, -52521, 95020, 163350, 124045, 113659, 90292, 49997, 50294, 107500, -62430, -107899, -34639, 14270, 7424, 78296, 123323, 376, 36722, 46512, 28802, 50767, -15752, 60754, 86732, 111335, 53742, 18028, 92973, 18725, 4022, 86999, 14473, -58690, 78201, 92663, 3287, 42565, -978, 102874, 129909, 60728, -20198, -19453, 97419, 106431, 106007, 136700, 103224, 184100, 148175, 149027, 157496, 241988, 51988, 51608, 101960, 73506, 163843, 146323, 59284, 52552, 98726, 69414, 75179, -48093, -68963, -6199, 23807, 46327, 10165, 15078, 115074, 54146]
443E4146L1209J9136j26490j07843J93966K4519n3168J65666K6918o4092q367
432A55600J8583j49224M4766M366n4615j2877k0782J06804L6583J053r6732o3784
420c0259L3325O4611j6110J23319l0560J6563N3014P26q0007l8432Q400J9816
408A24406J1440k9275l9385m7383L6599l5388k7887O2411p6764N915J0474k0486
396b5323n9848P7212N8321m1813L7864J1299j3343K8344j03691N5644p2527Q6339
384C8478O0507o7040o0410k7557O1281l3257J6977Q3426j22813J8406j6819P1429
372B2608p4049N1954j6435m2654J15640p8173L4612L6515J7648j861j1247J8600
360G3158L1017M820n1427m9734l9591K0503R7280O5143O935j28261M6599l5678
$$ y = [54146, 85355, 104491, -21999, -129842, 64124, 88643, 35475, 201141, 228059, 163967, 155600, 174183, 24959, 69725, 74091, 19476, 6599, -14183, 92621, 129204, 130257, 33525, -30259, 3066, 67677, 51567, 174886, 144326, 160889, 213903, 214629, 134622, 96190, 104590, 124406, 135846, 106571, 67186, 19803, 56402, 21014, -6873, 55538, -21226, -15311, -4837, -25323, -85171, -7959, 50362, 8549, 46413, 57712, 44369, 72713, -30978, 24666, -47861, 38478, 98985, 31945, -28465, -56022, 5259, -27998, -11021, 72405, -50408, -32002, -48821, 22608, -51441, 513, -15922, -58576, 57064, -21109, 13503, 50018, 67666, 65805, 54558, 73158, 104175, 108995, 57568, 7834, -31757, -11254, 86026, 151169, 158104, 29843, 76442, 40764]
348D0764j22328J26269m1049O6211N0358p4141M9199K2336R7101p5427o3346o4315
336A1632K6387J034j08877R840Q2345o8478J24592k371j4787k9963n8274O0668
324C3748L0922K7137l6410p0793P1551q3728j6413r157J40904M7491p9714l7781
312A7757N3668n9979J696k8243J9459O7754p0356l0900R6147K4312O1947o6032
300H7230m5072R5975n4449m7934M2541L9362n95o5720J4233J8178j0469N323o6899
287A1704K0488L1100q0824Q3012m2186L8798K4422j01417n0501J15764l2647L208
275B0921L2690j6212n0304M5813M9756n9651K0613O4451r9603m675k2854m6710
263f5765O6534O9778J3910o5596m3561k164Q4519o5278k512j0253Q2289k9263
$$ y = [40764, -81564, 44705, 3656, 69867, 120225, 46084, 95283, 117619, 214720, 139293, 75947, 11632, 38019, 39053, -69824, -59984, 22361, -46117, 78475, 76104, 61317, 31354, -26920, 33748, 64670, 91807, 55397, -15396, 56155, -27573, -43986, -53143, 87761, 135252, 55538, 17757, 71425, 11446, 13142, -15101, 4358, 72112, 1756, -29144, 67003, 91315, 153262, 87230, 42158, 138133, 83684, 35750, 78291, 117653, 117058, 51338, 65571, 83749, 73280, 78603, 11704, 32192, 63292, -17532, 65480, 23294, 62092, 86514, -14903, -65404, 50360, 17713, 20921, 53611, 37399, -12905, 32908, 82664, 23013, 43626, 108077, 8474, 3799, -19055, -65765, 769, 70547, 84457, 18861, -24700, -26864, 57655, -7623, -10135, -20388, 61901, 32638]
251C2638k6569p003N9176J1258K5917l6111p9094m4960O7326N1940j10202k2124
239g7808Q8421n705P4319R298m5801r192L6407K9861o2683L986k629p4287J7116
226a8697L8122M0899n3339O9372p5754O2778P612l1977j5193q5517l643J95039
214A29702m1031P886l3453n6486q26M1207M9008L3825r2291n4021j17616J05670
202b8426J93567L3612o0972n1131p6575P350O6776M0041o9991l3189J14967k3315
190A12714m2476m2247l0989Q5587l3574m2582J28964o2466n0579N0666q466j00710
178c6158l0075L3366n3733N9829J8383l739J14762J5878j3694l3234Q2484l4096
166A19973L9049l8518p1366J2301O4847n2218r4025R8204P658m1719J03403j01002
$$ y = [32638, 6069, -934, 58242, 69500, 95417, 59306, -19788, -64748, 2578, 54518, -55684, -77808, 10613, 4908, 79227, 88525, 42724, 33532, 69939, 99800, 37117, 41103, 38474, -35813, -18697, 19425, 60324, 6985, 76357, 603, 63381, 70993, 39016, 23823, -61694, -65337, 129702, 88671, 96557, 63104, 6618, 5792, 46999, 96007, 129832, 37541, -16480, -134096, -28426, 165141, 198753, 137781, 86650, 10075, 17425, 84201, 124242, 54251, 21062, 136029, 112714, 70238, 27991, -2998, 82589, 49015, 6433, 135397, 72931, 22352, 73018, 64552, -36158, -66233, -32867, -86600, -26771, -8388, -12127, 102635, 118513, 104819, 71585, 154069, 119973, 159022, 120504, 49138, 61439, 126286, 74068, -19957, 78247, 85905, 44186, 147589, 46587]
154D6587l28L7260p2546l5590N544K9157J05255n142n1695J1677Q3452r8885Q126
141F2872k421K0664R713L6947j4615k3517j399q3599j5949O4401Q1928m0019m7935
128D7071L8710O2251k6815r1968K5639K160m6634m77k8596K6837O3020j9451O081
115E7828K3101q0340m8906R5569p8192K4055j3364O0907L50j879j7560k4347n2577
102e5355J14847N2866j48698j0082Q3990L7008p8593K8144j9333M3735P5525N4494
90A78548m072k9470q0870N8396m1161j26098J31677L4002o9917L3161j38430K4918
78b9316O3072N4654j3038k3602k4631j8541R5429J298l2376L4359j7582O481j9370
65G6837M730K9326o05n6381j3542n210l8179M5338L0009O5134m4157N41J12414
$$ y = [46587, 46259, 83519, 10973, -24617, -19073, 10084, 115339, 110197, 58502, 70179, 153631, 54746, 62872, 60451, 81115, 90828, 127775, 113160, 89643, 88244, 4645, -11304, 53097, 135025, 95006, 47071, 85781, 148032, 121217, 29249, 54888, 57048, 10414, 9937, -18659, 8178, 71198, 51747, 57828, 80929, 589, -48317, 47252, -30940, -6885, -20249, 40658, 41008, 39129, 21569, -2778, -55355, 59492, 112358, -36340, -46422, 37568, 74576, -4017, 24127, 4794, 48529, 124054, 178548, 174476, 145006, 64136, 122532, 81371, -44727, 86950, 120952, 51035, 84196, -54234, -29316, 33756, 88410, 75372, 51770, 27139, 8598, 104027, 105325, 72949, 107308, 89726, 96207, 76837, 81567, 110893, 110288, 53907, 40365, 35155, -3024, 42314, 72323, 137457, 93300, 93841, 206255]
52B06255n3885J0285m2338l2695k1103n3515J1143J9640p935j7779K9731l467
40D4337q2271K0474k5459M9457J9566j3448Q692J5211M9492L224J7699m5675P505
27F8804n127O2687j0919l7651j2108k0635J5699m800l0705l7218J2829L2649M0657
14G4162J3837j10809j3916J02234n102M811J1270O4723M791m434J7273n3508l7632
1F7700k9794
0C7906
$$ y = [206255, 152370, 162655, 120317, 87622, 66519, 13004, 24147, 43787, 35852, 18073, 47804, 44337, -37934, -17460, -42919, 6538, 26104, 12656, 21348, 36559, 86051, 89275, 106974, 61299, 68804, 63677, 126364, 115445, 77794, 65686, 45051, 60750, 55950, 25245, -11973, 856, 33505, 74162, 87999, -22810, -36726, 65508, 60406, 65217, 76487, 141210, 146001, 141567, 158840, 105332, 67700, 37906]
$$ Imaginary data points
##PAGE= N=2
##DATA TABLE= (X++(I..I)), XYDATA
16383c891560N1255L0811N0085K7785K1300K6774K9692M8488J02940Q4628M3298
16372c374504N793L6887J23959K1902M9456M4671Q0096J33125J2263N8950N1649
16361b755753o994J9425k7537O1984J80530M4405L3077l2415K7956P0345P4323
16350b310654L7039Q2328R7722M4119m8167L7357J03560m956M8281J02557J1347
16339a799467J05636p301M1044N3489P2345M7296Q0244l9981L2740Q5231J4867
16328a313857J07325Q9916L1733K9919O7744M8508K7619L8842j0200L1368N8088
16317g92995N8127K7982P853J03674M7064R1480l4917K368J01389N3615L2042
16306c02318O6300N394K7551N5896L7550k6148K1704Q8607J08684N3354k6489
$$ y = [-3891560, -3840305, -3809494, -3759409, -3731624, -3710324, -3683550, -3653858, -3605370, -3502430, -3417802, -3374504, -3368711, -3331824, -3207865, -3185963, -3136507, -3091836, -3011740, -2878615, -2866352, -2807402, -2755753, -2762747, -2743322, -2770859, -2708875, -2528345, -2483940, -2450863, -2483278, -2455322, -2384977, -2310654, -2273615, -2191287, -2093565, -2049446, -2097613, -2060256, -1956696, -1961652, -1913371, -1810814, -1799467, -1693831, -1701132, -1660088, -1606599, -1534254, -1486958, -1406714, -1446695, -1413955, -1328724, -1313857, -1206532, -1116616, -1084883, -1054964, -987220, -938712, -911093, -872251, -882451, -851083, -792995, -734868, -706886, -699033, -595359, -548295, -456815, -491732, -489364, -387975, -334360, -302318, -236018, -230624, -203073, -147177, -109627, -135775, -114071, -25464, 83220, 136574, 110085]
16295A10085N1277R3808P1663M5391J0074m777k9618Q7272p318Q2374L2734J1449
16283E54414K5974J7557O0391L246k7815J70691J6792p9625J04243J21141P999
16272I75008P5854N8143m0589P2486K519M7061j1951Q1214l714R739O8496O0406
16260A394672N642P3005R796p496j5626n8234R9928K9691J30884N0410j858K6761
16248A737575l3566L6945J2665q367M7319L5680J8979K0160N9259l695P6993N2946
16236B052893k4355L2114P3543j2292k8210P1210J6173O0400l458R3287N8939
16225B390244m1708J6058m2988O7771J4995J36166N1620r1619K3430M716K021
16214B530706J19659K4600K4936L8882j17879M2409L417K9645L7864l0271O611
$$ y = [110085, 161362, 255170, 326833, 372224, 382298, 377521, 347903, 435175, 427857, 510231, 542965, 554414, 580388, 597945, 658336, 661582, 633767, 804458, 821250, 741625, 845868, 967009, 975008, 1050862, 1109005, 1068416, 1140902, 1143421, 1190482, 1178531, 1259745, 1256031, 1265770, 1334266, 1394672, 1400314, 1473319, 1483115, 1475619, 1459993, 1401759, 1501687, 1531378, 1662262, 1712672, 1710814, 1737575, 1704009, 1740954, 1753619, 1745252, 1792571, 1828251, 1847230, 1867390, 1926649, 1922954, 1999947, 2052893, 2028538, 2060652, 2134195, 2121903, 2093693, 2164903, 2181076, 2241476, 2238018, 2331305, 2390244, 2348536, 2364594, 2321606, 2389377, 2404372, 2540538, 2592158, 2500539, 2523969, 2528685, 2530706, 2650365, 2674965, 2699901, 2738783, 2620904, 2663313, 2666730, 2696375, 2734239, 2703968, 2710579]
16203B710579R4117j0369M1059K7628m7383k684J56500L1681r0873O8681P1816
16192C050752K0945o9257N472N2140o8110P8357K3803k7083P4287k343l2217M7618
16180C154364M1555P1190K3157k6081l0414n5070J44543K7262p9903l7274P9039
16169C312368M2414j5728L0111M6804j9054N0405L2892l0593r3113j8365P379
16158C345520L0529P46N0521l8315k4137Q1936M9177P2154p9262j877j7112M9679
16146C519559N0118K4428q7665l8343J66652K0422o7782J12028j23922N2189q6030
16135C541654O729R4745o7604N2905R0433n980o9050J2923P7034L3358j11866
16124C655281J10918l8797O4820j7151o9943k5781O2686Q66m0997P977l6328J8781
$$ y = [2710579, 2804696, 2794327, 2835386, 2863014, 2815631, 2812947, 2969447, 3001128, 2910255, 2978936, 3050752, 3071697, 3002440, 3007912, 3060052, 2991942, 3070299, 3094102, 3067019, 3141306, 3138963, 3106746, 3154364, 3195919, 3267109, 3290266, 3264185, 3233771, 3178701, 3323244, 3350506, 3270603, 3233329, 3312368, 3354782, 3339054, 3369165, 3415969, 3396915, 3447320, 3480212, 3449619, 3356506, 3338141, 3345520, 3376049, 3376795, 3427316, 3389001, 3364864, 3446800, 3495977, 3568131, 3488869, 3486992, 3469880, 3519559, 3569677, 3594105, 3506440, 3468097, 3634749, 3655171, 3587389, 3699417, 3575495, 3627684, 3541654, 3548383, 3643128, 3575524, 3628429, 3718862, 3712882, 3643832, 3656755, 3733789, 3767147, 3655281, 3766199, 3727402, 3792222, 3775071, 3705128, 3679347, 3742033, 3742899, 3701902, 3709879, 3673551, 3692332]
16112C692332J13934L3268M1136m9123k7220o3926M202j9186L5705P623l0117
16101C738628k853Q6881K3427r11k8639j03215J28254J8616j366l7695j3016O8156
16089C876267N9142p6607K0485O291P0737k4353j10632j2110k7976J63574M1083
16078C985901j06111L842k3296n984M7673n2596J5130Q7417L4899m9550k9715
16067C907610k259P1415Q350n2020j1078J0859J02457o8242M2008p5029k598K3829
16055C955302o2410J6621R0102j6043J01864q4093m8701N3004k7268o3488M333
16044C919223L8114J5107n2184K4795N8619M8703j213j90827L0653Q5193j0678
16033C965505P1869q5541k044O2180l9335l197n6659L0990J00523j20611N4792
$$ y = [3692332, 3806266, 3839534, 3880670, 3831547, 3804327, 3740401, 3744603, 3725417, 3761122, 3768745, 3738628, 3735775, 3822656, 3846083, 3845172, 3816533, 3713318, 3841572, 3860188, 3858822, 3821127, 3808111, 3876267, 3935409, 3858802, 3879287, 3885578, 3956315, 3931962, 3821330, 3809220, 3781244, 3944818, 3985901, 3879790, 3883632, 3860336, 3854352, 3902025, 3849429, 3864559, 3951976, 3986875, 3937325, 3907610, 3905351, 3976766, 3985116, 3933096, 3922018, 3932877, 4035334, 3967092, 4009100, 3934071, 3931473, 3955302, 3892892, 3909513, 3999615, 3983572, 4085436, 4001343, 3952642, 4005646, 3978378, 3914890, 3919223, 3957337, 3972444, 3920260, 3945055, 4003674, 4052377, 4051164, 3860337, 3890990, 3976183, 3965505, 4037374, 3951833, 3949789, 4011969, 3972634, 3969437, 3912778, 3943768, 4044291, 3923680, 3978472]
16022C978472J4601l3985P6543n4214Q1860L6445j3485p8099N1510o7120j2729
16011C979799r3614k7260J62216J1610o6725O928J3928k4613m1259J1193J9755
16000C951958P0568n3834n3626L3375N3668n3070n020M7620m9951j1122P6559
15989D007125J1495m8962M3020j9763k8594j2739l4351k2427k3670N6815n505
$$ y = [3978472, 3993073, 3959088, 4035631, 3981417, 4063277, 4099722, 4086237, 4008138, 4059648, 3992528, 3979799, 3886185, 3858925, 4021141, 4032751, 3966026, 3972954, 3986882, 3962269, 3921010, 3932203, 3951958, 4022526, 3968692, 3915066, 3948441, 4002109, 3949039, 3944019, 3991639, 3941688, 3930566, 4007125, 4018620, 3969658, 4012678, 3992915, 3964321, 3951582, 3917231, 3894804, 3871134, 3927949, 3922444]
$$ [...]
##END NTUPLES=NMR SPECTRUM
##END=
