##TITLE=1H_EC-3290(II-1)
 CDCl3
 8 sc, 
 21.2.2023
##JCAMPDX= 6.0         $$ Bruker NMR JCAMP-DX V2.0
##DATA TYPE= NMR SPECTRUM
##DATA CLASS= NTUPLES
##ORIGIN= UXNMR, Bruker Analytische Messtechnik GmbH
##OWNER= root
$$ XWIN-NMR		Version 3.5
$$ Wed Feb 22 14:40:33 2023 Russian Standard Time (UT+4h)  she@DPX200
##.OBSERVE FREQUENCY= 200.13135
##.OBSERVE NUCLEUS= ^1H
##.ACQUISITION MODE= SIMULTANEOUS
##.ACQUISITION SCHEME= undefined
##.AVERAGES= 8
##.DIGITISER RES= 18
##SPECTROMETER/DATA SYSTEM= spect
##.PULSE SEQUENCE= zg30
##.SOLVENT NAME= DMSO
##.SHIFT REFERENCE= (INTERNAL, DMSO, 0, 15.7425)
##AUDIT TRAIL= $$ (NUMBER, WHEN, WHO, WHERE, WHAT)
$$ ##TITLE= Audit trail, XWIN-NMR		Version 3.5
$$ ##JCAMPDX= 5.01
$$ ##ORIGIN= Bruker BioSpin GmbH
$$ ##OWNER= she
$$ F:/spectra/data/she/nmr/H-F/1/pdata/1/auditp.txt
$$ ##AUDIT TRAIL=  $$ (NUMBER, WHEN, WHO, WHERE, WHAT)
(   1,<2023-02-22 14:39:09.71 +0400>,<she>,<DPX200>,
      <created by zg, POWCHK disabled, PULCHK disabled
       configuration hash MD5:
       00 E9 B6 7A A2 85 ED C7 34 08 36 98 17 FE 4E 26
       data hash MD5: 16K
       97 E0 F7 B1 CA 70 2A 86 18 BC E5 9E 92 24 5A 16>)
(   2,<2023-02-22 14:39:15.81 +0400>,<she>,<DPX200>,
      <Start of raw data processing
       efp BC_mod = 2 LB = 0.24 FT_mod = 6 PKNL = 1 PHC0 = -19106.37 PHC1 = 12.60074 SI = 16K 
       data hash MD5: 16K
       97 CD FD FC 2A CC 54 3E 9E 24 19 8A 1E 41 8E A9>)
(   3,<2023-02-22 14:39:32.79 +0400>,<she>,<DPX200>,
      <pk PHC0 = 3.943286 PHC1 = -4.6 
       data hash MD5: 16K
       EF C0 54 3D 71 DF 0A CA 29 85 69 D8 79 0C 8C 03>)
(   4,<2023-02-22 14:39:36.35 +0400>,<she>,<DPX200>,
      <abs ABSG = 5 
       data hash MD5: 16K
       38 2D 8E 0F CD D8 E6 48 B7 9F E3 12 B5 41 66 6D>)
$$ ##END=
$$ 
$$ hash MD5
$$ CA BD 03 1A E0 16 3F 0C 97 B0 9D 0E 56 9F 4E 7F
##$RELAX= 
##$RELAX= 
##$RELAX= 
##$RELAX= 
##$RELAX= 
##$RELAX= 
$$ Bruker specific parameters
$$ --------------------------
##$DU= <F:/spectra>
##$EXPNO= 1
##$NAME= <H-F>
##$PROCNO= 1
##$TYPE= <nmr>
##$USER= <she>
##$AMP= (0..31)
100 100 100 100 100 100 100 100 100 100 100 100 100 100 100 100 100 100 
100 100 100 100 100 100 100 100 100 100 100 100 100 100 
##$AQSEQ= 0
##$AQ_mod= 1
##$AUNM= <au_zg>
##$AUTOPOS= <>
##$BF1= 200.13
##$BF2= 200.13
##$BF3= 200.13
##$BF4= 200.13
##$BF5= 200.13
##$BF6= 200.13
##$BF7= 200.13
##$BF8= 200.13
##$BYTORDA= 1
##$CFDGTYP= 0
##$CFRGTYP= 5
##$CHEMSTR= <none>
##$CNST= (0..31)
1 1 145 1 1 1 1 1 1 1 1 1 1 1 1 1 1 1 1 1 1 1 1 1 1 1 1 1 1 1 1 1 
##$CPDPRG= <>
##$CPDPRG1= <>
##$CPDPRG2= <>
##$CPDPRG3= <>
##$CPDPRG4= <mlev>
##$CPDPRG5= <mlev>
##$CPDPRG6= <mlev>
##$CPDPRG7= <mlev>
##$CPDPRG8= <mlev>
##$CPDPRGB= <>
##$CPDPRGT= <>
##$D= (0..31)
0 1.2 0 0 0 0 0 0 0 0.06 0 0.03 0 0 0 0 0.0002 0 0 0 0 0 0 0 0 0 0 0 0 
0 0 0 
##$DATE= 1677062349
##$DBL= (0..7)
120 120 120 120 120 120 120 120 
##$DBP= (0..7)
150 150 150 150 150 150 150 150 
##$DBP07= 0
##$DBPNAM0= <>
##$DBPNAM1= <>
##$DBPNAM2= <>
##$DBPNAM3= <>
##$DBPNAM4= <>
$$ [...]
##$SUBNAM3= <"">
##$SUBNAM4= <"">
##$SUBNAM5= <"">
##$SUBNAM6= <"">
##$SUBNAM7= <"">
##$SUBNAM8= <"">
##$SUBNAM9= <"">
##$SW= 18.05172834244
##$SWIBOX= (0..15)
0 0 2 0 0 0 0 0 0 0 0 0 0 0 0 0 
##$SW_h= 3612.71676300578
##$TD= 16384
##$TD0= 1
##$TE= 0
##$TE2= 300
##$TE3= 300
##$TEG= 300
##$TL= (0..7)
0 120 120 120 120 120 120 120 
##$TP= (0..7)
150 150 150 150 150 150 150 150 
##$TP07= 0
##$TPNAME0= <>
##$TPNAME1= <>
##$TPNAME2= <>
##$TPNAME3= <>
##$TPNAME4= <>
##$TPNAME5= <>
##$TPNAME6= <>
##$TPNAME7= <>
##$TPOAL= (0..7)
0.5 0.5 0.5 0.5 0.5 0.5 0.5 0.5 
##$TPOFFS= (0..7)
0 0 0 0 0 0 0 0 
##$TUNHIN= 0
##$TUNHOUT= 0
##$TUNXOUT= 0
##$USERA1= <user>
##$USERA2= <user>
##$USERA3= <user>
##$USERA4= <user>
##$USERA5= <user>
##$V9= 5
##$VALIST= <valist>
##$VCLIST= <CCCCCCCCCCCCCCC>
##$VD= 0
##$VDLIST= <DDDDDDDDDDDDDDD>
##$VPLIST= <PPPPPPPPPPPPPPP>
##$VTLIST= <TTTTTTTTTTTTTTT>
##$WBST= 1024
##$WBSW= 4
##$XGAIN= (0..3)
0 0 0 0 
##$XL= 0
##$YL= 0
##$YMAX_a= 718198
##$YMIN_a= -840515
##$ZGOPTNS= <>
##$ZL1= 120
##$ZL2= 120
##$ZL3= 120
##$ZL4= 120
##$ABSF1= 15.76121
##$ABSF2= -2.290639
##$ABSG= 5
##$ABSL= 3
##$ALPHA= 0
##$AQORDER= 0
##$ASSFAC= 0
##$ASSFACI= 0
##$ASSFACX= 0
##$ASSWID= 0
##$AUNMP= <proc_1d>
##$AZFE= 0.1
##$AZFW= 0.1
##$BCFW= 0
##$BC_mod= 2
##$BYTORDP= 0
##$COROFFS= 0
##$CY= -3
##$DATMOD= 1
##$DC= 0
##$DFILT= <>
##$DTYPP= 0
##$F1P= 0
##$F2P= 0
##$FCOR= 1
##$FTSIZE= 16384
##$FT_mod= 6
##$GAMMA= 0
##$GB= 0
##$INTBC= 1
##$INTSCL= 3.70164e-10
##$ISEN= 128
##$LB= 0.24
##$LEV0= 0
##$LPBIN= 0
##$MAXI= 10000
##$MC2= 0
##$MEAN= 0
##$ME_mod= 0
##$MI= 1.114404
##$NCOEF= 0
##$NC_proc= -6
##$NLEV= 6
##$NOISF1= 3.799351
##$NOISF2= 2.8
##$NSP= 0
##$NTH_PI= 0
##$NZP= 0
##$OFFSET= 15.74248
##$PC= 1
##$PHC0= -19102.43
##$PHC1= 8.00074
##$PH_mod= 1
##$PKNL= yes
##$PPARMOD= 0
##$PSCAL= 0
##$PSIGN= 0
##$REVERSE= no
##$SF= 200.13000581523
##$SI= 16384
##$SIGF1= 3
##$SIGF2= 2
##$SINO= 5.538805
##$SIOLD= 16384
##$SREGLST= <1H.CDCl3>
##$SSB= 0
##$STSI= 16384
##$STSR= 0
##$SW_p= 3612.71676300578
##$SYMM= 0
##$S_DEV= 0
##$TDeff= 16384
##$TDoff= 0
##$TI= <>
##$TILT= no
##$TM1= 0
##$TM2= 0
##$TOPLEV= 0
##$USERP1= <user>
##$USERP2= <user>
##$USERP3= <user>
##$USERP4= <user>
##$USERP5= <user>
##$WDW= 1
##$XDIM= 16384
##$YMAX_p= 506017556
##$YMIN_p= -356194
$$ End of Bruker specific parameters
$$ ---------------------------------
##NTUPLES= NMR SPECTRUM
##VAR_NAME=  FREQUENCY,     SPECTRUM/REAL,   SPECTRUM/IMAG
##SYMBOL=    X,             R,               I
##VAR_TYPE=  INDEPENDENT,   DEPENDENT,       DEPENDENT
##VAR_FORM=  AFFN,          ASDF,            ASDF
##VAR_DIM=   16384,         16384,           16384
##UNITS=     HZ,            ARBITRARY UNITS, ARBITRARY UNITS
##FACTOR=    0.220516191357247, 1,           1
##FIRST=     3150.54266958531, 0,            0
##LAST=      -462.174093420467, 0,           0
##MIN=       -462.174093420467, -356194,     0
##MAX=       3150.54266958531, 506017556,    0
$$ Real data points
##PAGE= N=1
##DATA TABLE= (X++(R..R)), XYDATA
$$ [...]
6129C292700J30456J0252K6218j07360R700j25853k44104j16006N470p9347o3744
6118B738382M3274m7622L2862J15471K3260q3522O0408J84226K3541P2385J50887
6107C313552J8711n549j6743j8189p7017l0201j75122j90468j13721m502j75358
6096B525393n9788J08866m1633j35785O6372L8319j7266r285l5742O4869J34907
6085B639227J7676p6661M7239J20465J2039N5808o4952N9556N7046k577J48917
6074C013783J74053O4673R1840N7421L29706L21234J51160K08540K26931K04761
6064D844102J07336J64293K18633K37347J45689m9123o1390p8118q9189j25042
6054E314538j77327j47409j73683j56787l3772j31965o2269Q005P0802M078M8485
$$ y = [3292700, 3423156, 3433408, 3459626, 3352266, 3361966, 3236113, 2992009, 2876003, 2881473, 2802126, 2738382, 2781656, 2734034, 2766896, 2882367, 2905627, 2822105, 2882513, 3066739, 3090280, 3162665, 3313552, 3332263, 3326714, 3309971, 3291782, 3214765, 3184564, 3009442, 2818974, 2705253, 2700751, 2525393, 2465605, 2574471, 2532838, 2397053, 2463425, 2501744, 2484478, 2475193, 2439451, 2504320, 2639227, 2656903, 2580242, 2627481, 2747946, 2759985, 2815793, 2750841, 2810397, 2867443, 2864866, 3013783, 3187836, 3252509, 3344349, 3401770, 3731476, 4052710, 4203870, 4412410, 4639341, 4844102, 4951438, 5115731, 5334364, 5571711, 5717400, 5668277, 5606887, 5528769, 5439580, 5314538, 5137211, 4989802, 4816119, 4659332, 4625560, 4493595, 4431326, 4439331, 4510133, 4514211, 4562696]
6043D562696P1769J25663M2002N9285J15250J15760K6148o2804k6449j06683n3895
6032D868742j35230k99139k53225j49794j59243k08371j77081j27310k11903j03183
6022C044263j92282k2789r3739L2885j29680j02943j9468r9585q7051j2477J0438
6011B327572N0952N2575j70704r3068P4276Q1150J28906p7412q9473K5558l5693
6000B274639j22193m9455k9578o9223l0231n1154L9819l733j6915k2320k562j13688
5988A803406R2945j1015q1269j3398k9091o079l8683P8606N7307R9788j8994K580
5976A936103L1501q0633o5340R541K7966j3132j0316m815l5787O0944N2079l1242
5964A876869N0664J10847M1270M8105R2714l3295m0635Q9380J26142Q282J58131
$$ y = [4562696, 4634465, 4760128, 4802130, 4861415, 4976665, 5092425, 5118573, 5055769, 5029320, 4922637, 4868742, 4733512, 4434373, 4181148, 4031354, 3872111, 3663740, 3486659, 3359349, 3147446, 3044263, 2851981, 2829192, 2735453, 2768338, 2638658, 2535715, 2516247, 2416662, 2329611, 2317134, 2327572, 2378524, 2431099, 2260395, 2167327, 2241603, 2322753, 2451659, 2374247, 2284774, 2310332, 2274639, 2152446, 2102991, 2073413, 2004190, 1973959, 1922805, 1962624, 1958891, 1941976, 1919656, 1917094, 1803406, 1896351, 1885336, 1804067, 1790669, 1761578, 1755499, 1716816, 1795422, 1852729, 1952517, 1933523, 1936103, 1967604, 1886971, 1821631, 1831172, 1859138, 1846006, 1835690, 1830875, 1795088, 1856032, 1908111, 1876869, 1927533, 2038380, 2079650, 2127755, 2220469, 2187174, 2146539, 2235919, 2362061, 2370343, 2528474]
5953B528474O6825k2036l6215m5742J6920o4551M6256P5640k7327o1684J01488
5942B578048O6075L1866N2488K24982Q6939K6288K69986J34310L3016K46634M8684
5931C799316Q6215J24510K10471K16070J10120R1943Q5766K7921l9985O0741m5254
5920D727834o7552j16143j38437r5132l3149j28076k14217j34917P6527l8779
5910C837959r7273r2276l6236j55959O097j5953q2267N8391J27970L5458K3377
5899C609288j6466J05940R8055J4100J28566J06520J50399J90098J84032O0965
5889D631497L6994J8358n6932M5152n9480j56819n7898j39349k4382j46080j48505
5878C942556j57467j22244m0465K1806O7859k3984j27317q3030R5551Q508P2649
$$ y = [2528474, 2595299, 2573263, 2537048, 2491306, 2508226, 2443675, 2489931, 2565571, 2538244, 2476560, 2578048, 2644123, 2675989, 2728477, 2953459, 3040398, 3066686, 3336672, 3470982, 3503998, 3750632, 3799316, 3885531, 4010041, 4220512, 4436582, 4546702, 4638645, 4724411, 4752332, 4712347, 4773088, 4727834, 4660282, 4544139, 4405702, 4310570, 4277421, 4149345, 3935128, 3800211, 3876738, 3837959, 3740686, 3648410, 3612174, 3456215, 3462312, 3446359, 3364092, 3422483, 3550453, 3585911, 3609288, 3592822, 3698762, 3796817, 3810917, 3939483, 4046003, 4196402, 4386500, 4570532, 4631497, 4668491, 4686849, 4629917, 4675069, 4615589, 4458770, 4400872, 4261523, 4237141, 4091061, 3942556, 3785089, 3662845, 3622380, 3644186, 3712045, 3688061, 3560744, 3477714, 3573265, 3581773, 3654422]
5867C654422j3267r8856L4199N2119K2714J18109Q5085M1877M5823K6811Q0070
5856D049106L4106p4898q8027k8238l1599j09928l4353P122j54751p0271m1193
5845C457076m8075j22882j26366m2863M1635k5664n9952j18838N5097J26372j3981
5834C121559r402K1228O727o4242m7031J13111J33864P3815Q2036K1067J20000
5823C572732P2885q376L6269N9072N7235J2332L1321k8604k4744l0560o3795q6289
5811C599478n6267L2274o0540J16698p0509K6009P8895l8246J39684J51120J64781
5800D083377K03781L27936L75520L48006M38141M19835Q1471k88695l65794m16723
5790E206855m29558l26899k30439r8856p1303j03674o0167n6006k0675L5391l0846
$$ y = [3654422, 3641155, 3542299, 3576498, 3628617, 3651331, 3769440, 3854525, 3896402, 3942225, 3969036, 4049106, 4083212, 4008314, 3920287, 3892049, 3860450, 3750522, 3716169, 3723291, 3568540, 3498269, 3457076, 3409001, 3286119, 3159753, 3116890, 3158525, 3132861, 3072909, 2954071, 3009168, 3135540, 3121559, 3112157, 3133385, 3140112, 3075870, 3028839, 3141950, 3275814, 3349629, 3431665, 3452732, 3572732, 3645617, 3637241, 3673510, 3732582, 3789817, 3802149, 3833470, 3804866, 3780122, 3749562, 3685767, 3599478, 3543211, 3575485, 3514945, 3631643, 3561134, 3587143, 3666038, 3627792, 3767476, 3918596, 4083377, 4287158, 4615094, 4990614, 5338620, 5776761, 6196596, 6278067, 5989372, 5623578, 5206855, 4777297, 4450398, 4219959, 4121103, 4049800, 3946126, 3885959, 3829953, 3809278, 3844669, 3813823]
5779C813823J2845p0967m7347Q1504L7214R3486K24060J2953l944p889m2573j43700
5767C959465p8263K7828l5515j907m4311N7603J61954l1597J23180K3830M8955
5756D211222J21111O1695l0434p6440M0638n0142L6352Q5104Q9261J6502k6295
5745D478574M3594P7416K8361J00200L3430K8889P0383J64345M7379N2567P4283
5734E199421J18351J21770J02134J27520J74156K4650K31676J19891m6023J64527
5724F338073J05469r98q50m6723n6479L5941K4843M7772P8673J12914j1204J28959
5712F756390R6341J5901O1711N2956J70744Q6738L1234o5903P1904J41805J43571
5701G563392K2128R8321N8829K8146K96723K53881m5632k0079P3343p8621j20119
$$ y = [3813823, 3826668, 3755701, 3708354, 3789858, 3827072, 3920558, 4144618, 4157571, 4153627, 4145738, 4103165, 3959465, 3881202, 3909030, 3873515, 3871608, 3827297, 3884900, 4046854, 4015257, 4138437, 4162267, 4211222, 4332333, 4394028, 4363594, 4287154, 4327792, 4277650, 4314002, 4399106, 4488367, 4504869, 4478574, 4522168, 4599584, 4627945, 4728145, 4761575, 4790464, 4860847, 5025192, 5072571, 5125138, 5199421, 5317772, 5439542, 5541676, 5669196, 5843352, 5868002, 6099678, 6219569, 6173546, 6338073, 6443542, 6442544, 6441694, 6394971, 6338492, 6374433, 6399276, 6447048, 6525721, 6638635, 6627431, 6756390, 6852731, 6868632, 6930343, 6983299, 7154043, 7240781, 7272015, 7206112, 7278016, 7419821, 7563392, 7585520, 7683841, 7742670, 7770816, 8067539, 8321420, 8275788, 8255709, 8329052, 8250431, 8130312]
5690H130312m5976j1214q0111k4296n1108L7196k7291r2957L0170R6414o937j7208
5678G936994Q2746L6996j9992Q4060K2464J1387j41785o4092j15462j28128j00432
5667G604756L2708j00780q5952L4231q380j03832j28088o5203k03357l9877j22779
5656F813447j51063j47450j23733j7744n7985r3992j53104J4039O2915l420n8134
5645F083776O2855m3077M5589R629k01555o8147j50383j59667j53185p8944q7701
5634E259190j32323j53457m5014n0253k07723j11312r9836r5584j22742j34307
5624D106639k17506N4810K4364q6360m4851o4849m0455j07298l0016n4041J0098
5613C550535l6066j10013j9440j522j22673j01135N1562m5566o8131J22074k01888
$$ y = [8130312, 8084336, 8073122, 7993011, 7968715, 7917607, 7954803, 7927512, 7834555, 7864725, 7961139, 7954202, 7936994, 8019740, 8056736, 8036744, 8120804, 8143268, 8154655, 8012870, 7948778, 7833316, 7705188, 7604756, 7637464, 7536684, 7450732, 7484963, 7476583, 7372751, 7244663, 7179460, 6976103, 6936226, 6813447, 6662384, 6514934, 6391201, 6373457, 6315472, 6221480, 6068376, 6082415, 6145330, 6141910, 6083776, 6146631, 6103554, 6149143, 6158772, 5957217, 5889070, 5738687, 5579020, 5425835, 5346891, 5259190, 5126867, 4973410, 4928396, 4878143, 4670420, 4559108, 4459272, 4363688, 4240946, 4106639, 3889133, 3943943, 3968307, 3881947, 3837096, 3772247, 3731792, 3624494, 3594478, 3540437, 3550535, 3514469, 3404456, 3385016, 3383494, 3260821, 3159686, 3211248, 3165682, 3097551, 3219625, 3017737]
5602C017737o3261j76642n3375J3884K4924r439j24544l2110j39630J906k364
5591B457086j0567N0393l3108j31761m093P8398m0869p9166N9212M6014K8731
5580B420270q7944L3685J09750P351l6313p7471P4470K5564n025q1974k6936K8429
5568B383856J2899N1871L3341J13883L8710J2721O9648M4602J48806L9203J69056
5557C118596J75999R881J27852K92798L89198L28790N92576O48685N34668M73928
5547F692971K78401k80830o35679p37290o46823m44044m64783k16259j18734j95437
5537C231493j10566k6689j00389j45501K4451n7119J02051L2376J3503J0074O8995
5526C042679n9454m9801J70105M9748Q5510R8796K18696M9119J28949q6862J1082
$$ y = [3017737, 2954476, 2777834, 2724459, 2738343, 2763267, 2753828, 2629284, 2597174, 2457544, 2459450, 2457086, 2446519, 2496912, 2463804, 2332043, 2327950, 2406348, 2365479, 2286313, 2345525, 2391539, 2420270, 2332326, 2366011, 2475761, 2483112, 2446799, 2369328, 2443798, 2469362, 2464337, 2382363, 2355427, 2383856, 2396755, 2448626, 2481967, 2595850, 2634560, 2647281, 2716929, 2761531, 2910337, 2949540, 3118596, 3294595, 3304476, 3432328, 3725126, 4114324, 4443114, 5035690, 5684375, 6219043, 6692971, 6971372, 6690542, 6054863, 5317573, 4670750, 4226706, 3761923, 3545664, 3426930, 3231493, 3120927, 3094238, 2993849, 2848348, 2872799, 2815680, 2917731, 2950107, 2963610, 2973684, 3042679, 2983225, 2933424, 3103529, 3153277, 3238787, 3337583, 3556279, 3605398, 3734347, 3647485, 3658567]
5515C658567j15188j08734L391n3337j00957M4824l4196J5142R8333J17170J59696
5504C684711O2538q024N3902J18969J62836J54055N8801N195M8157k2039o1316
5493D257785J12502K2465J28396N5034J15490J3670N5075K01612K48069O7679
5483E277777J93429K94380K63503K38041K10614M17125M31537K76470K34881K85485
5473H123242L88079K65250J53496J19334K02853J5362o4205k57115k38320l42704
5463H365272l57804l11806l04356k11059j38510j82787j52454l8586l1355P9710
5453F716265l5492J7481N4056P1097J21501J37588J20524K03508J50823K15733
5443G773084K64847K52533K80575K57465L18690K94987K05950J61698J2702o7597
$$ y = [3658567, 3543379, 3434645, 3438036, 3384699, 3283742, 3328566, 3294370, 3309512, 3407845, 3525015, 3684711, 3747249, 3739225, 3793127, 3912096, 4074932, 4228987, 4287788, 4292983, 4341140, 4319101, 4257785, 4370287, 4392752, 4521148, 4576182, 4691672, 4705342, 4760417, 4962029, 5210098, 5277777, 5471206, 5765586, 6029089, 6267130, 6477744, 6894869, 7326406, 7602876, 7837757, 8123242, 8511321, 8776571, 8930067, 9049401, 9252254, 9267616, 9203411, 8946296, 8707976, 8365272, 8007468, 7695662, 7391306, 7180247, 7041737, 6858950, 6706496, 6667910, 6636555, 6716265, 6680773, 6698254, 6752310, 6823407, 6944908, 7082496, 7203020, 7406528, 7557351, 7773084, 8037931, 8290464, 8571039, 8828504, 9147194, 9442181, 9648131, 9809829, 9822531, 9754934]
5433I754934n2542j82775j71305o7912j33343j4000R2772J51431K27223K08090
5423I812573J42644L15479L48758L45407M74536N13329M79352M93624O55845N64364
5413A4145911M72610M41177L30834K87964K24214m576j48668j09771j00012k27326
5403A5312357k65359l31727l02511j34153j52001r1133J19287J60336L08217M31342
5393A5054655M56635N60599O86851P46545P13577O59465P60182O46811M89689
5384B0775009L43458O990k04008m74673n61795p85324q48049q96908q49410p95496
5374A5709794r70900p55253q02933q26325p63518o80509n10812m48914m73613
5365I477017m50405k45096k47631k34017k02667j10416k26348j08321j27447m2986
$$ y = [9754934, 9702392, 9519617, 9348312, 9280400, 9147057, 9133057, 9225829, 9377260, 9604483, 9812573, 9955217, 10270696, 10619454, 10964861, 11439397, 11952726, 12432078, 12925702, 13581547, 14145911, 14618521, 15059698, 15390532, 15678496, 15902710, 15898134, 15749466, 15639695, 15539683, 15312357, 15046998, 14715271, 14412760, 14278607, 14126606, 14035473, 14154760, 14315096, 14623313, 15054655, 15511290, 16071889, 16758740, 17505285, 18218862, 18878327, 19638509, 20285320, 20775009, 21118467, 21125457, 20921449, 20446776, 19884981, 19099657, 18251608, 17354700, 16505290, 15709794, 14738894, 13983641, 13180708, 12354383, 11590865, 10910356, 10399544, 9950630, 9477017, 9026612, 8781516, 8533885, 8299868, 8097201, 7986785, 7760437, 7652116, 7524669, 7481683]
5355G481683l9046k05693j00928j1284n4589p2741K2026p1630o6240J01958k9015
5344F954501R3743K8272P7406J09303R0920J93729K05770J73501J10715P7429
5334H115289J09089J58098J48750K93231K64395K88143K79587K67383K61319L41358
5324A0526642K64629J84012K77318K15257K48500J52194q9003j2326j51397k79621
5314A1336205k36779k84242m11795k50621j95071l08016j96175k02815l44669
5305H906022l50434j83883k666k03267j65528q4765j32887n0799j64057l07623
5295G260113j55536q7647k50901j91543j45913q5012j22790j56913J7554L6824
5285F118236m4504q2602m7062J31171M3904N1168J39627Q8369J09328O1072P2625
$$ y = [7481683, 7442637, 7236944, 7136016, 7124732, 7070143, 6997402, 7019428, 6947798, 6881558, 6983516, 6954501, 7048244, 7076516, 7153922, 7263225, 7354145, 7547874, 7753644, 7927145, 8037860, 8115289, 8224378, 8382476, 8531226, 8824457, 9088852, 9376995, 9656582, 9923965, 10185284, 10526642, 10791271, 10975283, 11252601, 11467858, 11716358, 11868552, 11779549, 11767223, 11615826, 11336205, 11099426, 10815184, 10403389, 10152768, 9957697, 9649681, 9453506, 9250691, 8906022, 8555588, 8371705, 8369039, 8165772, 8000244, 7915479, 7782592, 7731793, 7567736, 7260113, 7104577, 7016930, 6766029, 6574486, 6428573, 6343561, 6220771, 6063858, 6081412, 6118236, 6073732, 5991130, 5944068, 6075239, 6119143, 6170311, 6309938, 6398307, 6507635, 6568707, 6641332]
5274F641332N7437l498K19237K54339M9942K17317J05080K64N5559J03174J6275
5263G716458J76477J00202J5355J42328J01767J99563J3816r681r2041n5660m6360
5252H262224j34509j16503o4313K8146n6300p3931L6480J36722J56617R1717K12590
5241H478940J81162L73735M04423K78577M28630M68203M10774L07837M00148K77353
5231A2009782J15007J87269m2690j50500l89950l62926l00534l89325k78512j94043
5221A0203578q9489j73552j12875J5637M9289P3372K10828K78163L99100L98238
5211A1252289N74482N80536O10091N21613N03216N06413L84128K67651K14781
5202A5415200r5664j07549j60902l86205l73432m71849m81611n78208n83220n20315
$$ y = [6641332, 6698769, 6695271, 6914508, 7168847, 7218789, 7436106, 7541186, 7541450, 7597009, 7700183, 7716458, 7892935, 7993137, 8008492, 8150820, 8252587, 8452150, 8465966, 8456285, 8364244, 8308584, 8262224, 8127715, 8011212, 7946899, 7975045, 7918745, 7844814, 7881294, 8018016, 8174633, 8266350, 8478940, 8660102, 9033837, 9438260, 9716837, 10145467, 10613670, 11024444, 11332281, 11732429, 12009782, 12124789, 12312058, 12269368, 12118868, 11728918, 11365992, 11065458, 10676133, 10397621, 10203578, 10114089, 9940537, 9827662, 9843299, 9892588, 9965960, 10176788, 10454951, 10854051, 11252289, 11826771, 12407307, 13017398, 13539011, 14042227, 14548640, 14932768, 15200419, 15415200, 15319536, 15211987, 15051085, 14664880, 14291448, 13819599, 13337988, 12759780, 12176560, 11656245]
5192A1656245n11310m05403l87543k28916k68413k65163j39001j50324M3614O6561
5182I410347O3375L8818R1332M8356J10294P1026J38491j8532m108J40988N2911
5171A0143298k4858j63035j91637l65761l52014l42087l26452k31580l03571l23802
5161G518501l44790k83461k48247k76809j32875j10542j26484n2925m6686J7968
5151E913650p6642N6842q1592j25179m407p2054j36995o9952J1081n6748n4381
5140E303623m5865J6517j29943n8811n0508l4558N764j4940K1800K9833k1375
5129E021537Q2685J3197k06287J5532L2797K8766J08426l6890P1694K6954k1391
5118E137020O9197R4562l3662Q3350k1394p5190R3602J3702L9200r982K6203L2105
$$ y = [11656245, 11144935, 10739532, 10351989, 10123073, 9854660, 9589497, 9450496, 9300172, 9343786, 9410347, 9473722, 9512540, 9603872, 9652228, 9762522, 9833548, 9972039, 9953507, 9949399, 10090387, 10143298, 10118440, 9955405, 9763768, 9398007, 9045993, 8703906, 8377454, 8145874, 7842303, 7518501, 7173711, 6890250, 6642003, 6365194, 6232319, 6121777, 5995293, 5942368, 5895682, 5913650, 5837008, 5893850, 5812258, 5687079, 5682672, 5610618, 5473623, 5403671, 5414752, 5358004, 5303623, 5257758, 5274275, 5144332, 5085521, 5035013, 5000455, 5006219, 4991279, 5013079, 5042912, 5021537, 5104222, 5117419, 4911132, 4926664, 4959461, 4988227, 5096653, 5059763, 5131457, 5158411, 5137020, 5206217, 5300779, 5267117, 5350467, 5329073, 5253883, 5347485, 5361187, 5400387, 5390405, 5416608, 5448713]
5106E448713J18891J7525O724P6950l8181J0782O6856p439j1461j0401M0660K6248
5094E745867J40044L5221N4663P7412L4903R2864R9021Q0389K8013Q0529L6777
5083F505703L0525J38725M9658O4220P2770O8848O3199Q152l498J32375P4853
5072G205530M0251J28054P6564l2032R5483R5317N1659J25329J08628j0714Q0567
5061G964636Q0003J82183Q7192K2760J42079K2714J59326K3933O7801J15979J85895
5050I054501J60026M3834O0623Q2862L9406J44554K64133J80773J30224k1311
5040A0139625K05796J85520R3113J06790J17432R2468j2357M4865J93354J29952
5030A1296558J08888J93370J36609J64142Q3733K41472J00967J98928K00559J14313
$$ y = [5448713, 5567604, 5585129, 5591853, 5668803, 5630622, 5641404, 5708260, 5700821, 5689360, 5678959, 5719619, 5745867, 5885911, 5921132, 5975795, 6053207, 6088110, 6180974, 6279995, 6360384, 6388397, 6468926, 6505703, 6536228, 6674953, 6724611, 6788831, 6861601, 6930449, 6993648, 7001800, 6998302, 7130677, 7205530, 7245781, 7373835, 7450399, 7418367, 7513850, 7609167, 7660826, 7786155, 7894783, 7884069, 7964636, 8044639, 8226822, 8314014, 8336774, 8478853, 8501567, 8660893, 8684826, 8752627, 8868606, 9054501, 9214527, 9258361, 9318984, 9401846, 9441252, 9585806, 9849939, 10030712, 10160936, 10139625, 10345421, 10530941, 10624054, 10730844, 10848276, 10940744, 10928387, 10973252, 11166606, 11296558, 11405446, 11598816, 11735425, 11899567, 11983300, 12224772, 12325739, 12524667, 12725226, 12839539]
5020A2839539K46885K59273K49435K71136J90185J51523J68615K30810K98743
5011A4906144K78354J09672M02193K78280K47114L07053K36789L14876L56298
5002A7436773K59196K14849K86226K74607K49566L88728L05440K77027R2022J09924
4992A9894358K78258L18129K33894K51098K12945L30303M05818L22314M27744
4983B2674861K92322M55882N54225N50611N45621N01605N75484N46996O13691
4974B7311298O26358M52098N24048N44571M09467K88047L57818J58258J42624
4965C0814587J57106Q4609J29947O0727P351J47266N1879J30380J56282O0014
4955C1800148R2141M6044j43974k2967P7552J0281J57725J59923L52548L66831
$$ y = [12839539, 13086424, 13345697, 13595132, 13866268, 14056453, 14207976, 14376591, 14607401, 14906144, 15184498, 15294170, 15696363, 15974643, 16221757, 16528810, 16765599, 17080475, 17436773, 17695969, 17910818, 18197044, 18471651, 18721217, 19109945, 19415385, 19692412, 19784434, 19894358, 20172616, 20490745, 20724639, 20975737, 21188682, 21518985, 21924803, 22247117, 22674861, 22967183, 23423065, 23977290, 24527901, 25073522, 25575127, 26150611, 26697607, 27311298, 27937656, 28389754, 28913802, 29458373, 29867840, 30155887, 30513705, 30671963, 30814587, 30971693, 31056302, 31186249, 31246976, 31254327, 31401593, 31453472, 31583852, 31740134, 31800148, 31892289, 31938333, 31794359, 31771392, 31848944, 31859225, 32016950, 32176873, 32529421, 32896252]
4945C2896252L08703L67983K67742J24544K66438M65695K46956K28549m1643n66046
4935C4565173p41076o48499o87857o74031m94898m04704m04083l92522m66576
4926B9650927m43745n82426p14845p11796p00881q17033q43004q96695q40373
4917B3100129o53223p09741o20374n91749n42767m31975l55046j83034n7560N4489
4907A9009149R5228K67692K28939M22373M07233L14471J0672o30682r09170j098049
4897A8117856j007338p47079p23920m84802l96256m09885l14026m66586l98491
4888A3169473l37772l05185j65847j69990k15201k35315j69514n3157j03664r0334
4878A1323494q1131j01180j07733j20888j22018o3591o0557j6015p2118j06009
$$ y = [32896252, 33204955, 33572938, 33840680, 33965224, 34231662, 34697357, 34944313, 35172862, 35131219, 34565173, 33824097, 33175598, 32487741, 31813710, 31318812, 30914108, 30510025, 30117503, 29650927, 29207182, 28624756, 27909911, 27198115, 26497234, 25680201, 24837197, 23940502, 23100129, 22446906, 21737165, 21116791, 20525042, 19982275, 19550300, 19195254, 19012220, 18954660, 19009149, 19104377, 19372069, 19601008, 20023381, 20430614, 20745085, 20755757, 20125075, 19215905, 18117856, 17110518, 16363439, 15639519, 15154717, 14758461, 14348576, 14034550, 13567964, 13169473, 12831701, 12526516, 12360669, 12190679, 11975478, 11740163, 11570649, 11517492, 11413828, 11323494, 11242363, 11141183, 11033450, 10912562, 10790544, 10726953, 10666396, 10650381, 10578263, 10472254]
4868A0472254j03420r5461n5459m5723p6243j50723j41609k6088M0256L1100M002
4857I852886Q455m8439j19081q4730M6550l59L017L0318Q8505j2930O7418M8282
4845I879892O7939Q4905j08474R8951M4120L6544J55110J07555M1673K69540J61356
4834A0839111K89375L50348L84223O48899O77985Q73620J047926J049760Q98720
4825A7059967M72305n41863j134872j113832j051810p51369o05373l50325k19879
4816A1762949j51685j71646j23655q5509j11744M9947j36031l3646n4538j272
4806A0943170R6047j8356Q6646J4569K5453K87489L897J43201K79765J78025J81338
4795A2221244K86181J28331J57249R1811O5131M3902K4769m54Q8568J70106M8511
$$ y = [10472254, 10368834, 10273373, 10217914, 10172191, 10095948, 9945225, 9803616, 9777528, 9817784, 9848884, 9852886, 9861341, 9812902, 9693821, 9609091, 9655641, 9655282, 9658299, 9688617, 9777122, 9764192, 9831610, 9879892, 9947831, 10032736, 9924262, 10023213, 10067333, 10103877, 10258987, 10366542, 10408215, 10677755, 10839111, 11128486, 11478834, 11863057, 12511956, 13189941, 14063561, 15111487, 16161247, 17059967, 17532272, 16990409, 15855537, 14741705, 13689895, 12938526, 12333153, 11982828, 11762949, 11611264, 11439618, 11315963, 11230454, 11118710, 11168657, 11032626, 10998980, 10944442, 10943170, 11039217, 11020861, 11107507, 11122076, 11147529, 11435018, 11438915, 11582116, 11861881, 12039906, 12221244, 12507425, 12635756, 12793005, 12884816, 12949947, 12993849, 13018618, 13018164, 13106732, 13276838, 13325349]
4784A3325349P3704J16709J00908J92840J17069l5325J26339J19875r925j02890
4774A4024653J13080K29878J08046P9193J06271K51062J29253J94733K96634L71709
4764A5904512L53260L65684M46024M48810N56315N44839M31279L53213M87776
4755A9891712M83824N19473L98118M02298L13565L55743L65559L17894K71724
4746B3319910L84484M64640M45777M22768M33189N43310O22225O87635P05401
4737B8029339P19607P42812Q15330J035181J053913R48842R66366R73617Q01770
4728C6086777P50176O90415N45129N44243M10690K46570L46883K87466K20661
4719D0129010J08170J9554j32857k81312l73617l39136l78711l57679k73237l89308
$$ y = [13325349, 13399053, 13515762, 13616670, 13809510, 13926579, 13891254, 14017593, 14137468, 14127543, 14024653, 14137733, 14367611, 14475657, 14554850, 14661121, 14912183, 15041436, 15236169, 15532803, 15904512, 16257772, 16623456, 17069480, 17518290, 18074605, 18619444, 19050723, 19403936, 19891712, 20375536, 20895009, 21293127, 21695425, 22008990, 22364733, 22730292, 23048186, 23319910, 23704394, 24169034, 24614811, 25037579, 25470768, 26014078, 26636303, 27323938, 28029339, 28748946, 29491758, 30307088, 31342269, 32396182, 33345024, 34311390, 35285007, 36086777, 36836953, 37527368, 38072497, 38616740, 39027430, 39274000, 39620883, 39908349, 40129010, 40237180, 40256734, 40123877, 39842565, 39468948, 39129812, 38751101, 38393422, 38120185, 37730877]
4709C7730877k59092k40338k89585j18419j76104n0484m524l1790J57537j7247
4699C6700831J42094P2834K37819K54599K72260L44232J63351J56300O1726l8847
4689C8367199j91209k71026n10925o89347q99063r44514j053228q72242q03609
4680C2132036r32642o95811l47385k02340m0701k3013q6063k20511n25287r82145
4670B8076138j200950j162991j262755j060038q87010p88046p36277p09018m93120
4661A9775933m61965m00613l22808l50025j66641k22826k32609k77138p4829n5481
4651A7210998k64255j58213j82370j45674L1072o9773o9469j05814q4529J41212
4641A6303185J0456q7780Q492N731j8623J1942j47586j17904j48632k79310k84118
$$ y = [37730877, 37471785, 37231447, 36941862, 36823443, 36647339, 36596855, 36592331, 36560541, 36718078, 36700831, 36842925, 36915759, 37153578, 37408177, 37680437, 38024669, 38188020, 38344320, 38406046, 38367199, 38175990, 37904964, 37394039, 36704692, 35805629, 34861115, 33807887, 32935645, 32132036, 31199394, 30503583, 30156198, 29953858, 29913157, 29890144, 29804081, 29583570, 29058283, 28076138, 26875188, 25712197, 24449442, 23389404, 22502394, 21714348, 20978071, 20269053, 19775933, 19313968, 18913355, 18590547, 18240522, 18073881, 17851055, 17618446, 17341308, 17266479, 17210998, 16946743, 16788530, 16606160, 16460486, 16491558, 16421785, 16352316, 16246502, 16161973, 16303185, 16313641, 16225861, 16234353, 16240084, 16221461, 16233403, 16085817, 15967913, 15819281, 15539971, 15255853]
4630A5255853l31773k93858m05879m03356k19513m04701l09129q6309k06610k44135
4620A2350590k01865j78283j42531j59179p9378p4777m2603j02175m5247p7693
4610A1246859L9908N9885L951L7434q9838M9076K8063j08917J2162o6090j66373
4599A1046120J8j90376j43413p9833k03872j30187j33790k35706l4264r7748j89113
4588I607836q8023q1245l2572p9828j30602n1037o8174p1585j40020k3314k15847
4577H625589j64114q6096j77201k37564j17242j14203j00784m7049p3131j04226
4567G403979j54933j09874r6862l8741n8957r4583q4697j03881j31852p2158j76
4556F457265r2148J0280L3902o6661j03836j62876o1227J2006j14650j07823p9682
$$ y = [15255853, 14924080, 14630222, 14224343, 13820987, 13601474, 13196773, 12887644, 12801335, 12594725, 12350590, 12148725, 11970442, 11827911, 11668732, 11589354, 11514577, 11471974, 11369799, 11324552, 11246859, 11286767, 11346652, 11350603, 11388037, 11298199, 11347275, 11375338, 11266421, 11278583, 11212493, 11046120, 11046138, 10855762, 10712349, 10632516, 10428644, 10298457, 10164667, 9928961, 9894697, 9796949, 9607836, 9519813, 9438568, 9405996, 9326168, 9195566, 9144529, 9076355, 9004770, 8864750, 8841436, 8625589, 8461475, 8375379, 8198178, 7960614, 7843372, 7729169, 7628385, 7581336, 7508205, 7403979, 7249046, 7139172, 7042310, 7003569, 6944612, 6850029, 6765332, 6661451, 6529599, 6457441, 6457265, 6365117, 6375397, 6409299, 6342638, 6238802, 6075926, 6014699, 6026705, 5912055, 5804232, 5724550]
4545E724550l1429l3261l7751m1479j449j49705j01197q687q3588O2367K0370
4534E318741K3136n1775O6215j34242n5432P2135j05965q9200J08557q9623K6152
4523E088699L1546q3492L0177k2793O6683l1723j3634o9557J5580l0685l2315
4512D948486j25170N690J15827j51131J0675J2483J15780J28991m5980l2379N6288
4501E039560N4095O5546J15425L5480M4557R1741O2113N6046j3018j0594P4161
4490E615112J07489Q7335M6621k7728J07589l2784j4817O3883P4796J32822J61880
4479F322198l0697R3583J37645J48418m780J43944M2725J174K07292M5092J31903
4468G238497J50667J6226J18178J16652P9759J63845N6895K38174L43042K44477
$$ y = [5724550, 5693121, 5659860, 5622109, 5580630, 5579181, 5429476, 5328279, 5319592, 5236004, 5298371, 5318741, 5341877, 5290102, 5356317, 5222075, 5166643, 5238778, 5132813, 5043613, 5152170, 5062547, 5088699, 5120245, 5036753, 5066930, 5044137, 5110820, 5079097, 5065463, 4995906, 5011486, 4980801, 4948486, 4823316, 4829006, 4944833, 4793702, 4804377, 4816860, 4932640, 5061631, 5015651, 4983272, 5039560, 5093655, 5159201, 5274626, 5310106, 5354663, 5446404, 5508517, 5564563, 5551545, 5540951, 5615112, 5722601, 5809936, 5856557, 5828829, 5936418, 5903634, 5888817, 5952700, 6027496, 6160318, 6322198, 6291501, 6385084, 6522729, 6671147, 6666367, 6810311, 6853036, 6854210, 7061502, 7106594, 7238497, 7389164, 7405390, 7523568, 7640220, 7719979, 7883824, 7940719, 8178893, 8521935, 8766412]
4458H766412J85749K26785K64969J68766K48443K42558J73157K72800K12711L09612
4448A1071962L29282K88970L25027M09788M57975N60196M82103N15524N83406
4439A5024233O07012O97552P85768R80042R70794J101761J241990J388777J645012
4430B4442941J835417K041022K300055K633787K863391L219726L671393M215876
4422D7223608M359288M484747M179274L497254K555161J253714N65524j17050
4414F8001520r60207j893555l079793m014892m696439m831679m519790m017708
4406C9987457l547551k950555k658654k183917j871833j688454j451317j340499
4398B2294677j083580r55440r71368q05253p53145p53330o48668n50306n22581
$$ y = [8766412, 8952161, 9178946, 9443915, 9612681, 9861124, 10103682, 10276839, 10549639, 10762350, 11071962, 11401244, 11690214, 12015241, 12425029, 12883004, 13443200, 13925303, 14440827, 15024233, 15631245, 16328797, 17114565, 18094607, 19065401, 20167162, 21409152, 22797929, 24442941, 26278358, 28319380, 30619435, 33253222, 36116613, 39336339, 43007732, 47223608, 51582896, 56067643, 60246917, 63744171, 66299332, 67553046, 68118570, 68001520, 67041313, 65147758, 62067965, 58053073, 53356634, 48524955, 44005165, 39987457, 36439906, 33489351, 30830697, 28646780, 26774947, 25086493, 23635176, 22294677, 21211097, 20255657, 19284289, 18479036, 17725891, 16972561, 16323893, 15773587, 15251006]
4389A5251006n41622n33497l62282m76434l88374k45776k50196l61638l38663
4380A1752524k22508k21137j49754j53163k13173k20547j38752j59478n8553q9796
4370A0125663j43484r1978k6330j32496j09299j48015j32616o3427o279m8891
4360I222848L5467j28416j12220L2548r9818p3545L3316j4274m332J376P9366
4349H972316P4336M8533M9150Q4527O7159J10881K7831Q3259J20192P0842J12931
4338I821957K1429K3702Q5373J53489K1213j9403r401J21823L4078j7099J4085
4327A0251246l9694Q2024J00354J01456Q1519L1144J88771J62651J46175J37367
4317A1243013K45370K58641K62284K31191K17732K84332J64272K29146K44227
$$ y = [15251006, 14709384, 14175887, 13813605, 13337171, 12948797, 12703021, 12452825, 12091187, 11752524, 11530016, 11308879, 11159125, 11005962, 10792789, 10572242, 10433490, 10274012, 10215459, 10125663, 9982179, 9890201, 9863871, 9731375, 9622076, 9474061, 9341445, 9278018, 9271739, 9222848, 9258315, 9129899, 9017679, 9050227, 8950409, 8876864, 8910180, 8895906, 8891574, 8892950, 8972316, 9046652, 9095185, 9144335, 9228862, 9296021, 9406902, 9434733, 9517992, 9638184, 9709026, 9821957, 9843386, 9867088, 9952461, 10105950, 10127163, 10107760, 10098359, 10220182, 10254260, 10237161, 10251246, 10211552, 10293576, 10393930, 10495386, 10576905, 10608049, 10796820, 10959471, 11105646, 11243013, 11488383, 11747024, 12009308, 12240499, 12458231, 12742563, 12906835, 13135981, 13380208]
4308A3380208L86095K67861L82398K47851K46654L37517L20501L66278K77667
4299A6213030K65272K90204J67930K50668K44022R6154J82584K19440J35776P8764
4289A8143844n3929j59270K2282n4613j09774j70287k28695j01486k58805m53796
4279A6575471l15312l16590l69295l09774l72268l11143l24566k76897l11804
4270A3667822l21305k69339k99090k64543j43383j95806j87980q5778j25647M3952
4260A1818903n0525q0240K1969R2766K9243n191q9109m1579k23384m25343l24242
4249A0723268m06079m67712m05187l11361k34347l04308j91725k91919j88959
4240G921671j57135j24394j43376j08046j72595j05713k67673p1494j09783j88318
$$ y = [13380208, 13766303, 14034164, 14416562, 14664413, 14911067, 15248584, 15569085, 15935363, 16213030, 16478302, 16768506, 16936436, 17187104, 17431126, 17527280, 17709864, 17929304, 18065080, 18143844, 18089915, 17930645, 17952927, 17898314, 17788540, 17618253, 17389558, 17288072, 17029267, 16575471, 16260159, 15943569, 15574274, 15264500, 14892232, 14581089, 14256523, 13979626, 13667822, 13346517, 13077178, 12778088, 12513545, 12370162, 12174356, 11986376, 11900598, 11774951, 11818903, 11768378, 11688138, 11710107, 11802873, 11832116, 11826925, 11737816, 11696237, 11472853, 11047510, 10723268, 10317189, 9849477, 9444290, 9132929, 8898582, 8594274, 8402549, 8110630, 7921671, 7764536, 7640142, 7496766, 7388720, 7216125, 7110412, 6842739, 6771245, 6661462, 6473144]
4230F473144j93229j40168P625j76518N8291j33924j22647l6311o7276p0181l4513
4219E564293R4816K6709q4055j72276j46450Q7437N46p2633n8604L2548p2398
4208E199933o5475K840m732j9572p2767o2566O6951Q6883j30230p6249K9466N8056
4196E012538J15594k687m9697j643P5933j49706r2522J680N040Q9150L4865r361
4184E029184Q5230N8612O7301J889r9462k2400Q8939k0190j09355n2359o8477
4173D958912l1808L9821L6030R1290k852o0802p7763l9222j3781P5463R7360J87618
4161E260266K9421o1915R2219J05917J93753P3077J97094J81398L21833L34014
4151F727077M07424M21163K85262J45532k27543l13903m38153l66090k43618k10072
$$ y = [6473144, 6279915, 6139747, 6147372, 5970854, 6029145, 5895221, 5772574, 5736263, 5668987, 5598806, 5564293, 5659109, 5685818, 5601763, 5429487, 5283037, 5370474, 5371020, 5298387, 5239783, 5272331, 5199933, 5134458, 5137298, 5132566, 5112994, 5040227, 4977661, 5044612, 5131495, 5001265, 4925016, 4954482, 5012538, 5128132, 5125445, 5075748, 5074105, 5150038, 5000332, 4907810, 4909490, 4914530, 5003680, 5038545, 5029184, 5114414, 5173026, 5240327, 5242216, 5142754, 5120354, 5209293, 5189103, 5079748, 5027389, 4958912, 4927104, 4966925, 5002955, 5094245, 5091393, 5030591, 4952828, 4913606, 4899825, 4975288, 5072648, 5260266, 5289687, 5227772, 5319991, 5425908, 5619661, 5692738, 5889832, 6071230, 6393063, 6727077, 7134501, 7555664, 7840926, 7986458, 7758915, 7445012, 7006859, 6640769, 6397151, 6187079]
4141F187079j75605n3858J744l5754J05577m9008r3235P4485K8735j9695k9175
4130E941290O0665P9022p774j34731M1858J45582l2122k2795M1393J16278K3626
4119F252292J5241j6376L6757K1520K1933Q8879P1456K8974N386J6555P4506L8895
4107F656018l2J3418J30669R8422J25300J35811P9837J7150J83893P3246K02011
4096G715743J43234R3851K17342Q8074J71674J97645J86048K26166K16047J64350
4086I420174L06586L36638L63913L38214L17587L42963L31476K66763L63740L34750
4076A2722804M65173M52268M28239M16057N41868O96959N44642O70182O08652
4067A7546844N39904O91365N39307N44240M64077L50977N36951N39389M77866
$$ y = [6187079, 6011474, 5957616, 5959360, 5923606, 6029183, 5980175, 5886940, 5961425, 5990160, 5970465, 5941290, 6001955, 6080977, 6073203, 5938472, 5980330, 6125912, 6093790, 6070995, 6112388, 6228666, 6252292, 6267533, 6251157, 6287914, 6309434, 6331367, 6420246, 6491702, 6520676, 6526062, 6542617, 6617123, 6656018, 6655986, 6669404, 6800073, 6898495, 7023795, 7159606, 7239443, 7256593, 7440486, 7513732, 7715743, 7858977, 7952828, 8170170, 8258244, 8429918, 8627563, 8813611, 9039777, 9255824, 9420174, 9726760, 10063398, 10427311, 10765525, 11083112, 11426075, 11757551, 12024314, 12388054, 12722804, 13187977, 13640245, 14068484, 14484541, 15026409, 15723368, 16268010, 16938192, 17546844, 18086748, 18778113, 19317420, 19861660, 20325737, 20676714, 21213665, 21753054, 22230920]
4058B2230920N57738P55235O64337O05550O03529O52637P61821N03551M87182
4049B7822500M75873L46970K17791K49782L05014K11845L25118M05232M72878
4040C0833003L97844L42686K39201J03588R2534p7087j51140j57049k03706l67064
4030C1052810l76129k28037k83951j12345j18719k06680j40614k30803k51842
4021B9103690m53134m37530m52027o45214o74914o32331o83281o01424m53220
4012B4070615l43490k89528m11560m45776k33761k72662m82318m42461n17803
4003B0631256m37593m84680o32599m48852m99983k64557j40291k99785k50955
3994A7171961l10083j68073k61376k37951k28913k01408l27883l59495l23791
$$ y = [22230920, 22788658, 23543893, 24208230, 24813780, 25417309, 26069946, 26831767, 27335318, 27822500, 28298373, 28645343, 28863134, 29112916, 29417930, 29629775, 29954893, 30360125, 30833003, 31230847, 31573533, 31812734, 31916322, 32008856, 31931769, 31780629, 31623580, 31419874, 31052810, 30676681, 30448644, 30164693, 30052348, 29933629, 29726949, 29586335, 29355532, 29103690, 28650556, 28213026, 27760999, 27115785, 26440871, 25808540, 25125259, 24523835, 24070615, 23727125, 23437597, 23026037, 22580261, 22346500, 22073838, 21591520, 21149059, 20631256, 20193663, 19708983, 19076384, 18627532, 18127549, 17862992, 17722701, 17422916, 17171961, 16861878, 16693805, 16432429, 16194478, 15965565, 15764157, 15436274, 15076779, 14752988]
3985A4752988l11130k17947j87500l63372j67509K0383p7502k55590k14884j21232
3975A2856705l00529j26785k25300k21587j29007j86851j44453j05073k08478
3966A1208642r2341j11474j51151j34749j92617j91351j76706p4374j35097j44202
3956I804580j00952j44322q8363q3972q3061j73969j27596k00679j50779j53748
3946H497139j80699k15657j88127o7667j74333j24007k22178j64448k6508m8556
3936G084959j36009k36152j63276L1193o6378j19768k9275j21379j00508j35565
3926F007842r2957j8762k8157j40104q6720j12045m6898n2954j03433K5843o6457
3915E285198p2705o4752M6266m394j14990m7084l7180O390L5912K8289j5588m2615
$$ y = [14752988, 14441858, 14223911, 14036411, 13673039, 13505530, 13525913, 13448411, 13192821, 12977937, 12856705, 12556176, 12429391, 12204091, 11982504, 11853497, 11666646, 11522193, 11417120, 11208642, 11116301, 11004827, 10853676, 10718927, 10526310, 10334959, 10158253, 10083879, 9948782, 9804580, 9703628, 9559306, 9470943, 9386971, 9303910, 9129941, 9002345, 8801666, 8650887, 8497139, 8316440, 8100783, 7912656, 7844989, 7670656, 7546649, 7324471, 7160023, 7133515, 7084959, 6948950, 6712798, 6549522, 6580715, 6514337, 6394569, 6365294, 6243915, 6143407, 6007842, 5914885, 5896123, 5867966, 5727862, 5641142, 5529097, 5482199, 5429245, 5325812, 5351655, 5285198, 5212493, 5147741, 5194007, 5189613, 5074623, 5027539, 4990359, 4996749, 5032661, 5060950, 5045362, 5002747]
3903E002747j9495l5418j03687L4628k5953r664j14122j41387P6997N6770J08040
3892D829456k858n0893O3264M1569r5731l3480k5032J3230K7964K5476q4257k932
3880D705776j0808L4908P4266O50J8159p4047j6788R84N4163k0465k271P0382
3868D834909P0114j5994p7673l6367J1408J17835K3686q1381j10245L8382O6462
3857D841136J5185O0160j48668j695r503m2412M3312Q1059J3996r8800j7871L1525
3845D767424O8121K6716o140N1261J1750n9202q7918J8173J446j6475R6703O9956
3833D941815j49209r7149L0724N4885o698q5252L2243R270K4097j81738K0898
3822D593886N4972M7726m6562J03137m717n4100M1371J4472m7058k7887Q7039
$$ y = [5002747, 4983252, 4947834, 4844147, 4878775, 4852822, 4843158, 4729036, 4587649, 4664646, 4721416, 4829456, 4826598, 4775705, 4838969, 4880538, 4784807, 4751327, 4726295, 4739525, 4767489, 4792965, 4708708, 4705776, 4694968, 4729876, 4804142, 4804792, 4822951, 4748904, 4732116, 4733100, 4787263, 4766798, 4764527, 4834909, 4905023, 4889029, 4811356, 4774989, 4786397, 4904232, 4927918, 4846537, 4736292, 4774674, 4841136, 4856321, 4916481, 4767813, 4766118, 4756615, 4714203, 4757515, 4838574, 4852570, 4753770, 4735899, 4767424, 4835545, 4862261, 4856121, 4907382, 4919132, 4859930, 4772012, 4790185, 4791631, 4775156, 4871859, 4941815, 4792606, 4695457, 4726181, 4781066, 4774368, 4689116, 4721359, 4730629, 4754726, 4572988, 4593886, 4648858, 4696584, 4650022, 4753159, 4748442, 4694342, 4735713, 4750185, 4703127, 4675240, 4762279]
3811D762279J3019p5254Q4198n4513N3335J20393m4209L452K0871Q4711p454r0417
3799D870411J26736J14836m0055L7372r8395Q4619L9758M9418J28684J8692n8547
3788E273529M6258N1181J3622L5206l3229n4045L5842N2775o6997J33738J17965
3777E605845N6163M3285j07274K2031J4793J4507r738J4967N3497k517q7064K3722
3765E642217K4051L3228M209j23823J11317R0730J15787j7586j56418L2878N1880
3754E808470J62349J693m9704O6588o5322n9944J33018K2717J22080P5850P6470
3743F294265p8010K5579O6897J6444O9774O8535K7339L1943K0273J14019J09669
3732F766727Q4355N5903j349R9323N3962Q7138L6149J79437J16281J14937Q0012
$$ y = [4762279, 4775298, 4700044, 4784242, 4729729, 4783064, 4903457, 4859248, 4862700, 4883571, 4968282, 4960828, 4870411, 4997147, 5111983, 5071928, 5109300, 5010905, 5095524, 5135282, 5184700, 5313384, 5332076, 5273529, 5319787, 5370968, 5384590, 5419796, 5386567, 5332522, 5368364, 5421139, 5354142, 5487880, 5605845, 5662008, 5705293, 5598019, 5620050, 5634843, 5649350, 5639612, 5654579, 5708076, 5705559, 5618495, 5642217, 5666268, 5699496, 5703705, 5579882, 5691199, 5781929, 5897716, 5880130, 5723712, 5756590, 5808470, 5970819, 5972512, 5922808, 5989396, 5924074, 5864130, 5997148, 6019865, 6141945, 6217795, 6294265, 6216255, 6241834, 6308731, 6325175, 6394949, 6463484, 6490823, 6522766, 6543039, 6657058, 6766727, 6851082, 6906985, 6905636, 7004959, 7058921, 7146059, 7182208, 7361645, 7477926, 7592863, 7672875]
3721G672875J66250O2048R4554K9890m6460J3931l7826Q6625l4122r7835m4195
3710G865735q234k8125O1853N139L6149O4400O9862J01311M4031P2932o950M9314
3698H327417J957N3401R8398j8404j6201J10983J34136J8397P2192J3247R9827
3687H895350Q9503O4644J22699O7466Q8175K44433J19753J13296K675J46988J23713
3676A0078695K8873l2096K2781J60941J16273M8284J02813J24207L0807Q063J19043
3665A0808684J03022R7714J36102J18025R3775M733O6595R4946k9764L8243J23325
3654A1655400P4849L1495O5976J58113q6836J8781N0066O4247q8842m0881J09449
3643A2011817M6152r525J20766l7607k5272m9103J62226K9554n7283R162J0690
$$ y = [7672875, 7839125, 7901173, 7995727, 8025617, 7979157, 7993088, 7955262, 8041887, 8007765, 7909930, 7865735, 7857501, 7829376, 7891229, 7896368, 7932517, 7996917, 8066779, 8168090, 8212121, 8285053, 8278103, 8327417, 8329374, 8382775, 8481173, 8462769, 8446568, 8557551, 8691687, 8710084, 8782276, 8795523, 8895350, 8984853, 9049497, 9172196, 9239662, 9327837, 9572270, 9692023, 9805319, 9807994, 9954982, 10078695, 10107568, 10075472, 10098253, 10259194, 10375467, 10423751, 10526564, 10650771, 10681578, 10689641, 10808684, 10911706, 11009420, 11145522, 11263547, 11357322, 11362055, 11428650, 11523596, 11493832, 11532075, 11655400, 11730249, 11761744, 11827720, 11985833, 11898997, 11917778, 11967844, 12032091, 11943249, 11902368, 12011817, 12057969, 12048444, 12169210, 12131603, 12106331, 12057228, 12219454, 12249008, 12191725, 12200887, 12211577]
3632A2211577N3783P6938K9527J72959J05846K5942j0651J5563M8738J18619J20823
3621A2969664M9869Q8379j179N3227P7978L0829K8776K0466J15988Q8595J06154
3610A3628746J21067m0315P235J07459J03354M8722j4120L9743O7062P5522j34328
3599A4010147q1397P3737j5524j7752M2262p0138n7133p5585P0572Q9592l6815
3588A3931966o3388j3820L8646o7519N8841N5415J4325l419O5825n046l4953k3095
3576A3953778J317N3099J90605K6491k5374o4953J59671N0523R6852N8709N1534
3565A4552252n120J07534J43207R8901R9009M9162l8287J27423J43948J22437
3555A5400466P1202J01274J67738R1081O2656J18163J77702J52683Q2383P2035
$$ y = [12211577, 12265360, 12342298, 12371825, 12544784, 12650630, 12676572, 12665921, 12681484, 12730222, 12848841, 12969664, 13019533, 13107912, 13106733, 13159960, 13237938, 13268767, 13297543, 13318009, 13433997, 13522592, 13628746, 13749813, 13709498, 13716733, 13824192, 13927546, 13976268, 13962148, 14001891, 14068953, 14144475, 14010147, 13928750, 14002487, 13986963, 13969211, 14011473, 13941335, 13884202, 13808617, 13879189, 13968781, 13931966, 13868578, 13854758, 13893404, 13825885, 13884726, 13940141, 13954466, 13951047, 14016872, 14011826, 13976873, 13953778, 13955095, 14008194, 14198799, 14225290, 14199916, 14134963, 14294634, 14345157, 14442009, 14500718, 14552252, 14547132, 14654666, 14797873, 14896774, 14995783, 15044945, 15006658, 15134081, 15278029, 15400466, 15471668, 15572942, 15740680, 15831761, 15894417, 16012580, 16190282, 16342965, 16425348, 16497383]
3545A6497383K43874P1836J44842R8253K53477J81460J55709J54794K35988J67024
3535A8204640J06411J52272O7084K03343J88311K21025K22183L26545J79898K01730
3525B0073442M9457K26698L77566L05240K05265K18407K98357K89398M45156L24144
3515B2813130N11551M86839N00466N74914N66769O00858N73114O40530N87129
3506B7855300O24327O54642N12182M21059L94499L41648J96480J79885J6097r9205
3496C1096914J57394K4689m2849n6411L9666j594J47849K9134p7995j36057j45362
3485C1035378j68265l30549k41127l95775l12829k79164l09638l22003k69072
3476B8406956k46201k64548j93977j56927j11091J1191j15329o8183j24876q85
$$ y = [16497383, 16741257, 16813093, 16957935, 17056188, 17309665, 17491125, 17646834, 17801628, 18037616, 18204640, 18311051, 18463323, 18530407, 18733750, 18922061, 19143086, 19365269, 19691814, 19871712, 20073442, 20122899, 20349597, 20727163, 21032403, 21237668, 21456075, 21754432, 22043830, 22488986, 22813130, 23324681, 23811520, 24311986, 24886900, 25453669, 26054527, 26627641, 27268171, 27855300, 28479627, 29134269, 29646451, 30067510, 30462009, 30803657, 31000137, 31180022, 31196119, 31096914, 31254308, 31278997, 31236148, 31179737, 31219403, 31217809, 31365658, 31394792, 31316797, 31180740, 31035378, 30867113, 30536564, 30295437, 29899662, 29586833, 29307669, 28998031, 28676028, 28406956, 28160755, 27896207, 27702230, 27545303, 27434212, 27445403, 27330074, 27261891, 27137015, 27136130]
3466B7136130p1369J09922p3489j6613J70779O2968K38365K07917J50319J40044
3456B8054973Q1859K08789L39618J58515K01782K11167J58734K10885K11658J88537
3446C0026517P8712J58040K40236J74997P0913L7529J07333J46552O6497J11981
3436C1219307J49267M3122J01322K23588K17986J19232K58076J35655K06781J20602
3426C2794938J50299J88071J30861K06494K36652J97062K37592L04094J65973
3417C4612036J77802K72019L37579K50474J20663K71893L95293L23647L93877
3408C7155283L13412M23155N12819N03933O00422O55172P38931P73036R64175
3399D2640338J035192J018032J100097J162041J205230J251552J091705J030477
$$ y = [27136130, 27064761, 27174683, 27101194, 27084581, 27255360, 27318328, 27556693, 27764610, 27914929, 28054973, 28136832, 28345621, 28685239, 28843754, 29045536, 29256703, 29415437, 29626322, 29837980, 30026517, 30105229, 30263269, 30503505, 30678502, 30749415, 30786944, 30894277, 31040829, 31107326, 31219307, 31368574, 31411696, 31513018, 31736606, 31954592, 32073824, 32331900, 32467555, 32674336, 32794938, 32945237, 33133308, 33264169, 33470663, 33707315, 33904377, 34141969, 34446063, 34612036, 34789838, 35061857, 35399436, 35649910, 35770573, 36042466, 36437759, 36761406, 37155283, 37468695, 37891850, 38404669, 38908602, 39509024, 40164196, 40903127, 41676163, 42640338, 43675530, 44693562, 45793659, 46955700, 48160930, 49412482, 50504187, 51534664]
3391E1534664R38238O52018N22496M54862L30055K87723K48253K80673N02213
3382E5751195N31252N12213L64541N93146N83324M68240L31252K96036l4822j4400
3372E9381977q8120j1647n6832j11124j14819j39993K7185J53573M2996J58344
3362E9241540K48996K40337L59192M68271M75767M39992O56045N54727Q46769
3353F3531636P52429Q59378J047870J040571J122944J288109J291005J370351
3345G2304293J342935J530241J432891J406500J302396J236153J085400R95582
3337H2636391J147366J251449J287467J341666J446832J506084J637559J593179
3329I3847993J638504J569663J317430J212783J231642R86018Q26329R29610Q22676
$$ y = [51534664, 52472902, 53124920, 53647416, 54102278, 54432333, 54720056, 54968309, 55248982, 55751195, 56282447, 56794660, 57159201, 57752347, 58335671, 58803911, 59135163, 59431199, 59396377, 59381977, 59293857, 59282210, 59225378, 59114254, 58999435, 58859442, 58886627, 59040200, 59083196, 59241540, 59490536, 59730873, 60090065, 60558336, 61034103, 61474095, 62130140, 62684867, 63531636, 64284065, 65143443, 66191313, 67231884, 68354828, 69642937, 70933942, 72304293, 73647228, 75177469, 76610360, 78016860, 79319256, 80555409, 81640809, 82636391, 83783757, 85035206, 86322673, 87664339, 89111171, 90617255, 92254814, 93847993, 95486497, 97056160, 98373590, 99586373, 100818015, 101804033, 102630362, 103559972, 104382648]
3320A04382648R39347R78419J024056J302759J214944J367442J578639J504742
3312A14292996J478117J497258J410803J351770J277329J243142J161140J229771
3304A24942326J086984J064852J012312J090931J187518J001714J094512J178175
3296A33659324J286572J230437J239062J198906J267803J342366J375948J367716
3288A43968134J448451J459606J654429J781286J842428J962490K230376K416220
3280A58763420K558384K706450L134247L394139L609251L968874M276594M709304
3272A87120663N091782N580960N983817O569866O982003P384298P911439Q413292
3264B41038120Q708990R057919R548781R708519R916315J0451979J0565766J0515042
$$ y = [104382648, 105321995, 106300414, 107324470, 108627229, 109842173, 111209615, 112788254, 114292996, 115771113, 117268371, 118679174, 120030944, 121308273, 122551415, 123712555, 124942326, 126029310, 127094162, 128106474, 129197405, 130384923, 131386637, 132481149, 133659324, 134945896, 136176333, 137415395, 138614301, 139882104, 141224470, 142600418, 143968134, 145416585, 146876191, 148530620, 150311906, 152154334, 154116824, 156347200, 158763420, 161321804, 164028254, 167162501, 170556640, 174165891, 178134765, 182411359, 187120663, 192212445, 197793405, 203777222, 210347088, 217329091, 224713389, 232624828, 241038120, 249747110, 258805029, 268353810, 278062329, 287978644, 298430623, 308996389, 319511431]
3256C19511431J0488603J0282014J0086422R791390R483588R301048R377014R466083
3248C97787593R798339J0401814J1036598J1674519J1961670J1907578J1628489
3241D76196600J0723083R089862O694494L313517j019959n730165j0591099j5075319
3233D73601014j8434096k0381848k0751198k0084420j8593568j6875867j5274967
3226C43205050j3870459j2516733j1244693j0093812r061262q274262p437617
3219B70706212o709291o070651n333516m787310m193162l709685l315176l316609
3211B33270812l397684l089630k668127k315815k120308j857788j585630j411882
3203B14823948j297211j161944j329322j311541j311745j333611j568252j621367
$$ y = [319511431, 330000034, 340282048, 350368470, 360159860, 369643448, 378944496, 388321510, 397787593, 407585932, 417987746, 429024344, 440698863, 452660533, 464568111, 476196600, 486919683, 496009545, 502704039, 506017556, 504997597, 499267432, 488676333, 473601014, 455166918, 434785070, 414033872, 393949452, 375355884, 358480017, 343205050, 329334591, 316817858, 305573165, 295479353, 286418091, 278143829, 270706212, 263996921, 257926270, 252592754, 247805444, 243612282, 239902597, 236587421, 233270812, 229873128, 226783498, 224115371, 221799556, 219679248, 217821460, 216235830, 214823948, 213526737, 212364793, 211035471, 209723930, 208412185, 207078574, 205510322, 203888955]
3195B03888955j775773j938980j933834k175233k268412k174468k253660k319252
3187A87049343k020820j977932j830883j680095j551430j564335j483387j765820
3179A73174641j827781j944533k038262j957573k053166k154930k083180k134992
3171A56980224k135196k149602j992329j955472j800023j581151j404850j289378
3163A42672223j143352j061359r20412o37749o64871n03113l56050j08544M3076
3154A37319849J21695L33969N13916O91692Q00398J003846R39089R64934R92001
3145A43681389R65163P99987P78718N78283M54153K95964J0524Q5478L845l9620
3135A47613884l5466J22474o3011j08919Q0780q8519k77722l66736n76316m26220
$$ y = [203888955, 202113182, 200174202, 198240368, 196065135, 193796723, 191622255, 189368595, 187049343, 185028523, 183050591, 181219708, 179539613, 177988183, 176423848, 174940461, 173174641, 171346860, 169402327, 167364065, 165406492, 163353326, 161198396, 159115216, 156980224, 154845028, 152695426, 150703097, 148747625, 146947602, 145366451, 143961601, 142672223, 141528871, 140467512, 139547100, 138909351, 138244480, 137741367, 137385317, 137276773, 137319849, 137441544, 137775513, 138289429, 138981121, 139781519, 140785365, 141724454, 142689388, 143681389, 144646552, 145446539, 146225257, 146803540, 147257693, 147553657, 147564181, 147649659, 147653504, 147613884, 147578418, 147700892, 147637881, 147528962, 147609742, 147521223, 147243501, 146876765, 146300449, 145874229]
3125A45874229q03422j023235j048026j143103j276531j244783j219631j317892
3117A36797606j150796r87542q72108n63008o17499l06656k22727k45827p481
3108A31823962J26072J93034J92654J65246K19240K61262L17836M11893K70917
3099A33982116K37338J50897R0802l5515j61113l21539m54285m94044m77294p37297
3089A31780066q14236q52286q84989j016209j051526r94444r51589j015434q18559
3080A23380794p90466q63396p13443p79592r26604j115821j161316j404658j569706
3071A14055792j836226k038128k208621k323073k448243k464213k533925k487452
3063I5715911k248556k176127k133353j983990j994504j674835j509601j563465
$$ y = [145874229, 145070807, 144047572, 142999546, 141856443, 140579912, 139335129, 138115498, 136797606, 135646810, 134659268, 133787160, 133224152, 132606653, 132299997, 132077270, 131831443, 131823962, 131950034, 132143068, 132335722, 132500968, 132720208, 132981470, 133299306, 133711199, 133982116, 134219454, 134370351, 134461153, 134425638, 134264525, 133942986, 133488701, 132994657, 132517363, 131780066, 130965830, 130113544, 129228555, 128212346, 127160820, 126166376, 125214787, 124199353, 123380794, 122590328, 121726932, 121013489, 120233897, 119307293, 118191472, 117030156, 115625498, 114055792, 112219566, 110181438, 107972817, 105649744, 103201501, 100737288, 98203363, 95715911, 93467355, 91291228, 89157875, 87173885, 85179381, 83504546, 81994945, 80431480]
3055H0431480j452104j289149j281110j235908j209874j122099j148470j082549
3047G0610217j208134j178050r48702j069981j189453r73993j008430r81545r25880
3038F1126049j024286r27926q47387q32963p78759p20979o80469o26506o83365
3029E4003409n12360m34522m41137m06888k19273l78141j52248k44339k13694
3020E1000807j68318k21870k88516l16319k69755l97849l16732m31228l71468
3011D8218752l25132m28234l39557k75898k91614l43277l17465k06241k67089
3002D5424245j92550k50633j62719j01014j65970k40462k1176N0162p996k7731
2992D4304156l5506J9371J53031Q3699r6889J70844j4296K7046k0387L3894j9668
$$ y = [80431480, 78979376, 77690227, 76409117, 75173209, 73963335, 72841236, 71692766, 70610217, 69402083, 68224033, 67275331, 66205350, 65015897, 64041904, 63033474, 62051929, 61126049, 60101763, 59173837, 58326450, 57493487, 56714728, 55993749, 55313280, 54686774, 54003409, 53491049, 53056527, 52615390, 52208502, 51989229, 51611088, 51458840, 51214501, 51000807, 50832489, 50610619, 50322103, 50005784, 49736029, 49338180, 49021448, 48590220, 48218752, 47893620, 47465386, 47125829, 46849931, 46558317, 46215040, 45897575, 45691334, 45424245, 45231695, 44981062, 44818343, 44717329, 44551359, 44310897, 44289721, 44339883, 44331887, 44304156, 44268650, 44288021, 44441052, 44524751, 44427862, 44598706, 44584410, 44611456, 44591069, 44624963, 44605295]
2981D4605295K2294Q5922R8818J38416K61078O0754J73514K81146L63149L12279
2971D6402665J40278L03258K75133R8235J21680K27879K48776J70523L16913M30069
2961D8735409L08799M18767L51583M48949M97813M42664L63281L87391L50668
2952E2305324N24537M74103O13543O45718N76180O67645P52693Q94090R59390
2943E8413223J132371J108185J078835J206075J277171J344176J321274J425133
2935F8306443J656854J639182J617877J828784J958571J911731K050982K087279
2927H3057703K017259J986279J844539J703418J730586J422332J375216J269406
2919I6406738J253307J212755J409663J399170J507223J654884J926450K160448
$$ y = [44605295, 44627589, 44713511, 44812329, 44950745, 45211823, 45272577, 45446091, 45727237, 46090386, 46402665, 46542943, 46846201, 47121334, 47219569, 47341249, 47569128, 47817904, 47988427, 48305340, 48735409, 49044208, 49462975, 49814558, 50263507, 50761320, 51203984, 51567265, 51954656, 52305324, 52829861, 53303964, 53917507, 54563225, 55139405, 55807050, 56559743, 57453833, 58413223, 59545594, 60653779, 61732614, 62938689, 64215860, 65560036, 66881310, 68306443, 69963297, 71602479, 73220356, 75049140, 77007711, 78919442, 80970424, 83057703, 85074962, 87061241, 88905780, 90609198, 92339784, 93762116, 95137332, 96406738, 97660045, 98872800, 100282463, 101681633, 103188856, 104843740, 106770190, 108930638]
2911A08930638K223873K517631K877342L196765L445106L796474M164459M467063
2903A35619351M962518N379449N523115N780522N836260N677502N144038M267532
2895A78190287K924361J799576N99826k97580q28425r42348l91398N30311J372340
2886A82956950K440636L556222M625873N715137O759285P808408Q972178J0111385
2878B32946074J1258642J2495853J3676948J4719739J5633505J6046059J5671410
2871C32448230J4932780J3589364J1912372J0283657Q548402P092205N312138
2864D04119148L372839N02609l300507p553605j0737479j2552623j3256245j3106343
2856C47487794j2723165j2204315j1821344j1168424j0019646q463768o719016
$$ y = [108930638, 111154511, 113672142, 116549484, 119746249, 123191355, 126987829, 131152288, 135619351, 140581869, 145961318, 151484433, 157264955, 163101215, 168778717, 173922755, 178190287, 181114648, 182914224, 183514050, 183216470, 182388045, 181445697, 181054299, 181584610, 182956950, 185397586, 188953808, 193579681, 199294818, 206054103, 213862511, 222834689, 232946074, 244204716, 256700569, 270377517, 285097256, 300730761, 316776820, 332448230, 347381010, 360970374, 372882746, 383166403, 391714805, 398807010, 404119148, 407491987, 407994596, 404694089, 397140484, 386403005, 373850382, 360594137, 347487794, 334764629, 322560314, 310738970, 299570546, 289550900, 281087132, 274368116]
2849B74368116m992867k987811j334248j35122N31130L8221j930702n173111r168524
2840B49215082j2534293j4377721j4716817j3828119j2347395j0916349r553505
2833A60940883q234927p356886o484833n834341n263051m734166m241466l926888
2825A14864325l456704l086753k805916k524539k348056k207338j859348j634337
2817I4941334j718714j505785j140771j339497j167313j044247j039175q58265
2809H5127567q36077o04739l48409k56668j27278J50192K81476M04551M55962
2800H4246577N82024O38124N32328N42527M77230K53955k2605k66398o36471r95746
2790H5351545j313652j668469j973936k189950k213867k457106k344766k440699
$$ y = [274368116, 269375249, 266387438, 265053190, 264918068, 265449198, 265487419, 263556717, 258383606, 249215082, 236680789, 222303068, 207586251, 193758132, 181410737, 170494388, 160940883, 152705956, 145349070, 138864237, 133029896, 127766845, 123032679, 118791213, 114864325, 111407621, 108320868, 105514952, 102990413, 100642357, 98435019, 96575671, 94941334, 93222620, 91716835, 90576064, 89236567, 88069254, 87025007, 85985832, 85127567, 84291490, 83686751, 83338342, 83081674, 82954396, 83104588, 83386064, 83790615, 84246577, 84828601, 85466725, 85999053, 86541580, 87018810, 87272765, 87250160, 86983762, 86347291, 85351545, 84037893, 82369424, 80395488, 78205538, 75991671, 73534565, 71189799, 68749100]
2782F8749100k364254k253711k267172k158473k087821j974673j969059j826934
2774E1847003j698302j674096j549040j470520j313097j290079j255930j137259
2766D0458680j148034j095283j082555q66536r76552q64749p37161p69310o96786
2757C2221714o82342o50429o13490n37750m93996n25258n39704n94016n46494
2748B7038235n75447n28136o17882n05770m86203m97767m68316m91637m39221
2739B2427856l17537m41827m59593m86739l43133k92468l75833m24945m09726
2730A8876055l14609k66765l00879l33277l39444l19075j87040k80423l12201
2721A6222342k31652j85328k46032k66981k25832k53986k03948j96789j90516
$$ y = [68749100, 66384846, 64131135, 61863963, 59705490, 57617669, 55642996, 53673937, 51847003, 50148701, 48474605, 46925565, 45455045, 44141948, 42851869, 41595939, 40458680, 39310646, 38215363, 37132808, 36266272, 35289720, 34424971, 33687810, 32918500, 32221714, 31539372, 30888943, 30275453, 29737703, 29243707, 28718449, 28178745, 27584729, 27038235, 26462788, 25934652, 25316770, 24811000, 24324797, 23827030, 23358714, 22867077, 22427856, 22110319, 21668492, 21208899, 20722160, 20379027, 20086559, 19710726, 19285781, 18876055, 18561446, 18294681, 17993802, 17660525, 17321081, 17002006, 16814966, 16534543, 16222342, 15990690, 15805362, 15559330, 15292349, 15066517, 14812531, 14608583, 14411794, 14221278]
2712A4221278k56128k12273j61756j98537j85958j28881j57444j97533j79979
2703A2542789k24646R285j58769j37983L7866k79028j17713q6426q7498r1974
2693A1405903p3092j49998j77686p1819r0348l3255j92051k05069j05102q1429
2683A0226054p5065j55178j19710j29934p4245l2738j54633j79966j33630p8420
2673I092535n349k6460q1747k32217j40869o7814n6173m1711r4561k3615j13562
2662H208457m3409j07182J7515m4554q6158j25594p2805p6981j08565l9966o494
2651G514264n1333j8037r1743K317m8833L6872r354K3658q3048R552m961l6763
2639G242591m1769r7964j4589k1298j0069j5636j11j26200J6378N399P0796j4852
$$ y = [14221278, 13965150, 13752877, 13591121, 13392584, 13206626, 13077745, 12920301, 12722768, 12542789, 12318143, 12327428, 12168659, 12030676, 12068542, 11789514, 11671801, 11585375, 11497877, 11405903, 11332811, 11182813, 11005127, 10933308, 10842960, 10809705, 10617654, 10412585, 10307483, 10226054, 10150989, 9995811, 9876101, 9746167, 9671922, 9639184, 9484551, 9304585, 9170955, 9092535, 9087186, 9060726, 8978979, 8746762, 8605893, 8538079, 8481906, 8440195, 8345634, 8322019, 8208457, 8165048, 8057866, 8075381, 8030827, 7944669, 7819075, 7746270, 7669289, 7560724, 7520758, 7514264, 7462931, 7444894, 7353151, 7355468, 7306635, 7343507, 7334153, 7357811, 7274763, 7284315, 7279354, 7242591, 7200822, 7102858, 7088269, 7066971, 7056902, 7041266, 7041155, 6914955, 6931333, 6936732, 7007528, 6992676]
2627F992676r2246J32245J1365M1181j3943N1536M5324Q7618k8581J56165N5587
2616G438927N9177J48498Q0387Q8926P2491J31291K8041K0942J7580J18043J5387
2605H219690K7918o9662j4264Q7753j8719m5958J46471l6604q4926m3134p9010
2594H089555J7237J07023J63833J40383N866j0473J36191N0090J3206Q120n4028
2583H667003M6380j10625J493j17115j12571o0551j49544j77612k16674k04324
2573G565860j35362k05418k46377k06802p0279j9515j18639j39163m1985j1698
2563F370622j06192J0000l207q7631o6199j35590j12686l5601q8682k19576j07862
2552E417396j31759n9251j1961j16211q9295j88558r0663k8798K4860j7808j35168
$$ y = [6992676, 6900430, 7032675, 7044040, 7085221, 7071278, 7122814, 7168138, 7255756, 7227175, 7383340, 7438927, 7498104, 7646602, 7726989, 7815915, 7888406, 8019697, 8047738, 8068680, 8086260, 8204303, 8219690, 8247608, 8177946, 8163682, 8251435, 8232716, 8186758, 8333229, 8296625, 8211699, 8168565, 8089555, 8106792, 8213815, 8377648, 8518031, 8523897, 8513424, 8649615, 8699705, 8712911, 8721031, 8667003, 8713383, 8602758, 8604251, 8487136, 8374565, 8314014, 8164470, 7986858, 7770184, 7565860, 7430498, 7225080, 6978703, 6771901, 6701622, 6682107, 6563468, 6424305, 6382320, 6370622, 6264430, 6274430, 6271223, 6183592, 6117393, 5981803, 5869117, 5833516, 5744834, 5525258, 5417396, 5285637, 5226386, 5214425, 5098214, 5008919, 4820361, 4729698, 4700900, 4725760, 4707952, 4572784]
2541D572784P9947o5452j27314m7826j57249m2740j37732j78544j2538j9595q3389
2530C780352j18233J649j5486j09628m817k250M2252N9008j9103r4629j36261
2519C382854j7291N9680n2075k2819o5903j56618j16096L9021J01294k4091j19874
2508C008082K5252M3926j36405p553k8273J9306k1783q2105j7582n9245r1225
2497B652395J0890p4357j13219K6644l3148q1052n067j5212L7573n3185j12272
2486B239990P9467n3964l1315n7884J3216K4903q4979l4951n8869Q28K1708j6950
2474B041200m6523J2798K2087m0016j03340M8736L4009J3804k6553L4477K6513
2463B017192j27098K6016L9228j19447j02337k9963o502N6837p0850n5606J7308
$$ y = [4572784, 4652731, 4587279, 4459965, 4412139, 4254890, 4212150, 4074418, 3895874, 3883336, 3863741, 3780352, 3662119, 3663768, 3648282, 3538654, 3533837, 3531587, 3573839, 3632847, 3613744, 3519115, 3382854, 3365563, 3425243, 3373168, 3350349, 3284446, 3127828, 3011732, 3050753, 3152047, 3127956, 3008082, 3033334, 3077260, 2940855, 2933302, 2905029, 2924335, 2902552, 2820447, 2802865, 2743620, 2652395, 2663285, 2588928, 2475709, 2502353, 2469205, 2388153, 2383086, 2367874, 2405447, 2352262, 2239990, 2319457, 2265493, 2234178, 2176294, 2189510, 2214413, 2129434, 2094483, 2035614, 2036442, 2058150, 2041200, 1994677, 2007475, 2029562, 1989546, 1886206, 1934942, 1968951, 1982755, 1956202, 1990679, 2017192, 1890094, 1916110, 1955338, 1835891, 1733554, 1703591, 1697089, 1753926, 1683076, 1627470, 1644778]
2452A644778K5985M3169j22910M816q5656R702L1498k7374M5767j05543K9188
2441A493420j24352l5759K4744L761O7049j02039o8487J9562l9593L4769L1780
2430A304855r8055k6280m681j5516O7344L6775j05936L4713O6005K627j24391
2419A137460m0018j6553n79J20396j02405n5649p8903l2001R2185Q8107j11272
2408A000768o3377j5543R4461p967r535M273M562j55322O0639O8909n611J6257
2396I92514M8071r7369J1490k4564L332Q858m6006j0688j15475L9269j27067N3548
2384G35913N8732L2284o9471K6309j23381L2741M5718P030q5653l0786J71004
2373H00440R914N2983q3396K6357m6740l0636P9190J8688k4167L8630N3375m8365
$$ y = [1644778, 1670763, 1713932, 1591022, 1595838, 1510182, 1519884, 1551382, 1524008, 1569775, 1464232, 1493420, 1369068, 1333309, 1358053, 1361814, 1428863, 1326824, 1258337, 1277899, 1238306, 1273075, 1304855, 1206800, 1180520, 1175839, 1160323, 1227667, 1264442, 1158506, 1193219, 1259224, 1261851, 1137460, 1097442, 1080889, 1080310, 1200706, 1098301, 1042652, 963749, 931748, 1023933, 1112040, 1000768, 937391, 921848, 1016309, 1008342, 998807, 1003080, 1007642, 852320, 912959, 981868, 976257, 992514, 1040585, 943216, 954706, 930142, 933474, 942332, 896326, 885638, 770163, 809432, 682365, 735913, 794645, 826929, 757458, 783767, 660386, 693127, 738845, 745875, 660222, 629436, 800440, 810354, 863337, 779941, 806298, 759558, 728922, 808112, 826800, 802633, 841263, 894638, 846273]
2361H46273n4291N1820k2464p2999r5303K465l3755N513o8192O1611q9232n5592
2349D75854J28749o6308L2034k0904o5729l0834Q4001K5388j4892L4656L2074
2338F14089K9363K2543k3761m7222p3121l7155k9051j1824m7439Q4379L3370j0745
2326E03426Q8884j07314K6541n5841j26089Q5837j2922j6380L4257J5445J3309
2315D49153m4516r4967O3250J07927p1953o2800J03997n8986N9680N810K6478
2304D83073j02716L0014M2301j00416m8317l4131K1563R4716J0701q540j59359
2293B28889J56253p985j8145N1713j874l8958l7033J31805J8375K821j19466m2649
2281C23746K9841j06504R837K9486R854O5757j33975Q2401l1678m7034k4935R3260
$$ y = [846273, 791982, 843802, 821338, 748339, 653036, 655501, 621746, 627259, 559067, 620678, 531446, 475854, 604603, 538295, 570329, 549425, 483696, 452862, 536863, 562251, 547359, 582015, 614089, 643452, 665995, 642234, 595012, 521891, 484736, 455685, 443861, 396422, 480801, 514171, 503426, 592310, 484996, 511537, 455696, 329607, 415444, 402522, 386142, 420399, 435844, 449153, 404637, 309670, 372920, 480847, 408894, 346094, 450091, 391105, 450785, 456595, 483073, 380357, 410371, 452672, 352256, 303939, 269808, 291371, 386087, 396788, 388248, 228889, 385142, 377157, 359012, 410725, 408851, 369893, 332860, 464665, 483040, 485861, 366395, 323746, 353587, 247083, 256920, 286406, 296260, 362017, 228042, 310443, 278765, 231731, 206796, 300056]
2269C00056J23291l8096m8099o4868J10683l9252k8779o5690j5054N1693L1293
2258C17178j3919K8761M1551L5341j6276n2801j881j59550L4974J22872n1905
2247B84345O084J366O5402m267j09512O4206M113k4209j17914P8627Q7899J37885
2235D74025q9480n961M87m843K1340n3650N9438k6777K3582l7023m6543p982P0984
2222C77597O3718j27994p380L7032P0542Q835L5985o8402p905M4647P4068k9769
2210D70974j60389L1022P7160J9443J7382j05801j10933P5169J13310O915m6830
2199C87422m5187K8551N8484P7148j4661K6639o2189r6986k1393M3887O4212p0152
2187C75775Q1618n2171O2710J02863r2325j4617J18043J4596n1624o556l9289
$$ y = [300056, 423347, 385251, 337152, 272284, 382967, 343715, 314936, 249246, 234192, 285885, 317178, 303259, 332020, 373571, 408912, 392636, 339835, 337954, 178404, 213378, 336250, 284345, 290429, 291795, 357197, 352930, 243418, 307624, 311737, 287528, 169614, 248241, 336140, 474025, 384545, 378584, 379071, 374228, 395568, 341918, 401356, 374579, 398161, 361138, 314595, 306613, 377597, 441315, 313321, 305941, 342973, 413515, 422350, 458335, 389933, 382028, 426675, 500743, 470974, 310585, 341607, 418767, 438210, 455592, 349791, 238858, 314027, 427337, 434252, 387422, 342235, 370786, 429270, 506418, 491757, 518396, 456207, 359221, 337828, 381715, 445927, 375775, 457393, 405222, 467932, 570795, 478470, 463853, 581896, 596492, 544868, 538312, 499023]
2176D99023P190P0527J9100K4888j1586K9988Q9005M325j8791R2908L1895J2772
2164H51244K6731M9333j6535m9819l658K9983J56791o7030R8458K9321K4408j1613
2152A117614J6817O7953r8365M1852L8513J11753O8051m1045j04110J48289Q3306
2141A450628K88l7436K8200J68541J01949J04133O5387N0972j7852M1226P3677
2130B029713J88384K37643M5633P4251N6788K21376K12493R0797K07948K03043
2120C568069J38869J88700J58673K56647K28687L52419M28934M51574N53677N63062
2110F889311M60282M68815O89042O64914R43723J263908J569875K052417K548640
2101A7550927L265344L962587M997859N398304M077440L216049k020879o725216
$$ y = [499023, 506213, 576740, 595840, 620728, 609142, 639130, 728135, 732460, 713669, 806577, 838472, 851244, 877975, 927308, 910773, 860954, 857296, 887279, 1044070, 977040, 1075498, 1104819, 1129227, 1117614, 1134431, 1202384, 1104019, 1145871, 1184384, 1296137, 1364188, 1323143, 1219033, 1367322, 1450628, 1450916, 1413480, 1441680, 1610221, 1712170, 1816303, 1881690, 1932662, 1914810, 1956036, 2029713, 2218097, 2455740, 2501373, 2575624, 2632412, 2853788, 3066281, 3157078, 3365026, 3568069, 3706938, 3895638, 4054311, 4310958, 4539645, 4892064, 5320998, 5772572, 6326249, 6889311, 7349593, 7818408, 8507450, 9172364, 10116087, 11379995, 12949870, 15002287, 17550927, 20816271, 24778858, 29776717, 35175021, 39252461, 42468510, 40447631, 33722415]
2093C3722415o321026n488967m200704k963224k105071j646270j235122j030038
2085H731993q13167n30751l13477l56415m67278m44754l42674o01328l51399k26580
2075D284170k67955l46547k16661n0852j17173k13662j80609k07468o7518q0431
2065B535294j09015p0737j65353j41261p4195j68197j34743K1347j6250j55346
2055A521544j57783P329K7582J9051m6565p4426K0444Q6318q5174j09805k5586
2044A182929m9427p6016J5371O8757j88271q4727O3340L1599r2538k0811K601
2033H52807j01781j6502k4996l0854N046L9753n6108m6820K8612N2920n7289l2747
2021F12041p9043J24118m4151j20947Q4270j1137q4578r944j8559N9832P36j1199
$$ y = [33722415, 27401389, 21912422, 17711718, 14748494, 12643423, 10997153, 9762031, 8731993, 7918826, 7388075, 7074598, 6718183, 6250905, 5806151, 5463477, 4862149, 4510750, 4284170, 4016215, 3669668, 3453007, 3402155, 3284982, 3071320, 2890711, 2683243, 2615725, 2535294, 2426279, 2355542, 2190189, 2048928, 1974733, 1806536, 1671793, 1693140, 1676890, 1521544, 1363761, 1371090, 1398672, 1417723, 1371158, 1296732, 1317176, 1403494, 1318320, 1208515, 1182929, 1133502, 1057486, 1072857, 1141614, 953343, 868616, 931956, 963555, 871017, 850206, 852807, 751026, 734524, 709528, 678674, 683720, 723473, 667365, 620545, 649157, 702077, 644788, 612041, 532998, 657116, 612965, 492018, 576288, 565151, 480573, 470629, 452070, 511902, 512638, 501439]
2009E01439n7239L6793j4841r3427J1580p5646K5631L3668J0061k9746K3894L376
1997C75543k5828m5408L4607L2707l4564k4392j24872J32070O0842l0503L4409
1986C84611k9733m0246n7848j05563j0543R439j6441K1836L7889K2218J2664N9164
1974B87447r0359q4562k5690R5149J9574o1382r0495k0749O6578K7138J4813l9239
1962I8223J4310M5239q0787l5915j3623L3572k4963M9962q334Q9248k1624m6965
1950I8343p2106R8930J45460j10012M088p6238k2204k9380L8093K1314J11762
1939B08050m2389o7535M0258l7507n1344k4844k3632R381L3436Q6406m3906m9420
1927C6954K9678L8933Q856N0855p2308n8096P816l3742N9534J0304N3569n9359
$$ y = [501439, 444200, 480993, 466152, 372725, 384305, 308659, 334290, 367958, 378019, 348273, 372167, 375543, 349715, 304307, 338914, 371621, 337057, 312665, 187793, 319863, 380705, 350202, 384611, 354878, 314632, 256784, 151221, 140678, 150117, 133676, 155512, 193401, 215619, 228283, 287447, 197088, 112526, 86836, 181985, 201559, 140177, 49682, 28933, 95511, 122649, 137462, 98223, 112533, 157772, 76985, 41070, 27447, 61019, 36056, 86018, 77684, 166932, 145308, 98343, 26237, 125167, 270627, 160615, 164703, 88465, 66261, 36881, 74974, 96288, 208050, 165661, 98126, 138384, 100877, 49533, 24689, 1057, 10438, 43874, 130280, 86374, 36954, 66632, 105565, 114421, 165276, 92968, 34872, 42688, 8946, 68480, 78784, 132353, 72994]
1915G2994O0666M2847k0300M9334j43587L9927l334j21231m9019J31367K5241
1904H4905o6107M0529L5276J1064j3026n8185K4548K1642l0631o0515O8993k3688
1892C4805J464K7910k8486m9259p5178J09144J52211j1178j52782o6230j03183
1881a60762O6893O8292L8846K0013n4193O5705k8171K6579m0619J5613l2107J19173
1869A05262m0629j30708J9377k9579P3579O0986k7087p2060K0951p2797M7110
1858d5595O5657o058M3716p4886o8824M5311K5146N4540m0138K9107j70958J15428
1846b7554J46292p2136m4347N2184R0824L0812j31282l6412l522K6854n0Q098
1834C9761p3784O621O6092M9956K3626J6615J07240j6368j4072m9055m2629J2739
$$ y = [72994, 133660, 176507, 156207, 205541, 61954, 101881, 98547, -22684, -71703, 59664, 84905, 18798, 59327, 94603, 105667, 92641, 34456, 59004, 80646, 50015, -10500, 58493, 34805, 36269, 64179, 35693, -13566, -88744, 20400, 172611, 161433, 8651, -57579, -160762, -93869, -25577, 13269, 33282, -20911, 44794, 16623, 43202, 2583, 18196, -13911, 105262, 64633, -66075, -46698, -76277, -2698, 58288, 31201, -40859, -19908, -92705, -45595, 20062, 14004, 57720, -17166, -85990, -40679, -15533, 39007, -1131, 27976, -142982, -27554, 118738, 46602, 2255, 54439, 145263, 176075, 44793, 8381, 4859, 31713, 31663, 39761, -34023, -27402, 38690, 88646, 112272, 128887, 236127, 219759, 205687, 156632, 114003, 126742]
1822A26742j2411K310k9756N6428l5071r2132o0566L4560k4817N351R334l93m6414
1809f6835o5271M6093R1812o0949P4633l1513p5653Q7072J5267p5053l4814K864
1797i2347p6097L9123N364K2364m8225K2515M9741M5165p2369J1859L5587n5975
1785a13295M6098M3688j11568k520R9685l987j3666o850j06053M2624N0120O5595
1773a0129j4523J2961j5449n3687M9767O2440N690q2998K7172k8089o4033J8846
1761i2032N5675M8338m3227n0487K2537P7100o0474l15J0532j5597L0322M3585
1749B5957m5018j0818o9099l605N0044L7091J1495j3118Q7433p8187k7186l8886
1737g3897N8044M4125j79279o5315k4612J14956M3353R508p1191n5108N4069O5381
$$ y = [126742, 114331, 116641, 86885, 143313, 108242, 16110, -44456, -9896, -34713, -29362, -20028, -20421, -66835, -132106, -86013, 5799, -55150, 19483, -12030, -87683, -611, 14656, -60397, -95211, -92347, -168444, -129321, -123957, -101593, -149818, -127303, -77562, -32397, -104766, -92907, -57320, -113295, -67197, -23509, -135077, -137597, -37912, -41899, -55565, -62415, -168468, -125844, -75724, -10129, -24652, -11691, -27140, -80827, -31060, 31380, 37070, -45928, -18756, -46845, -110878, -92032, -36357, 11981, -31246, -81733, -59196, 17904, -42570, -42885, -32353, -47950, -17628, 25957, -19061, -29879, -98978, -102583, -52539, -15448, -3953, -17071, 70362, -7825, -35011, -73897, -15853, 28272, -151007, -216322, -240934, -125978, -82625, -73117, -144308, -199416, -145347, -79966]
1725g9966J3344n811K8955J6939p0656J4519Q232K488P0430J5286n1511R618n46
1712b8679j01017J20725m3516l1030M8370K2781M3403L69n0431p0729J32885P7001
1700A20132o4267n3769o4433n9989K12190J6394J679j30863n8280m8046j2516
1689a41768j6575k8888J34508l6452J1452J9487J07697M2908k7707R4895j03640
1678E5917j12554N5472p0894j4799K1310Q9785L2498n7318o3773L4088J5422K3712
1666H866m9952m7398m5989o342L3348M3559k5293m4395o1571l6876N9030J30063
1654d2950O8252l5826k683q8971K4380L626M0790j16488J7536J10411n2260m463
1642g8646j10191L7279p613N0244n5399R6180P8882R0779j66447P966L1309p6669
$$ y = [-79966, -66622, -72433, -43478, -26539, -97195, -82676, -74444, -71956, -1526, 13760, -37751, -28133, -28679, -129696, -8971, -52487, -83517, -35147, -12366, 31037, 31406, -19025, -89754, 43131, 120132, 55865, 2096, -62337, -122326, 89864, 106258, 107937, -22926, -81206, -129252, -141768, -158343, -187231, -52723, -89175, -77723, -58236, 49461, 92369, 64662, 159557, 55917, -56637, -1165, -72059, -86858, -65548, 24237, 56735, -583, -64356, -30268, -14846, 8866, -41086, -88484, -134473, -140815, -107467, -63908, -89201, -133596, -195167, -232043, -173013, -42950, 25302, -10524, -13207, -102178, -77798, -74172, -33382, -149870, -132334, -21923, -74183, -78646, -188837, -151558, -159171, -108927, -164326, -68146, 10736, 101515, -64932, -56966, -25657, -102326]
1630a02326k77L7133l5729k9823k3019j3912P494K5241J04693k4937N0689m0670
1618d5443p249K8328P195l1923J9622P322j0453l6251n8289R343L4347M8421n2316
1605h7346j5568J5802J06053P024q9445N1111l9815P7032o973l1305J9430l1371
1593b5371p5028R1781J2426p9109l2820j1298O068K4056O3090l3057M5012o5997
1581h0247m1472R6577Q0647r9172n4340J9548M5709l4909m1866L4149n2961O7695
1569f0642L532K9761K9776Q338M3592J2594N2816j55256j0570O7316J5074j45552
1557a09221k3293J21379q9125n8132J18978R4255Q3791m8037k39159p8058P0530
1546a56092J45351L3533o2982K1929k1294M5745N289k5267N9928p7237j776m3835
$$ y = [-102326, -102603, -65470, -101199, -131022, -154041, -167953, -160459, -135218, -30525, -55462, -4773, -45443, -52692, -24364, -17169, -49092, -29470, -22148, -32601, -68852, -127141, -117798, -83451, -35030, -87346, -102914, -87112, 18941, 25965, -63480, -12369, -52184, 24848, 17875, -13430, 6000, -25371, -100399, -8618, 3808, -75301, -108121, -119419, -113351, -89295, -26205, -59262, -14250, -80247, -121719, -25142, 55505, -43667, -98007, -78459, -32750, -67659, -109525, -75376, -128337, -60642, -57110, -27349, 2427, 10765, 54357, 66951, 119767, -35489, -46059, 21257, 36331, -109221, -132514, -11135, -100260, -158392, -39414, 54841, 138632, 90595, -148564, -226622, -156092, -10741, 22792, -40190, -18261, -39555, 6190, 11479, -13788, 46140, -31097, -32873, -76708]
1534g6708q856l3080J1066m147N5731K7633R7674o1068l3796r340M087L8482J2514
1521B0192n8964K573p571Q306o7611J073j9380Q7257q0339Q3769R9446r3271j43110
1508a67630P5102o041p8300L0593k9388L5395p6326J09275L3367m8401m0097M3823
1496a18628l8926P5104k7181N1576q0443j1342N0636J2030N7127n1762j3421K6139
1484f9091K1988N5960q067k8242P6355L3451K8795m2478q3924M528k1375l4094
1472f6194L0628k6328o882J5652l864K1410k6523j19685J00242J03440o2519p5583
1460a16206p4512P3413o9425Q5229O8069J8435m2264q123j2010r0888l014L8673
1448a32623n7305N1585k8471L5084j9895L2071K8522m0055Q4095n648J5236q4999
$$ y = [-76708, -85564, -118644, -107578, -111725, -55994, -28361, 69313, 8245, -25551, -34891, -30804, 7678, 20192, -38772, -36199, -43770, -35464, -103075, -102002, -121382, -34125, -114464, -30695, 68751, -24520, -167630, -92528, -98569, -176869, -146276, -175664, -140269, -216595, -107320, -73953, -122354, -162451, -118628, -157554, -82450, -109631, -58055, -138498, -149840, -99204, -87174, -30047, -81809, -95230, -69091, -47103, 8857, 790, -27452, 48903, 82354, 111149, 68671, -15253, -10725, -32100, -66194, -35566, -61894, -68776, -53124, -56988, -35578, -62101, -181786, -81544, 21896, -40623, -116206, -190718, -117305, -186730, -101501, -33432, -14997, -57261, -65384, -77394, -168282, -171296, -132623, -189928, -138343, -166814, -131730, -151625, -119554, -91032, -131087, -46992, -52640, -37404, -122403]
1436a22403M35L4401n4955j6357J8824L7839N1161j6519J37303N154p4528p3078
1424g2723q0829l7417l2978Q0977P1373K2066p6431n903N8166p9728J2797j0594
1412a51224Q8306n590l9532J8482k4382J04352p8780L4143J4678r0519j7688O5302
1400h2452J6477l4847J7776r365M7520p179j0480L6108k4625j4968m1022M3364
1388f3693n360J4524R647k134k0092k6345O294j32395J38016P6733m8508N231
1376d8082k0128o8048J8889k2901K7428K8839O1533l7289m4013P6824L4732K4908
1364C2692K1533m3531o4572K4440M4854R07n5315L412M6796O7919q1422n981R3550
1351H5282J6788n6822j37359j26167P1548J67184k6684p2923K456l6466J01883
$$ y = [-122403, -121968, -87567, -142522, -158879, -140055, -102216, -51055, -67574, 69729, 74883, 355, -72723, -153552, -190969, -223947, -142970, -71597, -49531, -125962, -131865, -73699, -153427, -140630, -151224, -62918, -68508, -108040, -89558, -113940, -9588, -88368, -54225, -39547, -130066, -147754, -82452, -65975, -100822, -83046, -92411, -44891, -52070, -62550, -26442, -51067, -66035, -107057, -63693, -69053, -54529, -44882, -47016, -67108, -93453, -87159, -219554, -81538, -4805, -53313, -48082, -68210, -136258, -117369, -140270, -112842, -84003, -22470, -59759, -103772, -26948, 7784, 32692, 54225, 10694, -53878, -29438, 15416, 16323, -38992, -35580, 11216, 79135, -2287, -8268, 85282, 102070, 45248, -92111, -218278, -146730, 20454, -6230, -79153, -76697, -113163, -11280]
1340a1280l7089q8173Q297K72R1666L6592n7563N4265q465k9792M4305l854l8543
1327c9362N7855k927q8152Q651O4978j9012p136p4621R7240K3275m0410l8506
1315e8127k0397j6630P5429O3425q3316n730r10J14486q8655o3357l9211l9818
1303a62811K0520O8091J4222q6477N4472N0159q879l5690K122N0682k2838O7901
1291A1474m9749k7754R1946j4602n8169k9415m2765j2794j2128M3590P0402o9977
1279i9941J3764K1244n454K6557q957k4609M3744M085k6478J26875j49628k1702
1267a00500j2228K4489J32994k5038j15678p8550L3381J74767p2776j6099J33448
1256G8210m6211L7916k3078o7855j26817L5911N3027L2538J18270n9746j0158
$$ y = [-11280, -48369, -136542, -128245, -127973, -36307, 285, -57278, -3013, -11478, -41270, 3035, -819, -39362, 18493, 15566, -72586, -63935, 1043, -17969, -25105, -99726, -2486, 20789, -19621, -58127, -78524, -95154, -19725, 43700, -39616, -45346, -46256, 68230, -20425, -83782, -122993, -162811, -142291, -74200, -59978, -146455, -91983, -41824, -50703, -86393, -84271, -33589, -56427, 11474, -38275, -66029, 25917, 11315, -46854, -76269, -119034, -131828, -143956, -100366, -29964, -99941, -86177, -64933, -70387, -43830, -52787, -77396, -33652, -29567, -56045, 70830, -78798, -100500, -112728, -88239, 44755, 19717, -95961, -174511, -141130, 33637, -39139, -55238, 78210, 31999, 69915, 46837, -21018, -147835, -111924, -58897, -26359, 91911, 32165, 22007]
1245B2007r1648l9266O9651l0045J2676L7937k7552O7934P5527j04469n9340K2936
1233d3652o2535K3509N4845L2876q4028o1899K7710M030J10807L7821k9562o6283
1221e6361M371Q6728N15l9842j8377n4934N5572L6862j37292m8918J7570J8731
1209a35375j4558J29178O4975j25825L1761P2677j01384o9280M0632J13195m0179
1198c4183m1509N0914m0797M3351o2805m5816N2410N0004q850l6473J2767n0500
1186a11487p3305J05424P5827n481q0011p0905j6739K4483j7374L8732J13271
1175a7565m8543m1192J00640K7538M3464j45808J4688J4359n8503M1110M6463
1164b3349j1659M12N069j6068n9002k9024J08649Q9907p3344P007K6687p5035
$$ y = [22007, -69641, -108907, -39256, -69301, -56625, -18688, -46240, 21694, 97221, -7248, -66588, -43652, -106187, -82678, -27833, 5043, -78985, -140884, -113174, -109144, 1663, 39484, 9922, -56361, -51990, 34738, 35253, -4589, -22966, -77900, -22328, 14534, -122758, -171676, -154106, -135375, -149933, -20755, 44220, -81605, -49844, 22833, -78551, -147831, -107199, 5996, -34183, -75692, -24778, -65575, -22224, -85029, -130845, -78435, -28431, -37281, -73754, -60987, -111487, -184792, -79368, -3541, -9022, -89033, -159938, -176677, -152194, -169568, -130836, -17565, -66108, -107300, -6660, 20878, 64342, -81466, -66778, -52419, -110922, -69812, -23349, -35008, -34596, -29527, -45595, -104597, -133621, -24972, 64935, -8409, -1402, 25285, -49750]
1152d9750O6985j6916j6345q537l4962J4476j0618q807L8861R2116m7836O3209
1140H1876o3024q6645j3274K3000Q702P8141J798r023k9642k9723Q3126j43079
1128i7767k3182K1436Q0694Q1202Q3371n3895o2184l9501J4814L662o1519R000
1116d3869m2840k6838J3863o7996j4623J11263P755o2859P6184j2599o9894N2844
1104g9609q992J1336K6460M3685o9633l7862K1739R5164Q1890j15814K4594n5699
1092f2741P05J8363L7000p4850q1916Q1486P8231K4419k9559Q926L041L3677K768
1079C9550q9067M0127m97M1951l8393k3235J06816j0265j21995n0642O6074R4646
1067E5070P395j4822r45p7063O5400J0160j4072J2203n2662j2244J8020J3098
$$ y = [-49750, 17235, 319, -16026, -24563, -59525, -45049, -55667, -64474, -25613, 66503, 18667, 81876, 18852, -67793, -81067, -58067, -49365, 28776, 30574, 21551, -8091, -37814, 45312, -97767, -120949, -99513, -18819, 62383, 145754, 91859, 29675, -9826, 4988, 8650, -52869, -43869, -86709, -113547, -99684, -167680, -182303, -71040, -63285, -126144, -49960, -62559, -132453, -79609, -88601, -77265, -50805, -7120, -76753, -114615, -92876, 2288, 84178, -31636, -7042, -62741, -62036, -43673, -6673, -81523, -163439, -81953, -3722, 20697, -8862, 64, 3105, 36782, 39550, -49517, -9390, -9887, 32064, -6329, -29564, 77252, 66987, -55008, -105650, -39576, 55070, 62465, 47643, 46698, -30365, 35035, 45195, 31123, 43326, -9336, -21580, -3560, 9538]
1055I538n0513L7099J5769K1268R4643j42035Q3850j8783r160Q7570l6087l2620
1043F0539j04985J31976k5929j57390K2975K5408m6428Q3309N5452J7086j08524
1032d6511M3781P058k2247J476p7006P4133J38766n8287o8404O7628m1179p336
1020A1872j0442M1746L6506k0828j04265J4860L4082M2629j1068l5856m2281l552
1008d6597L4951q1472r22m0802O9213J34299j4366l6507n7868m6895J49648J0311
996G2993n5462k2847k3149J00084r3831P0188j6418j29025J02551M8035P662j45216
984h4435j3105P010R4627l253l7431n5927m2787O2089P4871k011P6059q910k9586
971C7211L7895r5199l8861K8976P6181K3325j6209j11331J01001O4967J598j00663
$$ y = [9538, -40975, -3876, 11893, 33161, 127804, -14231, 69619, 50836, 41676, 129246, 93159, 60539, -44446, 87530, 61601, -95789, -72814, -47406, -93834, -10525, 44927, 62013, -46511, -2730, 4328, -17919, -16443, -93449, -19316, 119450, 61163, -7241, 60387, 19208, 11872, 1430, 43176, 79682, 58854, -45411, -30551, 3531, 46160, 35092, -764, -43045, -46597, -11646, -93118, -94040, -134842, -65629, 68670, 54304, 17797, -40071, -86966, 62682, 72993, 17531, -5316, -28465, 71619, -22212, 47976, 31558, -97467, 5084, 53119, 60781, -84435, -97540, -90530, 4097, 844, -36587, -92514, -135301, -73212, 1659, -352, 75707, 66797, 37211, 75106, -20093, -58954, -29978, 46203, 69528, 53319, -58012, 42989, 107956, 109554, 8891]
959H891l1630R2676J2363m8046p649N6926o9791k4167n4163J4886N9141j5131
947e694J038j02286J30530r3904l9158O183P1254n6994M1698L2193K8696k0790
935g234m4432O1558q017O7524Q404k6818o1528q3155O3844O2478k63m0903j00737
922a09279l8706R2828r7524M9586J32945o9547O2600K9003m7445J05120m4175
911F5406n0400l2858j03647J47575j2980K2033l2651M6022m8612N0458J9249l7911
899C1684k9945P5330P7453j10668l0075L0548p4411o6596j9743J10201q105k1943
887c6270M5406j15016J54966J7073j13183Q6187o7758k9578M9955n4293R5771
876C3260p961n084m4513L151J7773j7258N9607j1974k5562j3393P0848r7048o546
$$ y = [8891, -22739, 69937, 82300, 34254, 26605, 83531, 13740, -10427, -64590, -49704, 9437, -5694, -4656, -106942, 23588, -70316, -109474, -103291, -32037, -89031, -47333, -15140, 13556, -7234, -51666, 9892, 1875, 69399, 77803, 50985, -10543, -93698, -29854, 32624, 32361, -8542, -109279, -147985, -55157, -152681, -103095, 29850, -39697, 22903, 51906, 4461, 109581, 65406, 15006, -17852, -121499, 26076, 13096, 35129, 2478, 48500, -112, 50346, 69595, 31684, 1739, 77069, 154522, 43854, 13779, 44327, -30084, -96680, -116423, -6222, -14327, -36270, 9136, -105880, 49086, 66159, -47024, 39163, -28595, -58173, -8218, -62511, 33260, 25299, 20215, -24298, -21147, -3374, -20632, 38975, 27001, 1439, -11954, 58894, -38154, -44700]
863d4700K4183Q7757J234J9041o0245j5071L1168j19789R0320L7420L4009O5283
851A50610j00849j06766K5041K8687K4445l6244j3562L9275K119L7642n0690P8688
839G8396j7864q1914j4969n8158Q5415P0533q6099J8361n5460k5983J00182L1836
827D4276R42m6643M5938K1955P1314p4325N5971k7204q3582l2708J8061l0517
815c6522N583P281k0361K1959k970O8863j4224r033L0257L2402o4471j3442J9810
802B5132Q5841L2292j12368o1069K1504k146K2575k954M2195N841l2601K4326
790D8568J3551n6902m9918P2118J4512p3547J7466o23J237L7635Q3906p3811n7353
777b3161Q136J26037L5208o3136n2920R1080m8386n4525P6234l7844J1478N1218
$$ y = [-44700, -20517, 67240, 68474, 87515, 27270, 12199, 43367, -76422, 13898, 51318, 85327, 150610, 49761, -57005, -31964, -3277, 21168, -15076, -28638, 10637, 12756, 50398, -292, 78396, 60532, -21382, -36351, -94509, -9094, 61439, -24660, -6299, -61759, -87742, 12440, 44276, 45218, -1425, 44513, 66468, 137782, 63457, 119428, 92224, 8642, -24066, -6005, -36522, -30939, -23658, -44019, -22060, -25030, 43833, 29609, 20576, 50833, 83235, 18764, 5322, 25132, 110973, 143265, 30897, -30172, -8668, -10814, 11761, 8807, 51002, 56843, 24242, 48568, 62119, 5217, -44701, 27417, 41929, -31618, -14152, -14775, -13538, 24097, 108003, 34192, -23161, -15025, 111012, 146220, 83084, 30164, 121244, 72858, 18333, 94567, 56723, 68201, 119419]
765A19419n2580K9248j7240J1108l084j10070M4839N4973r954o646l7599m4694
753b2280J60827N7434q4882q0963N7195j2925n9413P8681o5763p1743K028n7502
741i9306N6242M6956Q4456m7038l2634J392J239o3103L9686l880O1086L2217K9893
728A07206K6383k7260j19725j7809J16486o6100q0492R6241k5890J7970K5456
717E2466o8956k1860J02816N3269O916n0328o0099o1530j7324R9620N3527j3942
705G4575J07316k9878j02152j9086r017O0542m8790p7584k8447K4899K5508O5314
693D3200J0623J3348k9770M4740k5892k1894J25612k7247q9050q9420N5999m101
681F148K6844J10356r6994j3451Q361N3733j40089R7531J7478J4864q9593p2281
$$ y = [119419, 66839, 96087, 78847, 89955, 86871, -23199, 21640, 76613, 66659, 60013, 22414, -22280, 138547, 195981, 111099, 30136, 87331, 74406, 14993, 93674, 27911, -43832, -41804, -99306, -43064, 3892, 88348, 41310, 8676, 10068, 11307, -51796, -12110, -15990, 45096, 77313, 107206, 133589, 106329, -13396, -31205, 85281, 19181, -61311, 34930, 9040, 27010, 52466, -16490, -38350, 64466, 117735, 124651, 74323, 14224, -47306, -64630, 34990, 88517, 74575, 181891, 152013, 49861, 30775, 21758, 82300, 33510, -44074, -72521, -47622, -22114, 43200, 53823, 67171, 37401, 82141, 56249, 34355, 159967, 132720, 43670, -45750, 10249, 6148, 32992, 143348, 46354, 32903, 41264, 94997, -45092, 52439, 69917, 84781, -4812, -77093]
669g7093L9090N5673L120O3058o3718n0221N6490o9653Q4109j4644N0661O5617
657A42489n8308K6469J075n3751n9292o4448P9500N9151p7869R468R8485o4928
645C8041L7427J3564j3758J5039K0304p6189K2040P1848n3512k6255j7716o572
633B4261R1173j2712k6196l3803o6109j348O0198L1154o2528R5608J3j8421J07275
620A88565L7559j9617k6769r413r3036r5918J8579Q0253L9179N39n3050k3885
608D2986m962J5411M448j4848k8092N0754r604m2438k2950J1928L9105j01176
596e9438k4287K810N5621Q0769O4933Q9838j30096l6596L6245o8714P8046l1443
584E7688R4693p8395o4717J3312r6051l914R9882j9469P6365O1619q3705P349
$$ y = [-77093, -38003, 17670, 20790, 83848, 20130, -30091, 26399, -43254, 40855, 26211, 76872, 142489, 84181, 110650, 111725, 57974, -1318, -65766, 13734, 72885, -4984, 4484, 102969, 38041, 75468, 89032, 75274, 90313, 110617, 34428, 56468, 128316, 74804, 48549, 30833, 24261, 115434, 102722, 76526, 42723, -23386, -24734, 35464, 66618, 4090, 99698, 99711, 81290, 188565, 226124, 206507, 179738, 170325, 77289, -18629, -50, 80203, 119382, 119921, 66871, 42986, 38024, 53435, 57883, 43035, 14943, 65697, 56093, 13655, -9295, 2633, 41738, -59438, -83725, -80915, -25294, 55475, 120408, 210246, 80150, 43554, 79799, 11085, 89131, 57688, 152381, 73986, 9269, 22581, -73470, -77384, 22498, 3029, 79394, 141013, 57308, 64657]
572F4657m7257J2103O710K0585Q2460q3651p116R7162n2888k4833M3266L6491
560A47689q4844n7605J06078l0437M807j9662L1736J4514L7911M3605k05476m3329
548e5013O7709o0483j9199J20906l2492R2074k5041n8311R4832J2624j13758q4482
536f0634M2376J11148R483p8771L3434J06778m6365q8455n7775n1303O0450Q7234
524F7600O3524n2018l2835R906p213Q6524k419n6694m9097n7349N8074k695J6980
511D2288r841L7374L6280l2068M4492r4875L5324J9832j0437k2041j2678P4206
499A07856k6811j4997j8724N0148r2189j13776P0080K4873Q9414J1359r602k0257
487E7374j14524J1845K963L0877M2357P2460l3363O9936N6823q5183q278O9974
$$ y = [64657, 17400, 29503, 36213, 56798, 139258, 55607, 48491, 145653, 92765, 67932, 111198, 147689, 62845, 5240, 111318, 80881, 85688, 66026, 97762, 112276, 150187, 193792, -11684, -55013, 12696, -47787, -66986, 53920, 21428, 113502, 88461, 30150, 124982, 137606, 23848, -60634, -18258, 92890, 102373, 23602, 57036, 163814, 117449, 28994, -28781, -80084, -19634, 67600, 131124, 79106, 46271, 56177, 48964, 135488, 133069, 76375, 27278, -30071, 28003, 25308, 42288, 32447, 69821, 106101, 74033, 118525, 23650, 58974, 78806, 68369, 46328, 33650, 107856, 81045, 66048, 47324, 97472, 5283, -108493, -38413, -13540, 75874, 87233, 77631, 57374, -57150, -45305, -42342, -11465, 30892, 103352, 69989, 139925, 196748, 111565, 103287, 173261]
475A73261N135q6045J0221o8985K3920N9251O823P8970m8095j7808m4676L2049
463A24021m5901j21260R3734k020P2527m9521L4254L6573n8443M5889o9599N9368
451A19622J08688j15551l0376N1938j37273O0326J7612L5766k7044q5091o7138
440f8521L9613P7815k9883J06335j9066o941N988N6590J1714p3993p5943k5814
428b106P3267J22961j15390j1943o5974L0439J652M413M2219l6471P7384q8613
416C1838k6660K1747j0709L2548J4481O620j6824q8472J7080O5211P7891J1964
404A36715o0474l6742o3038J18271j3400O5772J18118j03126o0321j7540O8691
393A52926l4910J5899K325m1886O5498m4145m2274Q0667Q4l4357m4970J28203
$$ y = [173261, 178396, 92351, 102572, 33587, 57507, 116758, 123581, 202551, 154456, 136648, 91972, 124021, 78120, -43140, 50594, 48574, 121101, 71580, 105834, 142407, 83964, 129853, 60254, 119622, 228310, 112759, 82383, 134321, -2952, 57374, 74986, 110752, 83708, -1383, -68521, -28908, 48907, 19024, 125359, 106293, 99352, 105340, 161930, 173644, 99651, 23708, -2106, 71161, 194122, 78732, 66789, 815, 31254, 32906, 37319, 79538, 43067, 120451, 31838, 5178, 26925, 16216, 48764, 63245, 69865, 53041, -35431, -18351, 46860, 124751, 136715, 76241, 39499, -23539, 94732, 81332, 147104, 265222, 162096, 101775, 84235, 152926, 118016, 133915, 136240, 94354, 159852, 115707, 73433, 154100, 154184, 119827, 74857, 203060]
381B03060Q8332j68850o8409J3035J1613J11761k8078p0797k2363Q23n9775n8843
369d8491J09037p3821K1122J40655O0163N6859L3794q9822j16773M862n1459P4252
357A20378P4057p2643j4810j32614P3566R2148L0445j6794k0351N3276j79645
346G013O3231K8758m0178K9122m1110L4065K091J9682L6069m0699R092j27410
334b0274N9337P285j3192L2129N5791j24611M390J35937o3387l7880M6616M7157
322A29298l1568j4704L5450j0810j1964M8637r0684J1189R0101m6654J49524l0101
310B27714L1146k5497r0092j9164l9212J5575j3398M3541O1170n0152m9196k0851
298G1584M5977j4170m736M289J1782L3111p4884M1928K9799r671p5106M2346K8741
$$ y = [203060, 291392, 122542, 54133, 67168, 78781, 190542, 162464, 91667, 69304, 70127, 10352, -48491, 60546, -13275, 7847, 148502, 208665, 265524, 299318, 209496, 92723, 97585, 46126, 120378, 194435, 121792, 106982, -25632, 47934, 140082, 170527, 153733, 133382, 186658, 7013, 70244, 99002, 58824, 87946, 46836, 80901, 82992, 102674, 138743, 98044, 107136, -20274, 39063, 46348, 33156, 65285, 121076, -3535, 855, 136792, 73405, 35525, 82141, 129298, 97730, 83026, 118476, 107666, 95702, 144339, 53655, 64844, 154945, 108291, 257815, 227714, 258860, 233363, 143271, 124107, 84895, 100470, 87072, 130613, 191783, 141631, 92435, 71584, 117561, 103391, 98655, 102944, 114726, 147837, 72953, 114881, 144680, 135009, 59903, 102249, 130990]
285A30990M5318j9642n0196R418j9109k4186k9435L4552L0747P532J3904n1981
273G7912o7541O5024M9469n5353q5679K5206N5928K5433n799K6093M1880o3490
261H9083K7605L9303O9925j29437n3533O112Q5910q4585L5497j9602N0761j9294
249I7745J02218m5776N697n1546M0411L7683l3985k6036l0533M3408j5459K234
237A26061m3584L8984m0414O4181o3088r245P553M1034L8038K8033L3469n9765
225A61257l9472J1567N3083j2836q1691o418L2815K7959K897j3359N8317J8784
213B12903m8790o6296O06L2736l9736m1923M4892K8198k8323J5935L2422m0946
201A01678J3080L3507j16607j6739P735L2883J8647j0913O4365j8073q1970J17589
$$ y = [130990, 176308, 156666, 106470, 115888, 96779, 72593, 43158, 77710, 108457, 115989, 129893, 77912, 10371, 75395, 124864, 69511, -16168, 9038, 64966, 90399, 84600, 110693, 152573, 89083, 116688, 155991, 225916, 96479, 42946, 49058, 134968, 50383, 85880, 66278, 117039, 97745, 199963, 154187, 159884, 108338, 148749, 186432, 152447, 126411, 95878, 139286, 123827, 126061, 82477, 121461, 81047, 145228, 82140, 72895, 80448, 121482, 159520, 187553, 221022, 161257, 121785, 133352, 186435, 173599, 91908, 85490, 118305, 146264, 149161, 135802, 194119, 212903, 164113, 97817, 98423, 131159, 91423, 49500, 94392, 122590, 94267, 110202, 142624, 101678, 114758, 148265, 31658, 14919, 22654, 55537, 74184, 63271, 127636, 109563, 27593, 145182]
189A45182o191k7471M4622j1858J3449p0760j01567L6474O353j03J3943Q2663
177A24736n2401n3754R9647P8469l8803L589J7017q936p7884j6079p1545M1372
165D5428K4803M4386O0440m5003N4765n3334k4127N1234Q1911j7674j08742N0503
153A64590o6732j849o8184O2629L7535J5364o2782l7001J0345M8327K629N3192
141A58063J02722q5130K151j3773M5807o2354M0389k394n3972M6520K230n3103
129A27156K1270p646j1282j1679k373P742J05165n8492j12078P8820K590R890
$$ y = [145182, 138991, 111520, 156142, 144284, 157733, 86973, -14594, 21880, 28233, 28130, 42073, 124736, 72335, 18581, 118228, 196697, 157894, 161483, 178500, 169564, 91680, 75601, 4056, 45428, 70231, 114617, 175057, 130054, 184819, 131485, 107358, 158592, 240503, 222829, 114087, 164590, 97858, 96009, 27825, 90454, 127989, 143353, 80571, 43570, 53915, 102242, 104871, 158063, 260785, 175655, 177806, 164033, 209840, 147486, 187875, 185481, 131509, 178029, 180259, 127156, 148426, 140780, 129498, 117819, 115446, 123188, 228353, 169861, 57783, 136603, 139193, 149083]
$$ [...]
##END NTUPLES=NMR SPECTRUM
##END=
