##TITLE=1H_EC-3289
 CDCl3
 8 sc, 
 19.1.2023
##JCAMPDX= 6.0         $$ Bruker NMR JCAMP-DX V2.0
##DATA TYPE= NMR SPECTRUM
##DATA CLASS= NTUPLES
##ORIGIN= UXNMR, Bruker Analytische Messtechnik GmbH
##OWNER= root
$$ XWIN-NMR		Version 3.5
$$ Thu Jan 19 14:25:07 2023 Russian Standard Time (UT+4h)  she@DPX200
##.OBSERVE FREQUENCY= 200.13135
##.OBSERVE NUCLEUS= ^1H
##.ACQUISITION MODE= SIMULTANEOUS
##.ACQUISITION SCHEME= undefined
##.AVERAGES= 8
##.DIGITISER RES= 18
##SPECTROMETER/DATA SYSTEM= spect
##.PULSE SEQUENCE= zg30
##.SOLVENT NAME= CDCl3
##.SHIFT REFERENCE= (INTERNAL, CDCl3, 0, 15.7921)
##AUDIT TRAIL= $$ (NUMBER, WHEN, WHO, WHERE, WHAT)
$$ ##TITLE= Audit trail, XWIN-NMR		Version 3.5
$$ ##JCAMPDX= 5.01
$$ ##ORIGIN= Bruker BioSpin GmbH
$$ ##OWNER= she
$$ F:/spectra/data/she/nmr/H-F/1/pdata/1/auditp.txt
$$ ##AUDIT TRAIL=  $$ (NUMBER, WHEN, WHO, WHERE, WHAT)
(   1,<2023-01-19 14:23:55.34 +0400>,<she>,<DPX200>,
      <created by zg, POWCHK disabled, PULCHK disabled
       configuration hash MD5:
       00 E9 B6 7A A2 85 ED C7 34 08 36 98 17 FE 4E 26
       data hash MD5: 16K
       D7 FB AB 71 AD 14 5A 1C F9 30 32 E0 89 F3 45 D0>)
(   2,<2023-01-19 14:23:58.17 +0400>,<she>,<DPX200>,
      <Start of raw data processing
       efp BC_mod = 2 LB = 0.24 FT_mod = 6 PKNL = 1 PHC0 = -19269.16 PHC1 = 9.800789 SI = 16K 
       data hash MD5: 16K
       46 F1 A1 D1 CF CD 90 19 32 4A 38 3F 5C C1 DC DC>)
(   3,<2023-01-19 14:24:13.00 +0400>,<she>,<DPX200>,
      <pk PHC0 = -0.7104061 PHC1 = 1.4 
       data hash MD5: 16K
       57 E4 6F 3F 06 B2 B0 F8 27 38 2A D4 36 89 8F 79>)
(   4,<2023-01-19 14:24:16.14 +0400>,<she>,<DPX200>,
      <abs ABSG = 5 
       data hash MD5: 16K
       82 25 AD 1C 46 B8 9F 40 30 80 D3 12 A3 04 D1 EE>)
$$ ##END=
$$ 
$$ hash MD5
$$ F8 5A 64 BB CC F4 21 68 54 64 B1 A8 E3 F0 E5 A9
##$RELAX= 
##$RELAX= 
##$RELAX= 
##$RELAX= 
##$RELAX= 
##$RELAX= 
$$ Bruker specific parameters
$$ --------------------------
##$DU= <F:/spectra>
##$EXPNO= 1
##$NAME= <H-F>
##$PROCNO= 1
##$TYPE= <nmr>
##$USER= <she>
##$AMP= (0..31)
100 100 100 100 100 100 100 100 100 100 100 100 100 100 100 100 100 100 
100 100 100 100 100 100 100 100 100 100 100 100 100 100 
##$AQSEQ= 0
##$AQ_mod= 1
##$AUNM= <au_zg>
##$AUTOPOS= <>
##$BF1= 200.13
##$BF2= 200.13
##$BF3= 200.13
##$BF4= 200.13
##$BF5= 200.13
##$BF6= 200.13
##$BF7= 200.13
##$BF8= 200.13
##$BYTORDA= 1
##$CFDGTYP= 0
##$CFRGTYP= 5
##$CHEMSTR= <none>
##$CNST= (0..31)
1 1 145 1 1 1 1 1 1 1 1 1 1 1 1 1 1 1 1 1 1 1 1 1 1 1 1 1 1 1 1 1 
##$CPDPRG= <>
##$CPDPRG1= <>
##$CPDPRG2= <>
##$CPDPRG3= <>
##$CPDPRG4= <mlev>
##$CPDPRG5= <mlev>
##$CPDPRG6= <mlev>
##$CPDPRG7= <mlev>
##$CPDPRG8= <mlev>
##$CPDPRGB= <>
##$CPDPRGT= <>
##$D= (0..31)
0 1.2 0 0 0 0 0 0 0 0.06 0 0.03 0 0 0 0 0.0002 0 0 0 0 0 0 0 0 0 0 0 0 
0 0 0 
##$DATE= 1674123834
##$DBL= (0..7)
120 120 120 120 120 120 120 120 
##$DBP= (0..7)
150 150 150 150 150 150 150 150 
##$DBP07= 0
##$DBPNAM0= <>
##$DBPNAM1= <>
##$DBPNAM2= <>
##$DBPNAM3= <>
##$DBPNAM4= <>
$$ [...]
##$SUBNAM3= <"">
##$SUBNAM4= <"">
##$SUBNAM5= <"">
##$SUBNAM6= <"">
##$SUBNAM7= <"">
##$SUBNAM8= <"">
##$SUBNAM9= <"">
##$SW= 18.05172834244
##$SWIBOX= (0..15)
0 0 2 0 0 0 0 0 0 0 0 0 0 0 0 0 
##$SW_h= 3612.71676300578
##$TD= 16384
##$TD0= 1
##$TE= 0
##$TE2= 300
##$TE3= 300
##$TEG= 300
##$TL= (0..7)
0 120 120 120 120 120 120 120 
##$TP= (0..7)
150 150 150 150 150 150 150 150 
##$TP07= 0
##$TPNAME0= <>
##$TPNAME1= <>
##$TPNAME2= <>
##$TPNAME3= <>
##$TPNAME4= <>
##$TPNAME5= <>
##$TPNAME6= <>
##$TPNAME7= <>
##$TPOAL= (0..7)
0.5 0.5 0.5 0.5 0.5 0.5 0.5 0.5 
##$TPOFFS= (0..7)
0 0 0 0 0 0 0 0 
##$TUNHIN= 0
##$TUNHOUT= 0
##$TUNXOUT= 0
##$USERA1= <user>
##$USERA2= <user>
##$USERA3= <user>
##$USERA4= <user>
##$USERA5= <user>
##$V9= 5
##$VALIST= <valist>
##$VCLIST= <CCCCCCCCCCCCCCC>
##$VD= 0
##$VDLIST= <DDDDDDDDDDDDDDD>
##$VPLIST= <PPPPPPPPPPPPPPP>
##$VTLIST= <TTTTTTTTTTTTTTT>
##$WBST= 1024
##$WBSW= 4
##$XGAIN= (0..3)
0 0 0 0 
##$XL= 0
##$YL= 0
##$YMAX_a= 279025
##$YMIN_a= -153056
##$ZGOPTNS= <>
##$ZL1= 120
##$ZL2= 120
##$ZL3= 120
##$ZL4= 120
##$ABSF1= 15.83945
##$ABSF2= -2.212401
##$ABSG= 5
##$ABSL= 3
##$ALPHA= 0
##$AQORDER= 0
##$ASSFAC= 0
##$ASSFACI= 0
##$ASSFACX= 0
##$ASSWID= 0
##$AUNMP= <proc_1d>
##$AZFE= 0.1
##$AZFW= 0.1
##$BCFW= 0
##$BC_mod= 2
##$BYTORDP= 0
##$COROFFS= 0
##$CY= -3
##$DATMOD= 1
##$DC= 0
##$DFILT= <>
##$DTYPP= 0
##$F1P= 0
##$F2P= 0
##$FCOR= 1
##$FTSIZE= 16384
##$FT_mod= 6
##$GAMMA= 0
##$GB= 0
##$INTBC= 1
##$INTSCL= 3.70164e-10
##$ISEN= 128
##$LB= 0.24
##$LEV0= 0
##$LPBIN= 0
##$MAXI= 10000
##$MC2= 0
##$MEAN= 0
##$ME_mod= 0
##$MI= 1.114404
##$NCOEF= 0
##$NC_proc= -7
##$NLEV= 6
##$NOISF1= 3.799351
##$NOISF2= 2.8
##$NSP= 0
##$NTH_PI= 0
##$NZP= 0
##$OFFSET= 15.79206
##$PC= 1
##$PHC0= -19269.87
##$PHC1= 11.20079
##$PH_mod= 1
##$PKNL= yes
##$PPARMOD= 0
##$PSCAL= 0
##$PSIGN= 0
##$REVERSE= no
##$SF= 200.129995893588
##$SI= 16384
##$SIGF1= 3
##$SIGF2= 2
##$SINO= 5.538805
##$SIOLD= 16384
##$SREGLST= <1H.CDCl3>
##$SSB= 0
##$STSI= 16384
##$STSR= 0
##$SW_p= 3612.71676300578
##$SYMM= 0
##$S_DEV= 0
##$TDeff= 16384
##$TDoff= 0
##$TI= <>
##$TILT= no
##$TM1= 0
##$TM2= 0
##$TOPLEV= 0
##$USERP1= <user>
##$USERP2= <user>
##$USERP3= <user>
##$USERP4= <user>
##$USERP5= <user>
##$WDW= 1
##$XDIM= 16384
##$YMAX_p= 272323653
##$YMIN_p= -703200
$$ End of Bruker specific parameters
$$ ---------------------------------
##NTUPLES= NMR SPECTRUM
##VAR_NAME=  FREQUENCY,     SPECTRUM/REAL,   SPECTRUM/IMAG
##SYMBOL=    X,             R,               I
##VAR_TYPE=  INDEPENDENT,   DEPENDENT,       DEPENDENT
##VAR_FORM=  AFFN,          ASDF,            ASDF
##VAR_DIM=   16384,         16384,           16384
##UNITS=     HZ,            ARBITRARY UNITS, ARBITRARY UNITS
##FACTOR=    0.220516191357247, 1,           1
##FIRST=     3160.46488261338, 0,            0
##LAST=      -452.251880392403, 0,           0
##MIN=       -452.251880392403, -703200,     0
##MAX=       3160.46488261338, 272323653,    0
$$ Real data points
##PAGE= N=1
##DATA TABLE= (X++(R..R)), XYDATA
$$ [...]
5822B5891437k05915l27490m14896l55510m72300m58006m89481m16718m24808
$$ 25891437 25685522 25358032 24943136 24587626 24115326 23657320 23167839 22751121 22326313
5813B2326313l74665l00417k90861j93112r4389j23952r3694l215K6507k3920
$$ 22326313 21951648 21651231 21360370 21167258 21072869 20948917 20855223 20852008 20878515 20854595
5803B0854595P3744J76346J01831J10853Q3149J32254M9427J09023L9782j00489
$$ 20854595 20928339 21104685 21206516 21317369 21400518 21532772 21582199 21691222 21731004 21630515
5793B1630515j51696k04875l55297l65331l27676m57708k52649k49827l86778
$$ 21630515 21478819 21273944 20918647 20553316 20225640 19767932 19515283 19265456 18878678
5784A8878678j49608q6780r6111J9112O0337J53747R5155J32772O1002N7312J35218
$$ 18878678 18729070 18642290 18546179 18565291 18625628 18779375 18874530 19007302 19068304 19125616 19260834
5773A9260834N0166J4233n7155k18146k64223m03747m70082n41042p08729o15843
$$ 19260834 19311000 19325233 19268078 19049932 18785709 18381962 17911880 17370838 16662109 16046266
5763A6046266o77755o71945n79736o93041n31282l90105n21650m84913l05922
$$ 16046266 15368511 14696566 14116830 13423789 12892507 12502402 11980752 11495839 11189917
5754A1189917l42131l14033k19382k25078j91735k16174j51214j07631o2834m7612
$$ 11189917 10847786 10533753 10314371 10089293 9897558 9681384 9530170 9422539 9359705 9312093
5744I312093p2922p3089o5855l6880n421o3271k06550j35576n8202q2357j61727
$$ 9312093 9239171 9166082 9100227 9063347 9057926 8994655 8788105 8652529 8594327 8511970 8350243
5733H350243L708j0171j05185J3234k1945K8926o6137o9714K247J2059m5407p7198
$$ 8350243 8353951 8343780 8238595 8251829 8229884 8258810 8192673 8122959 8125206 8137265 8091858 8014660
5721H014660N6335j360J4738q0553K4605M9138j6886O0448l9513p1718j7524n737
$$ 8014660 8070995 8069635 8084373 8003820 8028425 8077563 8060677 8121125 8081612 8009894 7992370 7986633
5709G986633j14810j2591K8236k0363j5349J7569j5158N1308O4522Q5028L1369
$$ 7986633 7871823 7859232 7887468 7867105 7851756 7869325 7854167 7905475 7969997 8055025 8086394
5698H086394m719N3975O8544J2958L2401J1210J9452K9031K4266J2873K0374n820
$$ 8086394 8081675 8135650 8204194 8217152 8249553 8260763 8280215 8309246 8333512 8346385 8366759 8360939
5686H360939j1515J3779l0255n0920n2934j4314N72p0777m994p359p1191J2461
$$ 8360939 8349424 8363203 8332948 8282028 8229094 8214780 8215352 8144575 8139581 8132222 8061031 8073492
5674H073492K5439n7968K3897N6723M0068P4368j4823Q8133m0576L596J1541L1689
$$ 8073492 8098931 8040963 8064860 8121583 8161651 8236019 8221196 8309329 8268753 8272349 8283890 8315579
5662H315579j1087l6792K185P449m797k6257q3104L0776J5582j23467N310l0969
$$ 8315579 8304492 8267700 8269885 8277334 8272537 8246280 8163176 8193952 8209534 8086067 8091377 8060408
5650H060408o1328q7189q5748o1720j04271q5290r262l2237q5953r4241l1515
$$ 8060408 7999080 7911891 7826143 7764423 7660152 7574862 7565600 7533363 7447410 7353169 7321654
5639G321654l7495L145o6884j9906l8292L8383J3232k6578K5683k9552j42724
$$ 7321654 7284159 7287304 7220420 7200514 7162222 7200605 7213837 7187259 7212942 7183390 7040666
5628G040666l7633k9801o3234J7719M456Q696o7349l3462l9373K8215M7527k535
$$ 7040666 7003033 6973232 6909998 6927717 6932173 6940869 6873520 6840058 6800685 6828900 6876427 6873892
5616F873892o4918L352Q019p8339L464J9609J80K9055n2064N402n5097l8941q2640
$$ 6873892 6808974 6812326 6820345 6742006 6745470 6765079 6765259 6794314 6742250 6747652 6692555 6653614 6570974
5603F570974K7306K5649k1497K3792P3193k0893L4046L0490r3057M4456J9176
$$ 6570974 6598280 6623929 6602432 6626224 6699417 6678524 6712570 6743060 6650003 6694459 6713635
5592F713635r2527l0391m2965n9399j1201o4975m9541m1193j7906K8683l706k2270
$$ 6713635 6621108 6590717 6547752 6488353 6477152 6412177 6362636 6321443 6303537 6332220 6328514 6306244
5580F306244L0264L3472l6664r6726l145q384m19j6452k6627o2190L653N872j3781
$$ 6306244 6336508 6369980 6333316 6236590 6233445 6225061 6224642 6208190 6181563 6119373 6123026 6128898 6115117
5567F115117M3822J9732l8936J5792p5777n0369j30029r3535n1133r0422m0423
$$ 6115117 6158939 6178671 6139735 6155527 6079750 6029381 5899352 5805817 5754684 5664262 5623839
5556E623839J1455k7907l4789o4898Q5249L4644Q073L3399J0189L5488J05876
$$ 5623839 5635294 5607387 5572598 5507700 5592949 5627593 5635666 5669065 5679254 5714742 5820618
5545E820618Q8037J1111J14688K6932N8744K056q9006j40629n0279j51636r8413
$$ 5820618 5908655 5919766 6034454 6061386 6120130 6122186 6033180 5892551 5842272 5690636 5592223
5534E592223q6787k4258q4259n5645p5848p2621M1850r9211o6105m7432p6952
$$ 5592223 5505436 5481178 5396919 5341274 5265426 5192805 5234655 5135444 5069339 5021907 4944955
5523D944955l6486j03058M6819o1606n6467K0691p1469L3673m4477k7775j16242
$$ 4944955 4908469 4805411 4852230 4790624 4734157 4754848 4683379 4717052 4672575 4644800 4528558
5512D528558k1189n221l2558M61q6878n6043m8822k1704l3695o9044p2313k6040
$$ 4528558 4507369 4502148 4469590 4470051 4383173 4327130 4278308 4256604 4222909 4153865 4081552 4055512
5500D055512M8670j879m6114o1226o3617R562l1486J8004L9879k7878k8787m7545
$$ 4055512 4104182 4102303 4056189 3994963 3931346 3940908 3909422 3927426 3967305 3939427 3910640 3863095
5488C863095J3400M9714o6108M3395l5693q4171K4387N2584K0649l7081J3486
$$ 3863095 3876495 3926209 3860101 3903496 3867803 3783632 3808019 3860603 3881252 3844171 3857657
5477C857657K1851K6949K3374l8362n8926m3699m7845j7880J5325M9307j533L9005
$$ 3857657 3879508 3906457 3929831 3891469 3832543 3788844 3740999 3723119 3738444 3787751 3786218 3825223
5465C825223M0182R9123K024l0081R1562O6850J05796R1213L749K837q1921N6145
$$ 3825223 3865405 3964528 3966552 3936471 4028033 4094883 4200679 4291892 4295641 4298478 4216557 4272702
5453D272702O7869M926k5487J0326m079j2232J594N5780j1526n6269Q8752m5904
$$ 4272702 4340571 4345497 4320010 4330336 4326257 4314025 4315619 4371399 4359873 4303604 4392356 4346452
5441D346452N1469Q1438J11295M8750L1515O4437L8339P5631O3199K993j1751
$$ 4346452 4397921 4479359 4590654 4639404 4670919 4735356 4773695 4849326 4912525 4915518 4903767
5430D903767o6095R9074J09569P947Q4663k963R1131q7014j33703j72799j57193
$$ 4903767 4837672 4936746 5046315 5054262 5138925 5135962 5227093 5140079 5006376 4833577 4676384
5419D676384j13356q9392j58795j15063p6703n0472m7759p7007q4269j09374j29249
$$ 4676384 4563028 4473636 4314841 4199778 4123075 4072603 4024844 3947837 3863568 3754194 3624945
5408C624945m2042Q617m4063l0611q3258k1463J1026L3779O5921R2263J08159
$$ 3624945 3582903 3591520 3547457 3516846 3433588 3412125 3423151 3456930 3522851 3615114 3723273
5397C723273J06847P5099J00354K5123m6811r3569r9387j03531j40850k06067
$$ 3723273 3830120 3905219 4005573 4030696 3983885 3890316 3790929 3687398 3546548 3340481
5387C340481j71577j27966p2017q2752n7236m4422q2234k1908p7053r3100j5282
$$ 3340481 3168904 3040938 2968921 2886169 2828933 2784511 2702277 2680369 2603316 2510216 2494934
5376B494934L5739M928M891q182n8777J9568q137L8789N0263J1408N331N5011
$$ 2494934 2530673 2535601 2540492 2532310 2473533 2493101 2484964 2523753 2574016 2585424 2590755 2645766
5364B645766R955j6163L6074m4709j17573j07428l8426n1260r6084j10709j03342
$$ 2645766 2655721 2639558 2675632 2630923 2513350 2405922 2367496 2316236 2220152 2109443 2006101
5353B006101r1975k7552K9423l2335n2414m7627n5900J0123M9252o5645o2123
$$ 2006101 1914126 1886574 1915997 1883662 1831248 1783621 1727721 1737844 1787096 1721451 1659328
5342A659328l6020k646l1268L0790p224j64873M0123M7681l9455K9870n0494J0141
$$ 1659328 1623308 1620662 1589394 1620184 1612960 1448087 1488210 1535891 1496436 1526306 1475812 1485953
5330A485953Q169J0974J4233k1737n9270l8029L109M6197K030n0736m2056J8242
$$ 1485953 1494122 1505096 1519329 1497592 1438322 1400293 1403402 1449599 1451629 1400893 1358837 1377079
5318A377079o4832M0973k188o985n243O4672O1494k7247o4057Q122J5427p9297
$$ 1377079 1312247 1353220 1351032 1344047 1338804 1403476 1464970 1437723 1373666 1381788 1397215 1317918
5306A317918j1203P4554L5565Q223j7196j5711O8558j08755K4060j9802P514O036
$$ 1317918 1306715 1381269 1416834 1425057 1407861 1392150 1460708 1351953 1376013 1356211 1363725 1369761
5294A369761n4155N810J4492l9739O5610m2973o030M7766m0819k9627m694K9908
$$ 1369761 1315606 1321416 1335908 1296169 1361779 1318806 1312776 1360542 1319723 1290096 1285402 1315310
5282A315310M5450J1949K0173l208m0348K9117O9227m5760J9397k9939M4419j249
$$ 1315310 1360760 1372709 1392882 1389674 1349326 1378443 1447670 1401910 1421307 1391368 1435787 1434538
5270A434538j24662l2466Q1118L0638p3899j0212M0503n41J6397J6532j6010j40
$$ 1434538 1309876 1277410 1358528 1389166 1315267 1305055 1345558 1345017 1361414 1377946 1361936 1361796
5258A361796R486n7625o281Q3916P3399K9951m0687N951m2573K010O3776L4880
$$ 1361796 1371282 1313657 1307376 1391292 1464691 1494642 1453955 1459906 1417333 1419343 1483119 1517999
5246A517999k3638k5441R6177O3616N1451O0541J2837J4753Q5551J35026J16278
$$ 1517999 1494361 1468920 1565097 1628713 1680164 1740705 1753542 1768295 1853846 1988872 2105150
5235B105150j6547o2233l2880J3809j6607j952p8528j03004K66k0086j21n6547
$$ 2105150 2088603 2026370 1993490 2007299 1990692 1988740 1910212 1807208 1807474 1787388 1787267 1730720
5223A730720j5519R926K7851k793J9975n8031n1009L3243j6070l2875L0501M8470
$$ 1730720 1715201 1725127 1752978 1750185 1770160 1712129 1661120 1694363 1678293 1645418 1675919 1724389
5211A724389l0129n5395J640Q9213o5195j4197L1752L4599l1618r63K2395L126
$$ 1724389 1694260 1638865 1640505 1729718 1664523 1650326 1682078 1716677 1685059 1684096 1706491 1709617
5199A709617O7523k9077q3110j2927N0256J9596J7767j2175m4076K1541J0988
$$ 1709617 1777140 1748063 1664953 1652026 1702282 1721878 1739645 1727470 1683394 1704935 1715923
5188A715923m3282q5169k0483J20805K061L6592o5226o3441j3006K2463N7355
$$ 1715923 1672641 1587472 1566989 1687794 1689855 1726447 1661221 1597780 1584774 1607237 1664592
5177A664592M2425J822R8146j6992J5325m1442L8828j3507J5996N1126n2343j3069
$$ 1664592 1707017 1708839 1806985 1789993 1805318 1763876 1802704 1789197 1805193 1856319 1803976 1790907
5165A790907j6084k209J8723j1273J160R9562J874M2403K2592j9908l091O2492
$$ 1790907 1774823 1772614 1791337 1780064 1781224 1880786 1882660 1925063 1947655 1927747 1924656 1987148
5153A987148O6382k5758J3055P693M140J3614P2201q289r3222M5257M1668N1389
$$ 1987148 2053530 2027772 2040827 2048520 2052660 2066274 2138475 2130186 2036964 2082221 2123889 2175278
5141B175278O4501Q35N2630K9248N6942J7931p299M2849j4084L7878O7225P6537
$$ 2175278 2239779 2240614 2293244 2322492 2379434 2397365 2390066 2432915 2418831 2456709 2523934 2600471
5129B600471K2065K327M2062Q364k7387R2246Q9884J7214J6193J02585N3722J37217
$$ 2600471 2622536 2624863 2666925 2675289 2647902 2740148 2830032 2847246 2863439 2966024 3019746 3156963
5117C156963Q0699l8238L0023R3098K09531J49363J12617N6734J45886J59008
$$ 3156963 3237662 3199424 3229447 3322545 3532076 3681439 3794056 3850790 3996676 4155684
5107D155684K03582K01647K24517K82048K03744K92041M01742L38082K85199L02264
$$ 4155684 4359266 4560913 4785430 5067478 5271222 5563263 5965005 6303087 6588286 6890550
5097F890550J94328J80079L2111j88039l36023l35018k49172k81024j83851j28031
$$ 6890550 7084878 7264957 7297068 7109029 6773006 6437988 6188816 5907792 5723941 5595910
5087E595910j48871r8541n4540k1090m848Q5199P5092J74160J71840J88810P9100
$$ 5595910 5447039 5348498 5293958 5272868 5268020 5353219 5428311 5602471 5774311 5963121 6042221
5076F042221K03862L74613L23191K98489L23650L51287M74786N64217M84761M17512
$$ 6042221 6246083 6620696 6943887 7242376 7566026 7917313 8392099 8956316 9441077 9858589
5066I858589K56776N471k50693m55282m71070n19956n30528l66667l85742l99714
$$ 9858589 10115365 10120836 9870143 9414861 8943791 8423835 7893307 7526640 7140898 6741184
5056F741184l24494j78358k50076l14251j33806m2862j12671j08880n6345n1365
$$ 6741184 6416690 6238332 5988256 5674005 5540199 5497337 5384666 5275786 5219441 5168076
5046E168076m3690o5232j41292l3669m1833K3317k9073k8378Q094O408M6595J5411
$$ 5168076 5124386 5059154 4917862 4884193 4842360 4865677 4836604 4808226 4816320 4822728 4869323 4884734
5034D884734L7725P8487k045l3188l2505q494J13788q499O6527M3796O3223L3066
$$ 4884734 4922459 5000946 4998901 4965713 4933208 4924714 5038502 5030003 5096530 5140326 5203549 5236615
5022E236615j1780K4163O7072K7866Q1846n5011P9390M602P9636J12454R5927
$$ 5236615 5224835 5248998 5316070 5343936 5425782 5370771 5450161 5454763 5534399 5646853 5742780
5011E742780J40234L8630M8570Q9574J76501J26114P4399J47246J58315J46363
$$ 5742780 5883014 5921644 5970214 6059788 6236289 6362403 6436802 6584048 6742363 6888726
5001F888726J50358J93536R0658N6773J76141J20909K15077K18738O8195R5572
$$ 6888726 7039084 7232620 7323278 7380051 7556192 7677101 7892178 8110916 8179111 8274683
4991H274683J58115J49529J79966K11347K33523K55189K57559K04879K68542K33738
$$ 8274683 8432798 8582327 8762293 8973640 9207163 9462352 9719911 9924790 10193332 10427070
4981A0427070L27145K47901K11081K32488K12208K84627K68957K84411L10991
$$ 10427070 10754215 11002116 11213197 11445685 11657893 11942520 12211477 12495888 12806879
4972A2806879L01301L19172L01168L88774M36389N30577N46380M66307M43535
$$ 12806879 13108180 13427352 13728520 14117294 14553683 15084260 15630640 16096947 16540482
4963A6540482M22519L58617M19833L64969L90455L49141M45458M08769M38628
$$ 16540482 16963001 17321618 17741451 18106420 18496875 18846016 19291474 19700243 20138871
4954B0138871M96416M86459M97272O16777O57995O68590P78493Q08775Q19236
$$ 20138871 20635287 21121746 21619018 22235795 22893790 23562380 24340873 25149648 25968884
4945B5968884R02860J116101J163723J177699J325548J477340J669656J844968
$$ 25968884 26871744 27987845 29151568 30329267 31654815 33132155 34801811 36646779
4937C6646779K059320K101671K239069K510335K536021K913613L404313L826165
$$ 36646779 38706099 40807770 43046839 45557174 48093195 51006808 54411121 58237286
4929E8237286M362584N059307N965890O847091P809253Q712078R860082J1005066
$$ 58237286 62599870 67659177 73625067 80472158 88281411 96993489 106853571 117858637
4921A17858637J1223871R440689N224143K6848n032373r056452j1053966j1315766
$$ 117858637 129082508 138523197 143747340 143774188 138741815 129685363 118631397 107315631
4913A07315631j0497116r120427p555194o206399n149849m289426l505197k744903
$$ 107315631 96818515 87698088 80142894 73936495 68786646 64497220 60992023 58247120
4905E8247120k143607j713805j401938j160608j072141j036118j170435j421870
$$ 58247120 56103513 54389708 52987770 51827162 50755021 49718903 48548468 47126598
4897D7126598j607089j766411j798764j810145j843646j833045j624067j623380
$$ 47126598 45519509 43753098 41954334 40144189 38300543 36467498 34843431 33220051
4889C3220051j434766j384424j374216j354442j198015j103045j068461r72529
$$ 33220051 31785285 30400861 29026645 27672203 26474188 25371143 24302682 23330153
4881B3330153r06565q11768q49539p08567p70458p36781o77205o24949n64461
$$ 23330153 22423588 21611820 20762281 20053714 19283256 18546475 17869270 17244321 16679860
4872A6679860o02219n93713m57006m81978m23553n14141m63894l90905l55707
$$ 16679860 16077641 15483928 15026922 14544944 14121391 13607250 13143356 12752451 12396744
4863A2396744l34313l61108l84070k79005l16944k22996k29905j76431k22304
$$ 12396744 12062431 11701323 11317253 11038248 10721304 10498308 10268403 10091972 9869668
4854I869668j78986k51921j33091j05210j93391j33541k19718j97687j11585q0355
$$ 9869668 9690682 9438761 9305670 9200460 9007069 8873528 8653810 8456123 8344538 8264183
4844H264183j81992j38397j64398j03637q3968j69314n7548n2290j32374j34644
$$ 8264183 8082191 7943794 7779396 7675759 7591791 7422477 7364929 7312639 7180265 7045621
4834G045621p5311o0738o9540O855j4456j15369o7013J517j13169o3097n205k0605
$$ 7045621 6970310 6909572 6840032 6846887 6832431 6717062 6650049 6651566 6538397 6475300 6470095 6449490
4822F449490J4012n5149N3473P3756M2363R6121J15924L9215P7209O4272K6411
$$ 6449490 6463502 6408353 6461826 6535582 6577945 6674066 6789990 6829205 6906414 6970686 6997097
4811F997097q2649m4776j11257p7423K4314J5939J31941J29586J77246J60246
$$ 6997097 6914448 6869672 6758415 6680992 6705306 6721245 6853186 6982772 7160018 7320264
4801G320264Q8937K7988j06989k16650l36764k97213l05466k41172k42176j53460
$$ 7320264 7409201 7437189 7330200 7113550 6776786 6479573 6174107 5932935 5690759 5537299
4791E537299j06627j24476n9377j50330j48805J4798k4235q9129m1641j9375L3593
$$ 5537299 5430672 5306196 5246819 5096489 4947684 4962482 4938247 4849118 4807477 4788102 4821695
4780D821695r630O4283K541M8833P2870K6419L0109N357m3629l2022L9394R6485
$$ 4821695 4812065 4876348 4878889 4927722 5000592 5027011 5057120 5062477 5018848 4986826 5026220 5122705
4768E122705J8476L9543j1983O1574K1803k0158k9400R3213K5681J404L7980N1373
$$ 5122705 5141181 5180724 5168741 5230315 5252118 5231960 5202560 5295773 5321454 5322858 5360838 5412211
4756E412211L9765O4832L6989O5003k66o6338k4118l0726N7315L3022k1317K1170
$$ 5412211 5451976 5516808 5553797 5618800 5618534 5552196 5528078 5497352 5554667 5587689 5566372 5587542
4744E587542l2797M1559p8741N199o0206r940j8385J206n2818N082K8008L2186
$$ 5587542 5554745 5596304 5517563 5522762 5462556 5452616 5434231 5435437 5382619 5387701 5415709 5447895
4732E447895L4358p3866J7450L4849Q4040o3204P8145Q6890m5862K6269R1030
$$ 5447895 5482253 5408387 5425837 5460686 5544726 5481522 5559667 5646557 5600695 5626964 5717994
4721E717994R4673K4751O4370m8841P0529J05435o7481J14753M4018K7745J1552
$$ 5717994 5812667 5837418 5901788 5852947 5923476 6028911 5961430 6076183 6120201 6147946 6159498
4710F159498L6806P9031R002J51196j6089m4897L0036J35021J24300n1106P2961
$$ 6159498 6196304 6275335 6284337 6435533 6419444 6374547 6404583 6539604 6663904 6612798 6685759
4699F685759Q2053J65221J84760K07657J96800Q9910N4409J07296J66623K06657
$$ 6685759 6767812 6933033 7117793 7325450 7522250 7612160 7666569 7773865 7940488 8147145
4689H147145J07347Q0029J10826K08376J31279J03689J67342J87390K12898K27436
$$ 8147145 8254492 8334521 8445347 8653723 8785002 8888691 9056033 9243423 9456321 9683757
4679I683757J97338J83393J95273K63934K63004K16678K54633J70100K71969L13609
$$ 9683757 9881095 10064488 10259761 10523695 10786699 11003377 11258010 11428110 11700079 12013688
4669A2013688K90543K77943K16347L22533L45803K56478K62816L53633L67673
$$ 12013688 12304231 12582174 12798521 13121054 13466857 13723335 13986151 14339784 14707457
4660A4707457L87186M17493M09128M70251M88950N17210N47455N20108N04022
$$ 14707457 15094643 15512136 15921264 16391515 16880465 17397675 17945130 18465238 18969260
4651A8969260M99340N93036N94056O31401N88965P08257O67555P62266Q82998
$$ 18969260 19468600 20061636 20655692 21287093 21876058 22584315 23251870 24014136 24897134
4642B4897134R08962J040240J111265J021305J159380J286172J355666J433567
$$ 24897134 25806096 26846336 27957601 28978906 30138286 31424458 32780124 34213691
4634C4213691J703496J891507K117157K293373K425574K784273L024185L199607
$$ 34213691 35917187 37808694 39925851 42219224 44644798 47429071 50453256 53652863
4626E3652863L493268L893921M344001M876830N854949O992379Q106105R228440
$$ 53652863 57146131 61040052 65384053 70260883 76115832 83108211 91214316 100442756
4618A00442756J0471138J2203938J4378561J6639051J8288121J7186597J1416612
$$ 100442756 110913894 123117832 137496393 154135444 172423565 189610162 201026774
4611B01026774K556733o407043j3809472j8302779j9279506j7852315j5701616
$$ 201026774 203583507 197176464 183366992 165064213 145784707 127932392 112230776
4604A12230776j3408224j1383045r459941p915016o773660n679317m851809m072992
$$ 112230776 98822552 87439507 77979566 70064550 63290890 57611573 52759764 48686772
4596D8686772l573775l055523k628840k314954k086644j865237j623347j606946
$$ 48686772 45112997 42057474 39428634 37113680 35027036 33161799 31538452 29931506
4588B9931506j507462j338578j224361j127092j050325j041137r36390p68339
$$ 29931506 28424044 27085466 25861105 24734013 23683688 22642551 21706161 20937822
4580B0937822q01691q01995q01219q31698q56372p85539p10953o41360o09941
$$ 20937822 20136131 19334136 18532917 17701219 16844847 16059308 15348355 14706995 14097054
4571A4097054n59628n72063n44748m10382l40007l62490k37732k01997k15194
$$ 14097054 13537426 12965363 12420615 12010233 11670226 11307736 11070004 10868007 10652813
4562A0652813k54763k06301j94875k45555k27299j99044j93601k03423j82311
$$ 10652813 10398050 10191749 9996874 9751319 9524020 9324976 9131375 8927952 8745641
4553H745641j84919j40910r4752j53840r1193j97644j82717j72220j60159j18982
$$ 8745641 8560722 8419812 8325060 8171220 8080027 7882383 7699666 7527446 7367287 7248305
4543G248305j49094j64946j11150j19234j94936j40224j57910j29125j39283j89018
$$ 7248305 7099211 6934265 6823115 6703881 6508945 6368721 6210811 6081686 5942403 5753385
4533E753385n4861j26139o0478j23559p3235l7354q0382o8686j08560j52148n4761
$$ 5753385 5698524 5572385 5511907 5388348 5315113 5277759 5197377 5128691 5020131 4867983 4813222
4522D813222r5816j75938m1453j6022r9101j02624p6975N875j60569j16317k2595
$$ 4813222 4717406 4541468 4500015 4483993 4384892 4282268 4205293 4211168 4050599 3934282 3911687
4511C911687l1502p2683r3508j04508j53796K771q1157r1066k4390l8185J5873
$$ 3911687 3880185 3807502 3713994 3609486 3455690 3458461 3377304 3286238 3261848 3223663 3239536
4500C239536o7689j1531N8267k2545l0733q4868O0447j25007j2097o0111p4603
$$ 3239536 3171847 3160316 3218583 3196038 3165305 3080437 3140884 3015877 3003780 2943669 2869066
4489B869066R1240j8869q5953p4647M240m9340l9040m2324l7478q2454r0690o1034
$$ 2869066 2960306 2941437 2855484 2780837 2785077 2735737 2696697 2654373 2616895 2534441 2443751 2382717
4477B382717O6676J5991p0437j15394o4761J7979M9836m0917q1130m33j5899J0096
$$ 2382717 2449393 2465384 2394947 2279553 2214792 2232771 2282607 2241690 2160560 2160127 2144228 2154324
4465B154324n9150l7177o0638o9892L1965M7439m590j9089p8590J1867m6645K8103
$$ 2154324 2095174 2057997 1997359 1927467 1959432 2006871 2002281 1983192 1904602 1916469 1869824 1897927
4453A897927P0208L113N9762o0726p8744M9517J00457J8990l1948K2358k3190
$$ 1897927 1968135 1971248 2031010 1970284 1891540 1941057 2041514 2060504 2028556 2050914 2027724
4442B027724O917M7698o8744m3966Q4522o0123J2560L74j1525J0896m0525k3605
$$ 2027724 2034641 2082339 2013595 1969629 2054151 1994028 2006588 2006962 1995437 2006333 1965808 1942203
4430A942203k756P770J9161p8666j9655k9057l6210p656j6713j3102j417r0381
$$ 1942203 1939447 1947217 1966378 1887712 1868057 1839000 1802790 1795134 1778421 1765319 1763902 1673521
4418A673521o9428J9956L7199l1443j7547M850o5869j5118L86J7911m0577q1758
$$ 1673521 1604093 1624049 1661248 1629805 1612258 1617108 1551239 1536121 1536507 1554418 1513841 1432083
4406A432083N2712K2477J0853O1242j242o8828J5524k303k4882L0447k6781k5131
$$ 1432083 1484795 1507272 1518125 1579367 1578125 1509297 1524821 1522518 1497636 1528083 1501302 1476171
4394A476171M7429P542j3824l0350P929n174p3912m6674P0309l0370l933q8537
$$ 1476171 1523600 1531142 1517318 1486968 1494897 1489723 1415811 1369137 1439446 1409076 1405143 1316606
4382A316606J2473N3437K6095m888K029L024R043j23m861J7981J598k1872R7697
$$ 1316606 1329079 1382516 1408611 1403723 1405752 1408776 1417819 1417696 1412835 1430816 1432414 1410542 1508239
4369A508239j5907q5818J9155n8002Q0236l0773k2324K7672J48807l13m2028p8202
$$ 1508239 1492332 1406514 1425669 1367667 1447903 1417130 1394806 1422478 1571285 1570972 1528944 1450742
4357A450742n2451O7063P4310j614k3168m3017L0127n0152P3674k172J1120k7591
$$ 1450742 1398291 1465354 1539664 1538050 1514882 1471865 1501992 1451840 1525514 1523342 1534462 1506871
4345A506871L8038R419q791j3815K0054N6838p092j9265M261R064L4963L6506
$$ 1506871 1544909 1554328 1545537 1531722 1551776 1608614 1601522 1582257 1586518 1595582 1630545 1667051
4333A667051q525L8944Q8044o8115M8446k7267K7568M4541J1573P1046O9950K9496
$$ 1667051 1658526 1697470 1785514 1717399 1765845 1738578 1766146 1810687 1822260 1893306 1963256 1992752
4321A992752P033M5747L0367L0607P2130O7633n76J17653J0534L3587J86863J37008
$$ 1992752 1999785 2045532 2075899 2106506 2178636 2246269 2245693 2363346 2373880 2407467 2594330 2731338
4309B731338P8407R6365R2740L7541N3870P7797J13496p726m3240j09050m5772
$$ 2731338 2809745 2906110 2998850 3036391 3090261 3168058 3281554 3273828 3230588 3121538 3075766
4298C075766K2000o3830P3320N804l0134J4528L3252K3925L9046L1129K548l8419
$$ 3075766 3097766 3033936 3107256 3113060 3082926 3097454 3130706 3154631 3193677 3224806 3227354 3188935
4286C188935O6713O3215K7910J2764L2552l2555M8507P9588J00079K3566M2319
$$ 3188935 3255648 3318863 3346773 3359537 3392089 3359534 3408041 3487629 3587708 3611274 3653593
4275C653593J09573M9003M659N7949K4355j867P4286M3158J4658J9620P442L89
$$ 3653593 3763166 3812169 3816828 3874777 3899132 3897265 3971551 4014709 4029367 4048987 4056429 4056818
4263D056818K2114K0195O8635j9856O918n7675M3923O5712O3411J8751m9999j1163
$$ 4056818 4078932 4099127 4167762 4147906 4154824 4097149 4141072 4206784 4270195 4288946 4238947 4227784
4251D227784J8967k254j1925Q1942L437l1583l849O3784j02261k1092L4306J7371
$$ 4227784 4246751 4244497 4232572 4314514 4317951 4286368 4282519 4346303 4244042 4222950 4257256 4274627
4239D274627K2593M1137J4661M4971N2407m2475j4755L7889O43N4818R5281Q5734
$$ 4274627 4297220 4338357 4353018 4397989 4450396 4407921 4393166 4431055 4431698 4486516 4581797 4667531
4227D667531J4320J16936N8284L2590J48971J50957R3690J04461Q7458K29571
$$ 4667531 4681851 4798787 4857071 4889661 5038632 5189589 5283279 5387740 5475198 5704769
4217E704769J46688L5342J79721K15842J47370K46377K03352J95290K56535K19214
$$ 5704769 5851457 5886799 6066520 6282362 6429732 6676109 6879461 7074751 7331286 7550500
4207G550500K30616L10610K89892L84862L25785L07732L04737L64138M72000M26330
$$ 7550500 7781116 8091726 8381618 8766480 9092265 9399997 9704734 10068872 10540872 10967202
4197A0967202M49233M11585M45572M27332L93109M45061N00869M94888L94564
$$ 10967202 11416435 11828020 12273592 12700924 13094033 13539094 14039963 14534851 14929415
4188A4929415M73196N04566M88429N11378N22904N80443N30212N05638M25931
$$ 14929415 15402611 15907177 16395606 16906984 17429888 18010331 18540543 19046181 19472112
4179A9472112L46559L41431L63894K78725L18126L12591K72627K44682L43060
$$ 19472112 19818671 20160102 20523996 20802721 21120847 21433438 21706065 21950747 22293807
4170B2293807L34398K76117K48960J98103R0353L0190q2362q5313j55870k51003
$$ 22293807 22628205 22904322 23153282 23351385 23441738 23471928 23389566 23304253 23148383 22897380
4160B2897380k61331k00506j61043j94943j38913k11677j91834k06317m07548
$$ 22897380 22636049 22435543 22274500 22079557 21940644 21728967 21537133 21330816 20923268
4151B0923268l44917l94641l51303n25768n08481m77212m48056m48928m57691
$$ 20923268 20578351 20183710 19832407 19306639 18798158 18320946 17872890 17423962 16966271
4142A6966271l08398m33442l75989m22082l69318l72270l64745m15062m13151
$$ 16966271 16657873 16224431 15848442 15426360 15057042 14684772 14320027 13904965 13491814
4133A3491814l58445m26444l17346l68618l21306l76589l10363l12343l28452
$$ 13491814 13133369 12706925 12389579 12020961 11699655 11323066 11012703 10700360 10371908
4124A0371908k33250k56537k50529k95753k51677j34510k05182k39766k57336
$$ 10371908 10138658 9882121 9631592 9335839 9084162 8949652 8744470 8504704 8247368
4115H247368k43280j55167j71831k44464j02441r2842j42989k16303j04641j71331
$$ 8247368 8004088 7848921 7677090 7432626 7330185 7237343 7094354 6878051 6773410 6602079
4105F602079j08738k06321j37693r3793j13777n5063q4458r5571q5417j41893
$$ 6602079 6493341 6287020 6149327 6055534 5941757 5886694 5802236 5706665 5621248 5479355
4095E479355j39677m7451j35901r6455j66965o7325q4827p5222m7330n9178n6186
$$ 5479355 5339678 5292227 5156326 5059871 4892906 4825581 4740754 4665532 4618202 4559024 4502838
4084D502838j06354q3971p6061j15218m1983K4558L3497l2490n5332p2322p9942
$$ 4502838 4396484 4312513 4236452 4121234 4079251 4103809 4137306 4104816 4049484 3977162 3897220
4073C897220p781j4441n0820J9042K1948l1608J4007m1870j9375k679j0910K7999
$$ 3897220 3889439 3874998 3824178 3843220 3865168 3833560 3847567 3805697 3786322 3783643 3772733 3800732
4061C800732L6975o046P1012K8685O9052J38039j7036P9240L1001J10425M4359
$$ 3800732 3837707 3831661 3902673 3931358 4000410 4138449 4121413 4200653 4231654 4342079 4386438
4050D386438J5337R5614J34637Q6124J14874l1420R4234J34633R3674N6527J65251
$$ 4386438 4401775 4497389 4632026 4718150 4833024 4801604 4895838 5030471 5124145 5180672 5345923
4039E345923J12901M4527K4595J22563J80160J22382L0787Q1359J16662J73620
$$ 5345923 5458824 5503351 5527946 5650509 5830669 5953051 5983838 6065197 6181859 6355479
4029F355479J14628p219N5075j0549M0275K6600n517J1962K54o7344m2983L1634
$$ 6355479 6470107 6462888 6517963 6507414 6547689 6574289 6568772 6580734 6580988 6513644 6470661 6502295
4017F502295l0300l0808j15052p1849m4114o2017r6188l8248n9333j05344p4952
$$ 6502295 6471995 6441187 6326135 6254286 6210172 6148155 6051967 6013719 5954386 5849042 5774090
4006E774090q9590j30403r0119r7707p7308j84772k45554l0481n6710j25112j96481
$$ 5774090 5684500 5554097 5463978 5366271 5288963 5104191 4858637 4828156 4771446 4646334 4449853
3995D449853j02764j14078o2560j26452j25366j81937j83415m5888j37603n6739
$$ 4449853 4347089 4233011 4170451 4043999 3918633 3736696 3553281 3507393 3369790 3313051
3985C313051p0439o9265p7762j58813l3836j38373j14002k4413k6286m6827o5500
$$ 3313051 3242612 3173347 3095585 2936772 2902936 2764563 2650561 2626148 2599862 2553035 2487535
3974B487535p8899j10825j41041j4217r3501o0360L2789m5998k5911k2868j3277
$$ 2487535 2408636 2297811 2156770 2142553 2049052 1988692 2021481 1975483 1949572 1926704 1913427
3963A913427l1209l6779o1885r6489L7543M6595p5623q2837M2085p0737L6534
$$ 1913427 1882218 1845439 1783554 1687065 1724608 1771203 1695580 1612743 1654828 1584091 1620625
3952A620625N0413k8318q1181J8159K2046k073p565j6482k4258M425m308j8172
$$ 1620625 1671038 1642720 1561539 1579698 1601744 1599671 1592106 1575624 1551366 1555791 1551483 1533311
3940A533311p0511N3373l878k5903Q3262m8973l8873l131K5172k4175m7615K7477
$$ 1533311 1462800 1516173 1512295 1486392 1569654 1520681 1481808 1478677 1503849 1479674 1432059 1459536
3928A459536J8544j3477N61K6373l9762j475J02135o8850p6997J2729j790J16495
$$ 1459536 1478080 1464603 1465164 1491537 1451775 1450300 1552435 1483585 1406588 1419317 1417527 1534022
3916A534022P3437n3740N7716K2688o0045K3955J14618k672L361j2847N9922K8110
$$ 1534022 1607459 1553719 1611435 1634123 1574078 1598033 1712651 1709979 1713340 1700493 1760415 1788525
3904A788525o160J15154K6939l9852K3246J7639N4783P9822K34184J11444J17146
$$ 1788525 1782365 1897519 1924458 1884606 1907852 1925491 1980274 2060096 2294280 2405724 2522870
3893B522870K05300J35928N4973J7270r7953k06307j06632j64616j65519q9174
$$ 2522870 2728170 2864098 2919071 2936341 2838388 2632081 2525449 2360833 2195314 2106140
3883B106140n9633J0065M8280n9779l7318o7328O2739n675k5742L5229k7043j0490
$$ 2106140 2046507 2056572 2104852 2045073 2007755 1940427 2003166 1997491 1971749 2006978 1979935 1969445
3871A969445L1279P994j4617J4057l3864J974l3243R5765j906O191r670m9461
$$ 1969445 2000724 2008718 1994101 2008158 1974294 1976268 1943025 2038790 2036884 2043075 2033405 1983944
3859A983944Q9824J0181l041L4067l4877k6314l8538n1334N3709p404L7980O6179
$$ 1983944 2073768 2083949 2080908 2114975 2080098 2053784 2015246 1963912 2017621 2010217 2048197 2114376
3847B114376k088l5861J4164K1855j16585J13973m2354m8206M7158O3433L1078
$$ 2114376 2112288 2076427 2090591 2112446 1995861 2109834 2067480 2019274 2066432 2129865 2160943
3836B160943N858j0699M6673m6768j8906P901k1409n173j4497L3291N6665P3705
$$ 2160943 2166801 2156102 2202775 2156007 2137101 2145002 2123593 2118420 2103923 2137214 2193879 2267584
3824B267584M8947J5572K4704j1372K3258L6156k9029L0159N509n403N1552P6503
$$ 2267584 2316531 2332103 2356807 2345435 2368693 2404849 2375820 2405979 2411488 2406085 2457637 2534140
3812B534140k4152L8350j2113N9989R687J12694N9629J3706J1616R1090O6360
$$ 2534140 2509988 2548338 2536225 2596214 2605901 2718595 2778224 2791930 2803546 2894636 2960996
3801B960996R50K27N1873O2099J89520N3282n3815M0191R3892J8388P7565J41403
$$ 2960996 2961946 2962173 3014046 3076145 3265665 3318947 3265132 3305323 3399215 3417603 3495168 3636571
3789C636571K4395R0282P2392R9410L8631J11927J18113J41712J04190J30970
$$ 3636571 3660966 3751248 3823640 3923050 3961681 4073608 4191721 4333433 4437623 4568593
3779D568593J25732P5114J18260M5252R0855J63395J55680J20746J72420Q6429
$$ 4568593 4694325 4769439 4887699 4932951 5023806 5187201 5342881 5463627 5636047 5722476
3769E722476P8853J46389R2220R2723Q5269J56036Q9997K707O7909J14951P9137
$$ 5722476 5801329 5947718 6039938 6132661 6217930 6373966 6463963 6466670 6534579 6649530 6728667
3758F728667M2139M840O1788M2707N7436M3485r5757L3626K2323j2926K3153n7882
$$ 6728667 6770806 6775646 6837434 6880141 6937577 6981062 6885305 6918931 6941254 6928328 6951481 6893599
3746F893599q2400p7301l9473O2267J0572j17917m1675n5977q5735l9560m9633
$$ 6893599 6811199 6733898 6694425 6756692 6767264 6649347 6607672 6551695 6465960 6426400 6376767
3735F376767m1343p1289n6600n5175J5038k0778j29293o3067q7527K125l3282
$$ 6376767 6335424 6264135 6207535 6152360 6167398 6146620 6017327 5954260 5866733 5868858 5835576
3724E835576m5959p7966l5766j1955o9058k8741L1995l3314J5125j51872k7635
$$ 5835576 5789617 5711651 5675885 5663930 5594872 5566131 5598126 5564812 5579937 5428065 5400430
3713E400430P1862L2036j495r2171L2998M3903K5241Q746k3429N8267P522r8310
$$ 5400430 5472292 5504328 5502833 5410662 5443660 5487563 5512804 5521550 5498121 5556388 5563910 5465600
3701E465600J9563k1434j558l9224q507O4650J0282o3042K9307L2222M6193N3654
$$ 5465600 5485163 5463729 5462171 5422947 5414440 5479090 5489372 5426330 5455637 5487859 5534052 5587706
3689E587706K1143l4250L3521N4341N0139J5882K5251J0324l8637J7125N8228
$$ 5587706 5608849 5574599 5608120 5662461 5712600 5728482 5753733 5764057 5725420 5742545 5800773
3678E800773P2673P3577n515J6673O4153j2760J24747Q5050l6205M4189N6891
$$ 5800773 5873446 5947023 5941508 5958181 6022334 6009574 6134321 6219371 6183166 6227355 6284246
3667F284246K2781L6676J57839J30761J00299M0514J04862J00980J33322M9716
$$ 6284246 6307027 6343703 6501542 6632303 6732602 6773116 6877978 6978958 7112280 7161996
3657G161996P3674J10024R7683J66242R7059J33911J48869J32803J11207J44558
$$ 7161996 7235670 7345694 7443377 7609619 7706678 7840589 7989458 8122261 8233468 8378026
3647H378026J29268J32715R8208J78122K15372J29397J78113J76343J75226K24343
$$ 8378026 8507294 8640009 8738217 8916339 9131711 9261108 9439221 9615564 9790790 10015133
3637A0015133K33785K12626K16226K46908K23759K00819J93550K23314K13368
$$ 10015133 10248918 10461544 10677770 10924678 11148437 11349256 11542806 11766120 11979488
3628A1979488L16840L03359K68768K94034K59611L69250L16986K86077L91958
$$ 11979488 12296328 12599687 12868455 13162489 13422100 13791350 14108336 14394413 14786371
3619A4786371L56807L36015M19585M62370M63971N40255M96614N16423M74061
$$ 14786371 15143178 15479193 15898778 16361148 16825119 17365374 17861988 18378411 18852472
3610A8852472O60229O64582O34720O83132O76162P14998Q23817Q69199Q67738
$$ 18852472 19512701 20177283 20812003 21495135 22171297 22886295 23710112 24579311 25447049
3601B5447049R16680J002573R78654R72126J100868J154889J184779J241434J269708
$$ 25447049 26363729 27366302 28344956 29317082 30417950 31572839 32757618 33999052 35268760
3592C5268760J330379J335520J363495J489575J546488J548873J678640J805053
$$ 35268760 36599139 37934659 39298154 40787729 42334217 43883090 45561730 47366783
3584D7366783J733331J852227J882422J868663J704582J508529J290341J017473
$$ 47366783 49100114 50952341 52834763 54703426 56408008 57916537 59206878 60224351
3576F0224351Q49056M73902K89510K369k23036k97088l84159m12422l88229l72124
$$ 60224351 61073407 61547309 61836819 61839188 61616152 61319064 60934905 60522483 60134254 59762130
3566E9762130m31018n37344n19714p04536q69146j000803j328240j400220j648109
$$ 59762130 59331112 58793768 58274054 57569518 56700372 55699569 54371329 52971109 51323000
3557E1323000j825975j848180j949014k019378j850185j812166j732963j609027
$$ 51323000 49497025 47648845 45699831 43680453 41830268 40018102 38285139 36676112
3549C6676112j298908j265494j209529j094448r96005p75328p97342p86618o49815
$$ 36676112 35377204 34111710 32902181 31807733 30811728 30036400 29239058 28452440 27802625
3540B7802625n28153m47257m50085l87053l47651l03315k72127k77618k00795
$$ 27802625 27274472 26827215 26377130 25990077 25642426 25339111 25066984 24789366 24588571
3531B4588571j55861q3404j34557k7117r6187L4636j3769r2801o7623J4512J02561
$$ 24588571 24432710 24349306 24214749 24187632 24091445 24126081 24112312 24019511 23951888 23966400 24068961
3520B4068961q0193l4468l3342l1040p4529q0566j36870r8695p6113j46028k01652
$$ 24068961 23988768 23954300 23920958 23889918 23815389 23734823 23597953 23499258 23423145 23277117 23075465
3509B3075465j56623j72709k31084j59824j86507k23107k12133k58406k52458
$$ 23075465 22918842 22746133 22515049 22355225 22168718 21945611 21733478 21475072 21222614
3500B1222614k11978k69250k24056j83381k23836j90251j60513r3864k29250j54539
$$ 21222614 21010636 20741386 20517330 20333949 20110113 19919862 19759349 19665485 19436235 19281696
3490A9281696j48436j59640r3297j35471q2319r4376m1781l4507o6335j05859
$$ 19281696 19133260 18973620 18880323 18744852 18662533 18568157 18526376 18491869 18425534 18319675
3480A8319675n8215L0605l0772j5762O6999J6598l2677n767k5489K4057K0073
$$ 18319675 18261460 18292065 18261293 18245531 18312530 18329128 18296451 18290684 18265195 18289252 18309325
3469A8309325n4080N2514P4202N9337J01376O0991N3389J12751P9629J35414R7851
$$ 18309325 18255245 18307759 18381961 18441298 18542674 18603665 18657054 18769805 18849434 18984848 19082699
3458A9082699J39232J42642J22240K05595J37972J57946K35900J54101K09254
$$ 19082699 19221931 19364573 19486813 19692408 19830380 19988326 20224226 20378327 20587581
3449B0587581K22101J64312K18413K14495K46035K30351K72798K96160K52241
$$ 20587581 20809682 20973994 21192407 21406902 21652937 21883288 22156086 22452246 22704487
3440B2704487L28407L29955K97224L77366L53314L08375M16659M55095M66696
$$ 22704487 23032894 23362849 23660073 24037439 24390753 24699128 25115787 25570882 26037578
3431B6037578M96464M49403N20406N98003N93874N63537O21491O86516P19596
$$ 26037578 26534042 26983445 27503851 28101854 28695728 29259265 29880756 30567272 31286868
3422C1286868P65396P98944Q67043P59842P91635Q25574P71009N73456N50051
$$ 31286868 32052264 32851208 33718251 34478093 35269728 36095302 36866311 37439767 37989818
3413C7989818N96738M88589L83868L70735L14947K77187L43432L20418M08489
$$ 37989818 38586556 39075145 39459013 39829748 40144695 40421882 40765314 41085732 41494221
3404D1494221N10435M32057M94909O06231N70513P28332Q24394P92231Q58523
$$ 41494221 42004656 42436713 42931622 43537853 44108366 44836698 45661092 46453323 47311846
3395D7311846J010923J010383R69732J160108J207889J236017J241905J282771
$$ 47311846 48322769 49333152 50302884 51462992 52670881 53906898 55148803 56431574
3387E6431574J507100J454292J565957J586049J685570J764004J867673J982093
$$ 56431574 57938674 59392966 60958923 62544972 64230542 65994546 67862219 69844312
3379F9844312K034723K176036K198530K350345K492801K632467K808196L007391
$$ 69844312 71879035 74055071 76253601 78603946 81096747 83729214 86537410 89544801
3371H9544801L086273L175627L316740L423807L397453L310001L148836K911292
$$ 89544801 92631074 95806701 99123441 102547248 105944701 109254702 112403538 115314830
3363A15314830K715473K405770K063947J773513J510825J098403P85757N97719
$$ 115314830 118030303 120436073 122500020 124273533 125784358 126882761 127668518 128266237
3355A28266237L50303O9185O6754M442p4330p3778n1131q2195k67548m13740q24680
$$ 128266237 128616540 128685725 128752479 128756921 128682591 128608813 128557682 128475487 128207939 127794199 126969519
3344A26969519j101448j477649j749736j821834j859055j906361j805548j758699
$$ 126969519 125868071 124390422 122640686 120818852 118959797 117053436 115247888 113489189
3336A13489189j621932j341441j056508q41884m86339j96577J78461O16884R93394
$$ 113489189 111867257 110525816 109469308 108627424 108141085 107944508 108122969 108739853 109733247
3327A09733247J428779J839877K292228K734290L085011L340592L630539L857097
$$ 109733247 111162026 113001903 115294131 118028421 121113432 124454024 128084563 131941660
3319A31941660L998097L933677L858301L495298L024290K496584J870738J294148
$$ 131941660 135939757 139873434 143731735 147227033 150251323 152747907 154618645 155912793
3311A55912793Q11215M64566K34380K1460n7572r6028j96530l53925m36626p28993
$$ 155912793 156724008 157188574 157422954 157444414 157386842 157290814 157094284 156740359 156303733 155574740
3301A55574740j122079j654098k351027k899218l482265l947283m328154m573032
$$ 155574740 154452661 152798563 150447536 147548318 144066053 140118770 135790616 131217584
3293A31217584m620842m608297m569949m414011m158036l877234l546995l415414
$$ 131217584 126596742 121988445 117418496 113004485 108846449 104969215 101422220 98006806
3285I8006806l153961k886922k675566k415355k349276k172651k020185j886202
$$ 98006806 94852845 91965923 89290357 86875002 84525726 82353075 80332890 78446688
3277G8446688j740422j670625j462313j456943j331512j256736j044750j045264
$$ 78446688 76706266 75035641 73573328 72116385 70784873 69528137 68483387 67438123
3269F7438123j034650q62133q43312p46248p25306o44015n73978m78148m11339
$$ 67438123 66403473 65541340 64698028 63951780 63226474 62582459 62008481 61530333 61118994
3260F1118994l02073j97617k49918j20490n0966l2926N2739J76045K46021J82471
$$ 61118994 60816921 60619304 60369386 60248896 60197930 60165004 60217743 60393788 60639809 60822280
3250F0822280K95542K42690L33561L56776L69497M36115N51595N96227O29366
$$ 60822280 61117822 61360512 61694073 62050849 62420346 62856461 63408056 64004283 64633649
3241F4633649O15619P16900O56224Q14690Q89758R45198J070827J125147J258159
$$ 64633649 65249268 65966168 66622392 67437082 68326840 69272038 70342865 71468012 72726171
3232G2726171J350922J550136J600506J739502J810710J944487J990244J934019
$$ 72726171 74077093 75627229 77227735 78967237 80777947 82722434 84712678 86646697
3224H6646697J865158J875823J676539J659495J602337J445787J489508J557873
$$ 86646697 88511855 90387678 92064217 93723712 95326049 96771836 98261344 99819217
3216I9819217J441164J647691J773775J917195K138398K344337K445271K598066
$$ 99819217 101260381 102908072 104681847 106599042 108737440 111081777 113527048 116125114
3208A16125114K637254K385943K206322J879649J463488P22403J47695n09898
$$ 116125114 118762368 121148311 123354633 125234282 126697770 127420173 127567868 127057970
3200A27057970j340922j973344k634757l139797l337806l369253l219985l036694
$$ 127057970 125717048 123743704 121108947 117969150 114631344 111262091 108042106 105005412
3192A05005412k813107k691168k438378k302394k237365k138355j953906j747951
$$ 105005412 102192305 99501137 97062759 94760365 92523000 90384645 88430739 86682788
3184H6682788j720130j604518j417161j304384j099508r11351p66601n94110l83478
$$ 86682788 84962658 83358140 81940979 80636595 79537087 78625736 77859135 77265025 76881547
3175G6881547j92100j3511J44732M55591O36484R13116J017046R78190Q38678
$$ 76881547 76689447 76675936 76820668 77276259 77912743 78825859 79842905 80821095 81659773
3166H1659773O94806M09560K05038O8520p6824j45615j46840k24663m31428m07401
$$ 81659773 82354579 82764139 82969177 83037697 82960873 82815258 82668418 82443755 82012327 81604926
3156H1604926m32476l81561m14197l39685m22597m80284m96837p03797q32731
$$ 81604926 81172450 80790889 80376692 80037007 79614410 79134126 78637289 77933492 77100761
3147G7100761j011232j362167j549451j684862j888544k024418k059737k168512
$$ 77100761 76089529 74727362 73177911 71493049 69604505 67580087 65520350 63351838
3139F3351838k079719j903757j914788j808155j770808j808855j759261j646312
$$ 63351838 61272119 59368362 57453574 55645419 53874611 52065756 50306495 48660183
3131D8660183j518398j359169j285892j214566j093852r89394r81172r89632q91193
$$ 48660183 47141785 45782616 44496724 43282158 42188306 41198912 40217740 39228108 38336915
3122C8336915q31538q68888q75462p55393o79058o96618o41569o13796n74334
$$ 38336915 37505377 36636489 35761027 35005634 34326576 33629958 32988389 32374593 31800259
3113C1800259o34945n24627n03808n55390m12445m44905l88874k82980l95355
$$ 31800259 31165314 30640687 30136879 29581489 29169044 28724139 28335265 28052285 27656930
3104B7656930l54340k97581k72834k88463k45903j45478j79377j29544j29100
$$ 27656930 27302590 27005009 26732175 26443712 26197809 26052331 25872954 25743410 25614310
3095B5614310p0675r0320q4421j26987j27024j29438j27716j99417k10968j84904
$$ 25614310 25543635 25453315 25368894 25241907 25114883 24985445 24857729 24658312 24447344 24262440
3085B4262440k86748k06351j47606j86339k21064j08433j7054m2739J7150o2613
$$ 24262440 23975692 23769341 23621735 23435396 23214332 23105899 23088845 23046106 23063256 23000643
3075B3000643J5610N1422J74686K43589J55503J56126J76100J77473K06663J97149
$$ 23000643 23016253 23067675 23242361 23485950 23641453 23797579 23973679 24151152 24357815 24554964
3065B4554964J71053J49796J23920P1673O8482N266p7270m5420p1739j61931q3948
$$ 24554964 24726017 24875813 24999733 25071406 25139888 25145154 25067884 25022464 24950725 24788794 24704846
3054B4704846q6883j04818j91579k18479q7021j26070j77042j78309j25311j01819
$$ 24704846 24617963 24513145 24321566 24103087 24016066 23889996 23712954 23534645 23409334 23307515
3044B3307515k21992j33463j64830k10921k25626k36926j97694l49642l82896
$$ 23307515 23085523 22952060 22787230 22576309 22350683 22113757 21916063 21566421 21183525
3035B1183525k59113k47294k86176k36076k82628k95427k43908j55717j80126
$$ 21183525 20924412 20677118 20390942 20154866 19872238 19576811 19332903 19177186 18997060
3026A8997060j82375j00465j24459q8398l6477j06628n4719N3034o3719K549k7410
$$ 18997060 18814685 18714220 18589761 18501363 18464886 18358258 18303539 18356573 18292854 18295403 18267993
3015A8267993O3927J9619L4186O2951N2186P2800R5451J50384K3107J63162J45361
$$ 18267993 18331920 18351539 18385725 18448676 18500862 18573662 18669113 18819497 18842604 19005766 19151127
3004A9151127J62664J60231J44111K20336L26535L45153K89442K25344L28630
$$ 19151127 19313791 19474022 19618133 19838469 20165004 20510157 20799599 21024943 21353573
2995B1353573L58496L66424L57883M50248M59401M45656N19492M88430M84203
$$ 21353573 21712069 22078493 22436376 22886624 23346025 23791681 24311173 24799603 25283806
2986B5283806N85959N59509N38697N12653N64945N28707O60950O63104P85620
$$ 25283806 25869765 26429274 26967971 27480624 28045569 28574276 29235226 29898330 30683950
2977C0683950P93750P97218Q42854R98912J055071J037526J085462J159560J252545
$$ 30683950 31477700 32274918 33117772 34116684 35171755 36209281 37294743 38454303 39706848
2968C9706848J262377J333290J386968J368582J426625J355725J331468J274641
$$ 39706848 40969225 42302515 43689483 45058065 46484690 47840415 49171883 50446524
2960E0446524J183155Q73223O72026N36638J69314J01980m9105j59804j38072
$$ 50446524 51629679 52502902 53174928 53711566 53880880 53982860 53933755 53773951 53635879
2951E3635879j51212j3147O4467J26234K97151M36763N59677O44416Q11004R35131
$$ 53635879 53484667 53471520 53535987 53662221 53959372 54396135 54955812 55600228 56411232 57346363
2941E7346363J098201J207699J341479J585200J674528J809442J991163K190915
$$ 57346363 58444564 59652263 60993742 62578942 64253470 66062912 68054075 70244990
2933G0244990K479846K634073K987207L278419L518887L883875M321757M654914
$$ 70244990 72724836 75358909 78346116 81624535 85143422 89027297 93349054 98003968
2925I8003968N101792N568681O117203O716827P433873Q215974R200334J0221297
$$ 98003968 103105760 108674441 114791644 121508471 128942344 137158318 146358652 156579949
2917A56579949J1212353J2167807J3111430J3920164J4439969J4348035J3669393
$$ 156579949 167792302 179960109 193071539 206991703 221431672 235779707 249449100
2910B49449100J1630237Q059175L185141k130381o843329j0454429j2516526j3179898
$$ 249449100 261079337 269138512 272323653 270193272 263349943 252895514 240378988 227199090
2902B27199090j2838773j1922714j0753416r503568q310245p304599o450820n693254
$$ 227199090 214360317 202437603 191684187 182180619 173870374 166565775 160114955 154421701
2894A54421701n076976m611560m231053l784179l528771l266664l017427k749916
$$ 154421701 149344725 144733165 140502112 136717933 133189162 129922498 126905071 124155155
2886A24155155k542147k386433k243050k167137k148625k134169k192833k166656
$$ 124155155 121613008 119226575 116983525 114816388 112667763 110533594 108340761 106174105
2878A06174105k114959k121707j948899j912463j898161j850877j841033j863780
$$ 106174105 104059146 101937439 99988540 98076077 96177916 94327039 92486006 90622226
2870I0622226j697702j559081j467011j260246r96535p52587m93098j62268R4172
$$ 90622226 88924524 87365443 85898432 84638186 83641651 82889064 82395966 82233698 82327870
2861H2327870L07437O52557J006247J312173J809208K280897K446394K133494
$$ 82327870 82635307 83287864 84294111 85606284 87415492 89696389 92142783 94276277
2853I4276277J080582j88772j490491k602749l063977l140955k825850k395833
$$ 94276277 95356859 95168087 93677596 91074847 88010870 84869915 82044065 79648232
2845G9648232j965443j539584j086457o86917l93911Q4457L68316O11627R08126
$$ 79648232 77682789 76143205 75056748 74369831 73975920 74060377 74428693 75040320 75948446
2836G5948446J113625J319575J548078J709431J899977K017583K016603J867707
$$ 75948446 77062071 78381646 79929724 81639155 83539132 85556715 87573318 89441025
2828H9441025J545856J089124M80887m51088j396489k339595l065847l804135
$$ 89441025 90986881 92076005 92556892 92105804 90709315 88369720 85303873 81499738
2820H1499738m277194m486095m464641m334009m119156l798712l477822l199799
$$ 81499738 77222544 72736449 68271808 63937799 59818643 56019931 52542109 49342310
2812D9342310k925648k696155k449949k209931j945757j796629j693970j435218
$$ 49342310 46416662 43720507 41270558 39060627 37114870 35318241 33624271 32189053
2804C2189053j524336j318537j189014j191192j054689r86759q80559q98501q09548
$$ 32189053 30664717 29346180 28157166 26965974 25911285 24924526 24043967 23145466 22335918
2795B2335918p89179p70579p10110o29727o12483o61261n43758n97546n51059
$$ 22335918 21546739 20776160 20066050 19436323 18823840 18162579 17618821 17021275 16470216
2786A6470216m58880m33344m82067m85941l33128m21092l82140l08545l68755
$$ 16470216 16011336 15577992 15095925 14609984 14276856 13855764 13473624 13165079 12796324
2777A2796324l96464l16441l16480l29751k79839j80054k12958k92980k50659
$$ 12796324 12399860 12083419 11766939 11437188 11157349 10977295 10764337 10471357 10220698
2768A0220698k29247j87682k51318k31964k12738j37429j91536k10077j12404
$$ 10220698 9991451 9803769 9552451 9320487 9107749 8970320 8778784 8568707 8456303
2759H456303j72130j68870j36435j41391j26170j69674j80592l9735k3017j31172
$$ 8456303 8284173 8115303 7978868 7837477 7711307 7541633 7361041 7321306 7298289 7167117
2749G167117j62537j10146p0727j31479o1756n8858n6257j09734p9311j04815
$$ 7167117 7004580 6894434 6823707 6692228 6630472 6571614 6515357 6405623 6326312 6221497
2739F221497m1990r9031q2650q2034j50447j1816r0219q2307k1588o5678o3417
$$ 6221497 6179507 6080476 5997826 5915792 5765345 5753529 5663310 5581003 5559415 5493737 5430320
2728E430320j06423j07405p2494j15654r8738j08834p1125K745r1862j39497l0908
$$ 5430320 5323897 5216492 5143998 5028344 4929606 4820772 4749647 4752392 4660530 4521033 4490125
2717D490125p2993l7149j12946j27130M9178m9020p2259m4398j02516L6287q3403
$$ 4490125 4417132 4379983 4267037 4139907 4189085 4140065 4067806 4023408 3920892 3957179 3873776
2706C873776p7667N6072j02927l3928J0385j6191m2867n3407j35176j67214N3961
$$ 3873776 3796109 3852181 3749254 3715326 3725711 3709520 3666653 3613246 3478070 3310856 3364817
2695C364817j3433l0042M9886J2173r3968j03270L4844j0931o8436l6250k8801
$$ 3364817 3351384 3321342 3371228 3383401 3289433 3186163 3221007 3210076 3141640 3105390 3076589
2684C076589N0825k5079l0700q899L9647l4673m9729p9342K2031K0541r5452k9074
$$ 3076589 3127414 3102335 3071635 3062736 3102383 3067710 3017981 2938639 2960670 2981211 2885759 2856685
2672B856685r3843O9669L7465J8595n0331q1843N3296J0804J7356K1021n9369
$$ 2856685 2762842 2832511 2869976 2888571 2838240 2756397 2809693 2820497 2837853 2858874 2799505
2661B799505n921L4994K9922q6561l7408L6035K5253l9212l8639k6785r984J1929
$$ 2799505 2793584 2828578 2858500 2771939 2734531 2770566 2795819 2756607 2717968 2691183 2681199 2693128
2649B693128j218J0300Q727n3042j3749l3351n5564M0532R471K9475m0866n8041
$$ 2693128 2691910 2702210 2710937 2657895 2644146 2610795 2555231 2595763 2605234 2634709 2593843 2535802
2637B535802N1622P8270L7405K9961L1595o0005P1563M9175N9986Q9438O8270
$$ 2535802 2587424 2665694 2703099 2733060 2764655 2704650 2776213 2825388 2885374 2974812 3043082
2626C043082p9777P0747N9368p8633J3352J9237J9946j05121q4559M936m2805
$$ 3043082 2963305 3034052 3093420 3014787 3028139 3047376 3067322 2962201 2877642 2882578 2839773
2615B839773k2223j22458j13178m770J1425o8817m6947j8713r3155M8987r2517
$$ 2839773 2817550 2695092 2581914 2577144 2588569 2519752 2472805 2454092 2360937 2409924 2317407
2604B317407r6388o1421o227o7659K0336r386j9838k3970P1797Q346j9796o9947
$$ 2317407 2221019 2159598 2153371 2085712 2106048 2096662 2076824 2052854 2124651 2132997 2113201 2043254
2592B043254n5172L1503m8658k3197o5543K7838K0409j02448k4219M5939j3465
$$ 2043254 1988082 2019585 1970927 1947730 1882187 1910025 1930434 1827986 1803767 1849706 1836241
2581A836241l8767q8854q6859L6359L9087L4994k07o52M0930M233K6654M887k587
$$ 1836241 1797474 1708620 1621761 1658120 1697207 1732201 1731994 1731342 1772272 1776505 1803159 1808046 1805459
2568A805459l1603k8911l3439p6344K6666n4649j5160n1259o5355P366J3021m140
$$ 1805459 1773856 1744945 1711506 1635162 1661828 1607179 1592019 1540760 1475405 1482771 1495792 1491652
2556A491652J5789L8689l300j9382L202m6279J8047K7776j5055m911J8700M1334
$$ 1491652 1507441 1546130 1542830 1523448 1526650 1480371 1498418 1526194 1511139 1506228 1524928 1566262
2544A566262l7800n3997l9308N39k2699N8688l3274n1167j2360k6690j7341L776
$$ 1566262 1528462 1474465 1435157 1435696 1412997 1471685 1438411 1387244 1374884 1348194 1330853 1334629
2532A334629l7509m623l3645m6751o8847j1052N4271j9641k9516P353q5227k6835
$$ 1334629 1297120 1292497 1258852 1212101 1143254 1132202 1186473 1166832 1137316 1144669 1059442 1032607
2520A032607n0341J3924j4243K9745p3922N56L4924O580M0434l9441n2383m106
$$ 1032607 982266 996190 981947 1011692 937770 938326 973250 979830 1020264 980823 928440 924334
2508I24334n6442m580P4719k4281K619l7621k1800p3517j2704K6509L6916n5934
$$ 924334 867892 863312 938031 913750 916369 878748 856948 783431 770727 797236 834152 778218
2496G78218o2867M1351M6423o063L6993L7093l5697j3093k2771m4393q92P9131
$$ 778218 715351 756702 803125 797062 834055 871148 835451 822358 799587 755194 754302 833433
2484H33433k6653j06101J4261q247l2694m3077L7937k6928J4860L5069j9667l2833
$$ 833433 806780 700679 714940 706693 673999 630922 668859 641931 656791 691860 672193 639360
2472F39360O0124O8112K1262j36094n7082L1891N7105M4272j3101m1496k8872
$$ 639360 699484 767596 788858 652764 595682 627573 684678 728950 715849 674353 645481
2461F45481J0868Q529N617l5270J9314J0450l6071k045K097N3242J6748n8357
$$ 645481 656349 664878 670495 635225 654539 664989 628918 626873 628970 682212 698960 640603
2449F40603l4386J6121l116n1744L9070J4563P3313k3298l3307q6130k5085K6465
$$ 640603 606217 622338 619222 567478 606548 621111 694424 671126 637819 551689 526604 553069
2437E53069j7168o8756l53J0246M6212P2285l2664J9682o0392o0630P1892N0771
$$ 553069 535901 467145 466792 477038 523250 595535 562871 582553 522161 461531 533423 584194
2425E84194j0851o9421k1410Q0172K3262q5633N710o147m7735k5044J8279L7614
$$ 584194 573343 503922 482512 562684 585946 500313 506023 499876 452141 427097 445376 482990
2413D82990n507m5118m1103k481J8492k9640j7356O9585M7801k0505o035p3312
$$ 482990 477483 432365 391262 388781 407273 377633 360277 429862 477663 457158 451123 377811
2401C77811m4667L4600J02094j8529j9642l6963L4093O6285p5036J6768L0368
$$ 377811 333144 367744 469838 451309 431667 394704 428797 495082 420046 436814 467182
2390D67182L4809l1874l0826j4172Q1858l0306o780N3794q4002J8953k4279q1351
$$ 467182 501991 470117 439291 425119 506977 476671 469891 523685 439683 458636 434357 353006
2378C53006L1366k1237j4110n7192O1017l3225K2458R497K0467K01n702m4266
$$ 353006 384372 363135 349025 291833 352850 319625 342083 351580 372047 372248 366546 322280
2366C22280K1084J2870J0664J4712K3512K4465L1840j9461o0307j1470R680J10581
$$ 322280 343364 356234 366898 381610 405122 429587 461427 441966 381659 370189 379869 490450
2354D90450k7115p8443R756l3649p3981J2376K7751L6914o259K0437k1676R595
$$ 490450 463335 384892 394648 360999 287018 299394 327145 364059 357800 378237 356561 366156
2342C66156m1631o799j2568K2845J2036O0223p002L1278m7796l5986P5299l8488
$$ 366156 324525 317726 305158 328003 340039 400262 393260 424538 376742 340756 416055 377567
2330C77567M1011m7451l9756J00861K1401L2729N3350p6551l7889P293K7670J0924
$$ 377567 418578 371127 331371 432232 453633 486362 539712 463161 425272 432565 460235 471159
2318D71159j5941O6080l579p7383k5488k7116n0585M7457k9366l975L2955j1645
$$ 471159 455218 521298 517719 440336 414848 387732 337147 384604 355238 351263 384218 372573
2306C72573q3077N6861M4779J8639L4320o1527o0679n9366N1213J15449L807q3813
$$ 372573 289496 346357 391136 409775 444095 382568 321889 262523 313736 429185 432992 349179
2294C49179p8091q063O3097l4094L2338l0767m8491N081M8141M304j53m7288K6344
$$ 349179 271088 263025 326122 292028 324366 293599 245108 250189 298330 302634 302481 255193 281537
2281B81537K5504R278M9672l4664j4794k5625L2027M3966l244r2188L6577M4077
$$ 281537 307041 316319 365991 331327 316533 290908 322935 366901 363657 271469 308046 352123
2269C52123M6728n975j17330K3259N3297j4166m3198N647k24N137M6263K7308
$$ 352123 398851 392876 275546 298805 352102 337936 294738 300385 300161 305298 351561 378869
2257C78869R142M4098p4612r5497O9796L2099o145r624j9398J052J6233k8141
$$ 378869 388011 432109 357497 262000 331796 363895 357750 348126 328728 329780 346013 317872
2245C17872l2527j9886K5057K834M1918n521J4548P8926n6436k2796o5099P51
$$ 317872 285345 265459 290516 293350 335268 329747 344295 423221 366785 343989 278890 279641
2233B79641k3267L3387J6542N1501j8181n1019n92k7020p628J2399L0877Q891
$$ 279641 256374 289761 306303 357804 339623 288604 288012 260992 253364 265763 296640 305531
2221C05531n6175K3468O8981P5252o2440j09362k4772L4896P5462J7852J3178
$$ 305531 249356 272824 341805 417057 354617 245255 220483 255379 330841 348693 361871
2210C61871J8965m5011L1686l226m6637R662N5549L6349p8134J8986o2287L9794
$$ 361871 380836 335825 367511 364285 317648 327310 382859 419208 341074 360060 297773 337567
2198C37567M0538L9360K3489R361K806L1536k6631K9250j6912p7194R213L4200
$$ 337567 378105 417465 440954 450315 453121 484657 458026 487276 470364 393170 402383 436583
2186D36583J9822m4477m9896K7178Q6191k4573m0848M143j6322m9724j7287P4537
$$ 436583 456405 411928 362032 389210 475401 450828 409980 414123 397801 348077 330790 405327
2174D05327P5885p3647O347j4829L8824J0175l4925K600K2963L1756N3729J90
$$ 405327 481212 407565 413912 399083 437907 448082 413157 415757 438720 470476 524205 524395
2162E24395j6000n6601R843L7252n1176k831n687J1639K0292M8666n7k2416m0019
$$ 524395 508395 451794 461637 498889 447713 444882 439195 450834 471126 519792 519735 497319 457300
2149D57300r493N7593Q7460j040j1323p2784P069Q9197K4659l5984N6139J7101
$$ 457300 447807 505400 592860 591820 580497 507713 514782 603979 628638 592654 648793 665894
2137F65894l7937J0464j8464l1174P0598J7748p633N9464J6618k3348N0516j6325
$$ 665894 627957 638421 619957 588783 659381 677129 669496 728960 745578 722230 772746 756421
2125G56421L7647L600M1543N6995K7884l6652k8982j0006J9870R0209N4879J6549
$$ 756421 794068 797668 839211 896206 924090 887438 858456 848450 868320 958529 1013408 1029957
2113A029957O41L1043j7326J4731M1517Q4070O7170Q4101j8105n0966J17184J9663
$$ 1029957 1030598 1061641 1044315 1059046 1100563 1184633 1251803 1335904 1317799 1266833 1384017 1403680
2101A403680l9703j4302L9619Q5611J2998J03713l7982Q6738N1060P9386R6210
$$ 1403680 1363977 1349675 1389294 1474905 1487903 1591616 1553634 1640372 1691432 1770818 1867028
2090A867028Q2093N8715L3785Q2300Q1775M7847J57076O6914j0232M5947J26474
$$ 1867028 1949121 2007836 2041621 2123921 2205696 2253543 2410619 2477533 2467301 2513248 2639722
2079B639722J78154P6501J85129J34380J71997J94714K21690K65805L01134K40014
$$ 2639722 2817876 2894377 3079506 3213886 3385883 3580597 3802287 4068092 4369226 4609240
2069D609240K50516L28390L52896M00690L69655L73012M01823O37510O44564Q32447
$$ 4609240 4859756 5188146 5541042 5941732 6311387 6684399 7086222 7723732 8368296 9200743
2059I200743R97334J060471J357086J599284J974849K448750K476255J432332
$$ 9200743 10198077 11258548 12615634 14214918 16189767 18638517 21114772 22547104
2051B2547104L2912j072618k030669k482495k404455k096966j707429j350808
$$ 22547104 22580016 21507398 19476729 16994234 14589779 12492813 10785384 9434576
2043I434576j086752q97549p59526o55373m66032l39125l35282l02133l07303
$$ 9434576 8347824 7450275 6690749 6035376 5569344 5230219 4894937 4592804 4285501
2034D285501k13709k33746k81559k04144j69047j83625j75932j37953j39336q0704
$$ 4285501 4071792 3838046 3556487 3352343 3183296 2999671 2823739 2685786 2546450 2465746
2024B465746j56716n7561j50914j23130n2684j20091m1628j07787n0090q9960
$$ 2465746 2309030 2251469 2100555 1977425 1924741 1804650 1763022 1655235 1605145 1515185
2014A515185o0931R511j58373p5705p0116m7488l2439n9339l4453p767O3232k3138
$$ 1515185 1454254 1463765 1305392 1229687 1159571 1112083 1079644 1020305 985852 978085 1041317 1018179
2002A018179j8129k4163q943p9413l0761P5978m9841q2691j6091K6448K1832n366
$$ 1018179 1000050 975887 966944 887531 856770 932748 882907 800216 784125 810573 832405 827039
1990H27039n1119m2587l4560L1952j0771l7872J1906k6802o771K0884k2208m2799
$$ 827039 775920 733333 698773 730725 719954 682082 693988 667186 660415 681299 659091 616292
1978F16292m3317p494k1291O483m7151O5167m4079l094M7222n6904n2220k3676
$$ 616292 572975 565481 544190 550673 503522 568689 524610 521516 568738 511834 459614 435938
1966D35938M5928m8010J7465l0964n4479n5172K2082M6714M0331k0922q3058K470
$$ 435938 481866 433856 451321 420357 365878 310706 332788 379502 419833 398911 315853 318323
1954C18323Q065P352Q996j16007K4147Q2372J4594m6297j8798K9712j7612N7077
$$ 318323 326388 333740 342736 226729 250876 333248 347842 301545 282747 312459 294847 351924
1942C51924K7490r4599q3740P989K8341p966M2205j9407K2018j3555O5304j4728
$$ 351924 379414 284815 201075 209064 237405 229439 271644 252237 274255 260700 326004 311276
1930C11276m9814m9947p534N6605p0034N0915N517J1629r414p1671j8431M1052
$$ 311276 261462 211515 203981 260586 190552 241467 246984 258613 249199 177528 159097 200149
1918B00149l5383q2201P5894R8877l3056j4758p0837L4970L6772j7380j2269j736
$$ 200149 164766 82565 158459 257336 224280 209522 138685 173655 210427 193047 180778 179042
1906A79042j6490k0782n2241m3638J3795L4607L512k6714L9745O3813j2549J5253
$$ 179042 162552 141770 89529 45891 59686 94293 97805 71091 110836 174649 162100 177353
1894A77353j3241l5034K6699j1309P769K8779k2739q551Q4439m3546j09838J2872
$$ 177353 164112 129078 155777 144468 152237 181016 158277 149726 234165 190619 80781 93653
1882I3653O0060O4324m4200j3706j1449n6791P0383L8362k4294j3907J4318K229
$$ 93653 153713 218037 173837 160131 148682 91891 162274 200636 176342 162435 176753 178982
1870A78982n3170O480l8134j8417O736K3461j9229j5554N1244o4876l2943J0354
$$ 178982 125812 132292 94158 75741 82477 105938 86709 71155 122399 57523 24580 34934
1858C4934K1643Q5521L3345l9507k3607j1957m689J1762k6633J2397l496O078
$$ 34934 56577 142098 175443 135936 112329 100372 95683 107445 80812 93209 89713 95791
1846I5791J0088M223K5268j0411j3349M1277L3692m6324n2927J3421K6918j2421
$$ 95791 105879 110102 135370 124959 111610 152887 186579 140255 87328 100749 127667 115246
1834A15246l8947R260L3804K83K337l0390M1067o6522J384L8927J037o7854k3850
$$ 115246 76299 85559 119363 119646 121983 91593 132660 66138 67522 106449 107486 39632 15782
1821A5782L2865J2651K993o5456L7031J21641p3433k6439O8324K5974j3141J4377
$$ 15782 48647 61298 64291 -1165 35866 157507 84074 57635 125959 151933 138792 153169
1809A53169r3706n5243J0214M5155P3053N549j5136o1469K1138Q6754o4387n2168
$$ 153169 59463 4220 14434 59589 132642 138191 123055 61586 82724 169478 105091 52923
1797E2923L2334m99M7472L159l7852O0133k5117k622Q87q1159P6516K1936K5852
$$ 52923 85257 84758 132230 135389 97537 157670 132553 129931 130818 49659 126175 148111 173963
1784A73963J4205L429L3171j1893m3393l5696l5701Q070L3271m303m7739j8236
$$ 173963 188168 191597 224768 212875 169482 133786 98085 106155 139426 135123 87384 69148
1772F9148O2756p2198k6875O5219k0038L1279k9470M6648n0094O328O564L657
$$ 69148 131904 59706 32831 98050 78012 109291 79821 126469 76375 82703 89267 92924
1760I2924M224M8354o7263l4573L5257P09K003l7540L3095K9394l3972n6428L3532
$$ 92924 97148 145502 78239 43666 78923 79632 81635 44095 77190 106584 72612 16184 49716
1747D9716k98j1510j4596L3291m5717M379J619Q3549L463n0739n1871p117N9885
$$ 49716 49418 37908 23312 56603 10886 15265 16884 100433 103896 53157 1286 -5831 54054
1734E4054o1954k8399O157L0378J3088J6472n2795m8224O5838J9611L224L3775
$$ 54054 -7900 -36299 -30142 236 13324 29796 -22999 -71223 -5385 14226 17450 51225
1722E1225K3649o1553L0717M188n5747N5768K3026m79j7998o470k101K79l0865
$$ 51225 74874 13321 44038 48226 -7521 48247 71273 70794 52796 46326 44225 44504 13639
1709A3639L4634o593l8046L3698L3261j3726j6550m4377l791Q1061J3609k3033
$$ 13639 48273 41680 3634 37332 70593 56867 40317 -4060 -7851 73210 86819 63786
1697F3786j0032j9699J4P914J9383j992l5671L5609r65k1576l6640m6491N0187
$$ 63786 53754 34055 34069 41983 61366 59374 23703 59312 58347 36771 131 -46360 3827
1684C827N0486p078j8720M1740l6777p076K1760k9790N690n7792M2514l3133J2645
$$ 3827 54313 47235 28515 70255 33478 26402 48162 18372 24062 -33730 8784 -24349 -11704
1671a1704P4650n720m845j1087J4604Q052p4576K417R129L311O3591o5928m4132
$$ -11704 62946 57226 52381 41294 55898 63950 -10626 -8209 920 4231 67822 1894 -42238
1658d2238j4776k8288O3257N5682K8405o032l9365j8930M8529L5844m5497M0866
$$ -42238 -57014 -85302 -22045 33637 62042 56010 16645 -2285 46244 82088 36591 77457
1646G7457m3248K450l4423k6887R937l0625k0854O2487l4844k6660P7651M4934
$$ 77457 34209 36659 2236 -24651 -14714 -45339 -66193 -3706 -38550 -65210 12441 57375
1634E7375j1702j8202J8793n4868J5104r80m7011L8759j4819J5110K4414o729
$$ 57375 45673 27471 46264 -8604 6500 5520 -41491 -2732 -17551 -2441 21973 15244
1622A5244L7554j1997m1190j7475K4394J6726m654L2678J4834m6064m3131j4075
$$ 15244 52798 40801 -389 -17864 6530 23256 18602 51280 66114 20050 -23081 -37156
1610c7156K1333Q574N434L9684j9977l3354P7494N189k2219r0m6659k2954M6522
$$ -37156 -15823 -7249 -1815 37869 17892 -15462 62032 67221 45002 44912 -1747 -24701 21821
1597B1821L6439l8180m837J454n8707m4211Q1157q953J3419O2399k8353M6511
$$ 21821 58260 20080 15243 16697 -42010 -86221 -5064 -14017 -598 61801 33448 79959
1585G9959K8970m9417p3346j4017M1451N814r6436P698K8242J5778j9971J469
$$ 79959 108929 59512 -13834 -27851 13600 19414 -77022 -69324 -41082 -25304 -45275 -43806
1573d3806K1900P657J0753j4180k1986p905K2476O4951l4713o3871O5198L8439
$$ -43806 -21906 -14249 -3496 -17676 -39662 -47567 -25091 39860 5147 -58724 6474 44913
1561D4913n8843L8240j5656J3499N5864j2671n8661J358J1785n5997O5831j3512
$$ 44913 -13930 24310 8654 22153 78017 65346 6685 8043 19828 -36169 29662 16150
1549A6150J082P411l9972n4896M8072J26915l4276r9137o7011L8527L1186L0771
$$ 16150 17232 24643 -15329 -70225 -22153 104762 70486 -28651 -95662 -57135 -25949 4822
1537D822m0094J7453K360L2709k061M9884J0810o6234J7783J0233m3609j3439
$$ 4822 -35272 -17819 -15459 17250 15189 65073 75883 9649 27432 37665 -5944 -19383
1525a9383L3479n625L369K8211M8643l1904o427M804j2984L6746l2601r0674Q7239
$$ -19383 14096 8471 11840 40051 88694 56790 50363 55167 42183 78929 46328 -44346 42893
1512D2893m86m4844O6926m6822L2648J0521N055J4373j3994l2428l5613p273N6843
$$ 42893 42407 -2437 64489 17667 50315 60836 65891 80264 66270 33842 -1771 -9044 47799
1499D7799p196p7098k4566K4654O6788r8683L5241j0333j4799K6357J5175l0850
$$ 47799 40603 -36495 -61061 -36407 30381 -68302 -33061 -43394 -58193 -31836 -16661 -47511
1487d7511J4373j1961N1352O6632j4202o6870J2360l0432k4692O5691L7110n8984
$$ -47511 -33138 -45099 6253 72885 58683 -8187 4173 -26259 -50951 14740 51850 -7134
1475g134l940Q420L6701o9412j4316J2472O6170j7753j7742M0905n1497j338J015
$$ -7134 -11074 -2654 34047 -35365 -49681 -37209 28961 11208 -6534 34371 -17126 -18464 -17449
1462a7449j1749k7015P2494L3673n390l995j468n0188k9347O6650L2803m3058
$$ -17449 -29198 -56213 16281 49954 44564 40569 39101 -11087 -40434 26216 59019 15961
1450A5961l5261K4649r445K830N9593K6354p1566n7985m118j8759K2835o1012
$$ 15961 -19300 5349 -4096 -1266 58327 84681 13115 -44870 -48988 -67747 -44912 -105924
1438a05924M0284m4928O3708N8578m7166J2342R0878j3665q9163K1016J7148j5785
$$ -105924 -65640 -110568 -46860 11718 -35448 -23106 67772 54107 -35056 -14040 3108 -12677
1426a2677k1980L3046K2034q2304o6503M0191J19581m2670Q772N178K5224J6465
$$ -12677 -34657 -1611 20423 -61881 -128384 -88193 31388 -11282 -2510 2668 27892 44357
1414D4357r3071J4291L0030q332M074K6764O217k3800l1816J7653L9267Q922m7017
$$ 44357 -48714 -34423 -4393 -12725 -8651 18113 24330 530 -31286 -13633 25634 34556 -12461
1401a2461K0794k5685P5479n3413p2915J2794K5483m8574j9337N8601P4800l2453
$$ -12461 8333 -17352 58127 4714 -68201 -55407 -29924 -78498 -97835 -39234 35566 3113
1389C113J8737N8573k7380m0992P780L2783j1677Q0332j8514K8579r1817j0512
$$ 3113 21850 80423 53043 12051 19831 52614 40937 121269 102755 131334 39517 29005
1377B9005J7711n0960l0704L6299q528J6290j9315J929M2615o1617k1169o5685
$$ 29005 46716 -4244 -34948 1351 -7177 9113 -10202 -8273 34342 -27275 -48444 -114129
1365a14129L5978P4896Q8030l3600n3339M2904k0955k4456q1098N0837M7482j9895
$$ -114129 -78151 -3255 84775 51175 -2164 40740 19785 -4671 -85769 -34932 12550 -7345
1353g345n5337Q0249p0184j3072N0173K542K7011l8367l1709m1997K8456q284
$$ -7345 -62682 17567 -52617 -65689 -15516 -12974 14037 -24330 -56039 -98036 -69580 -77864
1341g7864K6847l0497K1291L1670J681P0307m1278j3301k9511K6660L5041J3735
$$ -77864 -51017 -81514 -60223 -28553 -26872 43435 2157 -11144 -40655 -13995 21046 34781
1329C4781Q574p1288J1712M6630n0824m2144J5536M5872r02N137j2232k0089N5231
$$ 34781 43355 -27933 -16221 30409 -20415 -62559 -47023 -1151 -2053 3084 -9148 -29237 25994
1316B5994l5695k7033N189K8946n930N5397l2950k7160L1051j1336L5907J3829
$$ 25994 -9701 -36734 -31545 -2599 -8529 46868 13918 -13242 17809 6473 42380 56209
1304E6209o361l3745k2411L0479L5372L5947o6305j7243l7101K6055P0804l6K7527
$$ 56209 49848 16103 -6308 24171 59543 95490 29185 11942 -25159 896 71700 71664 99191
1291I9191o0729n0739K4183k9269k1470j5529N1841O1289r9472L312J5032j8264
$$ 99191 38462 -12277 11906 -17363 -38833 -54362 -2521 58768 -40704 -37392 -22360 -40624
1279d0624N594k822J6619o974m7834J2929L0861m5725Q115N3060N5430n8180M3050
$$ -40624 -35030 -37852 -21233 -28207 -76041 -63112 -32251 -77976 -69861 -16801 38629 -19551 23499
1266B3499Q500m5450m6645n0480k307J6349O9075K6147l7697P933m7026o675L6628
$$ 23499 31999 -13451 -60096 -110576 -112883 -96534 -27459 -1312 -39009 -31076 -78102 -84777 -48149
1253d8149K678k3937J8369J1333J9722k8920l6209M7038L1958q3158P0730M1857
$$ -48149 -45471 -69408 -51039 -39706 -19984 -48904 -85113 -38075 -6117 -89275 -18545 23312
1241B3312J7794J7712j0436j8324m6552L8342p3987l1316J5807j2670m1533m260
$$ 23312 41106 58818 48382 30058 -16494 21848 -52139 -83455 -67648 -80318 -121851 -126111
1229a26111P3506K9078l4356k5305L6367O2476j9160M541j4328j3699J5032j557
$$ -126111 -52605 -23527 -57883 -83188 -46821 15655 -3505 1036 -13292 -26991 -11959 -13516
1217a3516N773M3562o1994k7206j9256J6843Q607M0593K7947K4446j9929p4283
$$ -13516 -7743 35819 -26175 -53381 -72637 -55794 -47187 -6594 21353 45799 25870 -48413
1205d8413j7765l954N6646l4916K3477O4847n3205N0325J8589l5291N7785k6046
$$ -48413 -66178 -70132 -13486 -48402 -24925 39922 -13283 37042 55631 20340 78125 52079
1193E2079n0701P7262l5499o1927k6128K9316O6264n9713L6853l9875K8883l2175
$$ 52079 1378 78640 43141 -18786 -44914 -15598 50666 -9047 27806 -12069 16814 -15361
1181a5361j4580P3723k4630L9j9405l980K6032j2517k3424j2040k006j6687K612
$$ -15361 -29941 43782 19152 19191 -214 -4194 21838 9321 -14103 -26143 -28149 -44836 -42224
1168d2224N0821O3138j3640m3234k7920J5480M192K9241J2178l0686n271l6473
$$ -42224 8597 71735 58095 14861 -13059 2421 6613 35854 48032 17346 12075 -24398
1156b4398O8836l7453n8534O6370K9383p5156J7846j4399j8538k7774M4634l027
$$ -24398 44438 6985 -51549 14821 44204 -30952 -13106 -27505 -46043 -73817 -29183 -32210
1144c2210M3566q8335M4409J0822Q242M6067p609J1450q3949J3932M2981m801
$$ -32210 11356 -76979 -32570 -21748 -13506 32561 24952 36402 -47547 -33615 9366 4565
1132D565J7135j5898m5380M0527p992O3725l3558m3921L9222N8217j8966K5138
$$ 4565 21700 5802 -39578 949 -7043 56682 23124 -20797 18425 76642 57676 82814
1120H2814q7306J9516O3333j08575J3382q517k8605L9346M419J8896L5417l6891
$$ 82814 -4492 15024 78357 -30218 -16836 -25353 -53958 -14612 -10193 8703 44120 7229
1108G229K1931o3169j1501L5438N9687k3279k6931k6709R745p288Q5513k268j0971
$$ 7229 29160 -34009 -45510 -10072 49615 26336 -595 -27304 -17559 -24847 60666 58398 47427
1095D7427o2712j17265P5182L024K211m5623M5527P6109j5891j08149l2944J03713
$$ 47427 -15285 -132550 -57368 -54344 -52133 -97756 -52229 23880 7989 -100160 -133104 -29391
1083b9391K429L8419L5631n9989j2999k5647m644k0546K7650M0554K3582l9717
$$ -29391 -26962 11457 47088 -12901 -25900 -51547 -56191 -76737 -49087 -8533 15049 -24668
1071b4668K2263l2560l868r080j6739Q817J6839m4957J5858k0863m2574J8931
$$ -24668 -2405 -34965 -38833 -47913 -64652 -55835 -38996 -83953 -68095 -88958 -131532 -112601
1059a12601O1554K6104K8184o722j209r3519K1367L2276j1832l0523P0228P7447
$$ -112601 -51047 -24943 3241 -3481 -4690 -98209 -76842 -44566 -56398 -86921 -16693 60754
1047F0754k4812p7338k4063p233J7649l6207k1849l9722J8510M2381P1174Q2662
$$ 60754 35942 -41396 -65459 -72692 -55043 -91250 -113099 -152821 -134311 -91930 -20756 61906
1035F1906k3206N0025p2205n4806j2391O6265J0566l8188J2004J5705o4575j8314
$$ 61906 38700 88725 16520 -38286 -50677 15588 26154 -12034 -30 15675 -48900 -67214
1023f7214N2258O3579l9308m6031K1441N8470j7182p3904M979M9101n3028l9969
$$ -67214 -14956 48623 9315 -36716 -15275 43195 26013 -47891 -42912 6189 -46839 -86808
1011h6808R870K2804p88N4413q033k7187Q7777R415J0123m2427k1177K3248l8437
$$ -86808 -76938 -54134 -54922 -509 -8542 -35729 52048 61463 71586 29159 7982 31230 -7207
998g207q196Q354j8190r882k8744K2219L9002m7889m192M1695m543L623k5396
$$ -7207 -15403 -7049 -25239 -35121 -63865 -41646 -2644 -50533 -54725 -13030 -17573 -13950 -39346
985c9346j1525O7531k9267r653K6832L0431l2409l5594J187N6647p0952M0876
$$ -39346 -50871 16660 -12607 -22260 4572 35003 2594 -33000 -31813 24834 -46118 -5242
973e242j0853m7998J8932o214l2804O6195j0318Q709j8800N3029K9232m0484l8300
$$ -5242 -16095 -64093 -45161 -51375 -84179 -17984 -28302 -19593 -38393 14636 43868 3384 -34916
960c4916J4067k7004O495J1536K2254j4694r7355K2926K9218Q2665l1651K9514
$$ -34916 -20849 -47853 -41358 -29822 -7568 -22262 -119617 -96691 -67473 15192 -16459 13055
948A3055J8931j4937j0966J0524l5675J842L8111N4810l5175q1571Q510N5262
$$ 13055 31986 17049 6083 16607 -19068 -17226 20885 75695 40520 -41051 -32541 22721
936B2721N8339K982k6672n2268p1266M9746j3794K0274M5388k9466j3482J7014
$$ 22721 81060 84042 57370 5102 -66164 -16418 -30212 -9938 35450 5984 -7498 9516
924I516l4112M3577n80R555p305m8804J0067n906K5961J03841o5524N1618l2585
$$ 9516 -24596 18981 18401 27956 20651 -28153 -18086 -23992 1969 105810 40286 91904 59319
911E9319n4637j0743j3247L8893J4398q393o0026O8509r781r915j9015o1711Q5567
$$ 59319 4682 -6061 -19308 19585 33983 25590 -34436 34073 24292 14377 -4638 -66349 19218
898A9218J8554o3234l7774M9300R4790r4962L6107P3789J9570o5757j0943J3950
$$ 19218 37772 -25462 -63236 -13936 80854 -14108 21999 95788 115358 49601 38658 52608
886E2608k0404k7719K6296O93j8850p8443M7639j883j2106Q0317K2970k0580j6719
$$ 52608 32204 4485 30781 31474 12624 -65819 -18180 -20063 -32169 48148 71118 50538 33819
873C3819L7609k4189r0747K2764P1861j2295j2505l8716n8617o619j16N8530N7012
$$ 33819 71428 47239 -43508 -20744 51117 38822 26317 -12399 -71016 -77635 -77751 -19221 37791
860C7791J5096L1768o6564k7363q875k3684j7568j0965L1319L7640J6291J4280
$$ 37791 52887 84655 18091 -9272 -18147 -41831 -59399 -70364 -39045 -1405 14886 29166
848B9166M3603l3686p4181O1189k36m8188J2147l277J4579j581l7004L2698N4585
$$ 29166 72769 39083 -35098 26091 25855 -22333 -10186 -13463 1116 -465 -37469 -4771 49814
835D9814J7174j4856K6731j40134n1844L47Q9549l96m5604Q8488K6298K243j9171
$$ 49814 66988 52132 78863 -61271 -113115 -112768 -23219 -23615 -69219 19269 45567 47810 28639
822B8639p0903P1546l5889L6290K0060J975O131l8491K7463J8277r1827N730L0406
$$ 28639 -42264 29282 -6607 29683 49743 51718 57849 19358 46821 65098 -26729 -20999 9407
809I407o9307k2448M7437O0342l9315j7092L4391L1313l4499M1618L2895K1472
$$ 9407 -59900 -82348 -34911 25431 -13884 -30976 3415 34728 229 41847 74742 96214
797I6214j2415j9353m7216M6481n7834j5920k1905O76j0125k8840M2310L7516
$$ 96214 83799 64446 17230 63711 5877 -10043 -31948 -31272 -41397 -70237 -27927 9589
785I589l7977l1570K1266N3502k668R6859j0917r4537K9776J4800o1256j2722
$$ 9589 -28388 -59958 -38692 14810 12142 109001 98084 3547 33323 48123 -13133 -25855
773b5855Q263o812N4688j285q9847R73O0769M3305j9313J4129l7598j8718R195
$$ -25855 -17592 -24404 30284 28999 -60848 -59875 894 44199 24886 39015 1417 -17301 -8106
760h106k2273K2568M3532l2033m06J243J5687N5702m0339k6271l0435M0103l3379
$$ -8106 -30379 -7811 35721 3688 3282 4525 20212 75914 35575 9304 -21131 18972 -14407
747a4407k5645N864O505M4913j23355k1061K7728J6595P8238K2120k4839o7684
$$ -14407 -40052 -34188 -27683 17230 -106125 -127186 -99458 -82863 -4625 17495 -7344 -75028
735g5028O2325o611J4665J0724q4305m7257N1403Q0180O8620q3538O4398M4617
$$ -75028 -12703 -19314 -4649 6075 -78230 -125487 -74084 6096 74716 -8822 55576 100193
723A00193m1307k8724o0924Q3277O720q9944O732m213p2242P7696k0496L6505
$$ 100193 58886 30162 -30762 52515 59235 -30709 -23977 -28190 -100432 -22736 -43232 -6727
711f727M4447p6493M6747k4000N958M2965J2801l3605L5k3693k8486J2621M0735
$$ -6727 37720 -38773 7974 -16026 -10068 32897 45698 12093 12128 -11565 -40051 -27430 13305
698A3305K8408J5657n445m8948j13785L6329j1179M9726L7801L0096M5454l2324
$$ 13305 41713 57370 51925 2977 -110808 -74479 -85658 -35932 1869 31965 77419 45095
686D5095j7572j2802L6109q441J0951K2916p188l2528m0350K9202l7794p2203
$$ 45095 27523 14721 50830 42389 53340 76256 69068 36540 -3810 25392 -12402 -84605
674h4605K7651M4168J0858l8252m3626L1003R4250k292p0475J4071J7186j1416
$$ -84605 -56954 -12786 -1928 -40180 -83806 -52803 41447 39155 -31320 -17249 -63 -11479
662a1479j2145r394M4364o5449O5784j6425L7888L028k8957l3160N7172K5434
$$ -11479 -23624 -33018 11346 -54103 11681 -4744 33144 36172 7215 -25945 31227 56661
650E6661n4841m9647o68M5551K6081Q114j6754l7586r0440M9096M3323j7926n3172
$$ 56661 1820 -47827 -48495 -2944 23137 31251 14497 -23089 -113529 -64433 -21110 -39036 -92208
637i2208N1774M2695k6554J2491P3210K4922l159n0547K1692N472q3031n6887
$$ -92208 -40434 2261 -24293 -11802 61408 86330 83171 32624 54316 59788 -23243 -80130
625h0130l6613P2586j086O8419K0318J1509O736l0120r4513k1267N5947J7982
$$ -80130 -116743 -44157 -45243 23176 43494 55003 61739 31619 -62894 -84161 -28214 -10232
613a0232j5114k2523L539n334m5127L9114M4148K2066j5491J1003o299j2145M594
$$ -10232 -25346 -47869 -44330 -49664 -94791 -55677 -11529 10537 -4954 6049 -250 -12395 -7801
600g801P097r39n1019P5700l5561J5887K7271m5334l1133O8232k4196O879l7537
$$ -7801 -704 -1643 -52662 23038 -12523 3364 30635 -14699 -45832 22400 -1796 5083 -32454
587c2454o3405l4108m318O8841M9508m6447o5839J7730L6125N4203l5157n7119
$$ -32454 -95859 -129967 -134285 -65444 -15936 -62383 -128222 -110492 -74367 -20164 -55321 -112440
575a12440J7820j0221k8654M3615K2564k1542j0228Q8937L2099l0117J988j2307
$$ -112440 -94620 -104841 -133495 -89880 -67316 -88858 -99086 -10149 21950 -8167 -6179 -18486
563a8486L8536m3050J3228M4456l8551n391K4310R246q005N1977P67r1923j0331
$$ -18486 20050 -23000 -9772 34684 -3867 -9258 15052 24298 16293 68270 69037 -22886 -33217
550c3217N0881L6801L3866L7764k6938n2705j8470n4966R737n319P7836J8069
$$ -33217 17664 54465 88331 126095 99157 46452 27982 -26984 -17247 -22566 55270 73339
538G3339o986j5991l7575r077L974K8820l5657l4656L4731N0417l5149n8295K6066
$$ 73339 66353 50362 12787 3710 7684 36504 847 -33809 922 51339 16190 -42105 -16039
525a6039M1918o1645N1484m4185L0406l1782R234J8252l3433j0982J9415L1429
$$ -16039 25879 -35766 15718 -28467 1939 -29843 -20609 -2357 -35790 -46772 -27357 4072
513D072M5592J883p7943N370N0679r508m5073J3974N8057l3735J4269j7894j0568
$$ 4072 49664 51547 -26396 -21026 29653 20145 -24928 -10954 47103 13368 27637 9743 -825
500h25n0471l2566J09715m08j9229k023L2962m8740K1805M7180m1558m537r2314
$$ -825 -51296 -83862 25853 25445 6216 4193 37155 -11585 10220 57400 15842 11305 -81009
487h1009J9191L0272p143M9425J1507o9161K5524N2386p149J4489j00166L4216
$$ -81009 -61818 -31546 -38689 10736 22243 -46918 -21394 30992 23843 38332 -61834 -27618
475b7618J6484K2786n0145N7606m4899j3803O5160m9017J1270R719k361j3563
$$ -27618 -11134 11652 -38493 19113 -25786 -39589 25571 -23446 -12176 -2457 -4818 -18381
463a8381j3719J8258o7180q169l6796Q7198P7669m3986j5594O9681n4169l8236
$$ -18381 -32100 -13842 -81022 -89191 -125987 -38789 38880 -5106 -20700 48981 -5188 -43424
451d3424j9143M2551L8284q395l152K5094K5759k5347k1916j03894Q449J4581
$$ -43424 -62567 -20016 18268 9873 6721 31815 57574 32227 10311 -93583 -85134 -70553
439g0553N8004j4953m9362J5212N7241L1616K3391m2772J3328j7975p112Q7441
$$ -70553 -12549 -27502 -76864 -61652 -4411 27205 50596 7824 21152 3177 -3935 83506
427H3506m4291o822o3115L7432N7524o2661J5833O8274k6559n0686k6881j7558
$$ 83506 39215 32393 -30722 6710 64234 1573 17406 85680 59121 8435 -18446 -36004
415c6004L5421N5540m3859K5547J6463k5178L7490o9412j847q896N4744K2374
$$ -36004 -583 54957 11098 36645 53108 27930 65420 -3992 -5839 -14735 40009 62383
403F2383j43257K4242Q3824m9211M3339J0889M575o0079P558K9388J0033p5051
$$ 62383 -80874 -56632 27192 -22019 21320 32209 36784 -23295 -15737 13651 23684 -51367
391e1367L4461N9403l2595p8213L4194K1756M3715J8308k7057j8405k699n647
$$ -51367 -16906 42497 9902 -68311 -34117 -12361 31354 49662 22605 4200 1501 -4146
379d146p881M5461j1206j4629m78K2665n3579J2810J5209l8401P0382L5884K6966
$$ -4146 -12027 33434 22228 7599 7121 29786 -23793 -10983 4226 -34175 36207 72091 99057
366I9057o5958k6602P3878m2486J2230Q5078r778j7173l3089k2322M081m6237
$$ 99057 33099 6497 80375 37889 50119 135197 125419 108246 75157 52835 56916 10679
354A0679K5296m7530J7956k3269q370L561j8988J9999J6187L2411J1495L5375
$$ 10679 35975 -11555 6401 -16868 -25238 -21677 -40665 -20666 -4479 27932 39427 74802
342G4802J0876n7473L0945l5096l8848K7567l3887P803K0756k9658p161l3858
$$ 74802 85678 28205 59150 24054 -14794 12773 -21114 -13311 7445 -22213 -29374 -63232
330f3232K4138R4174J7465k0169p53m4294m4006J5580P2470N3l809q8807n1655
$$ -63232 -39094 55080 72545 52376 51623 7329 -36677 -21097 51373 51426 47617 -41190 -92845
317i2845O0963j072L1515J3678k1742L9565l5552q449J1056q0437N8260K9424
$$ -92845 -31882 -32954 -1439 12239 -9503 30062 -5490 -13939 -2883 -83320 -25060 4364
305D364p5084K0566L8778j7837k7857L0836O9632J5819j5176m2107j1969P243
$$ 4364 -70720 -50154 -11376 -29213 -57070 -26234 43398 59217 44041 1934 -10035 -2792
293b792k121l6506L9545j1072L7787K525l2166Q879l037P8576J2449q7018m9271
$$ -2792 -4913 -41419 -1874 -12946 24841 27366 -4800 4079 1042 79618 92067 5049 -44222
280d4222N7446K1104j3105l951L480m7062K0997K4916j5465L6364P0504k5575
$$ -44222 13224 34328 21223 17272 20752 -26310 -5313 19603 4138 40502 111006 85431
268H5431r3515K9555q83j3559l13m4845q6O6437j3444Q433m8098j0210R5619l5658
$$ 85431 -8084 21471 20588 7029 6716 -38129 -38215 28222 14778 23211 -24887 -35097 60522 24864
254B4864o463L1987l2191m971l891p4786k972M7151J3017L4002J6265M019j8405
$$ 24864 18401 50388 18197 13226 9335 -65451 -68423 -21272 -8255 25747 42012 46031 27626
241B7626n9820J9731p24J4230j0968l8293M6073j8045J2902O2585j1421o0245
$$ 27626 -32194 -12463 -13187 1043 -9925 -48218 -2145 -20190 -7288 55297 43876 -16369
229a6369J5220K59O3048k8311m3899L3841L149m4609o165O8293K6868J2651k7581
$$ -16369 -1149 -890 62158 33847 -10052 23789 26938 -17671 -23836 44457 71325 83976 56395
216E6395j5781m8097k4871K3113J1717O109j2922K4502k9739o192L2014P5176
$$ 56395 40614 -7483 -32354 -9241 2476 8585 -4337 20165 -9574 -15766 16248 91424
204I1424M1402o3236n1899j423N1343j8732k4145K9698o0807l8253k8967j6072
$$ 91424 132826 69590 17691 16268 67611 48879 24734 54432 -6375 -44628 -73595 -89667
192h9667O4751J3516k0664M1341J4838m0595N3514l3340O819J7072Q4807R965
$$ -89667 -24916 -11400 -32064 9277 24115 -16480 37034 3694 10513 27585 112392 122357
180A22357p0078l7591r388m783O005m0738m673O499P512L3904L0239O1072n492
$$ 122357 52279 14688 5300 517 6522 -34216 -38889 -32390 -24878 9026 39265 100337 94845
167I4845n47l7873o4448n6034K5785K0911K1710l4845O728N4866J5823k947p6850
$$ 94845 94298 56425 -8023 -64057 -38272 -17361 4349 -30496 -23768 31098 46921 43974 -32876
154c2876Q6583J7511m2156J7647O170j6379m148k846j666o6119K9380M6674j5848
$$ -32876 53707 71218 29062 46709 52879 36500 32352 29506 27840 -38279 -8899 37775 21927
141B1927m2283j7206M2j7140J3144M0562l6822n3378N6069P5351l949k0537q574
$$ 21927 -20356 -37562 -37520 -54660 -41516 -954 -37776 -91154 -35085 40266 36317 15780 7206
128G206j9779P2072k6787l8174k6227K9834J7760k22m0499J3757k1524J7896l6963
$$ 7206 -12573 59499 32712 -5462 -31689 -1855 15905 15683 -24816 -11059 -32583 -14687 -51650
115e1650O467M9774M917J2976m2589J2152K1543J8900k0448j4069m2281O090o678
$$ -51650 -45183 4591 9508 22484 -20105 -7953 13590 32490 12042 -2027 -44308 -38218 -44896
102d4896M5719R4l1490P4270J3401k0109j022K5568j2666k9743M0951j2453l4537
$$ -44896 823 917 -30573 43697 57098 36989 35967 61535 48869 19126 60077 47624 13087
89A3087j5524R315J025j1320K7579l8971Q18k9529k5489L2345N1619J7802l3010
$$ 13087 -2437 6878 7903 -3417 24162 -14809 -13991 -43520 -69009 -36664 14955 32757 -253
76b53J0864K3043r029J7689j6138J6567l9496L3589j1159o8913K6896M7020J1627
$$ -253 10611 33654 24625 42314 26176 42743 3247 36836 25677 -43236 -16340 30680 42307
63D2307k6497r625p756Q813K6189o410M6863j8598q3239j0613L1182j1001J7714
$$ 42307 15810 6185 -1571 7242 33431 27021 73884 55286 -27953 -38566 -7384 -18385 -671
50f71M6465r5572L7953M8278p499k8072J5649J6723p179r033N261o961k4571j718
$$ -671 45794 -49778 -11825 36453 28954 882 16531 33254 26075 17042 22303 15342 -9229 -10947
36a0947k9619N0670L0315N601l913m856l8744K3627m9797n139K2989K7014l758
$$ -10947 -40566 10104 40419 46020 42107 37251 -1493 22134 -27663 -32802 -9813 17201 13443
23A3443j2408j132j9143L1664J9889k7921o495J2037o2471R202n863O4555Q890
$$ 13443 1035 -97 -19240 12424 32313 4392 -2103 9934 -52537 -43335 -49198 15357 24247
10B4247k4194j6688j0156K3909k0864K4792M7471K4533j4423m2540
$$ 24247 53 -16635 -26791 -2882 -23746 1046 48517 73050 58627 16087
0A6087
$$ 16087
$$ Imaginary data points
##PAGE= N=2
##DATA TABLE= (X++(I..I)), XYDATA
16383b457755L9886J9339M4473L2207M0407M3559K9697L754P997O1534k0902N6437
$$ -2457755 -2417869 -2398530 -2354057 -2321850 -2281443 -2237884 -2208187 -2204433 -2196436 -2134902 -2155804 -2099367
16371b099367N1262L1623L6295M5620O258J2137M4161M2108L534K0151M7562N292
$$ -2099367 -2048105 -2016482 -1980187 -1934567 -1928309 -1916172 -1872011 -1829903 -1826369 -1806218 -1758656 -1753364
16359a753364K4169P9075M1853j1864M2643P4708M7347N314L6290L9460O3106
$$ -1753364 -1729195 -1650120 -1608267 -1620131 -1577488 -1502780 -1455433 -1450119 -1413829 -1374369 -1311263
16348a311263l7621l652N7775j2229P880N0208P6959L1544M3137K7079Q1500O4391
$$ -1311263 -1348884 -1352536 -1294761 -1306990 -1299110 -1248902 -1171943 -1140399 -1097262 -1070183 -988683 -924292
16336i24292o8300M2508K0736M7606L0052K8157j6759N1861K1834L1085N0630
$$ -924292 -992592 -950084 -929348 -881742 -851690 -823533 -840292 -788431 -766597 -735512 -684882
16325f84882L5081J0096J2692L7348n556N4352N3628O2564m8514K4145L1645M0325
$$ -684882 -649801 -639705 -627013 -589665 -595221 -540869 -487241 -424677 -473191 -449046 -417401 -377076
16313c77076J9577J0026L9600K9364J4265M3060L9427Q29j8278L5350M8232M9925
$$ -377076 -357499 -347473 -307873 -278509 -264244 -221184 -181757 -180928 -199206 -163856 -115624 -65699
16301f5699m3559P8932N6272K1791M3601J4935k7517N2294L6207K4098k5187N1638
$$ -65699 -109258 -30326 25946 47737 91338 106273 78756 131050 167257 191355 166168 217806
16289B17806O7689p3605O2161N2573o838M850N920O5647N3107N4704N533R489
$$ 217806 285495 211890 274051 326624 319786 324636 330556 396203 449310 504014 509547 519036
16277E19036j5282M912L3380N8384J4690L1551m2171N3411M0857j82R307j1902
$$ 519036 503754 508666 542046 600430 615120 646671 604500 657911 698768 698586 707893 695991
16265F95991K6052m183Q8779L7625K4372k6705L0448K9364J0060q685M8318N2705
$$ 695991 722043 717860 806639 844264 868636 841931 872379 901743 911803 903118 951436 1004141
16253A004141M1523K6445P486J2021J8422M6802J4842k608l5129K1766K7739M5743
$$ 1004141 1045664 1072109 1079595 1091616 1110038 1156840 1171682 1169074 1133945 1155711 1183450 1229193
16241A229193L0529l1710P250k241j6807R8815L0912J5379M423K2645L3668l165
$$ 1229193 1259722 1228012 1235262 1233021 1216214 1315029 1345941 1361320 1365743 1388388 1422056 1418891
16229A418891L015J2297k440L4859M0162n0497M4849J6116R359J5962M6287k6059
$$ 1418891 1421906 1434203 1431763 1466622 1506784 1456287 1501136 1517252 1526611 1542573 1588860 1562801
16217A562801Q172O708M1183J8976M6856k4790l8429L5601J7721J8147M3509q253
$$ 1562801 1570973 1577681 1618864 1637840 1684696 1659906 1621477 1657078 1674799 1692946 1736455 1728202
16205A728202k0809o2361L2938Q9470N8244j6927l0256l3134P261k5589R6931
$$ 1728202 1707393 1645032 1677970 1767440 1825684 1808757 1778501 1745367 1752628 1727039 1823970
16194A823970Q8529k8133l6913O2906q853l0589P9842o4420J1087J8045O5840
$$ 1823970 1912499 1884366 1847453 1910359 1901506 1870917 1950759 1886339 1897426 1915471 1981311
16183A981311K685J2876j6480m7712L1983K6770L6909m3789J06452M7183p6892
$$ 1981311 1983996 1996872 1980392 1932680 1964663 1991433 2028342 1984553 2091005 2138188 2061296
16172B061296j672J0189j2476k373l106M485O0122l4433j5744j8687o8453J1232
$$ 2061296 2059624 2069813 2057337 2054964 2051858 2056343 2116465 2082032 2066288 2047601 1979148 1990380
16160A990380J02138J17804L7590j03045n6817P2731o1267K6439K3970L2826m092
$$ 1990380 2092518 2210322 2247912 2144867 2088050 2160781 2099514 2125953 2149923 2182749 2178657
16149B178657j5028K2243K1505M0003j3274j63l131L7686r420j1509L7908j9199
$$ 2178657 2163629 2185872 2207377 2247380 2234106 2233943 2230812 2268498 2259078 2247569 2285477 2266278
16137B266278k9504J11872o3539o9299K5987O7513n170r1274M7829J0408k5518
$$ 2266278 2236774 2348646 2285107 2215808 2241795 2309308 2304138 2212864 2260693 2271101 2245583
16126B245583n66L832N7343k0338M6835O236o35q106j4625N209Q2652j486M5484
$$ 2245583 2245017 2248849 2306192 2285854 2332689 2338925 2338290 2330184 2315559 2320768 2403420 2401934 2447418
16113B447418L492k1424l4457j8535J7973j8763k1498O1093L7786m4931m4672
$$ 2447418 2450910 2429486 2395029 2376494 2394467 2375704 2354206 2415299 2453085 2408154 2363482
16102B363482R097K0450J0779L7568J4634j2713K3260R451k5369m7757N5140k6568
$$ 2363482 2372579 2393029 2403808 2441376 2456010 2443297 2466557 2476008 2450639 2402882 2458022 2431454
16090B431454n4471L8220l4226l7365M6350O7735k8611j0968k4301k9459O290
$$ 2431454 2376983 2415203 2380977 2343612 2389962 2457697 2429086 2418118 2393817 2364358 2370648
16079B370648R475J4495J3633r4301N0048p015R0122K2349l7613o737M2481j6114
$$ 2370648 2380123 2394618 2408251 2313950 2363998 2356983 2447105 2469454 2431841 2425104 2467585 2451471
16067B451471J4452m5456L421m839l352M1163P532q4733J5589R2328n6364k446
$$ 2451471 2465923 2420467 2423888 2419049 2415697 2456860 2464392 2379659 2395248 2487576 2431212 2428766
16055B428766l9907L3325M5893k5626j3169Q9797j07575l4362J5736K8831M2753
$$ 2428766 2388859 2422184 2468077 2442451 2429282 2519079 2411504 2377142 2392878 2421709 2464462
16044B464462n0753r574n3289m1525Q3729R3676j3245k6693J3103N3858j5343
$$ 2464462 2413709 2404135 2350846 2309321 2393050 2486726 2473481 2446788 2459891 2513749 2498406
16033B498406n4032L3735k302q70K3096K1043n1455M091J1716r1139j9743R0720
$$ 2498406 2444374 2478109 2475807 2474937 2498033 2519076 2467621 2471712 2483428 2392289 2372546 2463266
16021B463266j9566q482j49K820R0410j6492n7427j7296j3904L2789n0012k8513
$$ 2463266 2443700 2435218 2435069 2437889 2528299 2511807 2454380 2437084 2423180 2455969 2405957 2377444
16009B377444J03433P6812r3685j9849L8841k3499j4641O617O0271l1581K6013
$$ 2377444 2480877 2557689 2464004 2444155 2482996 2459497 2444856 2451473 2511744 2480163 2506176
15998B506176P751k9782K9272O495P826n0856j6518R6309j6512j8843o5511k3148
$$ 2506176 2513927 2484145 2513417 2519912 2527738 2476882 2460364 2556673 2540161 2521318 2455807 2432659
15986B432659M6512K9019N80Q268j405n8712k9592L1939l9200l1344N1862j1925
$$ 2432659 2479171 2508190 2508770 2517038 2515633 2456921 2427329 2459268 2420068 2388724 2440586 2428661
15974B428661N394K1477m4904L6964j6231O116r956j6873O3287J0168Q64l7759
$$ 2428661 2434055 2455532 2410628 2447592 2431361 2437477 2427521 2410648 2473935 2484103 2484967 2447208
$$ [...]
##END NTUPLES=NMR SPECTRUM
##END=
