##TITLE=1H_EC-3289-P1
 CDCl3
 64 sc, 
 22.3.2023
##JCAMPDX= 6.0         $$ Bruker NMR JCAMP-DX V2.0
##DATA TYPE= NMR SPECTRUM
##DATA CLASS= NTUPLES
##ORIGIN= UXNMR, Bruker Analytische Messtechnik GmbH
##OWNER= root
$$ XWIN-NMR		Version 3.5
$$ Wed Mar 22 14:41:53 2023 Russian Standard Time (UT+4h)  she@DPX200
##.OBSERVE FREQUENCY= 200.13135
##.OBSERVE NUCLEUS= ^1H
##.ACQUISITION MODE= SIMULTANEOUS
##.ACQUISITION SCHEME= undefined
##.AVERAGES= 64
##.DIGITISER RES= 18
##SPECTROMETER/DATA SYSTEM= spect
##.PULSE SEQUENCE= zg30
##.SOLVENT NAME= CD3CN
##.SHIFT REFERENCE= (INTERNAL, CD3CN, 0, 15.7326)
##AUDIT TRAIL= $$ (NUMBER, WHEN, WHO, WHERE, WHAT)
$$ ##TITLE= Audit trail, XWIN-NMR		Version 3.5
$$ ##JCAMPDX= 5.01
$$ ##ORIGIN= Bruker BioSpin GmbH
$$ ##OWNER= she
$$ F:/spectra/data/she/nmr/H-F/1/pdata/1/auditp.txt
$$ ##AUDIT TRAIL=  $$ (NUMBER, WHEN, WHO, WHERE, WHAT)
(   1,<2023-03-22 14:41:00.28 +0400>,<she>,<DPX200>,
      <continue with go, POWCHK disabled, PULCHK disabled
       configuration hash MD5:
       00 E9 B6 7A A2 85 ED C7 34 08 36 98 17 FE 4E 26
       data hash MD5: 16K
       17 11 24 4B C0 69 E7 B6 5E 0C A3 11 FD 45 63 90>)
(   2,<2023-03-22 14:41:02.12 +0400>,<she>,<DPX200>,
      <Start of raw data processing
       efp BC_mod = 2 LB = 0.24 FT_mod = 6 PKNL = 1 PHC0 = -19105.68 PHC1 = 12.20075 SI = 16K 
       data hash MD5: 16K
       3F 56 D2 18 66 81 FB C7 C1 36 C1 16 C1 9E F2 F4>)
(   3,<2023-03-22 14:41:16.10 +0400>,<she>,<DPX200>,
      <pk PHC0 = -0.4481423 PHC1 = 2.4 
       data hash MD5: 16K
       83 55 7A 4F 4C 94 84 9E DC 5B D0 6C 22 62 04 60>)
(   4,<2023-03-22 14:41:19.28 +0400>,<she>,<DPX200>,
      <abs ABSG = 5 
       data hash MD5: 16K
       C8 CE B1 41 41 D1 A9 DD CA FB 67 C5 BC 72 9D C6>)
$$ ##END=
$$ 
$$ hash MD5
$$ 35 34 CD 3C C9 AF 63 A6 C9 EC 87 87 E3 87 3C FE
##$RELAX= 
##$RELAX= 
##$RELAX= 
##$RELAX= 
##$RELAX= 
##$RELAX= 
$$ Bruker specific parameters
$$ --------------------------
##$DU= <F:/spectra>
##$EXPNO= 1
##$NAME= <H-F>
##$PROCNO= 1
##$TYPE= <nmr>
##$USER= <she>
##$AMP= (0..31)
100 100 100 100 100 100 100 100 100 100 100 100 100 100 100 100 100 100 
100 100 100 100 100 100 100 100 100 100 100 100 100 100 
##$AQSEQ= 0
##$AQ_mod= 1
##$AUNM= <au_zg>
##$AUTOPOS= <>
##$BF1= 200.13
##$BF2= 200.13
##$BF3= 200.13
##$BF4= 200.13
##$BF5= 200.13
##$BF6= 200.13
##$BF7= 200.13
##$BF8= 200.13
##$BYTORDA= 1
##$CFDGTYP= 0
##$CFRGTYP= 5
##$CHEMSTR= <none>
##$CNST= (0..31)
1 1 145 1 1 1 1 1 1 1 1 1 1 1 1 1 1 1 1 1 1 1 1 1 1 1 1 1 1 1 1 1 
##$CPDPRG= <>
##$CPDPRG1= <>
##$CPDPRG2= <>
##$CPDPRG3= <>
##$CPDPRG4= <mlev>
##$CPDPRG5= <mlev>
##$CPDPRG6= <mlev>
##$CPDPRG7= <mlev>
##$CPDPRG8= <mlev>
##$CPDPRGB= <>
##$CPDPRGT= <>
##$D= (0..31)
0 1.2 0 0 0 0 0 0 0 0.06 0 0.03 0 0 0 0 0.0002 0 0 0 0 0 0 0 0 0 0 0 0 
0 0 0 
##$DATE= 1679481404
##$DBL= (0..7)
120 120 120 120 120 120 120 120 
##$DBP= (0..7)
150 150 150 150 150 150 150 150 
##$DBP07= 0
##$DBPNAM0= <>
##$DBPNAM1= <>
##$DBPNAM2= <>
##$DBPNAM3= <>
##$DBPNAM4= <>
$$ [...]
##$SUBNAM3= <"">
##$SUBNAM4= <"">
##$SUBNAM5= <"">
##$SUBNAM6= <"">
##$SUBNAM7= <"">
##$SUBNAM8= <"">
##$SUBNAM9= <"">
##$SW= 18.05172834244
##$SWIBOX= (0..15)
0 0 2 0 0 0 0 0 0 0 0 0 0 0 0 0 
##$SW_h= 3612.71676300578
##$TD= 16384
##$TD0= 1
##$TE= 0
##$TE2= 300
##$TE3= 300
##$TEG= 300
##$TL= (0..7)
0 120 120 120 120 120 120 120 
##$TP= (0..7)
150 150 150 150 150 150 150 150 
##$TP07= 0
##$TPNAME0= <>
##$TPNAME1= <>
##$TPNAME2= <>
##$TPNAME3= <>
##$TPNAME4= <>
##$TPNAME5= <>
##$TPNAME6= <>
##$TPNAME7= <>
##$TPOAL= (0..7)
0.5 0.5 0.5 0.5 0.5 0.5 0.5 0.5 
##$TPOFFS= (0..7)
0 0 0 0 0 0 0 0 
##$TUNHIN= 0
##$TUNHOUT= 0
##$TUNXOUT= 0
##$USERA1= <user>
##$USERA2= <user>
##$USERA3= <user>
##$USERA4= <user>
##$USERA5= <user>
##$V9= 5
##$VALIST= <valist>
##$VCLIST= <CCCCCCCCCCCCCCC>
##$VD= 0
##$VDLIST= <DDDDDDDDDDDDDDD>
##$VPLIST= <PPPPPPPPPPPPPPP>
##$VTLIST= <TTTTTTTTTTTTTTT>
##$WBST= 1024
##$WBSW= 4
##$XGAIN= (0..3)
0 0 0 0 
##$XL= 0
##$YL= 0
##$YMAX_a= 179174
##$YMIN_a= -258832
##$ZGOPTNS= <>
##$ZL1= 120
##$ZL2= 120
##$ZL3= 120
##$ZL4= 120
##$ABSF1= 15.73256
##$ABSF2= -2.319289
##$ABSG= 5
##$ABSL= 3
##$ALPHA= 0
##$AQORDER= 0
##$ASSFAC= 0
##$ASSFACI= 0
##$ASSFACX= 0
##$ASSWID= 0
##$AUNMP= <proc_1d>
##$AZFE= 0.1
##$AZFW= 0.1
##$BCFW= 0
##$BC_mod= 2
##$BYTORDP= 0
##$COROFFS= 0
##$CY= -3
##$DATMOD= 1
##$DC= 0
##$DFILT= <>
##$DTYPP= 0
##$F1P= 0
##$F2P= 0
##$FCOR= 1
##$FTSIZE= 16384
##$FT_mod= 6
##$GAMMA= 0
##$GB= 0
##$INTBC= 1
##$INTSCL= 3.70164e-10
##$ISEN= 128
##$LB= 0.24
##$LEV0= 0
##$LPBIN= 0
##$MAXI= 10000
##$MC2= 0
##$MEAN= 0
##$ME_mod= 0
##$MI= 1.114404
##$NCOEF= 0
##$NC_proc= -6
##$NLEV= 6
##$NOISF1= 3.799351
##$NOISF2= 2.8
##$NSP= 0
##$NTH_PI= 0
##$NZP= 0
##$OFFSET= 15.73256
##$PC= 1
##$PHC0= -19106.13
##$PHC1= 14.60075
##$PH_mod= 1
##$PKNL= yes
##$PPARMOD= 0
##$PSCAL= 0
##$PSIGN= 0
##$REVERSE= no
##$SF= 200.130007799961
##$SI= 16384
##$SIGF1= 3
##$SIGF2= 2
##$SINO= 5.538805
##$SIOLD= 16384
##$SREGLST= <1H.CDCl3>
##$SSB= 0
##$STSI= 16384
##$STSR= 0
##$SW_p= 3612.71676300578
##$SYMM= 0
##$S_DEV= 0
##$TDeff= 16384
##$TDoff= 0
##$TI= <>
##$TILT= no
##$TM1= 0
##$TM2= 0
##$TOPLEV= 0
##$USERP1= <user>
##$USERP2= <user>
##$USERP3= <user>
##$USERP4= <user>
##$USERP5= <user>
##$WDW= 1
##$XDIM= 16384
##$YMAX_p= 318556224
##$YMIN_p= -787284
$$ End of Bruker specific parameters
$$ ---------------------------------
##NTUPLES= NMR SPECTRUM
##VAR_NAME=  FREQUENCY,     SPECTRUM/REAL,   SPECTRUM/IMAG
##SYMBOL=    X,             R,               I
##VAR_TYPE=  INDEPENDENT,   DEPENDENT,       DEPENDENT
##VAR_FORM=  AFFN,          ASDF,            ASDF
##VAR_DIM=   16384,         16384,           16384
##UNITS=     HZ,            ARBITRARY UNITS, ARBITRARY UNITS
##FACTOR=    0.220516191357247, 1,           1
##FIRST=     3148.55738708904, 0,            0
##LAST=      -464.159375916738, 0,           0
##MIN=       -464.159375916738, -787284,     0
##MAX=       3148.55738708904, 318556224,    0
$$ Real data points
##PAGE= N=1
##DATA TABLE= (X++(R..R)), XYDATA
$$ [...]
$$ plain form
5078 6733544 6256352 6174538 5517248 5387150 5470813 5358596 5215488 5264660 5157639 5253000
5068 5253000 5044344 4941043 5174592 4877899 4983450 5241820 5266120 5474674 5455449 5370580
5058 5370580 5069714 4875412 4858476 5012778 4856296 4755622 4638292 4489247 4650327 4340033
5048 4340033 4331144 4446387 4380559 4486315 4441098 4471237 4371985 4123699 3665273 3844588 3842356
5037 3842356 3990735 3927327 4031447 4156451 4111073 4019202 3871276 4186301 3719062 3567853
5027 3567853 3364222 3514130 3649403 3673825 3785074 3775545 4078112 3800072 3979015 4332479
5017 4332479 4353276 4256030 4281629 4248893 3982003 4079665 3995271 3657622 3553834 3454441 3466709
5006 3466709 3661300 3475680 3607973 3556780 3335248 3371009 3283400 3520617 3490329 3251594
$$ packed form
5078F733544m77192q1814o57290j30098Q3663j12217j43108M9172j07021R5361
5068E253000k08656j03301K33549k96693J05551K58370K4300K08554j9225q4869
5058E370580l00866j94302j6936J54302j56482j00674j17330j49045J61080l10294
5048D340033q889J15243o5828J05756m5217L0139r9252k48286m58426J79315k232
5037C842356J48379o3408J04120J25004m5378r1871j47926L15025m67239j51209
5027C567853k03631J49908J35273K4422J11249r529L02567k78040J78943L53464
5017D332479K0797r7246K5599l2736k66890R7662q4394l37649j03788r9393J2268
5006C466709J94591j85620J32293n1193k21532L5761q7609K37217l0288k38735
$$ plain form
4996 3251594 3285337 3260918 3168581 3130145 3271544 2843238 2833220 2902433 2725843 2653092 2321544
4985 2321544 2526769 2667677 2798801 2802602 2989764 3240097 2962196 2832318 3167416 3194857
4975 3194857 3259773 3591335 3160041 3119321 3093164 3004089 3052093 3067217 3347332 3206861 3088089
4964 3088089 2820145 2935863 3620333 3764902 3538350 3202975 3207913 3247716 3397578 3752349
4954 3752349 3678049 3726558 3699599 3831074 3946996 4104915 4276011 4040876 3825986 3979926
4944 3979926 3838792 3909220 3674288 3475246 3500336 3629686 3473184 3357175 3472067 3311282
4934 3311282 3294984 3425022 3395580 3247043 3294869 3452334 3649062 3400344 3499202 3549744
4924 3549744 3483063 3297237 3742987 4006640 3938554 4006334 4284232 4383600 4680393 4919656
$$ packed form
4996C251594L3743k4419r2337l8436J41399m28306j0018O9213j76590p2751l31548
4985B321544K05225J40908J31124L801J87162K50333k77901j29878L35098K7441
4975C194857O4916L31562m31294m0720k6157q9075M8004J5124K80115j40471j18772
4964C088089k67944J15718O84470J44569k26552l35375M938L9803J49862L54771
4954C752349p4300M8509k6959J31475J15922J57919J71096k35135k14890J53940
4944C979926j41134P0428k34932j99042K5090J29350j56502j16009J14892j60785
4934C311282j6298J30038k9442j48537M7826J57465J96728k48718R8858N0542
4924C549744o6681j85826M45750K63653o8086O7780K77898R9368K96793K39263
$$ plain form
4914 4919656 4843155 4420425 4432824 4273008 3988462 3988255 3950117 3492319 3443617 3362832 3269609
4903 3269609 3287550 2725318 2605999 2960274 3073219 3019772 2942761 2981197 2975814 2786416 2982395
4892 2982395 2977774 2991680 3430513 3290683 3091496 3215657 3135194 3063299 3040431 3258660 3108417
4881 3108417 2951177 3098782 3017045 2906298 2894870 2601676 2749387 2504708 2170017 1986102
4871 1986102 2015674 2117683 2059391 2088748 2136886 2025278 1764487 1608721 1567496 1826292
4861 1826292 1548453 1526784 1618363 1651581 1387641 1271526 1430759 1471014 1455645 1455419 1519903
4850 1519903 1687701 1828860 1780259 1578080 1454624 1297455 1142257 1093060 1160727 1211873
4840 1211873 1195350 1198427 1163838 1098762 1067167 947019 848723 1091679 1089098 1182551 1228334
$$ packed form
4914D919656p6501m22730J2399j59816k84546k07l8138m57798m8702q0785r3223
4903C269609J7941n62232j19319L54275J12945n3447p7011L8436n383j89398J95979
4892B982395m621J3906M38833j39830j99187J24161q0463p1895k2868K18229j50243
4881C108417j57240J47605q1737j10747j1428k93194J47711k44679l34691j83915
4871A986102K9572J02009n8292K9357M8138j11608k60791j55766m1225K58796
4861A826292k77839k1669R1579L3218k63940j16115J59233M0255j5369k26O4484
4850A519903J67798J41159m8601k02179j23456j57169j55198m9197O7667N1146
4840A211873j6523L077l4589o5076l1595j20148r8296K42956k581R3453M5783
$$ plain form
4829 1228334 1248148 1322837 1240973 1334411 1279821 761983 665493 823585 844615 585752 627448
4818 627448 593945 641800 489840 532134 712862 854755 886471 962192 947394 911313 871300
4807 871300 1016816 1062030 846669 939776 1007709 762178 1013253 802124 690476 637375
4797 637375 818845 1012868 918421 1020715 1143896 857899 910229 889502 850519 895619 692032
4786 692032 675742 646332 705365 851135 721323 753939 827696 919886 912178 968554 894091
4775 894091 852223 577989 604479 972918 1142424 1226106 960543 998462 789411 742638 773293
4764 773293 829367 1062544 803409 558225 655714 464154 379295 510899 723815 709288
4754 709288 963340 926957 882984 993876 928013 696610 831146 848363 736448 1075120
$$ packed form
4829A228334J9814P4689q1864R3438n4590n17838r6490J58092K1030k58863M1696
4818F27448l3503M7855j51960M2294J80728J41893L1716P5721j4798l6081m0013
4807H71300J45516M5214k15361R3107O7933k45531K51075k11129j11648n3101
4797F37375J81470J94023r4447J02294J23181k85997N2330k0727l8983M5100k03587
4786F92032j6290k9410N9033J45770j29812L2616P3757R2190p708N6376p4463
4775H94091m1868k74234K6490L68439J69506Q3682k65563L7919k09051m6773L0655
4764G73293N6074K33177k59135k45184R7489j91560q4859J31604K12916j4527
4754G09288K54052l6383m3973J10892o5863k31403J34536J7217j11915L38672
$$ plain form
4744 1075120 1063797 667353 1081498 1141878 986166 851708 1263647 1341461 1225840 1232268
4734 1232268 1206671 1209417 1260602 1427681 1591956 1586704 1568022 1541793 1639694 1552184 1558605 1370391
4722 1370391 1621148 1695441 1547315 1657243 1543198 1682533 1690936 1558252 1424303 1775357
4712 1775357 1797716 1734107 1842808 1969838 1902325 2149641 2240315 2088729 2037815 1954119 2314560
4701 2314560 2450176 2443664 2623107 2651384 2498336 2394092 2583596 2689434 2539942 2432607
4691 2432607 2460672 2648235 2625237 2689281 2646757 2599733 2620817 2896512 2876854 2937890 3088115
4680 3088115 3019791 2962100 3246063 3342854 3538736 3951712 4244976 4202137 4215828 4232215 4498729
4669 4498729 4792668 5144019 5352889 5556604 6098490 6651549 7410417 7739212 8136289 9080441
$$ packed form
4744A075120j1323l96444M14145O0380j55712j34458M11939P7814j15621O428
4734A232268k5597K746N1185J67079J64275n252j8682k6229R7901q7510O421j88214
4722A370391K50757P4293j48126J09928j14045J39335Q403j32684j33949L51054
4712A775357K2359o3609J08701J27030o7513K47316R0674j51586n0914q3696L60441
4701B314560J35616o512J79443K8277j53048j04244J89504J05838j49492j07335
4691B432607K8065J87563k2998O4044m2524m7024K1084K75695j9658O1036J50225
4680C088115o8324n7691K83963R6791J95882M12976K93264m2839J3691J6387K66514
4669D498729K93939L51351K08870K03715N41886N53059P58868L28795L97077R44152
$$ plain form
4659 9080441 10153071 11242677 12153899 13476041 15127314 17503227 20751429 24738906
4651 24738906 29013754 33137931 36076203 37333986 35967931 31770615 27643560 23300787
4643 23300787 19556554 16457609 14093489 11918740 10367399 9269733 8276430 7523585
4635 7523585 7049510 6318782 6106551 5964489 5672645 5077574 4961843 4941935 4488270 4498931
4625 4498931 4359264 4257685 4148396 3919356 3789781 3789646 3531439 3310157 3496171 3601043
4615 3601043 3287910 2971449 3053071 2987986 2742150 2596700 2645548 2875805 2589188 2598929
4605 2598929 2501037 2341703 2605517 2411131 2402922 2550126 2855427 2819313 3049741 3048698 2854628
4594 2854628 2836928 3234159 3039819 2884782 2839983 2680157 2329767 2316221 2274270 2219988
$$ packed form
4659I080441J072630J089606R11222J322142J651273K375913L248202L987477
4651B4738906M274848M124177K938272J257783j366055m197316m127055m342773
4643B3300787l744233l098945k364120k174749j551341j097666r93303p52845
4635G523585m74075p30728k12231j42062k91844n95071j15731j9908m53665J0661
4625D498931j39667j01579j09289k29040j29575j35k58207k21282J86014J04872
4615C601043l13133l16461Q1622o5085k45836j45450M8848K30257k86617R741
4605B598929r7892j59334K63814j94386q209J47204L05301l6114K30428j043j94070
4594B854628j7700L97231j94340j55037m4799j59826l50390j3546m1951n4282
$$ plain form
4584 2219988 2200705 2280529 2271227 1860196 1761955 1366811 1318826 1524090 1649932 1688998 1353913
4573 1353913 1221746 1318262 1453673 1479877 1376897 1390610 1227910 1109641 1221043 1149871
4563 1149871 1438328 1718494 1677237 1448336 1189534 1107726 1027057 1273829 950455 750343
4553 750343 715181 974782 923360 1027855 1186001 933197 630749 770536 729675 550445
4543 550445 282794 249871 294908 375410 789800 728701 682039 417069 446849 714671 487472
4532 487472 379530 638925 706886 566450 349554 354708 327034 335748 57843 194543 358493
4521 358493 545866 353839 78315 286368 107181 269119 182602 408449 219683 251154
4511 251154 182306 55366 -82123 -140345 -263745 -44388 71882 53928 266959 347798
$$ packed form
4584B219988j9283P9824r302m11031r8241l95144m7985K05264J25842L9066l35085
4573A353913j32167R6516J35411K6204j02980J3713j62700j18269J11402p1172
4563A149871K88457K80166m1257k28901k58802q1808q0669K46772l23374k00112
4553G50343l5162K59601n1422J04495J58146k52804l02448J39787m0861j79230
4543E50445k67651l2923M5037Q0502M14390o1099m6662k64970K9780K67822k27199
4532D87472j07942K59395O7961j40436k16896N154k7674Q714k77905J36700J63950
4521C58493J87373j92027k75524K08053j79187J61938q6517K25847j88766L1471
4511B51154o8848j26940j37489n8222j23400K19357J16270j7954K13031Q0839
$$ plain form
4501 347798 386332 362408 -66457 -117012 51016 -267010 -208088 -71674 -68364 -119330 -170310
4490 -170310 -111496 122327 538429 250659 204301 195048 -3040 210099 147490 8745 89983
4479 89983 132424 128469 -198172 -58301 377193 209600 237510 -174938 -303587 182386 230284
4468 230284 303257 224677 -23811 -8063 343994 344615 293469 173703 382858 88738 -138592
4457 -138592 56130 219793 333517 330377 226707 -18128 -175117 -71923 152011 338442
4447 338442 121189 -22995 127201 121427 182152 358010 225742 126577 190454 234881 23569
4436 23569 -105604 -60912 63938 215744 27754 235555 74671 -33144 107365 -22145
4426 -22145 -204604 -384266 -307766 -1009 -169764 -90658 158665 347064 -77230 -331330
$$ packed form
4501C47798L8534k3924m28865n0555J68028l18026N8922J36414L310n0966n0980
4490a70310N8814K33823M16102k87770m6358r253j98088K13139o2609j38745Q1238
4479H9983M2441l955l26641J39871M35494j67593K7910m12448j28649M85973M7898
4468B30284P2973p8580k48488J5748L52057O21n1146j19766K09155k94120k27330
4457a38592J94722J63663J13724l140j03670k44835j56989J03194K23934J86431
4447C38442k17253j44184J50196n774O0725J75858j32268r9165O3877M4427k11312
4436B3569j29173M4692J24850J51806j87990K07801j60884j07815J40509j29510
4426b2145j82459j79662P6500L06757j68755P9106K49323J88399m24294k54100
$$ plain form
4416 -331330 -367242 25316 -3504 -109944 -302720 -320540 -139158 -196705 -363247 -210395
4406 -210395 48529 150744 895 -34399 -102648 -132933 -339221 -389610 -206624 -58641
4396 -58641 -66412 -150558 -279433 125770 189055 56261 33009 -6546 72661 135372 18009
4385 18009 245520 124381 5467 -156250 -252615 205278 143346 -61143 204061 136495
4375 136495 248881 56759 -319915 86154 -18456 190523 336769 -17182 58585 27840
4365 27840 -206954 -189464 -27482 16383 -151402 -176766 147897 391054 413210 387819 178541
4354 178541 19679 -24829 133032 -53927 82346 39307 67150 66061 141394 355245 315174
4343 315174 374388 486690 372420 135933 18666 164517 110513 -34962 -57423 138564
$$ packed form
4416c31330l5912L92558k8820j06440j92776j7820J81382n7547j66542J52852
4406b10395K58924J02215j49849l5294o8249l0285k06288n0389J82986J47983
4396e8641p771q4146j28875M05203O3285j32794k3252l9555P9207O2711j17363
4385A8009K27511j21139j18914j61717r6365M57893o1932k04489K65204o7566
4375A36495J12386j92122l76674M06069j04610K08979J46246l53951P5767l0745
4365B7840k34794J7490J61982M3865j67785k5364L24663K43157K2156k5391k09278
4354A78541j58862m4508J57861j86959J36273m3039K7843j089P5333K13851m0071
4343C15174N9214J12302j14270k36487j17267J45851n4004j45475k2461J95987
$$ plain form
4333 138564 -122082 -656174 -151315 -138212 -223312 57445 29938 6403 -343649 -370901 -39589
4322 -39589 140989 173731 -81305 -89102 184199 153198 270526 12501 84277 140065 7862
4311 7862 -150322 -361206 -259556 -28150 -51511 -63133 -12079 102652 192477 -128973 -13116
4300 -13116 124150 -170666 -90228 -279094 -248313 -351835 -346023 -334003 -382015 -456743 -543455
4289 -543455 -232113 -173633 -248695 -232756 35463 153303 93277 170756 -146415 -265419 -441544
4278 -441544 -62937 -22407 -75405 115974 179185 179234 196320 362509 173890 15431 7474
4267 7474 -103239 -128442 -88045 -51909 -235996 -287947 -185129 -191366 -248529 -114428 -45395
4256 -45395 -85917 44122 101908 344148 152789 243517 217841 504866 351255 -35692 -153356
$$ packed form
4333A38564k60646n34092N04859J3103q5100K80757k7507k3535l50052k7252L31312
4322c9589J80578L2742k55036p797K73301l1001J17328k58025P1776N5788j32203
4311G862j58184k10884J01650K31406k3361j1622N1054J14731Q9825l21450J15857
4300a3116J37266k94816Q0438j88866L0781j03522N812J2020m8012p4728q6712
4289e43455L11342N8480p5062J5939K68219J17840o0026P7479l17171j19004j76125
4278d41544L78607M0530n2998J91379O3211M9J7086J66189j88619j58459p957
4267G474j10713k5203M0397L6136j84087n1951J02818o237n7163J34101O9033
4256d5395m0522J30039N7786K42240j91359R0728k5676K87025j53611l86947j17664
$$ plain form
4245 -153356 -127187 -98174 -101410 -93951 -30694 315860 143577 170274 337955 173476 202649
4234 202649 74708 -83587 -256600 152213 -35930 -133221 79794 -52289 117376 119626
4224 119626 76094 19017 -78857 -131236 -94039 67592 233765 -84347 -140881 -262293 34680
4213 34680 26179 -31418 104029 95680 243828 404095 380046 237062 152701 350241 531305
4202 531305 212885 327142 381044 396088 510396 453712 169988 283184 298435 -48186
4192 -48186 -131086 -47354 -20919 159754 226176 172608 342882 299899 94625 28864 67158
4181 67158 338160 367894 305161 443618 305064 -9784 95514 9134 199553 372152
4171 372152 435890 500373 334729 425643 172827 336751 508553 496877 333551 178055
$$ packed form
4245a53356K6169K9013l236P459O3257L46554j72283K6697J67681j64479K9173
4234B02649j27941j58295j73013M08813j88143r7291K13015j32083J69665K250
4224A19626m3532n7077r7874n2379L7197J61631J66173l18112n6534j21412K96973
4213C4680q501n7597J35447q349J48148J60267k4049j42984q4361J97540J81064
4202E31305l18420J14257N3902J5044J14308n6684k83724J13196J5251l46621
4192d8186q2900Q3732K6435J80673O6422n3568J70274m2983k05274o5761L8294
4181F7158K71002K9734o2733J38457j38554l14848J05298q6380J90419J72599
4171C72152O3738O4483j65644R0914k52816J63924J71802j1676j63326j55496
$$ plain form
4161 178055 356886 388458 593195 615237 486694 578690 762896 629610 760377 550451
4151 550451 444240 495774 890171 879367 755025 867040 798484 361612 523690 466346
4141 466346 646613 1032723 1100031 1023523 833228 1052973 1320601 1477376 1482261 1457126 1280163
4130 1280163 1355087 1211399 1256400 1402045 1757982 1909675 1926551 1850608 1931541 2256323
4120 2256323 2437918 2256171 2439731 2562306 2500642 2715242 2867812 2905953 2945446 3289058
4110 3289058 3413362 3490238 3558143 3775600 3935953 3856252 4399913 4552238 4706800 4647562
4100 4647562 4707043 4744625 4637037 4661577 4822042 5089795 5201804 5573981 5686712 5775285
4090 5775285 5939824 6392334 6598426 6676719 6850902 6819561 7087387 7324474 7428596 7323304
$$ packed form
4161A78055J78831L1572K04737K2042j28543R1996J84206j33286J30767k09926
4151E50451j06211N1534L94397j0804j24342J12015o8556m36872J62078n7344
4141D66346J80267L86110O7308p6508j90295K19745K67628J56775M885k5135j76963
4130A280163P4924j43688M5001J45645L55937J51693J6876p5943Q0933L24782
4120B256323J81595j81747J83560J22575o1664K14600J52570L8141L9493L43612
4110C289058J24304P6876O7905K17457J60353p9701N43661J52325J54562n9238
4100D647562N9481L7582j07588K4540J60465K67753J12009L72177J12731Q8573
4090E775285J64539M52510K06092P8293J74183l1341K67826K37087J04122j05292
$$ plain form
4080 7323304 7152988 7096476 7213532 7553856 7596317 7504415 7787225 8295433 8303231 8101145
4070 8101145 8433813 8554097 8470948 8463854 8309900 8088040 7740514 7543954 7723979 8038005
4060 8038005 8280756 8606308 8589722 8695801 8855684 8939002 8700396 8454573 8512370 8192458
4050 8192458 7707418 7517462 7798575 7834618 7644955 7602203 7747549 7684863 7709693 7665318
4040 7665318 7701697 7661724 7706372 7271289 7158680 7174845 7046940 6774628 6733113 6569176
4030 6569176 6589267 6240949 6214086 6174982 5996521 5952849 5752348 5821298 5981542 5586459
4020 5586459 5302927 5399132 5337134 5030281 4532860 4408331 4465129 4445845 4316960 4314058 4140423
4009 4140423 4165608 4399466 4121714 3888638 3847024 3521790 3602971 3849433 3922468 3774285
$$ packed form
4080G323304j70316n6512J17056L40324M2461r1902K82810N08208P798k02086
4070H101145L32668J20284q3149p094j53954k21860l47526j96560J80025L14026
4060H038005K42751L25552j6586J06079J59883Q3318k38606k45823N7797l19912
4050H192458m85040j89956K81113L6043j89663m2752J45346o2686K4830m4375
4040G665318L6379l9973M4648m35083j12609J6165j27905k72312m1515j63937
4030F569176K0091l48318k6863l9104j78461m3672k00501O8950J60244l95083
4020E586459k83532R6205o1998l06853m97421j24529N6798j9284j28885k902j73635
4009D140423K5185K33858k77752k33076m1614l25234Q1181K46462P3035j48183
$$ plain form
3999 3774285 3795681 3881912 3828310 3841981 3977019 3761723 3658895 3484935 3455912 2967558
3989 2967558 2675191 2643034 2406060 2255213 2102969 2247440 2657466 2700558 2462095 2255803
3979 2255803 2265813 2362876 2296517 1983624 2034708 2440849 2268303 2177429 2086635 2355394 2558422
3968 2558422 2484040 2373508 2387703 2358712 2284431 2220828 1649592 1272344 1220553 1476438 1229034
3957 1229034 1300835 1194373 1171526 1103201 1518028 1453872 947666 874742 1178998 1213710 1281384
3946 1281384 1405046 1261651 1388606 1256408 1273546 1113609 1000776 1222934 1225867 1336380
3936 1336380 1412779 1449592 1338459 1394587 1155733 984075 1113801 989639 897946 882813
3926 882813 657401 469181 262987 300609 404679 735014 699126 162295 233550 431956
$$ packed form
3999C774285K1396Q6231n3602J3671J35038k15296j02828j73960k9023m88354
3989B967558k92367l2157k36974j50847j52244J44471M10026M3092k38463k06292
3979B255803J0010R7063o6359l12893N1084M06141j72546r0874r0794K68759K03028
3968B558422p4382j10532J4195k8991p4281o3603n71236l77248n1791K55885k47404
3957A229034P1801j06462k2847o8325M14827o4156n06206p2924L04256L4712O7674
3946A281384J23662j43395J26955j32198J7138j59937j12833K22158K933J10513
3936A336380P6399L6813j11133N6128k38854j71658J29726j24162r1693j5133
3926H82813k25412j88220k06194L7622J04070L30335l5888n36831P1255J98406
$$ plain form
3916 431956 113040 24062 441235 529944 552786 361122 421416 529592 290627 -87262
3906 -87262 -7748 355481 497157 397245 117652 -71887 -17658 118614 301123 55872
3896 55872 162120 296547 181491 462292 377274 224706 169145 467603 307332 95487
3886 95487 278060 268121 144669 363113 227141 330670 542031 263639 336212 620934
3876 620934 572947 340890 489918 439459 523661 465577 250036 373158 476192 215940
3866 215940 285501 170426 289667 264096 617622 582109 527964 673216 483011 301376
3856 301376 204072 147832 87932 47103 231710 359235 436164 526273 510325 360232 198378
3845 198378 138296 211024 335740 453540 450541 404957 479514 503806 300350 117629 363171
$$ packed form
3916D31956l18916q8978M17173Q8709K2842j91664O0294J08176k38965l77889
3906h7262P9514L63229J41676r9912k79593j89539N4229J36272J82509k45251
3896E5872J06248J34427j15056K80801q5018j52568n5561K98458j60271k11845
3886I5487J82573r939j23452K18444j35972J03529K11361k78392P2573K84722
3876F20934m7987k32057J49028n0459Q4202n8084k15541J23122J03034k60252
3866B15940O9561j15075J19241k5571L53526l5513n4145J45252j90205j81635
3856C01376r7304n6240n9900m0829J84607J27525P6929R0109j5948j50093j61854
3845A98378o0082P2728J24716J17800k999m5584P4557K4292k03456j82721K45542
$$ plain form
3834 363171 344830 188091 -26710 103096 157593 228226 568385 286183 522249 168152
3824 168152 110457 244151 412521 514381 424872 483010 541949 555483 474051 397719 554794
3813 554794 514150 546027 528099 441584 562924 717039 716472 621162 690253 710673 877789
3802 877789 737761 557701 452935 208483 422835 492064 307657 114769 388870 479671
3792 479671 671199 490995 334820 241890 348529 626482 774411 932010 995008 1214704
3782 1214704 968471 742429 823353 848251 650351 630576 579255 923808 729437 636805
3772 636805 455056 440186 648006 734502 645757 771528 641709 741205 733247 755421 883932
3761 883932 1187848 912895 1217187 995226 903654 1197672 1460452 1446306 1426147 1309719
$$ packed form
3834C63171j8341j56739k14801J29806N4497P0633L40159k82202K36066l54097
3824A68152n7695J33694J68370J01860q9509N8138N8939J3534q1432p6332J57075
3813E54794m0644L1877j7928q6515J21340J54115n67r5310O9091K0420J67116
3802H77789j40028j80060j04766k44452K14352O9229j84407j92888K74101R0801
3792D79671J91528j80204j56175r2930J06639K77953J47929J57599O2998K19696
3782A214704k46233k26042Q0924K4898j97900j9775n1321L44553j94371r2632
3772F36805j81749j4870K07820Q6496q8745J25771j29819R9496p958K2174J28511
3761H83932L03916k74953L04292k21961r1572K94018K62780j4146k0159j16428
$$ plain form
3751 1309719 1549997 1706790 1442318 1291350 1303992 1340783 1318834 1346803 1476698 1295545
3741 1295545 1248381 1434774 1572476 1492349 1640234 1809697 1722128 1891573 1982854 2076376
3731 2076376 1802121 1745612 1991402 2369818 2069867 2002451 2081326 1713580 1711434 1911475
3721 1911475 1953568 2284480 2195509 1936977 2021800 2149910 2369957 2321288 2341483 2602852
3711 2602852 2782756 2733044 2802957 2955747 3172844 2994472 3058384 3230814 2907217 2975965
3701 2975965 3245176 3329302 3226721 3665804 3871104 3979971 3925606 4069252 4344069 4488055
3691 4488055 4464181 4238867 4359376 4628293 4963647 4928291 4870390 5045924 5002012 5468099
3681 5468099 5640628 5486154 5761099 5831169 5972964 6078735 6181749 6487281 6596562 6924203
$$ packed form
3751A309719K40278J56793k64472j50968J2642L6791k1949K7969J29895j81153
3741A295545m7164J86393J37702q0127J47885J69463q7569J69445R1281R3522
3731B076376k74255n6509K45790L78416k99951o7416P8875l67746k146K00041
3721A911475M2093L30912q8971k58532Q4823J28110K20047m8669K0195K61369
3711B602852J79904m9712O9913J52790K17097j78372O3912J72430l23597O8748
3701B975965K69211Q4126j02581M39083K05300J08867n4365J43646K74817J43986
3691D488055k3874k25314J20509K68917L35354l5356n7901J75534m3912M66087
3681E468099J72529j54474K74945P0070J41795J05771J03014L05532J09281L27641
$$ plain form
3671 6924203 7355092 7747398 7917901 8382131 8209170 8225361 8395139 8862201 9229626 9589050
3661 9589050 9902724 10453371 10748896 10865209 11034244 11259245 11953323 12642768 13113273 13512313
3651 13512313 13805901 14153219 14843664 15575363 16146520 16609165 17441059 17937510 18321737
3642 18321737 19007081 19764118 20539489 21134190 22191346 22827496 23426688 24368026 24708103
3633 24708103 25488916 26531807 27063727 27617761 28353542 28849934 29344904 29776827 30059810
3624 30059810 29973952 29864221 29874452 30062288 29822607 29765478 29371915 28737615 27931313 27240976
3614 27240976 26598401 26134453 25388183 24735598 24196174 23093910 22295547 21615160 21160415
3605 21160415 20549268 19921550 19135849 18402239 17965058 17280356 16519342 15908225 15551708
$$ packed form
3671F924203M30889L92306J70503M64230j72961J6191J69778M67062L67425L59424
3661I589050L13674N50647K95525J16313J69035K25001O94078O89445M70505L99040
3651A3512313K93588L47318O90445P31699N71157M62645Q31894M96451L84227
3642A8321737O85344P57037P75371N94701J057156O36150N99192R41338L40077
3633B4708103P80813J042891N31920N54034P35781M96392M94970M31923K82983
3624C0059810q5858j09731J0231J87836k39681n7129l93563o34300q06302o90337
3614B7240976o42575m63948p46270o52585n39424j102264p98363o80387m54745
3605B1160415o11147o27718p85701p33610m37181o84702p61014o11117l56517
$$ plain form
3596 15551708 15154121 14597548 14321940 13983806 13348644 12927465 12804367 12359046 11982296
3587 11982296 11805340 11433752 10923967 10733224 10157716 10022823 9990316 9999308 9453277 9181295
3577 9181295 8895771 8519328 8630731 8525419 8429018 8359232 8040250 7917693 7899364 7671044
3567 7671044 7492685 7077569 7030698 6932766 6843913 6492728 6556831 6460940 6254122 6287203 6249478
3556 6249478 5931483 6061902 6178231 5880886 5865026 5932520 5512674 5407685 5265681 5438711
3546 5438711 5203287 4988430 5018740 5144554 5191832 4730707 4875157 5040097 4812072 4921362
3536 4921362 4863634 4785431 4739261 4453989 4395019 4457790 4319985 4220966 4122712 4199857 4411698
3525 4411698 4518579 4599216 4650992 4536950 4554010 4335561 4028518 3966178 3966144 3877304 3907789
$$ packed form
3596A5551708l97587n56573k75608l38134o35162m21179j23098m45321l76750
3587A1982296j76956l71588n09785j90743n75508j34893l2507Q992n46031k71982
3577I181295k85524l76443J11403j05312r6401o9786l18982j22557j8329k28320
3567G671044j78359m15116m6871r7932q8853l51185O4103r5891k06818L3081l7725
3556F249478l17995J30419J16329k97345j5860O7494m19846j04989j42004J73030
3546E438711k35424k14857L0310J25814M7278m61125J44450J64940k28025J09290
3536D921362n7728p8203m6170k85272n8970O2771j37805r9019r8254P7145K11841
3525D411698J06881Q0637N1776j14042J7060k18449l07043o2340l4q8840L0485
$$ plain form
3514 3907789 4104749 4242149 4074305 3695742 3834069 4208583 4240273 4105234 4009030 3809471
3504 3809471 4035354 3880190 4054254 4232364 4022994 4108314 4219817 4282936 4196167 4145485
3494 4145485 4213146 4364214 4205957 3883255 3990026 4092454 4025339 3849417 3822012 4029584
3484 4029584 4190046 3959244 4050159 3774477 4093423 4394832 4331303 4401699 4255210 4300403
3474 4300403 4247474 4267996 4199275 4179205 4349817 4249717 4532318 4685398 4388474 4202499
3464 4202499 4267402 4353441 4652168 4542970 4690023 4564036 4538624 4689876 4814828 4941896
3454 4941896 5021322 5068212 4858013 5008710 5100332 5132994 5374298 5304720 5174807 5275363
3444 5275363 5425142 5505111 5403628 5557487 5229750 5369986 5768108 5845124 6018552 6152969
$$ packed form
3514C907789J96960J37400j67844l78563J38327L74514L1690j35039r6204j99559
3504C809471K25883j55164J74064J78110k09370Q5320J11503O3119q6769n0682
3494D145485O7661J51068j58257l22702J06771J02428o7115j75922k7405K07572
3484D029584J60462k30802R0915k75682L18946L01409o3529P0396j46489M5193
3474D300403n2929K0522o8721k0070J70612j00100K82601J53080k96924j85975
3464D202499O4903Q6039K98727j09198J47053j25987k5412J51252J24952J27068
3454D941896P9426M6890k10199J50697R1622L2662K41304o9578j29913J00556
3444E275363J49779P9969j01483J53859l27737J40236L98122P7016J73428J34417
$$ plain form
3434 6152969 5868406 6006330 6068298 6113930 6160070 6071718 6105586 6405506 6330060 6322140 6421080
3423 6421080 6804934 6571166 6612668 6896533 7135183 7113452 7402648 7570109 7432035 7426536
3413 7426536 7860258 8150186 8308118 8548442 8557559 8668785 8895724 8928459 9492061 10124579
3403 10124579 10172361 10230472 10386440 11210852 11358315 11630767 11838318 12584038 13258701 13824976
3393 13824976 14466804 15153706 15620723 16257526 17230479 17710125 18181220 18954040 19599247
3384 19599247 19993653 20197575 20555932 20918612 21272664 21465527 21341812 21325597 21258267 21021911
3374 21021911 21164058 21031952 20967504 20734266 20535542 20676980 20596006 20531824 20446379 20021215
3364 20021215 19755035 19327855 19033992 18644222 18048046 17797235 17349614 16971233 16810777
$$ packed form
3434F152969k84563J37924O1968M5632M6140q8352L3868K99920p5446p920R8940
3423F421080L83854k33768M1502K83865K38650k1731K89196J67461j38074n499
3413G426536M33722K89928J57932K40324R117J11226K26939L2735N63602O32518
3403A0124579M7782N8111J55968Q24412J47463K72452K07551P45720O74663N66275
3393A3824976O41828O86902M67017O36803R72953M79646M71095P72820O45207
3384A9599247L94406K03922L58357L62680L54052J92863j23715j6215o7330k36356
3374B1021911J42147j32106o4448k33238j98724J41438q0974o4182q5445m25164
3364B0021215k66180m27180k93863l89770n96176k50811m47621l78381j60456
$$ plain form
3355 16810777 16452994 16122872 16008686 16145914 15989806 15949022 16120635 16135133 16310144 16540420
3345 16540420 16872707 17244627 17563051 17540794 17640725 17970173 17993553 18442617 18552902 18574500
3335 18574500 18655643 18867223 19190447 18954376 18980911 19261318 19157503 19032755 19058601 19306555
3325 19306555 19702145 19732931 19656825 20060798 20189671 19599350 19637714 20134430 20247771 20526704
3315 20526704 20574200 20587681 21198044 21352450 21531777 21749425 22248450 22773433 23644989 24558931
3305 24558931 25249589 25817517 26724543 27601451 28559528 29721685 30861694 31895157 33075483
3296 33075483 34574899 35762089 36438248 37366058 38348476 39359671 40422751 41230367 41835559
3287 41835559 42636064 43605385 44678774 45737840 46592393 47621748 48578574 49242632 49855320
$$ packed form
3355A6810777l57783l30122j14186J37228j56108m0784J71613J4498J75011K30276
3345A6540420L32287L71920L18424k2257R9931L29448K3380M49064J10285K1598
3335A8574500Q1143K11580L23224k36071K6535K80407j03815j24748K5846K47954
3325A9306555L95590L0786p6106M03973J28873n90321L8364M96716J13341K78933
3315B0526704M7496J3481O10363J54406J79327K17648M99025N24983Q71556R13942
3305B4558931O90658N67928R07026Q76908R58077J162157J140009J033463J180326
3296C3075483J499416J187190O76159R27810R82418J011195J063080Q07616O05192
3287D1835559Q00505R69321J073389J059066Q54553J029355R56826O64058O12688
$$ plain form
3278 49855320 50486520 50637006 50780914 51219087 51380802 51317830 51537177 51890016 52147027 52403127
3268 52403127 52887796 53519199 54116367 54718172 54772746 55048892 55132151 55495783 55546383 55978780
3258 55978780 56220673 56265137 56275739 56186079 56500851 56671195 56833521 56843771 57103697 57321537
3248 57321537 57534060 57392431 56924042 57006202 57144251 56319030 55622332 54916829 54139439 53230047
3238 53230047 51970482 50781179 49589285 48027284 46691962 45465339 43755890 42013811
3230 42013811 40815492 39734569 38571361 37176009 36263080 35497466 34343703 33385938 32707703
3221 32707703 32218914 31854999 31622345 30920829 30482514 29913263 29498183 29073118 28663115
3212 28663115 28260129 27983032 28054738 28005635 28032623 27977908 27874121 27881398 28212783 28157887 28124001
$$ packed form
3278D9855320O31200J50486J43908M38173J61715o2972K19347L52839K57011K56100
3268E2403127M84669O31403N97168O01805N4574K76146Q3259L63632N0600M32397
3258E5978780K41893M4464J0602q9660L14772J70344J62326J0250K59926K17840
3248E7321537K12523j41629m68389Q2160J38049q25221o96698p05503p77390r09392
3238E3230047j259565j189303j191894j562001j335322j226623j709449j742079
3230D2013811j198319j080923j163208j395352r12929p65614j153763r57765o78235
3221C2707703m88789l63915k32654p01516m38315n69251m15080m25065m10003
3212B8663115m02986k77097P1706m9103K6988n4715j03787P277L31385n4896l3886
$$ plain form
3201 28124001 28069801 28132806 28490971 28888798 29522310 30097262 30556560 31524845 32337459 32995970
3191 32995970 33895487 35300136 35893483 36852754 38167332 39134650 39879662 40996159 42327418
3182 42327418 43161989 43450179 44126629 44397282 44843102 44739634 44251477 43770789 43485333
3173 43485333 43475000 43393910 42925507 42315500 41885442 41741031 41169662 40416422 39837027 39095827
3163 39095827 38751441 38020633 37277226 36537524 35852434 35028185 34433542 33782427 33225349
3154 33225349 32642865 32647768 32752105 32491709 32648975 32851850 33055501 33752995 33766980 34089935
3144 34089935 34185211 34368812 34605888 34947983 35159230 35581266 35602594 35638471 35694378 35491127
3134 35491127 35683828 35626802 35373846 35320525 35260242 34968267 34956046 34934411 34624627 34454481
$$ packed form
3201B8124001n4200O3005L58165L97827O33512N74952M59298R68285Q12614O58511
3191C2995970Q99517J404649N93347R59271J314578R67318P45012J116497J331259
3182D2327418Q34571K88190O76450K70653M45820j03468m88157m80688k85456
3173D3485333j0333q1090m68403o10007m30058j44411n71369p53240n79395p41200
3163C9095827l44386p30808p43407p39702o85090q24249n94643o51115n57078
3154C3225349n82484M903J04337k60396J57266K02875K03651O97494J3985L22955
3144C4089935R5276J83601K37076L42095K11247M22036K1328L5877N5907k03251
3134C5491127J92701n7026k52956n3321o0283k91975j2221k1635l09784j70146
$$ plain form
3124 34454481 34730240 34838196 34761219 34968902 35051710 34985058 35065131 35221167 35327049 35382608
3114 35382608 35638215 35570452 35519076 35639068 35698910 35508620 35343262 35351032 34956081 34995624
3104 34995624 34907139 34981160 34645757 34415165 34417148 34196209 34230362 33983582 33713674 33453252
3094 33453252 33007535 32401335 31815116 31195932 30926419 30508809 30240216 29568886 29204650
3085 29204650 28897949 28649849 28038420 27690882 27677655 27199843 26874778 26389075 26260868 25791982
3075 25791982 25270245 25022810 24769148 24548863 24051447 23571785 23108311 22719728 22494103
3066 22494103 22106517 21692975 21061567 20634032 20293095 19892478 20030360 19698081 19700164 19462754
3056 19462754 19069136 18816663 18728065 18383847 18378451 18207794 18127864 18268061 18134794 17862364
$$ packed form
3124C4454481K75759J07956p6977K07683Q2808o6652Q0073J56036J05882N5559
3114C5382608K55607o7763n1376J19992N9842j90290j65358P770l94951L9543
3104C4995624q8485P4021l35403k30592J983k20939L4153k46780k69908k60422
3094C3453252m45717o06200n86219o19184k69513m17610k68593o71330l64236
3085B9204650l06701k48100o11429l47538j3227m77812l25065m85703j28207m68886
3075B5791982n21737k47435k53662k20285m97416m79662m63474l88583k25625
3066B2494103l87586m13542o31408m27535l40937m00617J37882l32279K083k37410
3056A9462754l93618k52473q8598l44218n396j70657p9930J40197j33267k72430
$$ plain form
3046 17862364 17777130 17804389 17554502 17336140 17278123 17037427 16557595 16481539 16039325 16043812
3036 16043812 15856183 15595726 15316708 15231450 15049016 14894636 14356550 14444571 14045932 13714289
3026 13714289 13617521 13324495 13166179 13101293 12642254 12313484 12190049 12158887 11867835 11195415
3016 11195415 10831022 10570547 10188727 9910982 9619140 9441886 9836951 9703534 9461146
3007 9461146 9107277 9209323 9063470 8899401 8738051 8657365 8695157 8471372 8395368 8542491
2997 8542491 8282596 8455383 8309956 8146987 8198588 8006039 8029267 7967545 7521775 7686006
2987 7686006 7882580 8056233 7972143 8113132 8051784 7710282 7610985 7613598 7647274 7633464 8100457
2976 8100457 8074393 8068859 7899926 8183610 8051158 7951184 7963952 7991521 7913814 7982657 7958839
$$ packed form
3046A7862364q5234K7259k49887k18362n8017k40696m79832p6056m42214M487
3036A6043812j87629k60457k79018q5258j82434j54380n38086Q8021l98639l31643
3026A3714289r6768k93026j58316o4886m59039l28770j23435l1162k91052o72420
3016A1195415l64393k60475l81820k77745k91842j77254L95065j33417k42388
3007I461146l53869J02046j45853j64069j61350q0686L7792k23785p6004J47123
2997H542491k59895J72787j45427j62969N1601j92549K3228o1722m45770J64231
2987G686006J96574J73653q4090J40989o1348l41502r9297K613L3676j3810M66993
2976H100457k6064n534j68933K83684j32452r9974J2768K7569p7707O8843k3818
$$ plain form
2965 7958839 7735881 7707877 8018971 8018643 7876344 8098980 8429849 8363721 8267333 8455342 8193909
2954 8193909 8398531 8592680 8926870 8678455 8725252 9061112 9079484 9134490 9382400 9527331
2944 9527331 9513700 9904653 10496352 10391825 10376985 10465926 10554518 11075686 11316204 11783095
2934 11783095 11905801 12029043 12278568 12526597 12766363 13276019 13714054 13693612 14085831 14396127
2924 14396127 14946261 15816604 16202036 16613481 17113836 17640065 18255385 18993914 19856568
2915 19856568 20574378 21717765 22383781 23158743 24340164 25558031 26655770 27864278 29307542
2906 29307542 30893843 32696952 34801264 36937161 39155975 41866452 44953558 48568608
2898 48568608 52895790 57872498 63776409 70172532 76397430 81777718 86128033 89025950
$$ packed form
2965G958839k22958k8004L11094l28j42299K22636L30869o6128r6388J88009k61433
2954H193909K04622J94149L34190k48415M6797L35860J8372N5006K47910J44931
2944I527331j3631L90953N91699j04527j4840Q8941Q8592N21168K40518M66891
2934A1783095J22706J23242K49525K48029K39766N09656M38035k0442L92219L10296
2924A4396127N50134Q70343L85432M11445N00355N26229O15320P38529Q62654
2915A9856568P17810J143387O66016P74962J181421J217867J097739J208508J443264
2906B9307542J586301J803109K104312K135897K218814K710477L087106L615050
2898D8568608M327182M976708N903911O396123O224898N380288M350315K897917
$$ plain form
2890 89025950 90057762 90123006 89992425 89308049 87973563 86199082 83660864 80981022 78238167
2881 78238167 76215384 74687551 73487185 73134749 72920323 73011386 73570752 73652135 73470687
2872 73470687 72618016 71643217 70479706 69222584 67680177 65962183 64388774 63085916
2864 63085916 62013456 61494117 60889221 60208359 59492320 58696436 57649377 56621675 55052909
2855 55052909 53531552 51788804 50272107 48288713 46113367 44358825 42467915 40650675
2847 40650675 38690953 37154460 35772726 34496306 33198019 32287667 31069408 30015952
2839 30015952 28822852 27774507 26579298 25397831 24302164 23400234 22232137 21368675
2831 21368675 20131289 19403513 18790449 18315322 17456628 16304859 15815749 15196950 14609632
$$ packed form
2890H9025950J031812O5244j30581o84376j334486j774481k538218k679842k742855
2881G8238167k022783j527833j200366l52436k14426R1063N59366Q1383j81448
2872G3470687q52671r74799j163511j257122j542407j717994j573409j302858
2864F3085916j072460n19339o04896o80862p16039p95884j047059j027702j568766
2855E5052909j521357j742748j516697j983394k175346j754542j890910j817240
2847D0650675j959722j536493j381734j276420j298287r10352j218259j053456
2839C0015952j193100j048345j195209j181467j095667r01930j168097q63462
2831B1368675j237386p27776o13064m75127q58694j151769m89110o18799n87318
$$ plain form
2822 14609632 14255537 13736380 13603103 13489144 12694365 12035956 11462771 11464160 11130653 10546070
2812 10546070 9998921 9578803 9336244 9157589 8988764 8791867 8350786 8317737 7899238 7468029
2802 7468029 7387525 7377671 7415830 7157726 6981142 6733713 6523586 6490746 6399367 6333844 6086970
2791 6086970 6151954 6000124 5680258 5427261 5311970 5422618 5238624 5149204 4907474 5411851
2781 5411851 5559340 5335383 5340070 5306988 5115486 5040581 4925147 5289395 5508731 5297210
2771 5297210 5212225 5060957 4969521 4764459 5115199 5262436 5140844 4818407 4795946 4600683
2761 4600683 4342143 4467372 4424676 4537292 4455268 4040793 4125967 3799917 3790997 3695931 3875754
2750 3875754 4060839 4148771 3756583 3489999 3341779 3210174 3355174 3296615 3057679 2978122
$$ packed form
2822A4609632l54095n19157j33277j13959p94779o58409n73185J389l33507n84583
2812A0546070n47149m20118k42559j78655j68825j96897m41081l3049m18499m31209
2802G468029q0504r854L8159k58104j76584k47429k10127l2840r1379o5523k46874
2791F086970O4984j51830l19866k52997j15291J10648j83994q9420k41730N04377
2781E411851J47489k23957M687l3082j91502p4905j15434L64248K19336k11521
2771E297210q4985j51268r1436k05062L50740J47237j21592l22437k2461j95263
2761D600683k58540J25229m2696J12616q2024m14475Q5174l26050q920r5066J79823
2750C875754J85085Q7932l92188k66584j48220j31605J45000n8559k38936p9557
$$ plain form
2740 2978122 2817345 2639704 2645231 2147970 2230217 2246666 2287356 2363053 2573156 2328752 2501912
2729 2501912 2355340 2238450 2051363 2137274 2075938 2127083 1806264 1531501 1689960 1854453
2719 1854453 1846959 1884272 1911166 1731486 1698626 1666983 1774328 1927997 1845292 1701869 1856602
2708 1856602 1891719 1667424 1619597 2028901 1826587 1540080 1465858 1326168 1280159 1160518
2698 1160518 973800 1054191 971813 924981 1114019 1202983 911615 1080552 1208525 1274446
2688 1274446 1114434 1195827 998372 870145 998228 1054925 830546 782663 722484 653177
2678 653177 624220 881428 1033403 738275 1167372 1348323 1098816 864283 704204 966323
2668 966323 1028796 1101681 1186415 935109 827529 819376 752241 526923 697581 401104 437266
$$ packed form
2740B978122j60777j77641N527m97261Q2247J6449M0690P5697K10103k44404J73160
2729B501912j46572j16890j87087Q5911o1336N1145l20819k74763J58459J64493
2719A854453p494L7313K6894j79680l2860l1643J07345J53669q2705j43423J54733
2708A856602L5117k24295m7827M09304k02314k86507p4222j39690m6009j19641
2698A160518j86718Q0391q2378m6832J89038Q8964k91368J68937J27973O5921
2688A274446j60012Q1393j97455j28227J28083N6697k24379m7883o0179o9307
2678F53177k8957K57208J51975k95128M29097J80951k49507k34533j60079K62119
2668I66323O2473P2885Q4734k51306j07580q153o7135k25318J70658k96477L6162
$$ plain form
2657 437266 535361 417573 601422 401961 405422 575090 630509 595496 473596 621090 697688
2646 697688 805514 670180 644645 468770 455566 561488 430381 390629 471386 487267 296643
2635 296643 410144 449628 335714 70510 265194 491884 111508 353607 780195 865376
2625 865376 749449 713563 620695 354887 372324 771490 653668 282287 132285 166661
2615 166661 295403 412566 215403 233433 551929 827207 894764 843125 806961 609248
2605 609248 645242 481670 480265 556248 629893 579661 437171 217458 178673 399721 670348
2594 670348 533907 507424 533159 433002 278855 600332 830209 539967 176663 441786
2584 441786 534942 304644 509638 541287 591194 573375 584200 484120 408457 403663 543791
$$ packed form
2657D37266R8095j17788J83849j99461L461J69668N5419l5013j21900J47494P6598
2646F97688J07826j35334k5535j75875j3204J05922j31107l9752Q0757J5881j90624
2635B96643J13501L9484j13914k65204J94684K26690l80376K42099M26588Q5181
2625H65376j15927l5886r2868k65808J7437L99166j17822l71381j50002L4376
2615A66661J28742J17163j97163J8030L18496K75278O7557n1639l6164j97713
2605F09248L5994j63572j405P5983P3645n0232j42490k19713l8785K21048K70627
2594F70348j36441k6483K5735j00157j54147L21477K29877k90242l63304K65123
2584D41786R3156k30298K04994L1649M9907j7819J0825j00080p5663m794J40128
$$ plain form
2573 543791 638525 263238 225049 394018 238773 82068 263234 300716 278740 213991 13121
2562 13121 374399 282933 296361 252180 227251 -50142 -273491 74009 179252 31812 -14820
2551 -14820 154615 215953 225481 177519 -19393 86930 445609 391907 160673 -58867 -251508
2540 -251508 -81852 -192148 -125282 84275 -62260 -122539 174057 285610 68392 -67196
2530 -67196 -286863 -57332 -139074 -49997 -25953 -49503 60842 158198 -125539 -5238 -93656
2519 -93656 -248790 18257 29994 -7319 -127047 -376 -85102 -287363 -132237 -352409
2509 -352409 -370161 -203258 -116412 212690 227247 205335 92944 -106584 -112272 -148074 -132088
2498 -132088 62979 128756 192704 136675 113994 43819 -148821 -340779 -325475 -279492 -203122
$$ packed form
2573E43791R4734l75287l8189J68969j55245j56705J81166L7482k1976o4749k00870
2562A3121L61278r1466J3428m4181k4929k77393k23349L47500J05243j47440m6632
2551a4820J69435O1338R528m7962j96912J06323L58679n3702k31234k19540j92641
2540b51508J69656j10296O6866K09557j46535o0279K96596J11553k17218j35588
2530f7196k19667K29531q1742Q9077K4044k3550J10345R7356k83737J20301q8418
2519i3656j55134K67047J1737l7313j19728J26671q4726k02261J55126k20172
2509c52409j7752J66903Q6846L29102J4557k1912j12391j99528n688l5802J5986
2498a32088J95067O5777O3948n6029k2681p0175j92640j91958J5304M5983P6370
$$ plain form
2487 -203122 -34051 -100795 -240294 -15233 47892 -237510 65066 314058 292956 203258
2477 203258 417986 350763 57623 120627 -39011 -617 -301768 -345044 -298559 -356024 -380827
2466 -380827 -404892 -352011 -369975 -203892 23325 -2607 129694 -141533 -32825 -259140
2456 -259140 -324288 -35114 -322908 -508965 -313934 22506 -75134 -153170 230079 147943
2446 147943 44876 101743 99 -252816 -479853 -341022 -220167 -523124 -535680 -227651
2436 -227651 -238027 -254674 -49160 174092 -127035 -68378 121764 131471 84578 232854 83406
2425 83406 -34877 211793 -68144 -172602 173283 24514 105071 153836 192834 63901
2415 63901 269740 75986 182324 295252 51906 -7174 -95097 82847 60480 -49784
$$ packed form
2487b03122J69071o6744j39499K25061O3125k85402L02576K48992k1102q9698
2477B03258K14728o7223k93140O3004j59638L8394l01151m3276M6485n7465k4803
2466c80827k4065N2881j7964J66083K27217k5932J32301k71227J08708k26315
2456b59140o5148K89174k87794j86057J95031L36440r7640p8036L83249q2136
2446A47943j03067N6867j01644k52915k27037J38831J20855l02957j2556L08029
2436b27651j0376j6647K05514K23252l01127N8657J90142R707m6893J48276j49448
2425H3406j18283K46670k79937j04458L45885j48769Q0557M8765L8998j28933
2415F3901K05839j93754J06338J12928k43346n9080q7923J77944k2367j10264
$$ plain form
2405 -49784 -146814 -214448 -151854 -31068 -34874 19863 113525 18440 -166900 24478 -31231
2394 -31231 54145 129452 252122 283493 109508 278723 60186 -59964 104755 205898
2384 205898 267467 554732 447792 219769 333822 394354 898852 969009 969226 1333193 1692556
2373 1692556 1491769 1323707 1474906 1313983 1108779 772047 416354 410003 125622 212194
2363 212194 338256 273477 195383 282016 421234 423819 -14255 183652 629593 337514 170186
2352 170186 -10560 124772 237686 381048 332057 374699 450603 209974 155764 -15517
2342 -15517 -315089 12523 89993 242947 -70555 -101412 76367 -104598 92639 220992
2332 220992 255800 156473 247224 215732 249250 235898 -12468 63384 96189 69696 97321
$$ packed form
2405d9784r7030o7634O2594J20786l806N4737R3662r5085j85340J91378n5709
2394c1231Q5376P5307J22670L1371j73985J69215k18537j20150J64719J01143
2384B05898O1569K87265j06940k28023J14053O0532N04498P0157K17L63967L59363
2373A692556k00787j68062J51199j60923k05204l36732l55693o351k84381Q6572
2363B12194J26062o4779p8094Q6633J39218K585m38074J97907M45941k92079j67328
2352A70186j80746J35332J12914J43362m8991M2642P5904k40629n4210j71281
2342a5517k99572L27612P7470J52954l13502l0857J77779j80965J97237J28353
2332B20992L4808r9327R0751l1492L3518j3352k48366P5852L2805k6493K7625
$$ plain form
2321 97321 60138 -128421 -410956 -162981 95043 297315 322423 35188 13364 36460 -371942
2310 -371942 -295970 70751 347547 59810 -127973 44739 -246516 -242710 -90812 -88228 -136468
2299 -136468 225260 42918 12978 226480 21546 192874 363919 458201 343597 315685
2289 315685 144561 -60369 157835 170521 227590 99299 -57334 -33575 -13184 134862
2279 134862 255878 373956 610328 445673 379585 297055 501149 600035 316748 300083
2269 300083 152161 128224 408710 401309 291483 414892 252746 505733 635126 723481
2259 723481 717993 623207 797036 800209 625364 499713 559664 686059 792535 828094 925630
2248 925630 746807 786182 625185 654831 625024 838696 869505 756042 920054 822071 472466
$$ packed form
2321I7321l7183j88559k82535K47975K58024K02272K5108k87235k1824K3096m08402
2310c71942P5972L66721K76796k87737j87783J72712k91255L806J51898K584m8240
2299a36468L61728j82342k9940K13502k04934J71328J71045R4282j14604k7912
2289C15685j71124k04930K18204J2686N7069j28291j56633K3759K0391J48046
2279A34862J21016J18078K36372j64655o6088q2530K04094R8886k83287j6665
2269C00083j47922k3937K80486p401j09826J23409j62146K52987J29393Q8355
2259G23481n488r4786J73829L173j74845j25651N9951J26395J06476L5559R7536
2248I25630j78823L9375j60997K9646k9807K13672L0809j13463J64012r7983l49605
$$ plain form
2237 472466 515253 777029 850411 937593 1081730 993741 1009469 1204163 863929 650456 756616
2226 756616 1222749 1280732 1199172 1435433 1490615 1459047 1260183 1408131 1733814 1673722 1493875
2215 1493875 1762268 1741502 1976407 2198919 1972006 1848892 1797920 2036148 2024186 2071020
2205 2071020 1945748 2362184 2476010 2282017 2347085 2459693 2557438 2554375 2709801 2686720
2195 2686720 2957968 3271663 3246986 3447113 3902697 4103702 4039889 4316969 4182450 4330429
2185 4330429 4436231 4585688 4563572 4853375 4865044 5221360 5247883 5522227 5761426 5856487
2175 5856487 5765096 6162524 6629143 6789017 6788702 6777656 6824389 6984729 7042965 7426948 7725572
2164 7725572 8004363 7941936 7998867 8358966 8597720 8667849 8875497 9218828 9398933 9442951
$$ packed form
2237D72466M2787K61776P3382Q7182J44137q7989J5728J94694l40234k13473J06160
2226G56616M66133N7983q1560K36261N5182l1568j98864J47948L25683o0092j79847
2215A493875K68393k0766K34905K22512k26913j23114n0972K38228j1962M6834
2205B071020j25272M16436J13826j93993O5068J12608R7745l063J55426k3081
2195B686720K71248L13695k4677K00127M55584K01005o3813K77080j34519J47979
2185D330429J05802J49457k2116K89803J1669L56316K6523K74344K39199R5061
2175E856487r1391L97428M66619J59874l15j1046M6733J60340N8236L83983K98624
2164G725572K78791o2427N6931L60099K38754P0129K07648L43331J80105M4018
$$ plain form
2154 9442951 9763406 10021559 10236303 10992281 11207634 11565057 11850764 12124297 12550626 13090559
2144 13090559 13494768 14252714 15127377 16136827 17000984 17999883 18895577 19811348 20573441
2135 20573441 21356584 22336844 23521977 24613401 25931440 27399795 28731879 29866067
2127 29866067 31536853 33757139 36554281 39404752 42499017 46293507 50668697 55543734
2119 55543734 59763724 62990127 68055538 74677430 83134680 92711484 103759690 117805823
2111 117805823 137421228 164996759 201808460 239014504 277412141 303877981 318556224
2104 318556224 301898262 260276178 223204817 186511282 153200440 125546372 106033672
2097 106033672 90738311 79741044 71336192 65322625 60187636 56357421 53032508 49753572
$$ packed form
2154I442951L20455K58153K14744P55978K15353L57423K85707K73533M26329N39933
2144A3090559M04209P57946Q74663J009450Q64157R98899Q95694R15771P62093
2135B0573441P83143R80260J185133J091424J318039J468355J332084J134188
2127B9866067J670786K220286K797142K850471L094265L794490M375190M875037
2119E5543734M219990L226403N065411O621892Q457250R576804J1048206J4046133
2111A17805823J9615405K7575531L6811701L7206044L8397637K6465840J4678243
2104C18556224j6657962m1622084l7071361l6693535l3310842k7654068j9512700
2097A06033672j5295361j0997267q404852o013567n134989l830215l324913l278936
$$ plain form
2089 49753572 46122199 42655893 39240958 36421774 33625817 31404793 29308646 27817316
2081 27817316 26025359 24779153 23556291 22004277 20606452 19782827 18891825 18356039 17368566
2072 17368566 16757319 15844226 15005153 14499805 14073085 13471743 13082845 12472798 12131013
2063 12131013 11806261 11276423 11074931 10431014 10071757 10008514 9340388 8984502 8800433 8544478
2053 8544478 8653207 8518460 8414622 8360657 8007776 7748381 7267428 6904117 6801014 6642594
2043 6642594 6257295 6086800 5991394 6045961 5815019 5546859 5377806 5225285 5082906 4979697
2033 4979697 4823424 4687655 4552261 4224160 4032491 4122876 4174240 4018245 3990021 3868030
2023 3868030 3614463 3409418 3578250 3526097 3527324 3384329 3359646 3092466 2916764 2787781
$$ packed form
2089D9753572l631373l466306l414935k819184k795957k221024k096147j491330
2081B7817316j791957j246206j222862j552014j397825q23625q91002n35786r87473
2072A7368566o11247r13093q39073n05348m26720o01342l88898o10047l41785
2063A2131013l24752n29838k01492o43917l59257o3243o68126l55886j84069k55955
2053H544478J08729j34747j03838n3965l52881k59395m80953l63311j03103j58420
2043F642594l85299j70495r5406N4567k30942k68160j69053j52521j42379j03209
2033D979697j56273j35769j35394l28101j91669R0385N1364j55995k8224j21991
2023C868030k53567k05045J68832n2153J227j42995k4683k67180j75702j28983
$$ plain form
2013 2787781 2800711 2853200 2697790 2513107 2538265 2441001 2511257 2166915 2235988 2322492 2254653
2002 2254653 2266251 2127474 2208297 2026685 2164439 2021633 1997659 2040573 1829858 2047405
1992 2047405 2071648 2027917 1851235 1649931 1588567 1977414 1815520 1843684 1761788 1635626
1982 1635626 1640165 1796567 1635324 1579400 1561492 1261140 1233169 1510597 1572682 1415843 1367080
1971 1367080 1295282 1134814 1260353 1436922 1489340 1619928 1421426 1233583 968843 780679
1961 780679 1040036 1060631 1213224 1136013 741688 770680 739650 924302 1204986 1192030 774235
1950 774235 958772 977252 1005912 1131129 1165849 1319403 1387262 1330137 1303904 964394 1095063
1939 1095063 941812 808701 889576 562179 591500 603155 674977 615643 656900 601613 758074
$$ packed form
2013B787781J2930N2489j55410j84683K5158r7264P0256l44342O9073Q6504o7839
2002B254653J1598j38777Q0823j81612J37754j42806k3974M2914k10715K17547
1992B047405K4243m3731j76682k01304o1364L88847j61894K8164q1896j26162
1982A635626M539J56402j61243n5924j7908l00352k7971K77428O2085j56839m8763
1971A367080p1798j60468J25539J76569N2418J30588j98502j87843k64740j88164
1961G80679K59357K0595J52593p7211l94325K8992l1030J84652K80684j2956m17795
1950G74235J84537J8480K8660J25217L4720J53554O7859n7125k6233l39510J30669
1939A095063j53251j33111Q0875l27397K9321J1655P1822n9334M1257n5287J56461
$$ plain form
1928 758074 516243 604931 437272 445399 427724 631904 766291 499954 304936 465881
1918 465881 565864 618738 701999 495572 278600 309928 354244 435357 367264 238930 256051
1907 256051 369015 650774 639031 649442 367099 595124 492653 327120 629574 461071
1897 461071 516427 396784 234542 334219 330581 432139 437377 718933 229484 260562 167333
1886 167333 125924 88341 264630 197688 100149 60528 301317 181272 80216 -26684 40310
1875 40310 166233 72100 277213 264580 263302 258970 535926 650713 612113 472766 321151
1864 321151 209746 453018 120069 -15229 -48909 -88204 320573 486359 712891 586023
1854 586023 556817 321575 357078 562486 517684 442629 446217 636300 631287 498974 641632
$$ packed form
1928G58074k41831Q8688j67659Q127j7675K04180J34387k66337j95018J60945
1918D65881R9983N2874Q3261k06427k16972L1328M4316Q1113o8093j28334J7121
1907B56051J12964K81759j1743J0411k82343K28025j02471j65533L02454j68503
1897D61071N5356j19643j62242R9677l638J01558N238K81556m89449L1078r3229
1886A67333m1409l7583J76289o6942r7539l9621K40789j20045j01056j06900O6994
1875D0310J25923r4133K05113j2633j278m332K76956J14787l8600j39347j51615
1864C21151j11405K43272l32949j35298l3680l9295M08777J65786K26532j26868
1854E86023k9206k35242L5503K05408m4802p5055L588J90083n013j32313J42658
$$ plain form
1843 641632 995092 844577 832274 1052591 1231563 1361880 1505557 1608039 1657884 1414069
1833 1414069 1411374 1072641 875179 1027583 671470 559552 816871 958916 511479 355172
1823 355172 351519 137545 146099 175872 300376 -80012 -254301 -43586 211766 370057 354337
1812 354337 14883 225296 86841 254734 414874 380338 485480 454961 359795 -203158
1802 -203158 -226095 -260507 -361154 67780 62920 -100385 -7343 269008 366360 30866 62069
1791 62069 183705 76401 7379 -153544 -179298 41063 14382 51298 105675 -339042 -440136
1780 -440136 -120141 51250 -159476 46969 304460 188049 -266340 -387143 -167278 47394
1770 47394 135994 104063 256515 241922 241178 36624 46514 -111352 180831 412 -30479
$$ packed form
1843F41632L53460j50515j2303K20317J78972J30317J43677J02482M9845k43815
1833A414069k695l38733j97462J52404l56113j11918K57319J42045m47437j56307
1823C55172l653k13974Q554K9773J24504l80388j74289K10715K55352J58291j5720
1812C54337l39454K10413j38455J67893J60140l4536J05142l0519r5166n62953
1802b03158k2937l4412j00647M28934m860j63305R3042K76351R7352l35494L1203
1791F2069J21636j07304o9022j60923k5754K20361k6681L6916N4377m44717j01094
1780d40136L19995J71391k10726K06445K57491j16411m54389j20803K19865K14672
1770D7394Q8600l1931J52452j4593p44k04554R890j57866K92183j80419l0891
$$ plain form
1759 -30479 68015 8218 -97071 -298782 -108294 269002 141818 -227353 -311573 -230105 -425728
1748 -425728 -605604 -313554 -158609 -226162 -135591 262349 333915 235866 24493 -259120
1738 -259120 -275124 -239947 -212039 -100935 -19318 -30272 261077 163436 -272954 -189161 133191
1727 133191 112851 379937 365949 118559 -2019 -174970 -220546 -123609 128160 -40047
1717 -40047 -229870 -241907 -513349 -500048 -226141 -307218 -312988 -427677 -136445 -296361 -336210
1706 -336210 -293742 -152298 -28545 -64212 -267239 -232960 -153387 -26180 278905 227816 207162
1695 207162 -105563 -249126 -283043 -264979 -481694 -367159 -519667 -241444 -190210 -199311 -151309
1684 -151309 -167890 -80160 -99894 194296 -80947 -265071 -265369 -142799 -147070 -211772 -161474
$$ packed form
1759c0479R8494n9797j05289k01711J90488L77296j27184l69171q4220Q1468j95623
1748d25728j79876K92050J54945o7553R0571L97940P1566r8049k11373k83613
1738b59120j6004L5177K7908J11104Q1617j0954K91349r7641m36390Q3793L22352
1727A33191k0340K67086j3988k47390j20578j72951m5576R6937K51769j68207
1717d0047j89823j2037k71442J3301K73907q1077n770j14689K91232j59916l9849
1706c36210M2468J41444J23753l5667k03027L4279P9573J27207L05085n1089k0654
1695B07162l12725j43563l3917J8064k16715J14535j52508K78223N1234r101M8002
1684a51309j6581Q7730j9734K94190k75243j84124k98J22570m271o4702N0298
$$ plain form
1673 -161474 -107909 190059 55680 -52162 -19601 77181 -50113 -145434 -336091 -332463 -220610
1662 -220610 -154382 -360465 -399912 -32343 -47369 37883 -1506 35842 -248003 -139840 40316
1651 40316 377343 -97446 -378811 -110690 36275 -216490 -249697 149386 -17314 -61954
1641 -61954 -142195 7778 -60013 -155792 -10123 -266691 -149510 7755 104658 -8249 -40922
1630 -40922 -185822 -212279 -411637 -30079 -83405 -332503 -348967 -544043 -286858 -15527
1620 -15527 65646 67495 152770 -114056 160763 10004 -232935 -460229 -90780 172529 -12085
1609 -12085 -250415 -263453 57090 91538 86674 114711 -101418 -314779 -101179 -115828 -242717
1598 -242717 -162125 -115113 81372 -40226 -325145 -172400 201975 -56420 -178058 -341891
$$ packed form
1673a61474N3565K97968j34379j07842L2561R6782j27294r5321j90657L628J11853
1662b20610O6228k06083l9447L67569j5026Q5252l9389L7348k83845J08163J80156
1651D0316L37027m74789k81365K68121J46965k52765l3207L99083j66700m4640
1641f1954q0241J49973o7791r5779J45669k56568J17181J57265R6903j12907l2673
1630d0922j44900k6457j99358L81558n3326k49098j6464j95076K57185K71331
1620a5527Q1173J849Q5275k66826K74819j50759k42939k27294L69449K63309j84614
1609a2085k38330j3038L20543L4448m864K8037k16129k13361K13600j4649j26889
1598b42717Q0592M7012J96485j21598k84919J52745L74375k58395j21638j63833
$$ plain form
1588 -341891 -254814 -43909 -70481 14075 -21466 19461 -130795 -114450 -120563 -319580 -263701
1577 -263701 -119943 -212799 -169850 2631 -386419 -265299 -119227 -213180 -137122 -139190 -290497
1566 -290497 -123455 -97961 -109477 96116 -50602 -177652 -125457 -8736 -273413 -122636
1556 -122636 -220057 6975 -256759 -603588 -390177 -164654 -179761 20784 -52190 -135724
1546 -135724 -74852 -194301 -5656 -47899 -96384 -135992 -300896 -27597 -12735 -60563 -243588
1535 -243588 -156334 -104870 -178944 70728 -105775 108737 -78433 34081 169796 85830
1525 85830 -302455 -109779 -23004 -312894 -235345 -44883 -373299 -587981 -408569 -428297
1515 -428297 -586518 -535444 -385551 -460123 -556529 -579797 -641353 -560664 -312352 14988 -50021
$$ packed form
1588c41891Q7077K10905k6572Q4556l5541M0927j50256J6345o113j99017N5879
1577b63701J43758r2856M2949J72481l89050J21120J46072r3953P6058k068j51307
1566b90497J67042K5494j1516K05593j46718j27050N2195J16721k64677J50777
1556a22636r7421K27032k63734l46829K13411K25523j5107K00545p2974q3534
1546a35724O0872j19449J88645m2243m8485l9608j64904K73299J4862m7828j83025
1535b43588Q7254N1464p4074K49672j76503K14512j87170J12514J35715q3966
1525H5830l88285J92676Q6775k89890P7549J90462l28416k14682J79412j9728
1515d28297j58221N1074J49893p4572r6406k3268o1556Q0689K48312L27340o5009
$$ plain form
1504 -50021 45119 -133127 -365415 -330853 -423670 -34164 101065 -72463 -56281 -46390 30254
1493 30254 100492 -156000 76052 -69073 -278066 -34285 -291938 -262152 -376648 -373765 -470250
1482 -470250 -464962 -358549 -478034 -451620 -589266 -354707 -388037 -186920 -7201 -89197 -142696
1471 -142696 -198637 -532421 -336619 -343966 -215188 -258589 -275733 -191818 -293977 -198202 -331751
1460 -331751 -386251 -57684 -84363 -255883 -292069 -418071 -280359 -110709 86188 293375
1450 293375 293140 87695 166738 154048 71755 42430 -119426 -3100 53321 -168586 -169656
1439 -169656 -401573 -400358 -508267 -394034 -473398 -223744 219754 -171916 -456063 -532584
1429 -532584 -245850 -324081 -318909 -224728 -82849 274436 35218 -95589 -89349 -17650 -47353
$$ packed form
1504e0021R5140j78246k32288L4562r2817L89506J35229j73528J6182R891P6644
1493C0254P0238k56492K32052j45125k08993K43781k57653K9786j14496K883r6485
1482d70250N288J06413j19485K6414j37646K34559l3330K01117J79719q1996n3499
1471a42696n5941l33784J95802p347J28778m3401j7144Q3915j02159R5775j33549
1460c31751n4500L28567k6679j71520l6186j26002J37712J69650J96897K07187
1450B93375k35k05445P9043j2690q2293k9325j61856J16326N6421k21907j070
1439a69656k31917J215j07909J14233p9364K49654M43498l91670k84147p6521
1429e32584K86734p8231N172R4181J41879L57285k39218j30807O240P1699k9703
$$ plain form
1418 -47353 -315734 120293 67390 -149486 -191099 -173558 130726 326662 200855 270524 35003
1407 35003 16396 125185 268344 9501 -74981 144287 168828 21627 28328 13422 -114517
1396 -114517 -7970 -136927 -161847 -223835 -265694 -25565 75071 -211757 29090 -73472
1386 -73472 -94779 15175 3559 -186011 -429659 -323513 -373927 -17516 222098 221684 174649
1375 174649 -245996 -219579 -465540 -279466 -2016 24617 -231325 71757 138821 129738 -225653
1364 -225653 -458159 -226039 -296453 -194556 -4518 -167810 -286736 -139098 -105703 -40480
1354 -40480 -377330 -290635 -119023 -133417 -62104 -265244 -45643 -12410 -286929 -175211 -125212
1343 -125212 -180962 -314660 -192045 -248874 -279427 -506901 -349633 -429978 -432530 -230303 -222393
$$ packed form
1418d7353k68381M36027n2903k16876m1613J7541L04284J95936j25807O9669k35521
1407C5003j8607J08789J43159k58843q4482K19268K4541j47201O701j4906j27939
1396a14517J06547j28957k4920o1988m1859K40129J00636k86828K40847j02562
1386g3472k1307J09954j1616j89570k43648J06146n0414L56411K39614m14m7035
1375A74649m20645K6417k45961J86074K77450K6633k55942L03082O7064r083l55391
1364b25653k32506K32120p0414J01897J90038j63292j18926J47638L3395O5223
1354d0480l36850Q6695J71612j4394P1313k03140K19601L3233k74519J11718M9999
1343a25212n5750j33698J22615n6829l0553k27474J57268q0345k552K02227P910
$$ plain form
1332 -222393 -74525 -490439 -396134 -109240 67255 -43382 -136233 -352999 -42465 -48924
1322 -48924 -237397 -166030 -142195 -115866 -205245 -123005 -80467 -406595 -552438 -402954 -303100
1311 -303100 -129320 -309076 -78799 -281559 -175941 -81888 -18581 99922 -131916 -66
1301 -66 -62598 -82247 -40211 -191461 -136537 -248482 -142654 -188497 -67645 -81581 3611 -72381
1289 -72381 108480 194873 -192981 -123093 226473 245616 -82628 64027 68086 211397 119882
1278 119882 177169 222223 -134456 -65154 321733 -77905 -389241 -167290 144431 -4310
1268 -4310 -169491 15350 -169829 26394 -333332 -366124 -95548 69413 21342 93506 34047
1257 34047 -426601 -266172 -179064 29273 -70535 71974 84218 -107859 -10805 -88318 -63156
$$ packed form
1332b22393J47868m15914R4305K86894J76495j10637r2851k16766L10534o459
1322d8924j88473P1367K3835K6329q9379Q2240M2538l26128j45843J49484R9854
1311c03100J73780j79756K30277k02760J05618R4053O3307J18503k31838J31850
1301f6o2532j9649M2036j51250N4924j11945J05828m5843J20852j3936Q5192p5992
1289g2381J80861Q6393l87854O9888L49566J9143l28244J46655M059J43311r1515
1278A19882N7287M5054l56679O9302L86887l99638l11336K21951L11721j48741
1268d310j65181J84841j85179J96223l59726l2792K70576J64961m8071P2164n9459
1257C4047m60648J60429Q7108K08337r9808J42509J2244j92077R7054p7513K5162
$$ plain form
1246 -63156 -106134 -49423 24605 -3019 -7728 -95212 -125326 153860 -44515 -105677 123884
1235 123884 -119410 -90300 198433 482138 251939 -109128 -247496 -179781 -124729 -147664
1225 -147664 -33361 -88624 92985 -2265 -153236 -196575 -142247 -301661 -336215 -46523 136036
1214 136036 45381 -276558 -110957 95278 -243425 -251260 -10007 171044 236241 -265618
1204 -265618 -191127 -249922 -164460 74531 -139493 -283714 -343336 -313180 25254 -44992 -155454
1193 -155454 -284817 -282028 -323735 -90906 21814 -27456 -87340 8255 -103104 -474192 -275331
1182 -275331 -404284 -54069 107871 -146132 -335854 -140799 2013 -89791 -125635 -279199
1172 -279199 -294134 -193779 -35305 154637 230648 203285 -203121 -252069 -103033 88602
$$ packed form
1246f3156m2978N6711P4028k7624m709q7484l0114K79186j98375o1162K29561
1235A23884k43294K9110K88733K83705k30199l61067j38368O7715N5052k2935
1225a47664J14303n5263J81609r5250j50971m3339N4328j59414l4554K89692J82559
1214A36036r0655l21939J65601K06235l38703p835K41253J81051O5197n01859
1204b65618P4491n8795Q5462K38991k14024j44221n9622L0156L38434p0246j10462
1193a55454j29363K789m1707K32829J12720m9270n9884R5595j11359l71088J98861
1182b75331j28953L50215J61940k54003j89722J95055J42812r1804l5844j53564
1172b79199j4935J00355J58474J89942P6011k7363m06406m8948J49036J91635
$$ plain form
1162 88602 6405 36463 -206889 -210882 -267617 -38922 218611 -191449 -443702 -254797 -179320
1151 -179320 -418133 213700 -100396 -501029 -427021 -351972 -288042 -493166 -468153 -162663
1141 -162663 -272285 -303325 100876 105192 -237753 -401994 -232151 -139345 -230104 -157074 -214886
1130 -214886 -246470 -246995 -23341 -117364 -53845 -20787 -110338 -187125 -150138 76907 -94477
1119 -94477 76384 53862 -32422 -103571 -282802 -272213 -122127 -178033 -98149 -139158 -188059
1108 -188059 -94550 -112927 165281 -106190 -173090 -380347 -398236 -358744 -178705 151437 -55278
1097 -55278 -20865 -82421 -351573 -588030 -383634 -502711 -421292 -383383 -483061 -341422 -155276
1086 -155276 -210897 -203773 -234981 -372960 -246897 38465 -50380 -191864 -200852 -30123 27414
$$ packed form
1162H8602q2197L0058k43352l993n6735K28695K57533m10060k52253J88905P5477
1151a79320k38813O31833l14096m00633P4008P5049O3930k05124K5013L05490
1141a62663j09622l1040M04201M316l42945j64241J69843R2806r0759P3030n7812
1130b14886l1584n25K23654r4023O3519L3058q9551p6787L6987K27045j71384
1119i4477J70861k2522q6284p1149j79231J0589J50086n5906P9884m1009m8901
1108a88059R3509j8377K78208k71471o6900k07257j7889L9492J80039L30142k06715
1097e5278L4413o1556k69152k36457K04396j19077Q1419L7909r9678J41639J86146
1086a55276n5621P124l1208j37979J26063K85362q8845j41484q988J70729N7537
$$ plain form
1075 27414 162333 -335775 -32540 382569 112502 -120752 -33151 -111915 -268456 302539
1065 302539 69533 130331 76223 151398 -10618 -25393 -12018 175485 19076 -145305 -87805
1054 -87805 -138773 -9111 111367 -126661 -2911 -52277 -184871 -244916 -180159 246768 262663
1043 262663 223696 193079 78770 -115837 -25650 -334416 -387621 -139035 -173789 -84649 -338410
1032 -338410 -20313 327657 167660 26245 7646 258817 233496 185934 243811 399151
1022 399151 299686 145443 258307 280117 67108 94881 -33667 137032 -52436 -301350
1012 -301350 -274130 -6317 25869 -427918 -461183 -189178 -36961 -87875 -158152 -188954 -168354
1001 -168354 -52884 223142 242317 161630 89057 70848 -66436 -212200 -275346 -11248 -298887
$$ packed form
1075B7414J34919m98108L03235M15109k70067k33254Q7601p8764j56541N70995
1065C02539k33006O0798n4108P5175j62016j4775J3375J87503j56409j64381N7500
1054h7805n0968J29662J20478k38028J23750m9366j32594o0045O4757M26927J5895
1043B62663l8967l0617j14309j94607R0187l08766n3205K48586l4754Q9140k53761
1032c38410L18097L47970j59997j41415j8599K51171k5321m7562N7877J55340
1022C99151r9465j54243J12864K1810k13009K7773j28548J70699j89468k48914
1012c01350K7220K67813L2186m53787l3265K72005J52217n0914p0277l0802K0600
1001a68354J15470K76026J9175q0687p2573j8209j37284j45764o3146K64098k87639
$$ plain form
990 -298887 -398102 -246098 -18899 350165 188810 151566 35270 94667 -54746 -191126
980 -191126 -304883 -275926 -169114 -49425 -5264 -14497 154033 340388 465004 343033 56561
969 56561 170166 68837 -278659 -115612 183279 -113016 -399831 -357406 -178268 52735
959 52735 55534 225920 154463 10528 48966 -126470 83064 -115363 -120669 -17350 -119301
948 -119301 -17339 23882 66126 79953 100 49995 88311 -128786 -123511 113277 -31721
937 -31721 143640 269110 -2326 57815 346656 262158 248261 46001 -147055 132263 59718
926 59718 403316 45466 -72344 182173 222432 229950 189058 234327 241046 263380 32503
915 32503 13090 358401 421213 235497 110730 43785 289565 153235 -38415 68186 314189
$$ packed form
990b98887r9215J52004K27199L69064j61355l7244j16296N9397j49413j36380
980a91126j13757K8957J06812J19689M4161r233J68530J86355J24616j21971k86472
969E6561J13605j01329l47496J63047K98891k96295k86815M2425J79138K31003
959E2735K799J70386p1457j43935L8438j75436K09534j98427n306J03319j01951
948a19301J01962M1221M2244J3827p9853M9895L8316k17097N275K36788j44998
937c1721J75361J25470k71436O0141K88841q4498j3897k02260j93056K79318p2545
926E9718L43598l57850j17810K54517M0259P518m0892M5269O719K2334k30877
915C2503j9413L45311O2812j85716j24767o6945K45780j36330j91650J06601K46003
$$ plain form
904 314189 72516 -311246 -316974 -9144 308411 -40808 -33609 -123781 -54103 152447 -27877
893 -27877 125447 248365 -88683 121947 322053 268207 120739 -67297 -262263 -51875
883 -51875 -258068 -57378 183776 391132 216967 150315 234250 394016 246557 -160106
873 -160106 -375651 -199268 -106364 8916 125183 121 103768 18599 -54799 1936 26510
862 26510 -193491 108024 158763 -150215 -122486 72010 -89273 -93329 -122094 217406 398142
851 398142 144082 -145342 228509 162015 10135 129801 221582 349727 904 -39208
841 -39208 -63786 -117666 -59334 -107854 -102138 77319 -27871 -283682 33631 -84703 -314865
830 -314865 -448233 202538 351807 -25739 -13996 -150256 -158779 249289 271353 -74329 -38376
$$ packed form
904C14189k41673l83762n728L07830L17555l49219P199r0172O9678K06550j80324
893b7877J53324J22918l37048K10630K00106n3846j47468j88036j94966K10388
883e1875k06193K00690K41154K07356j74165o6652Q3935J59766j47459m06663
873a60106k15545J76383R2904J15280J16267j25062J03647q5169p3398N6735K4574
862B6510k20001L01515N0739l08978K7729J94496j61283m056k8765L39500J80736
851C98142k54060k89424L73851o6494j51880J19666R1781J28145l48823m0112
841c9208k4578n3880N8332m8520N716J79457j05190k55811L17313j18334k30162
830c14865j33368O50771J49269l77546J1743j36260q523M08068K2064l45682L5953
$$ plain form
819 -38376 -3162 -149882 -237702 -65428 -40388 39599 78408 66783 -95962 119623 70278
808 70278 303229 510052 185768 -66658 -14532 190524 113676 297903 348054 79643 -217789
797 -217789 -109604 -94249 142051 180506 -120948 -122243 -270910 -312561 -185629 -249424 -127619
786 -127619 -145518 116636 -48169 -91936 -219020 -24199 -33348 -129352 12123 18904 73288
775 73288 25372 -168980 -58010 252183 268057 328464 67114 86376 80587 91727 -53170
764 -53170 -13731 -91846 81331 77792 150267 134692 14948 355306 336235 139874 -132232
753 -132232 -87916 -77276 -72991 79617 -76148 -139336 -333652 -118414 73900 -50889 -233892
742 -233892 51658 59017 107085 188925 23799 -92267 -26066 -19060 -169898 220520 200765
$$ packed form
819c8376L5214j46720q7820J72274K5040P9987L8809j1625j62745K15585m9345
808G0278K32951K06823l24284k52426N2126K05056p6848J84227N0151k68411k97432
797b17789J08185J5355K36300L8455l01454j295j48667m1651J26932o3795J21805
786a27619j7899K62154j64805m3767j27084J94821r149r6004J41475O781N4384
775G3288m7916j94352J10970L10193J5874O0407k61350J9262n789J1140j44897
764e3170L9439p8115J73177l539P2475j5575j19744L40358j9071j96361k72106
753a32232M4316J0640M285J52608j55765o3188j94316K15238J92314j24789j83003
742b33892K85550P359M8068Q1840j65126j16066O6201P006j50838L90418j9755
$$ plain form
731 200765 113708 -162746 -343641 -71092 -101207 -172887 -428622 -73253 515198 546734 431001
720 431001 191979 282574 85238 -77123 125892 165567 191201 -245954 -171287 49456 36755
709 36755 1262 -214365 -67145 -140805 -128269 268483 159630 114653 192842 185457 32483
698 32483 293541 60395 -69134 -2343 -169502 -119668 -184465 -48883 -150514 -52423 -282589
687 -282589 -219312 190495 302972 -71548 -382743 157800 410011 386003 170530 -71856
677 -71856 83214 -49346 80372 -47618 -201551 -435424 -386906 -212002 211115 313192
667 313192 -44247 6227 -31467 102896 200161 -185224 -201048 -55980 -21294 13922 279782
656 279782 141377 14013 133364 237619 228366 310395 338037 137977 49698 -301347 -209779
$$ packed form
731B00765q7057k76454j80895K72549l0115p1680k55735L55369N88451L1536j15733
720D31001k39022R0595j97336j62361K03015L9675K5634m37155P4667K20743j2701
709C6755l5493k15627J47220p3660J2536L96752j08853m4977P8189p385j52974
698C2483K61058k33146j29529O6791j67159M9834o4797J35582j01631R8091k30166
687b82589O3277M09807J12477l74520l11195N40543K52211k4008k15473k42386
677g1856J55070j32560J29718j27990j53933k33873M8518J74904M23117J02077
667C13192l57439N0474l7694J34363R7265l85385j5824J45068L4686L5216K65860
656B79782j38405j27364J19351J04255r253Q2029K7642k00060q8279l51045R1568
$$ plain form
645 -209779 -141544 -239741 -298186 -240508 -223895 48470 82078 -92331 -136945 133167 -54331
634 -54331 -22680 140783 253938 84429 61805 92348 40843 -90248 -165663 -146455 -159399
623 -159399 130976 149629 291357 261532 29810 -70151 -58451 -332901 -449592 248490 704851
612 704851 395156 184887 193337 193798 83013 -119790 -258849 -331907 -173604 15292 -165852
601 -165852 83623 98448 190856 60036 -26151 215645 205812 79249 219679 173646 259184
590 259184 243896 204120 188264 133894 285829 133688 -75354 -186001 103263 195663 38364
579 38364 68088 4577 13393 1858 26568 166117 208229 409272 206546 -129211 -88225
568 -88225 155543 205713 205038 300459 47484 126175 214629 -9562 -1038 -99250 -80746 17845
$$ packed form
645b09779O8235r8197n8445N7678J6613K72365L3608j74409m4614K70112j87498
634e4331L1651J63463J13155j69509k2624L0543n1505j31091p5415J9208j2944
623a59399K90375J8653J41728k9825k31722r9961J1700k74450j16691O98082M56361
612G04851l09695k10269Q450M61j10785k02803j39059p3058J58303J88896j81144
601a65852K49475J4825R2408j30820q6187K41796r833j26563J40430m6033Q5538
590B59184j5288l9776j5856n4370J51935j52141k09042j10647K89264R2400j57299
579C8364K9724o3511Q816j1535K4710J39549M2112K01043k02726l35757M0986
568h8225K43768N0170o75R5421k52975P8691Q8454k24191Q524r8212J8504R8591
$$ plain form
556 17845 132018 -13712 54341 44140 21775 174209 267727 -70779 -194192 6494 261196
545 261196 312000 210849 330739 69865 100594 33923 -179825 122887 -137845 -231566 22001
534 22001 214115 324534 483324 148634 17602 148204 415599 472703 160152 307187
524 307187 108584 412577 438880 274361 205915 30626 -101800 -83107 -73374 -19759 228639
513 228639 -23977 162909 200805 -125336 -41771 108211 166714 9352 -18018 143427 286772
502 286772 269295 77309 -38281 113998 172521 157400 -33198 314225 292918 254175 341054
491 341054 361447 475598 244465 192273 36103 759 192787 53033 32186 146979 321720
480 321720 269151 209557 203100 104476 -12721 126246 267356 304743 207557 147478 -126266
$$ packed form
556A7845J14173j45730O8053j0201k2365J52434R3518l38506j23413K00686K54702
545B61196N0804j01151J19890k60874L0729o6671k13748L02712k60732r3721K53567
534B2001J92114J10419J58790l34690j31032J30602K67395N7104l12551J47035
524C07187j98603L03993K6303j64519o8446j75289j32426J8693R733N3615K48398
513B28639k52616J86886L7896l26141Q3565J49982N8503j57362k7370J61445J43345
502B86772j7477j91986j15590J52279N8523j5121j90598L47423k1307l8743Q6879
491C41054K0393J14151k31133n2192j56170l5344J92028j39754k0847J14793J74741
480C21720n2569n9594o457r8624j17197J38967J41110L7387r7186o0079k73744
$$ plain form
469 -126266 16661 231014 108787 -61277 41104 137485 -36205 -268123 80274 442787
459 442787 460108 323522 -109748 -14267 83729 403929 164604 167208 527696 506824 676050
448 676050 648480 335346 335022 248497 70698 12956 26137 199807 170848 407856 348913
437 348913 111734 191863 162890 15126 113423 296114 286423 338851 430332 158212 -136897
426 -136897 -28867 -84154 417206 318946 72219 124511 266114 270216 214424 378137 483492
415 483492 200851 119188 116 444291 369476 163644 -25498 -88563 6617 263427 62414
404 62414 128995 120816 48843 -85652 113055 -99169 38537 225737 166778 34025 -200946
393 -200946 -53211 -166525 -178871 -108523 -3483 -54145 -4289 -193031 -150915 -201541 256994
$$ packed form
469a26266J42927K14353j22227j70064J02381R6381j73690k31918L48397L62513
459D42787J7321j36586m33270R5481R7996L20200k39325K604L60488k0872J69226
448F76050k7570l13134l24q6525j77799n7742J3181J73670k8959K37008n8943
437C48913k37179Q0129k8973j47764R8297J82691r691N2428R1481k72120k95109
426a36897J08030n5287N01360r8260k46727N2292J41603M102n5792J63713J05355
415D83492k82641q1663j19072M44175p4815k05832j89142o3065R5180K56810k01013
404F2414O6581q179p1973j34495J98707k12224J37706J87200n8959j32753k34971
393b00946J47735j13314j2346P0348J05040n0662M9856j88742M2116n0626M58535
$$ plain form
382 256994 210088 254398 180795 305014 196586 331321 298883 334344 367411 343156 367381
371 367381 541960 475997 192027 -34953 -133637 -153613 -67218 134536 307250 81119 -141344
360 -141344 -101119 -183402 -303732 98031 157950 142251 149709 222910 246521 309098 53041
349 53041 69062 385661 308306 78802 64748 245184 310727 319258 149275 219205 8356
338 8356 -93844 -412846 -129563 116509 97825 18016 -144283 -255669 -245606 104883 123217
327 123217 199426 242486 114238 293644 523306 220758 260679 -58162 -182956 -22617
317 -22617 214087 197127 136740 255288 313467 195981 99723 124598 159035 -21454 299770
306 299770 291303 206061 340942 77407 21482 -101086 204442 33633 97740 66304 -61452
$$ packed form
382B56994m6906M4310p3603J24219j08428J34735l2438L5461L3067k4255K4225
371C67381J74579o5963k83970k26980r8684j9976Q6395K01754J72714k26131k22463
360a41344M0225q2283j20330M01763N9919j5699P458P3201K3611O2577k56057
349E3041J6021L16599p7355k29504j4054J80436O5543Q531j69983O9930k10849
338H356j02200l19002K83283K46072j8684p9809j62299j11386J0063L50489J8334
327A23217P6209M3060j28248J79406K29662l02548L9921l18841j24794J60339
317b2617K36704j6960o0387J18548N8179j17486r6258K4875L4437j80489L21224
306B99770q467q5242J34881k63535n5925j22568L05528j70809O4107l1436j27756
$$ plain form
295 -61452 45476 123817 -2405 -8774 -74581 207383 -47338 36625 94557 64542 227790
284 227790 96660 11574 -119859 -18580 115816 -38610 130090 184949 187642 266060 -59379
273 -59379 -52331 344690 228542 104421 125871 -154061 -214711 -234768 -310506 -2474 104918
262 104918 103939 74386 -123707 -106609 -33357 21536 175202 60409 -41848 49353 89429
251 89429 5491 -117731 -24362 178986 334699 146839 307732 275792 45472 -39113 161780
240 161780 332623 255739 94177 260867 318310 236205 396814 296880 151125 -57632 129494
229 129494 59030 305969 217369 83785 116131 24954 139731 191221 -38305 88693 296959
218 296959 115519 216318 94323 21342 202434 522124 396338 227061 114168 112107
$$ packed form
295f1452J06928P8341j26222o369o5807K81964k54721Q3963N7932l0015J63248
284B27790j31130q5086j31433J01279J34396j54426J68700N4859K693P8418l25439
273e9379P048L97021j16148j24121K1450k79932o0650k0057p5738L08032J07392
262A04918r79k9553j98093J7098P3252N4893J53666j14793j02257R1201M0076
251H9429q3938j23222R3369K03348J55713j87860J60893l1940k30320q4585K00893
240A61780J70843p6884j61562J66690N7443q2105J60609r9934j45755k08757J87126
229A29494p0464K46939q8600j33584L2346r1177J14777N1490k29526J26998K08266
218B96959j81440J00799j21995p2981J81092L19690j25786j69277j12893k061
$$ plain form
208 112107 160143 88375 74756 48880 91144 179236 191176 81220 283051 583447 410565
197 410565 108379 166027 260799 320368 297634 172346 214761 39417 116107 253762 190767
186 190767 339224 527856 451871 426283 166356 298033 496352 594012 443150 298724
176 298724 129063 71600 143240 221297 199430 235361 271839 181438 50282 -59492 101986
165 101986 263233 -113556 -175847 174615 39172 -84692 126413 283835 114922 373544
155 373544 437850 237269 183122 -67464 61070 186694 13319 387630 302187 128285
145 128285 379474 -47719 217079 236239 109635 117540 49269 206354 -222586 -67292 212792
134 212792 10627 -333889 -60492 -72687 -1028 141180 54943 167032 164434 189379 -82957
$$ packed form
208A12107M8036p1768j3619k5876M2264Q8092J1940j09956K01831L00396j72882
197D10565l02186N7648R4772N9569k2734j25288M2415j75344P6690J37655o2995
186A90767J48457J88632p5985k5588k59927J31677J98319R7660j50862j44426
176B98724j69661n7463P1640P8057k1867L5931L6478r0401j31156j09774J61478
165A01986J61247l76789o2291L50462j35443j23864K11105J57422j68913K58622
155C73544O4306k00581n4147k50586J28534J25624j73375L74311q5443j73902
145A28285K51189m27193K64798J9160j26604P905o8271J57085m28940J55294K80084
134B12792k02165l44516K73397j2195P1659J42208q6237J12089k598K4945k72336
$$ plain form
123 -82957 -2746 198277 196429 430227 395762 404132 270228 182868 81813 62166 234352
112 234352 393311 259441 477972 528575 558199 343497 70632 222698 -79573 -243365
102 -243365 -230996 -235390 108919 87194 212075 470363 458069 452281 181843 214284 280952
91 280952 157686 83696 119287 125353 294307 308669 137373 94804 190631 43787 98836
80 98836 199723 292530 220417 215940 149995 290228 392335 344379 238688 382248 304943
69 304943 136442 392645 190477 38459 91398 69913 312829 206090 241090 158579 234615
58 234615 212202 300304 192113 -89462 98793 105254 184751 179700 108952 141627 159115 199226
46 199226 211676 156383 142628 140721 -3126 101458 393453 383169 449557 308976 213944
$$ packed form
123h2957Q0211K01023j848K33798l4465Q370j33904q7360j01055j9647J72186
112B34352J58959j33870K18531N0603K9624k14702k72865J52066l02271j63792
102b43365J2369m394L44309k1725J24881K58288j2294n788k70438L2441O6668
91B80952j23266p3990L5591O066J68954J4362j71296m2569R5827j46844N5049
80I8836J00887R2807p2113m477o5945J40233J02107m7956j05691J43560p7305
69C04943j68501K56203k02168j52018N2939k1485K42916j06739L5000q2511P6036
58B34615k2413Q8102j08191k81575J88255O461P9497n051p0748L2675J7488M0111
46A99226J2450n5293j3755j907j43847J04584K91995j0284O6388j40581r5032
$$ plain form
35 213944 400521 401498 221391 152546 70560 264374 286670 349257 294420 217506 272995 124973
23 124973 156458 247728 163679 387064 167683 183717 392611 426811 333927 596274 429769
12 429769 245036 265680 68728 186482 277719 68332 93821 242641 266807 84042 79467
1 79467 217495
0 217495
$$ packed form
35B13944J86577R77j80107o8845q1986J93814K2296O2587n4837p6914N5489j48022
23A24973L1485R1270q4049K23385k19381J6034K08894L4200r2884K62347j66505
12D29769j84733K0644j96952J17754R1237k09387K5489J48820K4166j82765m575
1G9467J38028
0B17495
$$ Imaginary data points
##PAGE= N=2
##DATA TABLE= (X++(I..I)), XYDATA
$$ plain form
16383 -1645616 -1919609 -1873106 -1817706 -1639175 -1482246 -1537316 -1399791 -1540765 -1578665 -1689678
16373 -1689678 -1625332 -1436917 -1445180 -1276545 -1423434 -1437475 -1334553 -1360031 -1404648 -1057499
16363 -1057499 -1293490 -1386787 -1479617 -1332536 -1338853 -1183587 -1114162 -1163397 -1033810 -1166151
16353 -1166151 -1220096 -966307 -1179348 -1065545 -1025090 -1147240 -766751 -758055 -833212 -963877
16343 -963877 -1173314 -1084285 -868448 -921235 -1025623 -949512 -826997 -627563 -778526 -669981
16333 -669981 -672693 -801080 -691054 -770619 -652853 -639065 -573227 -749743 -823656 -776202 -455019
16322 -455019 -291449 -578618 -734813 -717663 -628779 -820607 -623867 -698991 -640867 -490627
16312 -490627 -454722 -311026 -591212 -599748 -428834 -523762 -556574 -254587 -492889 -447660 -410856
$$ packed form
16383a645616k73993M6503N5400J78531J56929n5070J37525j40974l7900j11013
16373a689678O4346J88415q263J68635j46889j4041J02922k5478m4617L47149
16363a057499k35991r3297r2830J47081o317J55266O9425m9235J29587j32341
16353a166151n3945K53789k13041J13803M0455j22150L80489Q696p5157j30665
16343i63877k09437Q9029K15837n2787j04388P6111J22515J99434j50963J08545
16333f69981k712j28387J10026p9565J17766J3788O5838j76516p3913M7454L21183
16322d55019J63570k87169j56195J7150Q8884j91828J96740p5124N8124J50240
16312d90627L5905J43696k80186q536J70914r4928l2812L01987k38302M5229L6804
$$ plain form
16301 -410856 -368219 -186761 -402039 -422782 -240602 -294808 -38401 -11006 -236481 -259655
16291 -259655 -130038 -202016 2404 41955 -49135 216737 -23627 -108977 3944 79066
16281 79066 48987 -68621 -85833 -191792 -165123 -39831 251758 175777 22783 179492
16271 179492 -4222 -17868 125620 165980 463193 546511 242514 198758 339848 31516
16261 31516 80856 303001 377782 343211 308692 500850 553530 269854 366975 290175 233216
16250 233216 391191 437425 249758 201633 466780 503411 300475 442553 411819 325119
16240 325119 328526 367763 380302 430221 643858 392653 424377 737753 787389 731344 758100
16229 758100 888886 567964 790486 835520 702348 578156 425179 668489 515042 550434
$$ packed form
16301d10856M2637J81458k15278k0743J82180n4206K56407K7395k25475k3174
16291b59655J29617p1978K04420L9551r1090K65872k40364q5350J12921P5122
16281G9066l0079j17608j7212j05959K6669J25292K91589p5981j52994J56709
16271A79492j83714j3646J43488M0360K97213Q3318l03997m3756J41090l08332
16261C1516M9340K22145P4781l4571l4519J92158N2680k83676R7121p6800n6959
16250B33216J57975M6234j87667m8125K65147L6631k02936J42078l0734q6700
16240C25119L407L9237J2539M9919K13637k51205L1724L13376M9636n6045K6756
16229G58100J30786l20922K22522M5034j33172j24192j52977K43310j53447L5392
$$ plain form
16219 550434 720570 666911 583635 653226 579256 630318 723100 877209 904260 895577 786564
16208 786564 700373 722506 871335 679662 928801 899041 654978 669868 610421 635528 840435
16197 840435 979139 702555 706757 940744 1006043 1020040 728420 536126 365241 838636
16187 838636 1035454 1109459 1020864 701430 596596 671472 945997 1148270 1160011 1014641
16177 1014641 959503 1030237 900460 1054587 1160601 976595 955275 1113892 1162594 981842
16167 981842 990268 1086368 923781 916113 1106560 785630 745697 938757 1162918 973393 856226
16156 856226 842178 935822 1100708 1067801 959313 1005437 953410 928100 909869 1083857 794403
16145 794403 820705 1088326 1077121 1104780 809385 1050044 1205674 1109767 1126815 1018715
$$ packed form
16219E50434J70136n3659q3276O9591p3970N1062R2782J54109K7051q683j09013
16208G86564q6191K2133J48829j91673K49139k9760k44063J4890n9447K5107K04907
16197H40435J38704k76584M202K33987O5299J3997k91620j92294j70885M73395
16187H38636J96818P4005q8595l19434j04834P4876K74525K02273J1741j45370
16177A014641n5138P0734j29777J54127J06014j84006k1320J58617M8702j80752
16167I81842Q426R6100j62587p668J90447l20930l9933J93060K24161j89525j17167
16156H56226j4048R3644J64886l2907j08488M6124n2027k5310j8231J73988k89454
16145G94403K6302K67621j1205K7659k95395K40659J55630r5907J7048j08100
$$ plain form
16135 1018715 1167918 1458528 1402076 1165317 1236591 1045976 1344172 1576255 1265726 1000774
16125 1000774 934462 907652 780556 905305 868138 968354 1134581 1347593 1186786 1154072
16115 1154072 992482 1379342 1686716 1493474 1491695 1296160 1241715 1393242 1385332 1381698 1528686
16104 1528686 1291022 785169 783563 1089164 1035675 754819 621177 642753 615488 989047
16094 989047 893245 1131724 1511956 1333083 1361701 1377788 1413894 1487832 1401820 1509754 1520761
16083 1520761 1024442 1252155 1073007 1001128 1227054 1062516 798002 1108317 1376927 1366431
16073 1366431 1412289 1121470 826662 833892 1127712 1146043 1329637 1113589 1149653 1354955
16063 1354955 1384154 1284738 1476718 1261716 1236333 1460117 1165560 1090918 986554 1031894
$$ packed form
16135A018715J49203K90610n6452k36759P1274j90615K98196K32083l10529k64952
16125A000774o6312k6810j27096J24749l7167J00216J66227K13012j60807l2714
16115A154072j61590L86860L07374j93242j779j95535n4445J51527p910l634J46988
16104A528686k37664n05853j606L05601n3489k80856j33642K1576k7265L73559
16094I89047r5802K38479L80232j78873K8618J6087L6106P3938q6012J07934J1007
16083A520761m96319K27713j79148p1879K25926j64538k64514L10315K68610j0496
16073A366431M5858k90819k94808P230K93820J8331J83594k16048L6064K05302
16063A354955K9199r9416J91980k15002k5383K23784k94557p4642j04364M5340
$$ plain form
16053 1031894 1327133 1452645 1440823 1423755 1404813 940825 1228125 1236395 1096169 1224277
16043 1224277 1465303 1471544 1281617 1261122 978868 1112586 1317225 1303161 1156023 989119
16033 989119 756334 1164062 1272915 1591232 1734221 1400840 1187050 1234352 1057384 1157421
16023 1157421 1237038 1086059 1125080 1309067 1307984 1211703 1344394 1377163 1225635 1099052
16013 1099052 1243299 1330674 1405677 1459361 1496881 1218568 1184016 1153298 1070673 989790 1185659
16002 1185659 1080400 1127648 1298626 1349494 1362877 1152747 959845 1177620 1310185 1297503
15992 1297503 1261570 1185206 1514874 1370350 1314383 1181311 1059959 1099687 1257960 1327435
15982 1327435 1246957 1388617 1262053 1174883 1439595 1292472 982217 937105 1242607 1447429
$$ packed form
16053A031894K95239J25512j1822j7068j8942m63988K87300Q270j40226J28108
16043A224277K41026O241j89927k0495k82254J33718K04639j4064j47138j66904
16033I89119k32785M07728J08853L18317J42989l33381k13790M7302j76968J00037
16023A157421P9617j50979L9021J83987j083r6281J32691L2769j51528j26583
16013A099052J44247Q7375P5003N3684L7520k78313l4552l0718q2625q0883J95869
16002A185659j05259M7248J70978N0868J3383k10130j92902K17775J32565j2682
15992A297503l5933p6364L29668j44524n5967j33072j21352L9728J58273O9475
15982A327435q0478J41660j26564q7170K64712j47123l10255m5112L05502K04822
$$ plain form
15972 1447429 1388330 1033465 1073839 1208549 1197258 1517889 1241220 1217258 1529358 1364555
15962 1364555 1177710 1156418 1108158 1200937 1507389 1327700 1160744 997166 1001347 1062774
15952 1062774 1118152 1342549 1508951 1497980 1217772 1071131 1080751 1405254 1375609 1179732
15942 1179732 1417391 1315111 1502686 1457375 1561476 1329968 1038631 1205277 1111126 738189
15932 738189 730500 1166302 1272361 1654598 1626138 1676005 1567503 1591057 1299643 1283069 1285436
15921 1285436 1221692 1286622 1339039 1303974 1293672 1240592 1162901 1256616 1432840 1287541 989007
15910 989007 1161668 1428534 1710672 1413208 1571914 1490701 1519568 1241457 1353337 1586834
15900 1586834 1102624 1325285 1230141 1347355 1547334 1364801 1315163 887307 1346627 1405095
$$ packed form
15972A447429n9099l54865M0374J34710j1291L20631k76669k3962L12100j64803
15962A364555j86845k1292m8260R2779L06452j79689j66956j63578M181O1427
15952A062774N5378K24397J66402j0971k80208j46641R620L24503k9645j95877
15942A179732K37659j02280J87575m5311J04101k31508k91337J66646r4151l72937
15932G38189p689M35802J06059L82237k8460M9867j08502K3554k91414j6574K367
15921A285436o3744O4930N2417l5065j0302n3080p7691R3715J76224j45299k98534
15910I89007J72661K66866K82138k97464J58706q1213K8867k78111J11880K33497
15900A586834m84210K22661r5144J17214J99979j82533m9638m27856M59320N8468
$$ plain form
15890 1405095 1226154 1060193 1124034 1281528 1248243 1183438 1239969 1302983 1113944 1194969
15880 1194969 1483304 1525010 1602066 1806828 1566394 1548581 1486822 1745541 1622218 1382305
15870 1382305 1341444 1365927 1498493 1528600 1172862 1099413 956014 880531 1114655 1088342
15860 1088342 1160096 1354327 1364948 1389803 1555186 1654211 1312498 1130684 1346779 1465979
15850 1465979 1193312 1280407 1179876 1308269 1429350 1461480 1417674 1218154 1326295 1406567
15840 1406567 1388315 1419532 1196602 1360667 1499489 1287219 961418 1005397 1156425 1376112
15830 1376112 1301613 866073 762396 790952 1039607 1044141 1320292 1241440 1586048 1537345
15820 1537345 1227137 1333666 1472009 1659853 1490299 1406348 1257927 1378682 1283997 1286662
$$ packed form
15890A405095j78941j65961O3841J57494l3285o4805N6531O3014j89039Q1025
15880A194969K88335M1706P7056K04762k40434j7813o1759K58719j23323k39913
15870A382305m0861K4483J32566L0107l55738p3449j43399p5483K34124k6313
15860A088342P1754J94231J0621K4855J65383R9025l41713j81814K16095J19200
15850A465979k72667Q7095j00531J28393J21081L2130m3806j99520J08141Q0272
15840A406567j8252L1217k22930J64065J38822k12270l25801M3979J51028K19687
15830A376112p4499m35540j03677K8556K48655M534K76151p8852L44608m8703
15820A537345l10208J06529J38343J87844j69554q3951j48421J20755r4685K665
$$ plain form
15810 1286662 1303358 1339955 1520075 1237105 1176752 1311556 1340573 1217870 1109473 1208174
15800 1208174 1415183 1175881 1319130 985994 994336 1276617 1606972 1566684 1270066 1240763
15790 1240763 1109354 1225235 1257207 1521279 1549893 1438128 1265298 1204242 1380927 1498780
15780 1498780 1483881 1319767 1176352 1148622 1201582 956464 839137 1015373 1442941 1598092
15770 1598092 1327179 1465990 1520863 1362445 1392645 1368793 1225707 1126614 1295403 1306885
15760 1306885 916088 1103228 1164417 986041 1141714 1215576 1348390 1341290 1158826 1423696
15750 1423696 1818155 1332565 1201116 1218503 1275207 1358952 1422441 1342124 1289646 1275981 1158783
15739 1158783 1200697 1159758 1593872 1505648 1635837 1615329 1385885 1214458 1151721 1285078
$$ packed form
15810A286662J6696L6597J80120k82970o0353J34804K9017j22703j08397R8701
15800A208174K07009k39302J43249l33136Q342K82281L30355m0288k96618k9303
15790A240763j31409J15881L1972K64072K8614j11765j72830o1056J76685J17853
15780A498780j4899j64114j43415k7730N2960k45118j17327J76236M27568J55151
15770A598092k70913J38811N4873j58418L0200k3852j43086r9093J68789J1482
15760A306885l90797J87140O1189j78376J55673P3862J32814p100j82464K64870
15750A423696L94459m85590j31449J7387N6704Q3745O3489q0317n2478j3665j17198
15739A158783M1914m0939M34114q8224J30189k0508k29444j71427o2737J33357
$$ plain form
15729 1285078 1366018 1402252 1455687 1504498 1302361 1507581 1458461 1399842 1376375 1302901 1042969
15718 1042969 1057056 1439810 1466503 1862635 1617049 1119956 1285778 1397612 1560906 1170405
15708 1170405 1281491 1377280 1277069 1216288 1210770 1398467 1480599 1471735 1481759 1550980 1220309
15697 1220309 1194524 1210973 1347677 1525062 1157207 1079346 1410805 1526534 1512605 1529473
15687 1529473 1426473 1313629 1364421 1442904 1390517 1138454 1140312 1311723 1236029 1248662 1098870
15676 1098870 1172372 1418392 1176428 1185413 1280556 1371075 1412042 1101253 783230 1131983
15666 1131983 1109538 1088082 1322155 1204315 1376165 1188368 892021 1143233 1292808 1290301
15656 1290301 1213582 1249147 1090250 1131977 1229172 1336918 1310143 1565913 1613761 1400030
$$ packed form
15729A285078Q0940L6234N3435M8811k02137K05220m9120n8619k3467p3474k59932
15718A042969J4087L82754K6693L96132k45586m97093J65822J11834J63294l90501
15708A170405J11086R5789j00211o0781n518J87697Q2132q864J0024O9221l30671
15697A220309k5785J6449J36704J77385l67855p7861L31459J15729j3929J6868
15687A529473j03000j12844N0792P8483n2387k52063J858J71411p5694J2633j49792
15676A098870P3502K46020k41964Q985R5143R0519M0967l10789l18023L48753
15666A131983k2445k1456K34073j17840J71850j87797k96347K51212J49575k507
15656A290301p6719L5565j58897M1727R7195J07746k6775K55770M7848k13731
$$ plain form
15646 1400030 1071842 1110378 1234302 1527565 1639095 1340957 1275702 1330255 1283161 1300591
15636 1300591 1324917 1288395 1182027 1148088 1136774 1053526 1032726 1136264 1259807 1314210 1377615
15625 1377615 1243084 1321169 1007680 920700 1263832 1116411 1027401 1120831 1222388 1426502
15615 1426502 1187990 1359670 1485187 1366613 1487412 1683740 1544097 1331143 1297831 1668130
15605 1668130 1654152 1349853 1509147 1324731 1221997 1232349 1097517 1322327 1620274 1652423
15595 1652423 1643004 1375042 1262210 1370799 1162310 1243107 1401032 1497551 1454603 1359586
15585 1359586 1538551 1358227 1319384 1477216 1539884 1257108 1093553 978963 1125398 1609685
15575 1609685 1432492 1437314 1504597 1472456 1314511 1617225 1514706 1451516 1451656 1545072 1260585
$$ packed form
15646A400030l28188L8536J23924K93263J11530k98138o5255N4553m7094J7430
15636A300591K4326l6522j06368l3939j1314q3248k0800J03538J23543N4403O3405
15625A377615j34531P8085l13489q6980L43132j47421q9010R3430J01557K04114
15615A426502k38512J71680J25517j18574J20799J96328j39643k12954l3312L70299
15605A668130j3978l04299J59294j84416j02734J0352j34832K24810K97947L2149
15595A652423r419k67962j12832J08589k08489Q0797J57925R6519m2948r5017
15585A359586J78965j80324l8843J57832O2668k82776j63555j14590J46435M84287
15575A609685j77193M822O7283l2141j57945L02714j02519o3190J40R3416k84487
$$ plain form
15564 1260585 1070792 1126847 1271215 1033257 773808 999477 1352589 1275023 1185962 1127463
15554 1127463 1142638 1224521 1175705 1289332 1104153 1376137 1519387 1185628 1305913 1687185
15544 1687185 1653320 1579962 1210343 1327573 1778895 1794423 1640739 1489020 1534598 1563261
15534 1563261 1409541 1358805 1304745 1268943 1318752 1304933 1344096 1410063 1126068 1271246 1496115
15523 1496115 1516013 1412412 1280739 1112585 1355658 1213611 1278157 1129815 1295773 1283944
15513 1283944 1352925 1440728 1091360 1079071 1181500 1257623 1039181 1177584 1163980 1193269
15503 1193269 843856 1256043 1186409 1272327 1385216 1311059 1236211 944722 887617 1266770
15493 1266770 1328643 1415934 1462710 1060250 930411 1283663 1044682 738756 985780 983795
$$ packed form
15564A260585j89793N6055J44368k37958k59449K25669L53112p7566q9061n8499
15554A127463J5175Q1883m8816J13627j85179K71984J43250l33759J20285L81272
15544A687185l3865p3358l69619J17230M51322J5528j53684j51719M5578K8663
15534A563261j53720n0736n4060l5802M9809j3819L9163O5967k83995J45178K24869
15523A496115J9898j03601j31673j68154K43073j42047O4546j48342J65958j1829
15513A283944O8981Q7803l49368j2289J02429P6123k18442J38403j3604K9289
15503A193269l49413M12187o9634Q5918J12889p4157p4848k91489n7105L79153
15493A266770O1873Q7291M6776m02460j29839L53252k38981l05926K47024j985
$$ plain form
15483 983795 1157900 1281823 1178106 1215382 1310096 1462324 1482586 1200273 1399410 1618547
15473 1618547 1929074 1372737 1213332 1244208 1444719 1404981 1434192 1300656 1265744 889471
15463 889471 917543 1216665 1111433 1055751 1291331 1360916 1468979 1432293 1451785 1507812 1356313
15452 1356313 1492623 1454130 1395266 1406697 1066309 1199958 1494798 1255111 1162670 867402
15442 867402 1020842 1415548 1263534 1245594 1426170 1319159 1081732 1120895 1326491 1365450
15432 1365450 1325004 1161742 1179349 1347266 1596520 1247121 1255419 1211985 1112681 1324516
$$ packed form
15483I83795J74105J23923j03717L7276R4714J52228K0262k82313J99137K19137
15473A618547L10527n56337j59405L0876K00511l9738K9211j33536l4912l76273
15463H89471K8072K99122j05232n5682K35580O9585J08063l6686J9492N6027j51499
15452A356313J36310l8493n8864J1431l40388J33649K94840k39687r2441k95268
15442H67402J53440L94706j52014j7940J80576j07011k37427L9163K05596L8959
15432A365450m0446j63262J7607J67917K49254l49399Q298m3434r9304K11835
$$ [...]
##END NTUPLES=NMR SPECTRUM
##END=
