##TITLE=1H_EC-3289-P
 CDCl3
 8 sc, 
 14.3.2023
##JCAMPDX= 6.0         $$ Bruker NMR JCAMP-DX V2.0
##DATA TYPE= NMR SPECTRUM
##DATA CLASS= NTUPLES
##ORIGIN= UXNMR, Bruker Analytische Messtechnik GmbH
##OWNER= root
$$ XWIN-NMR		Version 3.5
$$ Tue Mar 14 13:56:47 2023 Russian Standard Time (UT+4h)  she@DPX200
##.OBSERVE FREQUENCY= 200.13135
##.OBSERVE NUCLEUS= ^1H
##.ACQUISITION MODE= SIMULTANEOUS
##.ACQUISITION SCHEME= undefined
##.AVERAGES= 8
##.DIGITISER RES= 18
##SPECTROMETER/DATA SYSTEM= spect
##.PULSE SEQUENCE= zg30
##.SOLVENT NAME= CDCl3
##.SHIFT REFERENCE= (INTERNAL, CDCl3, 0, 15.7865)
##AUDIT TRAIL= $$ (NUMBER, WHEN, WHO, WHERE, WHAT)
$$ ##TITLE= Audit trail, XWIN-NMR		Version 3.5
$$ ##JCAMPDX= 5.01
$$ ##ORIGIN= Bruker BioSpin GmbH
$$ ##OWNER= she
$$ F:/spectra/data/she/nmr/H-F/1/pdata/1/auditp.txt
$$ ##AUDIT TRAIL=  $$ (NUMBER, WHEN, WHO, WHERE, WHAT)
(   1,<2023-03-14 13:55:18.45 +0400>,<she>,<DPX200>,
      <created by zg, POWCHK disabled, PULCHK disabled
       configuration hash MD5:
       00 E9 B6 7A A2 85 ED C7 34 08 36 98 17 FE 4E 26
       data hash MD5: 16K
       9C 34 52 E7 37 67 A9 3A 61 52 6D 38 BA BD D6 07>)
(   2,<2023-03-14 13:55:21.60 +0400>,<she>,<DPX200>,
      <Start of raw data processing
       efp BC_mod = 2 LB = 0.24 FT_mod = 6 PKNL = 1 PHC0 = -19104.83 PHC1 = 8.200742 SI = 16K 
       data hash MD5: 16K
       3C D4 88 41 A5 E0 D7 A9 24 78 93 23 98 B9 38 16>)
(   3,<2023-03-14 13:55:40.70 +0400>,<she>,<DPX200>,
      <pk PHC0 = 2.835217 PHC1 = -0.6 
       data hash MD5: 16K
       15 94 EE 69 D2 A5 72 82 AC B6 02 7A 29 6E BC 02>)
(   4,<2023-03-14 13:55:43.71 +0400>,<she>,<DPX200>,
      <abs ABSG = 5 
       data hash MD5: 16K
       E6 9B 73 6C 0B E4 0B EC 99 D0 7D 61 40 D8 32 B9>)
(   5,<2023-03-14 13:56:19.73 +0400>,<she>,<DPX200>,
      <pk PHC0 = -0.3234913 PHC1 = 1.6 
       data hash MD5: 16K
       B5 68 2F DD 2C 9F B4 0B 62 A2 CF 38 DB 2D 56 B1>)
(   6,<2023-03-14 13:56:23.67 +0400>,<she>,<DPX200>,
      <abs ABSG = 5 
       data hash MD5: 16K
       22 78 EB 45 B0 9F 6E 01 7F 0A 29 C1 FB E3 15 A4>)
$$ ##END=
$$ 
$$ hash MD5
$$ 44 B3 43 F9 61 74 91 DA 42 52 91 C6 0F 3D D5 8C
##$RELAX= 
##$RELAX= 
##$RELAX= 
##$RELAX= 
##$RELAX= 
##$RELAX= 
$$ Bruker specific parameters
$$ --------------------------
##$DU= <F:/spectra>
##$EXPNO= 1
##$NAME= <H-F>
##$PROCNO= 1
##$TYPE= <nmr>
##$USER= <she>
##$AMP= (0..31)
100 100 100 100 100 100 100 100 100 100 100 100 100 100 100 100 100 100 
100 100 100 100 100 100 100 100 100 100 100 100 100 100 
##$AQSEQ= 0
##$AQ_mod= 1
##$AUNM= <au_zg>
##$AUTOPOS= <>
##$BF1= 200.13
##$BF2= 200.13
##$BF3= 200.13
##$BF4= 200.13
##$BF5= 200.13
##$BF6= 200.13
##$BF7= 200.13
##$BF8= 200.13
##$BYTORDA= 1
##$CFDGTYP= 0
##$CFRGTYP= 5
##$CHEMSTR= <none>
##$CNST= (0..31)
1 1 145 1 1 1 1 1 1 1 1 1 1 1 1 1 1 1 1 1 1 1 1 1 1 1 1 1 1 1 1 1 
##$CPDPRG= <>
##$CPDPRG1= <>
##$CPDPRG2= <>
##$CPDPRG3= <>
##$CPDPRG4= <mlev>
##$CPDPRG5= <mlev>
##$CPDPRG6= <mlev>
##$CPDPRG7= <mlev>
##$CPDPRG8= <mlev>
$$ [...]
##$SUBNAM3= <"">
##$SUBNAM4= <"">
##$SUBNAM5= <"">
##$SUBNAM6= <"">
##$SUBNAM7= <"">
##$SUBNAM8= <"">
##$SUBNAM9= <"">
##$SW= 18.05172834244
##$SWIBOX= (0..15)
0 0 2 0 0 0 0 0 0 0 0 0 0 0 0 0 
##$SW_h= 3612.71676300578
##$TD= 16384
##$TD0= 1
##$TE= 0
##$TE2= 300
##$TE3= 300
##$TEG= 300
##$TL= (0..7)
0 120 120 120 120 120 120 120 
##$TP= (0..7)
150 150 150 150 150 150 150 150 
##$TP07= 0
##$TPNAME0= <>
##$TPNAME1= <>
##$TPNAME2= <>
##$TPNAME3= <>
##$TPNAME4= <>
##$TPNAME5= <>
##$TPNAME6= <>
##$TPNAME7= <>
##$TPOAL= (0..7)
0.5 0.5 0.5 0.5 0.5 0.5 0.5 0.5 
##$TPOFFS= (0..7)
0 0 0 0 0 0 0 0 
##$TUNHIN= 0
##$TUNHOUT= 0
##$TUNXOUT= 0
##$USERA1= <user>
##$USERA2= <user>
##$USERA3= <user>
##$USERA4= <user>
##$USERA5= <user>
##$V9= 5
##$VALIST= <valist>
##$VCLIST= <CCCCCCCCCCCCCCC>
##$VD= 0
##$VDLIST= <DDDDDDDDDDDDDDD>
##$VPLIST= <PPPPPPPPPPPPPPP>
##$VTLIST= <TTTTTTTTTTTTTTT>
##$WBST= 1024
##$WBSW= 4
##$XGAIN= (0..3)
0 0 0 0 
##$XL= 0
##$YL= 0
##$YMAX_a= 282442
##$YMIN_a= -439265
##$ZGOPTNS= <>
##$ZL1= 120
##$ZL2= 120
##$ZL3= 120
##$ZL4= 120
##$ABSF1= 15.78655
##$ABSF2= -2.265302
##$ABSG= 5
##$ABSL= 3
##$ALPHA= 0
##$AQORDER= 0
##$ASSFAC= 0
##$ASSFACI= 0
##$ASSFACX= 0
##$ASSWID= 0
##$AUNMP= <proc_1d>
##$AZFE= 0.1
##$AZFW= 0.1
##$BCFW= 0
##$BC_mod= 2
##$BYTORDP= 0
##$COROFFS= 0
##$CY= -3
##$DATMOD= 1
##$DC= 0
##$DFILT= <>
##$DTYPP= 0
##$F1P= 0
##$F2P= 0
##$FCOR= 1
##$FTSIZE= 16384
##$FT_mod= 6
##$GAMMA= 0
##$GB= 0
##$INTBC= 1
##$INTSCL= 3.70164e-10
##$ISEN= 128
##$LB= 0.24
##$LEV0= 0
##$LPBIN= 0
##$MAXI= 10000
##$MC2= 0
##$MEAN= 0
##$ME_mod= 0
##$MI= 1.114404
##$NCOEF= 0
##$NC_proc= -6
##$NLEV= 6
##$NOISF1= 3.799351
##$NOISF2= 2.8
##$NSP= 0
##$NTH_PI= 0
##$NZP= 0
##$OFFSET= 15.78655
##$PC= 1
##$PHC0= -19102.31
##$PHC1= 9.200742
##$PH_mod= 1
##$PKNL= yes
##$PPARMOD= 0
##$PSCAL= 0
##$PSIGN= 0
##$REVERSE= no
##$SF= 200.129996994979
##$SI= 16384
##$SIGF1= 3
##$SIGF2= 2
##$SINO= 5.538805
##$SIOLD= 16384
##$SREGLST= <1H.CDCl3>
##$SSB= 0
##$STSI= 16384
##$STSR= 0
##$SW_p= 3612.71676300578
##$SYMM= 0
##$S_DEV= 0
##$TDeff= 16384
##$TDoff= 0
##$TI= <>
##$TILT= no
##$TM1= 0
##$TM2= 0
##$TOPLEV= 0
##$USERP1= <user>
##$USERP2= <user>
##$USERP3= <user>
##$USERP4= <user>
##$USERP5= <user>
##$WDW= 1
##$XDIM= 16384
##$YMAX_p= 302385007
##$YMIN_p= -578337
$$ End of Bruker specific parameters
$$ ---------------------------------
##NTUPLES= NMR SPECTRUM
##VAR_NAME=  FREQUENCY,     SPECTRUM/REAL,   SPECTRUM/IMAG
##SYMBOL=    X,             R,               I
##VAR_TYPE=  INDEPENDENT,   DEPENDENT,       DEPENDENT
##VAR_FORM=  AFFN,          ASDF,            ASDF
##VAR_DIM=   16384,         16384,           16384
##UNITS=     HZ,            ARBITRARY UNITS, ARBITRARY UNITS
##FACTOR=    0.220516191357247, 1,           1
##FIRST=     3159.3621176402, 0,             0
##LAST=      -453.354645365576, 0,           0
##MIN=       -453.354645365576, -578337,     0
##MAX=       3159.3621176402, 302385007,     0
$$ Real data points
##PAGE= N=1
##DATA TABLE= (X++(R..R)), XYDATA
$$ [...]
5769F900893k85609k46762k05079j60457l5846j51064j64841o8763q9959j75953
5759E316560K06j97795j10679l7135j20104r9119o7853o5214o9167q7873p5861
5748D385966q7664n7346j03515o5545q1430p5887m7753j08178O9556L8299p0561
5737C795942m1582j8000N5322k3570j15533m0657N0949J6187p3327K7238j12772
5726C520197l8345q2120m5910Q3191J06456q8508o9529L0368l6129j1526L4111
5715C402256L2004q0592l5962Q828r3564o2111P2080J2409j1866j05521R710j666
5703C146005R626l9874k1065O037m469k2974q4671l7275O7623o6207p8867j3085
5691B860804J4253n2071l3717R4015K0634N7440P3040o842l6503j10979q8744
$$ y = [6900893, 6615284, 6368522, 6163443, 6002986, 5967140, 5816076, 5651235, 5582472, 5492513, 5316560, 5316766, 5118971, 5008292, 4971157, 4851053, 4751934, 4684081, 4618867, 4549700, 4461827, 4385966, 4298302, 4240956, 4137441, 4071896, 3990466, 3914579, 3866826, 3758648, 3828204, 3866503, 3795942, 3754360, 3736360, 3791682, 3768112, 3652579, 3611922, 3662871, 3679058, 3605731, 3632969, 3520197, 3481852, 3399732, 3353822, 3437013, 3543469, 3454961, 3385432, 3415800, 3379671, 3368145, 3402256, 3434260, 3353668, 3317706, 3326534, 3232970, 3170859, 3242939, 3255348, 3243482, 3137961, 3147671, 3146005, 3155631, 3115757, 3094692, 3100729, 3096260, 3073286, 2988615, 2951340, 3018963, 2952756, 2873889, 2860804, 2875057, 2822986, 2789269, 2883284, 2903918, 2961358, 3034398, 3027556, 2991053, 2880074, 2791330]
5680B791330J17434o6068L4677L6832o3994k707m8669M4840J3272L3204l8815
5669B851336K47o8190q7807M9270M8355m6455m2227M3167K3395m1887K7231P493
5657B763928o1860R8570M4489N4398j40646p4015P7090O902Q4606Q2613r357j1051
5645B915667j9573j08345q6160O2416m0748j2866L2284M5910j8904N5934N2527
5634B878142j298K562O7505N6095P3144j34594m8876L9324j2723Q4333O8125j0798
5622C060941m3986j8139O0897J03377P8391o2223P88o2068m077K6666L9173J32998
5610C312738o8215k9949o463N7535n1586J27112J59712p712M1477M5701J07141
5599C687491m7412M3234L3905m0539m7945j4731j4724K5051K9816O8236k2078
$$ y = [2791330, 2908764, 2842696, 2877373, 2914205, 2850211, 2847504, 2798835, 2843675, 2856947, 2890151, 2851336, 2851583, 2783393, 2695586, 2744856, 2793211, 2746756, 2704529, 2747696, 2771091, 2729204, 2756435, 2763928, 2702068, 2800638, 2845127, 2899525, 2758879, 2684864, 2761954, 2768856, 2853462, 2936075, 2926718, 2915667, 2896094, 2787749, 2701589, 2764005, 2723257, 2710391, 2742675, 2788585, 2769681, 2825615, 2878142, 2876844, 2879406, 2946911, 3003006, 3076150, 2941556, 2892680, 2932004, 2919281, 3003614, 3071739, 3060941, 3016955, 2998816, 3059713, 3163090, 3241481, 3179258, 3180046, 3117978, 3113901, 3140567, 3179740, 3312738, 3244523, 3214574, 3208111, 3265646, 3214060, 3341172, 3500884, 3493172, 3534649, 3580350, 3687491, 3640079, 3683313, 3717218, 3676679, 3628734, 3614003, 3599279, 3624330, 3654146, 3722382, 3700304]
5588C700304j0662M8052N0277J24624j3365O0952J24424J87358J04239J18214
5578D494417P4209J08263J70050K27101K84935K23129K99956L49061K16420Q8528
5568F536069J09781o988r4768j50077m29085j63569j72782j56328j14544j20701
5558E237008j28831J15026k864n803L7243O9199J30205J13851J66964K72497K92253
5547F296748K93468J00800R2297n9084j5586n0667k90492l08723k38994k53231
5537E566536k01976k30783j92773o3316r6798J7444l6006l9953p8032o5424L7950
5526D616869J3208P53o2051j10649J5502O6787O7589p7076j4508l4348R0106k133
5514D570049P3894K357p041k2056j16686N0731Q3585k4596l1842R4399J6278P673
$$ y = [3700304, 3689642, 3737694, 3787971, 3912595, 3899230, 3960182, 4084606, 4271964, 4376203, 4494417, 4568626, 4676889, 4846939, 5074040, 5358975, 5582104, 5882060, 6231121, 6447541, 6536069, 6645850, 6638862, 6544094, 6394017, 5964932, 5801363, 5628581, 5472253, 5357709, 5237008, 5108177, 5223203, 5220339, 5214536, 5251779, 5320978, 5451183, 5565034, 5731998, 6004495, 6296748, 6590216, 6691016, 6783313, 6724229, 6708643, 6657976, 6367484, 6058761, 5819767, 5566536, 5364560, 5133777, 4941004, 4877688, 4780890, 4798334, 4762328, 4722375, 4644343, 4578919, 4616869, 4630077, 4630830, 4568779, 4458130, 4473632, 4540419, 4608008, 4530932, 4516424, 4482076, 4572182, 4570049, 4643943, 4646300, 4639259, 4617203, 4500517, 4551248, 4634833, 4610237, 4578395, 4672794, 4689072, 4696745]
5502D696745P1897L8295r568K6192J914M8322L1978J02568P9847O6533Q3087L7669
5490E275479O1124J29067J89866K14902R3083j6035K00233k7369K4359J06200
5480F250909J46993N8239O1195k249n5433j07826M553o789j52019k4673o4984
5469F107916p7001l6307j2097j5018j502r6904j7107j47765m1694J87067J47396
5458E996984N404p8871R0275L1813K746L843J3080j01496k0182p8032j14415m9371
5446E701778n3550p6096j63325r6103j57539o2849j01303j10859l0010j07720
5436D742424L0627j0069j07676r8643n7492n3591p8279k280J2031q947N2823j01349
5424D319579l5289k4948k7981M7602P3153j13652k33664q0528k0984K2931p0156
$$ y = [4696745, 4768642, 4806937, 4797369, 4823561, 4825475, 4873797, 4905775, 5008343, 5088190, 5154723, 5237810, 5275479, 5336603, 5465670, 5655536, 5870438, 5963521, 5947486, 6147719, 6120350, 6144709, 6250909, 6397902, 6456141, 6517336, 6515087, 6459654, 6351828, 6356381, 6349592, 6197573, 6172900, 6107916, 6030915, 5994608, 5982511, 5967493, 5965991, 5869087, 5851980, 5704215, 5662521, 5849588, 5996984, 6002388, 5923517, 6013792, 6045605, 6048351, 6052194, 6065274, 5963778, 5943596, 5865564, 5751149, 5701778, 5648228, 5572132, 5408807, 5312704, 5155165, 5092316, 4991013, 4880154, 4850144, 4742424, 4773051, 4762982, 4655306, 4556663, 4499171, 4445580, 4367301, 4365021, 4377052, 4368105, 4420928, 4319579, 4284290, 4259342, 4231361, 4278963, 4352116, 4238464, 4004800, 3924272, 3903288, 3926219, 3856063]
5413C856063K8691q6701j3431J3925L3142L7512o3629m6947j8741J39660M8129
5402C927673L0557M1068q2823k8293M9027j9066k3181O5088m6329j1796l9879
5391C862046O9836j07720q6744J6490L602K7453m3931O1489p7407l4295k2591
5380C668228P4874P8590L1040j12665L5130N148l0504O940J8487k7236Q0908J68795
5368C997735N619o0705L3083N9517j08342J08986L2559k5760L8895J3001k0601
5357D073987J9314Q3610J56850l4044j08705J60951M8861M7990N8342m1852L4139
5346D499443n8244j723J8321J09058l4168O298L535L7451o0893j05521m4466k2579
5334D346512P5929O6761k3364j02780n4586Q2169p8336j22943o5403L4366N5527
$$ y = [3856063, 3884754, 3798053, 3784622, 3798547, 3831689, 3869201, 3805572, 3758625, 3739884, 3879544, 3927673, 3958230, 3999298, 3916475, 3888182, 3937209, 3918143, 3894962, 3960050, 3913721, 3901925, 3862046, 3931882, 3824162, 3737418, 3753908, 3757510, 3784963, 3741032, 3802521, 3725114, 3690819, 3668228, 3743102, 3821692, 3852732, 3740067, 3775197, 3780345, 3749841, 3756781, 3775268, 3748032, 3828940, 3997735, 4003354, 3942649, 3975732, 4035249, 3926907, 4035893, 4068452, 4042692, 4081587, 4094588, 4073987, 4093301, 4176911, 4333761, 4299717, 4191012, 4351963, 4400824, 4448814, 4507156, 4465304, 4499443, 4441199, 4439476, 4457797, 4566855, 4532687, 4538985, 4542520, 4579971, 4519078, 4413557, 4369091, 4346512, 4422441, 4489202, 4465838, 4363058, 4308472, 4390641, 4312305, 4189362, 4123959, 4158325, 4213852]
5323D213852p580j67523r3961O5020n5928j03859L902O8780K5902j2771r0289
5312C845545l6028L0116J6207n8756R9179Q250j40064J9486J8902J4551K7461
5301C844849M6267o2327m20K7492j32638o0430l4833O6927R5833K2250O1437k249
5289C872158j59480j853l2218L0323j8393k9443p365P2620R979L493M8107l2386
5277C755542K0712R9654m2899Q7208N1529K0457J4816j04506L457m2464q2589
5266C780917L4781J21689J32103L36j8989o3970Q2654k5360n7025n5577m3779
5255C887780L1297n9474Q6691l1332L8667J11540o3211o9404L9371m2874P9156
5244D008207l793M7764l1686q14P5379J3551k8978J00697Q3362k3926j30146J0451
$$ y = [4213852, 4206272, 4038749, 3944788, 4009808, 3953880, 3850021, 3853923, 3922703, 3948605, 3935834, 3845545, 3809517, 3839633, 3855840, 3797084, 3896263, 3904513, 3764449, 3783935, 3802837, 3817388, 3844849, 3891116, 3828789, 3828369, 3855861, 3723223, 3662793, 3627960, 3694887, 3790720, 3812970, 3874407, 3872158, 3712678, 3710825, 3678607, 3708930, 3690537, 3661094, 3653729, 3726349, 3736328, 3739821, 3787928, 3755542, 3776254, 3875908, 3833009, 3920217, 3971746, 3992203, 4007019, 3902513, 3905970, 3863506, 3780917, 3815698, 3937387, 4069490, 4069826, 4050837, 3986867, 4069521, 4044161, 3987136, 3931559, 3887780, 3919077, 3859603, 3946294, 3914962, 3953629, 4065169, 4001958, 3932554, 3971925, 3929051, 4008207, 4004414, 4052178, 4020492, 4019678, 4095057, 4108608, 4079630, 4180327, 4263689, 4239763, 4109617, 4120068]
5232D120068J35383O4143J428P7007j19080n9845l0355K5304J42708k4045M943
5221D337659N572K2445j0083M811J39488j371k6810J57948r3631k7561J52109
5210D660576J1846l3589N2681Q9904J04543L740L7610R9310J12331J6127j9299
5199E135780l900K5714J40656L3208N1865J24357Q1157M8761O0309M5400O7676
5188E810983K75281L5254J03830L2291J22861M3041J05128J47394Q6870R1009
5178F853942O2066L1188J24644K09904K03892j4023J17080J50942K24001K24351
5168H187987J84688J92407K16020K02296J74852K65372K63082J37070J79303L25199
5158A0328276L45604L45276L63911K85555M02590M15765N05541M59083N52187
$$ y = [4120068, 4255451, 4319594, 4321022, 4398029, 4278949, 4219104, 4188749, 4214053, 4356761, 4332716, 4337659, 4343231, 4365676, 4355593, 4360404, 4499892, 4498521, 4471711, 4629659, 4536028, 4508467, 4660576, 4672422, 4638833, 4691514, 4781418, 4885961, 4889701, 4927311, 5026621, 5138952, 5155079, 5135780, 5131880, 5157594, 5298250, 5331458, 5383323, 5507680, 5588837, 5637598, 5697907, 5743307, 5810983, 6086264, 6121518, 6225348, 6257639, 6380500, 6423541, 6528669, 6676063, 6762933, 6853942, 6916008, 6947196, 7071840, 7281744, 7485636, 7471613, 7588693, 7739635, 7963636, 8187987, 8372675, 8565082, 8781102, 8983398, 9158250, 9423622, 9686704, 9823774, 10003077, 10328276, 10673880, 11019156, 11383067, 11668622, 12071212, 12486977, 12992518, 13451601, 14003788]
5149A4003788O48986O78135Q94093P58303R30782J061808J208067J281122J505960
5140B2971044J534033J790109J744883J562986J557659J310649J039175R24406
5132C4434944P56060P02927O81922P81850O43781L70003N2715l04528o83465q12963
5122C6623246j152356j083270j120680j159068j127572j088567r84256r76385
5114B7931092r93364q75321q23741p65579o45861l72447k57687k11762K7829K01382
5104B3214541L46581M79842N84356P70844P28789Q06540Q80232R89380Q73097
5095B9674202R64906J327434J227222J099804J143400Q74919O26373K76727k47660
5086C6967327n45349n44980q38306q68474p22813q28864r55115j115228j245850
$$ y = [14003788, 14652774, 15330909, 16225002, 16983305, 17914087, 18975895, 20183962, 21465084, 22971044, 24505077, 26295186, 28040069, 29603055, 31160714, 32471363, 33510538, 34434944, 35191004, 35893931, 36575853, 37357703, 38001484, 38371487, 38424202, 38119674, 37436209, 36623246, 35470890, 34387620, 33266940, 32107872, 30980300, 29891733, 28907477, 27931092, 26937728, 26062407, 25238666, 24473087, 23827226, 23454779, 23197092, 22985330, 23013159, 23214541, 23561122, 24040964, 24625320, 25396164, 26124953, 26931493, 27811725, 28801105, 29674202, 30639108, 31966542, 33193764, 34293568, 35436968, 36311887, 36938260, 37214987, 36967327, 36421978, 35876998, 35038692, 34170218, 33447405, 32618541, 31663426, 30548198, 29302348]
5077B9302348j430592j615453j592724j536331j665564j605389j480734j251909
5069A7123652j118358j036337q65226o91670p95893n92118n16654n36989l87145
5060A0583262l94935m81915l72738l09207k26425k75291j93425l96479k85692
5051G647155j11639j35731k48235j34404m6009j83687j48038r8433o6065j11359
5041F363555j11929j03598j03124o7646q7324p0295M1512q9351p6521j49956l2513
5030E512810M1632r3206q4501r1088o5975q1226N6938N042M607j53283l7939P8710
5018E092521J12930j08197j20365k7863l4105M6891J401r1957q6819l0308n8802
5007D695327j717J0794o759N3489o701j4017q5273K780O4976L0058j06841Q3562
$$ y = [29302348, 27871756, 26256303, 24663579, 23127248, 21461684, 19856295, 18375561, 17123652, 16005294, 14968957, 14103731, 13412061, 12616168, 12024050, 11507396, 10970407, 10583262, 10188327, 9706412, 9333674, 9024467, 8798042, 8522751, 8329326, 7932847, 7647155, 7535516, 7399785, 7151550, 7017146, 6971137, 6787450, 6639412, 6540979, 6474914, 6363555, 6251626, 6148028, 6044904, 5977258, 5889934, 5819639, 5861151, 5771800, 5695279, 5545323, 5512810, 5554442, 5461236, 5376735, 5285647, 5219672, 5138446, 5195384, 5200426, 5205033, 5051750, 5013811, 5092521, 5205451, 5097254, 4976889, 4949026, 4914921, 4961812, 4963213, 4871256, 4784437, 4754129, 4695327, 4693610, 4704404, 4697645, 4751134, 4744433, 4730416, 4645143, 4647923, 4712899, 4742957, 4636116, 4719678]
4995D719678J50699L6267l4003O8283N1027o3677K9452n31L6621J66387J35648
4984E295851L8889L1818K684J13609P6739N0082Q5663K5760N0336J17520J31886
4973F020837J22931J35312K33070J95602K08778L37157L20171K56229K06963K16095
4963H253145K0560r2478r7873j66510j01053l38260l42135j15462j88053r2369
4953F739512K133j20159j28409O0195N0453O4308K09584K10621L05900L48965
4943G743103M53561M09565N12094L93883K72572Q513r5547j96012m11436m03898
4933H686398l36490l13643k10137j7746l2103K3563K34541J50527J99697K03134
4923H587741J21384L2406R2702m4857j01960j75934j53176k33913k90093j72200
$$ y = [4719678, 4870377, 4906644, 4872641, 4940924, 4991951, 4928274, 4957726, 4957195, 4993816, 5160203, 5295851, 5334740, 5366558, 5369242, 5482851, 5559590, 5609672, 5695335, 5721095, 5771431, 5888951, 6020837, 6143768, 6279080, 6512150, 6707752, 6916530, 7253687, 7573858, 7830087, 8037050, 8253145, 8273705, 8181227, 8083354, 7916844, 7815791, 7477531, 7135396, 7019934, 6831881, 6739512, 6741645, 6621486, 6493077, 6553272, 6603725, 6668033, 6877617, 7088238, 7394138, 7743103, 8196664, 8606229, 9118323, 9512206, 9784778, 9793291, 9697744, 9501732, 9090296, 8686398, 8349908, 8036265, 7826128, 7808382, 7776279, 7799842, 8034383, 8184910, 8384607, 8587741, 8709125, 8741531, 8834233, 8789376, 8687416, 8511482, 8358306, 8124393, 7834300, 7662100]
4913G662100k40438k89928k08319j84517k26405k78936j49136j36217j48959j9019
4903E780226j12668j48268m8906n0622n4919j42255r725J1457N2950l0200j04172
4892E142898k4697j23727j21722j24448j9295j27539M4911l6359m7215l0001o5392
4881D467414j555p9310P7155N6832j19210M8599L2240p052K068J09178O3298J03168
4869D752825O6104J21965J54026q8546l3226k0481J38l5546o0936j17883j04954
4858D633486l8823N6484N5052j50633N607Q5791O0275J09858J1570o4260L7258
4847D801665P3552k471n4451j41492n816j29941p9085L56l4067n911p046p8517
4835D336776p2860j4406o0439l9348k5584P1265M3378o7476J12978L6524m6529
$$ y = [7662100, 7421662, 7131734, 6923415, 6738898, 6512493, 6233557, 6084421, 5948204, 5799245, 5780226, 5667558, 5519290, 5470384, 5419762, 5364843, 5222588, 5212863, 5224320, 5277270, 5247070, 5142898, 5118201, 4994474, 4872752, 4748304, 4729009, 4601470, 4646381, 4610022, 4562807, 4532806, 4467414, 4465859, 4386549, 4463704, 4520536, 4401326, 4449925, 4482165, 4475113, 4477181, 4586359, 4649657, 4752825, 4818929, 4940894, 5094920, 5006374, 4973148, 4952667, 4952805, 4917259, 4856323, 4738440, 4633486, 4594663, 4651147, 4706199, 4555566, 4561173, 4646964, 4707239, 4817097, 4828667, 4764407, 4801665, 4875217, 4872746, 4818295, 4676803, 4670987, 4541046, 4461961, 4462317, 4428250, 4422339, 4415293, 4336776, 4263916, 4249510, 4189071, 4149723, 4124139, 4195404, 4238782, 4171306, 4284284, 4320808, 4274279]
4824D274279J8382j758J58452J08062L6365j7744R5732R5243J32531J51612M2443
4813E093599j7428K67822K20343Q6697K18715J92261K49545J45883J12178J14994
4803F684609l4173M5801N0094Q937J00895J41866J25957K24862J93250J12280
4793G654378j7734l2704L1939j36552j44457l09633k41034k14351k30100j54093
4783F205659l43670k14623k03720j70072q9527j25636j48185j34416j47353j42505
4773D485952q1965j6828o2241o0852p1350o7793j43591q8779j02570o7813Q1687
4762C803857M3433j03564j03465J2611J17793l7747l5714j02122J4347K5957n8593
4751C576793l0936O374r163j60625N1837R2496N022j07099L2817n8630M1341o7486
$$ y = [4274279, 4292661, 4290903, 4449355, 4557417, 4593782, 4576038, 4671770, 4767013, 4899544, 5051156, 5093599, 5076171, 5343993, 5564336, 5651033, 5869748, 6062009, 6311554, 6457437, 6569615, 6684609, 6650436, 6696237, 6746331, 6755268, 6856163, 6998029, 7123986, 7348848, 7542098, 7654378, 7636644, 7603940, 7635879, 7499327, 7354870, 7045237, 6804203, 6589852, 6359752, 6205659, 5861989, 5647366, 5443646, 5273574, 5184047, 5058411, 4910226, 4775810, 4628457, 4485952, 4403987, 4387159, 4324918, 4264066, 4192716, 4124923, 3981332, 3892553, 3789983, 3722170, 3803857, 3847290, 3743726, 3640261, 3652872, 3770665, 3732918, 3697204, 3595082, 3609429, 3635386, 3576793, 3545857, 3552231, 3543068, 3382443, 3434280, 3526776, 3531798, 3424699, 3457516, 3398886, 3440227, 3372741]
4739C372741p9466N5336K5092l2450j9261Q9507N4314q2198o0102J55038o4879
4728C413672j70104O0996J00227r3530l4978K3037m0958n855M2307J40639N7521
4717C492974l7185K3369N1585J6045m7964n2177L8157Q4934M3146J9247j07129
4706C525002j6921o2736m3699J27850p529j25965O0163J15229R849j0684j5034
4695C555525N8352R2406o734o6998O4264L5774n6783r887O3084J04023m788J6901
4683C845139J07245P58L354j11585J19364L7025J39422J810j12824N3206P6622
4672D159536R4354K1570Q490P7840P6642Q4101R7710J26017L814J75022N3722
4661D978818Q5849Q0417J40974N6303j5757P6266J54796J42891P2007P4158K25389
$$ y = [3372741, 3293275, 3348611, 3373703, 3341253, 3321992, 3411499, 3465813, 3383615, 3323513, 3478551, 3413672, 3243568, 3304564, 3404791, 3311261, 3276283, 3299320, 3258362, 3252507, 3294814, 3435453, 3492974, 3455789, 3479158, 3530743, 3546788, 3498824, 3446647, 3484804, 3569738, 3612884, 3632131, 3525002, 3508081, 3445345, 3401646, 3529496, 3521967, 3396002, 3456165, 3571394, 3581243, 3570559, 3555525, 3613877, 3706283, 3699549, 3632551, 3696815, 3732589, 3675806, 3665919, 3729003, 3833026, 3828238, 3845139, 3952384, 3953142, 3956496, 3844911, 3964275, 4001300, 4140722, 4142532, 4029708, 4082914, 4159536, 4253890, 4275460, 4283950, 4361790, 4438432, 4522533, 4620243, 4746260, 4750074, 4925096, 4978818, 5064667, 5145084, 5286058, 5342361, 5326604, 5402870, 5557666, 5700557, 5772564, 5846722, 6072111]
4650F072111Q1518n1571R2601K2940Q4546J39386K03535J08376J17317J59296
4640G030055J77157K07272J18411K13279L39572J53722J29025K23003J95738K58602
4630I045836K11314J65706L41883J54468K00519J75361K04718J95669J66096J65459
4620A1027029K07583J68358L76394L43320L54804K38577K77300L19682L86111
4611A3699158M67371L88187M84474M78485M86050N70098N67141P59097O37010
4602A8537071P08010P75378O81549P25881P02729Q21544P73401P34752Q84427
4593B5344742R91650J132291J030585J145115J411630J491256J684061J881216
4585C6112546K046752K308079K540748K644005L070528L429295L824001M263610
$$ y = [6072111, 6153629, 6102058, 6194659, 6217599, 6302145, 6441531, 6645066, 6753442, 6870759, 7030055, 7207212, 7414484, 7532895, 7746174, 8085746, 8239468, 8368493, 8591496, 8787234, 9045836, 9257150, 9422856, 9764739, 9919207, 10119726, 10295087, 10499805, 10695474, 10861570, 11027029, 11234612, 11402970, 11779364, 12122684, 12477488, 12716065, 12993365, 13313047, 13699158, 14166529, 14554716, 15039190, 15517675, 16003725, 16573823, 17140964, 17900061, 18537071, 19245081, 20020459, 20702008, 21427889, 22130618, 22952162, 23725563, 24460315, 25344742, 26336392, 27468683, 28499268, 29644383, 31056013, 32547269, 34231330, 36112546, 38159298, 40467377, 43008125, 45652130, 48722658, 52151953, 55975954, 60239564]
4577F0239564M637837N159354N779824O908097Q620501J0184445J1669030J2642334
4569A25840986J3530777J4567205J6257149J7756816J6572887R942167L99604
4562B14867591p154691j1997879j4333631j5886700j7390004j7914949j6924707
4555A13265030j4934292j2362490j0102999q215888o780658n696988m851397m225832
4547D6094486l695208l144556k702511k293887j892882j765665j649182j555424
4539B7395171j381736j242777j255686j134165j123655j073094r30502r50586
4531A8302970q10399p31154q08697p50928o57422n06033n64188m23849l62088
4522A2688212l67334n20988l20453l12359l59886l17802l05739j54956l41543
$$ y = [60239564, 64877401, 70036755, 75816579, 82724676, 91345177, 101529622, 113198652, 125840986, 139371763, 153938968, 170196117, 187952933, 204525820, 214467987, 214867591, 207712900, 195715021, 181381390, 165494690, 148104686, 130189737, 113265030, 98330738, 85968248, 75865249, 67649361, 60868703, 55171715, 50320318, 46094486, 42399278, 39254722, 36552211, 34258324, 32365442, 30599777, 28950595, 27395171, 26013435, 24770658, 23514972, 22380807, 21257152, 20184058, 19253556, 18302970, 17492571, 16761417, 15952720, 15201792, 14544370, 14038337, 13474149, 13050300, 12688212, 12320878, 11799890, 11479437, 11167078, 10807192, 10489390, 10183651, 10028695, 9687152]
4513I687152k88972k28716j59012m17123k23074l05466k18914j97752j78647j40236
4503G329240k71461k69394k21214k05601q0191j95119j04436j36493k03478j23893
4493E517960j00523j35108j97158n1646l0077l5495j97152j6862q5426j8732j11138
4482D538643j70309n1849l8554p7476k49651r2541Q439j34112j20953k7122k8103
4471C556412j09738j46169l8818j7806k2899o9675j6278j12958p3057K6621m7138
4460B928497l0681k3161J6530N1088m9272L1000m6113k509q0019r4281p0242K2912
4448B653749m8726n3254j4413O1014j4899j36645l2663k6828J40710r0159j4742
4437B423144k9881l4807P752j14858n9760J03944r332m3737j24377r2446l8323
$$ y = [9687152, 9398180, 9169464, 9010452, 8593329, 8370255, 8064789, 7845875, 7648123, 7469476, 7329240, 7057779, 6788385, 6567171, 6361570, 6281379, 6086260, 5981824, 5845331, 5641853, 5517960, 5417437, 5282329, 5085171, 5033525, 5003448, 4967953, 4770801, 4753939, 4668513, 4649781, 4538643, 4368334, 4316485, 4277931, 4200455, 3950804, 3858263, 3866702, 3732590, 3611637, 3584515, 3556412, 3446674, 3300505, 3261687, 3243881, 3220982, 3151307, 3135029, 3022071, 2949014, 2975635, 2928497, 2897816, 2874655, 2891185, 2942273, 2893001, 2924001, 2877888, 2875379, 2795360, 2701079, 2630837, 2653749, 2605023, 2551769, 2537356, 2598370, 2583471, 2446826, 2414163, 2387335, 2528045, 2437886, 2423144, 2393263, 2358456, 2366208, 2251350, 2191590, 2295534, 2286202, 2242465, 2118088, 2025642, 1987319]
4426A987319k741J1600O2428J7627j7251p706j25348K399r4123n392L0574J20801
4414A980187n1868k5996j9044n7819j5412M1178J9959o7166l8036r965L5437P3844
4402A865299o1028j50430l2395m9224M51j26168O4546j12330O8778k0249j48387
4391A298863P9226P6496l8313n9919J38418M8089j02907Q169k0077L3015N855
4380A466915m6475M3731M17j0941O55N1557q7479j9423j35910l4704J13726J69079
4368A511148J5082m0720r3434j9753J9221J503l8738K8613k331r9228l2686l1020
4356A217657N2159q5038K0645M7150j3914J0965O6121o2906l7911l4646K52m9241
4344A131293N9393J08982M5381k6763o9304P4671n9872j05107M061J413J00172
$$ y = [1987319, 1984578, 1996178, 2058606, 2076233, 2058982, 2051276, 1925928, 1928327, 1834204, 1828812, 1859386, 1980187, 1928319, 1902323, 1883279, 1825460, 1810048, 1851226, 1871185, 1804019, 1765983, 1756018, 1791455, 1865299, 1804271, 1653841, 1621446, 1572222, 1572673, 1446505, 1511051, 1398721, 1467499, 1447250, 1298863, 1378089, 1454585, 1416272, 1356353, 1494771, 1542860, 1439953, 1448122, 1428045, 1461060, 1466915, 1420440, 1464171, 1464588, 1453647, 1454302, 1505859, 1418380, 1398957, 1263047, 1228343, 1342069, 1511148, 1526230, 1485510, 1392076, 1372323, 1391544, 1393047, 1354309, 1382922, 1380591, 1281363, 1248677, 1217657, 1269816, 1184778, 1205423, 1252573, 1238659, 1249624, 1315745, 1252839, 1214928, 1180282, 1180534, 1131293, 1190686, 1299668, 1345049, 1318286, 1248982, 1323653, 1263781, 1158674, 1162735, 1164148, 1264320]
4333A264320L6142N713p3561M7643J40112M623j11287n7116l4820N0847M0641
4322A313257J0066L4077Q182j4708m2677J30971j44034J008M195L6227L0173j67251
4310A199486J3642j4275K4828K3805M1710m9784j12114L7130J32169j07601L9235
4299A228231O7851o6853L786L8336K6330K9388J4002M8444L0179M1229k1505k9770
4287A409648L1646M4834l1941O9271N8288j1879M7316o9101r8407J9025J23964
4276A592664m070M966L217j2406J58497J62354p6002j2837P9541J00193J0048
4265B006165K1409L5793J12066P5116J27173J67423M0234m2801q4993L4265n5979
4254B435871k7617j41942j69835l713j30895K5022p4901r0690l0047Q2812o7290
$$ y = [1264320, 1300462, 1306175, 1232614, 1280257, 1420369, 1424992, 1313705, 1256589, 1221769, 1272616, 1313257, 1323323, 1357400, 1365582, 1350874, 1308197, 1439168, 1295134, 1296142, 1300337, 1336564, 1366737, 1199486, 1213128, 1198853, 1223681, 1247486, 1289196, 1239412, 1127298, 1164428, 1296597, 1188996, 1228231, 1296082, 1229229, 1233015, 1271351, 1297681, 1327069, 1341071, 1389515, 1419694, 1460923, 1439418, 1409648, 1441294, 1486128, 1454187, 1523458, 1581746, 1569867, 1617183, 1548082, 1449675, 1468700, 1592664, 1588594, 1593560, 1596777, 1584371, 1742868, 1905222, 1829220, 1816383, 1895924, 1996117, 2006165, 2027574, 2063367, 2175433, 2250549, 2377722, 2545145, 2585379, 2542578, 2457585, 2491850, 2435871, 2408254, 2266312, 2096477, 2092764, 1961869, 1986891, 1911990, 1821300, 1791253, 1874065, 1806775]
4243A806775q3526j54176r1729J03345Q7519j9691l7588j1762K2796o6417p5388
4232A480158r494O3347q4289m8739L7872k75J6940L7663j55206k5529j2623O5246
4220A365071L3087O2098p4800J2517k810o1026P5616q7352M6620n6026J35442
4209A448437l5730J0544n7831o8991O4324j4382j7178L7698M0156M3616p8609
4198A372054R467k4470N066Q2321J50664j47042p4140P1822p2126M9972J04136
4187A527724J4424l9353P2470L7555l4570P2889r0461j0351j0520N1138L3404
4176A624349j06669R7469J97618P9345k8875K9144p0978K4506l0785R0917J24526
4165B030567J14893K6086k0629M2061M6386J89515q0385M7663J53445L2951Q3199
$$ y = [1806775, 1723249, 1569073, 1477344, 1580689, 1668208, 1648517, 1610929, 1599167, 1621963, 1555546, 1480158, 1470664, 1534011, 1449722, 1400983, 1438855, 1438580, 1455520, 1493183, 1337977, 1312448, 1299825, 1365071, 1398158, 1460256, 1385456, 1397973, 1395163, 1334137, 1409753, 1322401, 1369021, 1312995, 1448437, 1412707, 1423251, 1365420, 1296429, 1360753, 1346371, 1329193, 1366891, 1407047, 1450663, 1372054, 1381521, 1357051, 1362117, 1444438, 1595102, 1448060, 1373920, 1445742, 1373616, 1423588, 1527724, 1542148, 1502795, 1575265, 1612820, 1578250, 1651139, 1560678, 1550327, 1539807, 1590945, 1624349, 1517680, 1615149, 1812767, 1892112, 1863237, 1892381, 1821403, 1845909, 1815124, 1906041, 2030567, 2145460, 2171546, 2150917, 2192978, 2239364, 2428879, 2348494, 2396157, 2549602, 2582553, 2665752]
4154B665752K1375N288J25073P9798N9742Q6954m535O3598J81644Q5717q6111
4143C284295R3299Q5713P0371Q9085J02824P0506N7571J48964P8279k1117k5695
4132D034095Q6250N1291O1159P95R7428J41950J0438M7866L3126N6418K0953Q3277
4120D725046J19377Q3866P9958J738K7155n0611N3838Q4680o6809K1999J08534
4109E188771K0929O3783p279J27209J21086M6710j7920p937R3331J25991j3396
4098E741278O4532Q0868M649K4168P8597R3251J77291R322O147J09867Q8485J77612
4086F656067J65568K11145Q5986J17692J27595J73198J70366K70592J26649P3054
4076H177912K48325K83497J84759K94313L08187K94237K31538M28601M69154L33778
$$ y = [2665752, 2687127, 2692415, 2817488, 2897286, 2957028, 3043982, 3039447, 3103045, 3284689, 3370406, 3284295, 3377594, 3463307, 3533678, 3622763, 3725587, 3796093, 3853664, 4002628, 4080907, 4059790, 4034095, 4120345, 4171636, 4232795, 4233590, 4331018, 4472968, 4483406, 4531272, 4564398, 4620816, 4641769, 4725046, 4844423, 4928289, 5008247, 5009985, 5037140, 4986529, 5040367, 5125047, 5058238, 5080237, 5188771, 5209700, 5273483, 5266204, 5393413, 5514499, 5561209, 5543289, 5535352, 5628683, 5754674, 5741278, 5805810, 5886678, 5891327, 5915495, 5994092, 6087343, 6264634, 6273956, 6280103, 6389970, 6478455, 6656067, 6821635, 7032780, 7118766, 7236458, 7364053, 7537251, 7707617, 7978209, 8104858, 8177912, 8426237, 8709734, 8894493, 9188806, 9496993, 9791230, 10022768, 10451369, 10920523, 11254301]
4066A1254301M11370M19680M83744M85863N09772L86192L21499M91297L60984
4057A5124702M49271M48304N27435N76103P31049O62212O99563O85115N49731
4048B0453485O29387M11940M89172M12967L46648L14857M38211M61191N44542
4039B4502400P60518O34946O99781Q32725Q42961O97949L13442k75392m90687
4030B8518643o36826p78871p73507q20167q27233q65520n77633m12955m08542
4021B2417389m16303l12016m22978m96889n72051o28788p85631p57394n59431
4012A7465908o50373n18819n80126n38987n85415m35771m64900m80096n14123
4003A2697298m42449m34034n52408m99070m52187m18611m57072m29390m23145
$$ y = [11254301, 11665671, 12085351, 12569095, 13054958, 13564730, 13950922, 14272421, 14763718, 15124702, 15573973, 16022277, 16549712, 17125815, 17856864, 18519076, 19218639, 19903754, 20453485, 21082872, 21494812, 21983984, 22396951, 22743599, 23058456, 23496667, 23957858, 24502400, 25262918, 25897864, 26597645, 27430370, 28273331, 28971280, 29284722, 29009330, 28518643, 27881817, 27102946, 26329439, 25509272, 24682039, 23816519, 23238886, 22825931, 22417389, 22001086, 21689070, 21266092, 20769203, 20197152, 19568364, 18782733, 18025339, 17465908, 16815535, 16296716, 15716590, 15177603, 14592188, 14156417, 13691517, 13211421, 12697298, 12254849, 11820815, 11268407, 10769337, 10317150, 9898539, 9441467, 9012077, 8588932]
3994H588932l08001l14063l45238k12730k48626l21542j37490k90309k87733j22913
3984F000287j92935j81648j79583k47263k07125k07086r3192o9143j55784j29761
3974D336767q3584j40767j80449r5260j06000o2169j56977p4533O9357L1489p2475
3963C465399j34290o6115q0726O3796j44832l8529J3538m9602m0298n0612j17330
3952B820399p5885r6172R4928Q9450q6041m7264j23141L9239P9589o7486j16265
3941B511351r0131l8350k356o6799j7130P8581j40211N6555p3003j17968Q3685
3930B184224o6958R401k8320O8699J2049r0379N7538N2989K1353r1398L788J32670
3918B265656K2348L1946q8371N7373l7528r2565k0885K2001N1840J8549Q3797
$$ y = [8588932, 8280931, 7966868, 7621630, 7408900, 7160274, 6838732, 6701242, 6410933, 6123200, 6000287, 5807352, 5625704, 5446121, 5198858, 4991733, 4784647, 4691455, 4622312, 4466528, 4336767, 4253183, 4112416, 3931967, 3836707, 3730707, 3668538, 3511561, 3437028, 3506385, 3537874, 3465399, 3331109, 3264994, 3184268, 3248064, 3103232, 3064703, 3078241, 3028639, 2988341, 2937729, 2820399, 2744514, 2648342, 2743270, 2832720, 2746679, 2699415, 2576274, 2615513, 2695102, 2627616, 2511351, 2421220, 2382870, 2380514, 2313715, 2296585, 2375166, 2234955, 2291510, 2218507, 2100539, 2184224, 2117266, 2126667, 2098347, 2167046, 2179095, 2088716, 2146254, 2199243, 2220596, 2129198, 2132986, 2265656, 2288004, 2319950, 2231579, 2288952, 2251424, 2158859, 2137974, 2159975, 2211815, 2230364, 2314161]
3907B314161P8890o7662M7920R559J07818j19923M7858J13206M4022L9970K8312
3896B644131k7293o6625M3350K3750K6499k4841M8728j09972J10275P3329q0960
3885B660371q7309J5349K1184J67309N6165p2840L5126R233K5080j10086l0037
3874B689545K4807J4100q136j4621l5517n3861n0220P2325j48784J3621J3947
3863B517206o390J08628j88161k5418M3614r513l1045m0372R085N2277j6416K9270
3851B442765n1881n0524p6989P706j25564q194k4057M7426j36738k43346J36782
3840A917386J1856n6403q3902n2044J23949j11745j8352N9564n4182k4978O531
3829A717680l2322j010Q2161n7160N1457Q8153n0771r1299j3869m320q5238L8040
$$ y = [2314161, 2393051, 2325389, 2373309, 2382868, 2490686, 2370763, 2418621, 2531827, 2575849, 2615819, 2644131, 2616838, 2550213, 2593563, 2617313, 2643812, 2618971, 2667699, 2557727, 2668002, 2741331, 2660371, 2573062, 2588411, 2609595, 2776904, 2833069, 2760229, 2795355, 2804588, 2829668, 2719582, 2689545, 2714352, 2728452, 2720316, 2705695, 2670178, 2616317, 2566097, 2638422, 2489638, 2503259, 2517206, 2510816, 2619444, 2431283, 2405865, 2449479, 2439966, 2408921, 2368549, 2377634, 2429911, 2413495, 2442765, 2390884, 2340360, 2263371, 2271077, 2145513, 2137319, 2113262, 2160688, 2023950, 1780604, 1917386, 1929242, 1872839, 1788937, 1736893, 1860842, 1749097, 1730745, 1790309, 1736127, 1711149, 1717680, 1685358, 1684348, 1766509, 1709349, 1760806, 1848959, 1798188, 1706889, 1693020, 1688700, 1603462, 1641502]
3817A641502l399J203P5532M6855j06378m8179P7037K8608l2211r055k9093q3535
3805A558887L5570k0741J07761J07015l1215j4513q690K4934m3564K8653K3977
3794A768074J9219l2827r5337R1602o1880k1608j518N2901N444j0866l7502j0224
3782A665478l4987o3762P3782j9955M4874r483l9280J31113j29291m591P950n244
3770A616604R314K8862o1057N3540O2157k8081Q542j7455l7405N5608O0874l5961
3758A715542M0664m1484k8677R3907o5942q6217N2548R8228O3919J9357j48477
3747A713368N2822L9722q6224J7384O6496J15432L3781K3842j23060o384Q4159
3736A931338J0709n560j3591K9081J5118n5366r4601O1319r865m3547l6382r187
$$ y = [1641502, 1638103, 1639306, 1714838, 1761693, 1655315, 1607136, 1684173, 1712781, 1680570, 1671515, 1642422, 1558887, 1594457, 1573716, 1681477, 1788492, 1757277, 1742764, 1734074, 1759008, 1715444, 1744097, 1768074, 1787293, 1754466, 1659129, 1750731, 1688851, 1667243, 1665725, 1718626, 1724070, 1713204, 1675702, 1665478, 1630491, 1566729, 1640511, 1620556, 1665430, 1655947, 1616667, 1747780, 1618489, 1613898, 1621848, 1616604, 1625918, 1654780, 1593723, 1647263, 1709420, 1681339, 1689881, 1672426, 1635021, 1690629, 1751503, 1715542, 1756206, 1714722, 1686045, 1779952, 1714010, 1627793, 1680341, 1778569, 1842488, 1861845, 1713368, 1766190, 1805912, 1719688, 1737072, 1803568, 1919000, 1952781, 1976623, 1853563, 1847179, 1931338, 1942047, 1936487, 1922896, 1951977, 1967095, 1911729, 1817128, 1878447, 1868582, 1825035, 1788653, 1779466]
3724A779466J5151R401J17932r614J0621J6790O1964r1542M9050J6269J2702N2504
3712B040694j6031q0448O1617J12413n1520P548L3037J40678K523q5852J7174
3701B181833M5689J0588R249O4367O3338M5770k928R1906M177j8511R7050J19678
3689B712206L9784K9330J21379K00662j9473o612K1298M6833j2938P6812Q856
3678C218137L5022o174N676K9728J10032m3661j27861O6982k5066J79011n4041
3667C387785j59805O0406M5683j03642L2440r8332N6361P8726p0721L765j07960
3656C124706K4150o4576K173N973L0563k8752r5890J1755P505j7007o8104m9062
3644B883434j9674j3822p4722q6727k6884M954J967o8271J02252O1831j2613K5744
$$ y = [1779466, 1794617, 1804018, 1921950, 1912336, 1922957, 1939747, 2001711, 1910169, 1959219, 1975488, 1988190, 2040694, 2024663, 1944215, 2005832, 2118245, 2066725, 2074273, 2107310, 2247988, 2250511, 2164659, 2181833, 2227522, 2238110, 2247359, 2311726, 2375064, 2420834, 2417906, 2509812, 2513989, 2495478, 2592528, 2712206, 2751990, 2781320, 2902699, 3103361, 3083888, 3077276, 3098574, 3145407, 3132469, 3209281, 3218137, 3253159, 3246985, 3252661, 3282389, 3392421, 3348760, 3220899, 3287881, 3262815, 3441826, 3387785, 3227980, 3288386, 3334069, 3230427, 3262867, 3164535, 3220896, 3299622, 3228901, 3232666, 3124706, 3148856, 3084280, 3086453, 3092426, 3122989, 3094237, 2998347, 3010102, 3017607, 3000600, 2932496, 2883434, 2863760, 2849938, 2775216, 2688489, 2661605, 2666559, 2668526, 2600255, 2702507, 2764338, 2751725, 2777469]
3632B777469m5250q267K4809m3745n4723P156K0701R0485n210J19137R0403L9825
3620C012790k7626j447n7193n9453J35106J11052k7471k2366N2980k4673j1267
3609C080432R9706o373l167k0714N2168J25695K5681l2360L3622q4206O7852m247
3597C334089l2866J29457j6541n7942Q2434L734P024J01794J2743k3450M2331
3586C582807M1536R103l878L8687J35151Q3647k3924P3331m514N8529Q1674L9218
3574D111367J70320P5260K5618m1721R9080J46066R7624J66646J51740P3612L5888
3563E111500Q4826J21139K12219J76689P6205Q3012R529K30187J50792K04620
3553F460718J01302L5273J46274J71705R2454N1032J58653N0071O7161J03917
$$ y = [2777469, 2732219, 2723952, 2748761, 2705016, 2650293, 2657449, 2678150, 2768635, 2763425, 2882562, 2972965, 3012790, 2985164, 2983717, 2926524, 2867071, 3002177, 3113229, 3085758, 3063392, 3116372, 3091699, 3080432, 3180138, 3173765, 3170598, 3149884, 3202052, 3327747, 3353428, 3321068, 3354690, 3270484, 3338336, 3334089, 3301223, 3430680, 3414139, 3356197, 3438631, 3442365, 3449389, 3551183, 3563926, 3540476, 3582807, 3624343, 3633446, 3629568, 3668255, 3803406, 3887053, 3863129, 3936460, 3931946, 3990475, 4072149, 4111367, 4281687, 4356947, 4382565, 4340844, 4439924, 4585990, 4683614, 4850260, 5002000, 5075612, 5111500, 5196326, 5317465, 5529684, 5706373, 5782578, 5865590, 5875119, 6105306, 6256098, 6460718, 6562020, 6597293, 6743567, 6915272, 7007726, 7058758, 7217411, 7267482, 7334643, 7438560]
3543G438560R3711K5629O6101L3343J23645J35683K6979P3738P6828O177l189
3532H097205n4522M5899J5112M3330M5406J17329L0429n4097m2251r267K6233
3521H260806l9213Q1657Q7392m9776k9937k446n9531O276M0262J0423j7585P1025
3509H359353R0867P0747J2318L4086q7246J47669k0760j4635M9085r268n1569
3498H580647Q015R0505Q0205j6367q007R7185L1292R2444j01688k3225j563k5753
3486H803690n1661p9751Q2255K1416k3801O9240L5349N9398N1294m8759J15845
3475I034515K4913j7773k127O8157Q3812P67J16204q382O704J17532m5936j346
3463I377040N4277P4107J09596R7232J3598R4009n5494l3680M7712q6101l1905
$$ y = [7438560, 7532271, 7557900, 7624001, 7657344, 7780989, 7916672, 7943651, 8017389, 8094217, 8100394, 8097205, 8042683, 8088582, 8103694, 8147024, 8192430, 8309759, 8340188, 8286091, 8243840, 8234573, 8260806, 8221593, 8303250, 8390642, 8340866, 8310929, 8308483, 8248952, 8255228, 8295490, 8305913, 8288328, 8359353, 8450220, 8520967, 8533285, 8567371, 8480125, 8627794, 8607034, 8592399, 8641484, 8632216, 8580647, 8588662, 8679167, 8759372, 8743005, 8734998, 8832183, 8863475, 8955919, 8854231, 8831006, 8829443, 8803690, 8752029, 8672278, 8754533, 8775949, 8752148, 8821388, 8856737, 8916135, 8967429, 8918670, 9034515, 9059428, 9041655, 9039528, 9107685, 9191497, 9192264, 9308468, 9300086, 9306790, 9424322, 9378386, 9377040, 9431317, 9505424, 9615020, 9712252, 9725850, 9819859, 9764365, 9730685, 9778397, 9692296, 9660391]
3452I660391J04778k5313R0966K0431o9803L8327J15166M1230l8581J30533K8183
3441A0096308R5733k3083J40090J13749Q1104J74813P0944M897R3324O5000K11783
3430A1124662P7468K15188L01528L8324J27500J94004J31926J07521J20569J57788
3420A2596478J31358K21847K00794K03833J30367J31356J82984K01174K20212
3411A4220403K08071K37186K13409Q0297J21395J71837K19034J74001R2887K74733
3401A6013253J51145R4172K56155J95245J61828K09997J18689Q2461K13130K67388
3391A7763463K53023J73818J15302J64204K73691J25894J39978J55828J41781
3382A9306982J87998L70832J97279N5244K23792K82346K43346K25929J71836K29867
$$ y = [9660391, 9765169, 9739856, 9830822, 9851253, 9781450, 9819777, 9934943, 9976173, 9937592, 10068125, 10096308, 10192041, 10168958, 10309048, 10422797, 10503901, 10678714, 10749658, 10754555, 10847879, 10912879, 11124662, 11202130, 11417318, 11718846, 11757170, 11884670, 12078674, 12210600, 12318121, 12438690, 12596478, 12727836, 12949683, 13150477, 13354310, 13484677, 13616033, 13799017, 14000191, 14220403, 14428474, 14665660, 14879069, 14959366, 15080761, 15252598, 15471632, 15645633, 15738520, 16013253, 16164398, 16258570, 16514725, 16709970, 16871798, 17081795, 17200484, 17282945, 17496075, 17763463, 18016486, 18190304, 18305606, 18469810, 18743501, 18869395, 19009373, 19165201, 19306982, 19494980, 19865812, 20063091, 20118335, 20342127, 20624473, 20867819, 21093748, 21265584, 21495451]
3372B1495451K28361J98571L14521K17026K38553L84617M52262L69867M14112
3363B4313341M05660O60050M48118N48318N86138Q15029R39483P73683R35876
3354C0425696J205878J051110J100411J288975J465782J440726J482912J523082
3346D0984572J551279J711914J800449K095550K125453K327640K517150K545356
3338E7659363K662514K484646K502477K241486J912030J722528J286203R44128
3330G3415375O49578M99186K54782J16819J60955J01277J36199M8648J30478K9243
3320G5542540k58523m03183n98403r65943j234185j397469j616817j797000j950404
3311F5320613k060873j958434j737485j542325j500874j360940j208773j085915
$$ y = [21495451, 21723812, 21922383, 22236904, 22453930, 22692483, 23077100, 23529362, 23899229, 24313341, 24719001, 25379051, 25827169, 26375487, 26961625, 27776654, 28716137, 29489820, 30425696, 31631574, 32682684, 33783095, 35072070, 36537852, 37978578, 39461490, 40984572, 42535851, 44247765, 46048214, 48143764, 50269217, 52596857, 55114007, 57659363, 60321877, 62806523, 65309000, 67550486, 69462516, 71185044, 72471247, 73415375, 74064953, 74564139, 74818921, 74935740, 75096695, 75197972, 75334171, 75382819, 75513297, 75542540, 75284017, 74880834, 74282431, 73316488, 72082303, 70684834, 69068017, 67271017, 65320613, 63259740, 61301306, 59563821, 58021496, 56520622, 55159682, 53950909, 52864994]
3303E2864994q46118p19298n29290m96269k73252l51480k45773j86710j77747
3294D9039057j00105N4957M8566J01458N6544K91014K94988K24874L41705L93369
3284E0746427M35480N13518L57552N34906N68027M43872N72563N33490N86264
3275E5292099O51812O59180O63803P34693Q41020P01809Q92005J075261R94042
3266F2505724J008564J141532J340774J387035J633461J566608J734534J848110
3258G4166342K050875K286109K414755K564388K815108L131395L339043L715759
3250I6483774L975663M082631M338769M582475M610828M945742M705472M415044
3242A32140398M231224L807318L223802K744736K496444J828307J437975J253126
$$ y = [52864994, 52018876, 51299578, 50770288, 50274019, 50000767, 49649287, 49403514, 49216804, 49039057, 48938952, 48993909, 49042475, 49143933, 49200477, 49491491, 49786479, 50011353, 50353058, 50746427, 51181907, 51695425, 52052977, 52587883, 53155910, 53599782, 54172345, 54705835, 55292099, 55943911, 56603091, 57266894, 58001587, 58842607, 59544416, 60436421, 61511682, 62505724, 63514288, 64655820, 65996594, 67383629, 69017090, 70583698, 72318232, 74166342, 76217217, 78503326, 80918081, 83482469, 86297577, 89428972, 92768015, 96483774, 100459437, 104542068, 108880837, 113463312, 118074140, 123019882, 127725354, 132140398, 136371622, 140178940, 143402742, 146147478, 148643922, 150472229, 151910204, 153163330]
3234A53163330R97467P98960N60487N40815N42912J44725j0472n13542p63203
3225A55461479j289506j706084j947482k349370k601719k893668k905846k607246
3217A37160558k419634k173095j751515j487811j152508p24934m41924n04005
3209A26505132m88322o00167p27813j045190j550085j886941k338570k381742
3201A15486302k725936k826543k838398k687443k560011k404973k283818k232879
3193I4926301j874670j928835j814943j966254j717672j660614j648707j705883
3185H0608723j661960j600831j618010j685816j639580j360695j398606j312682
3177F8330543j277698j174651j153874r03857q38479p21973n51392m93385m15894
$$ y = [153163330, 154160797, 154959757, 155520244, 156061059, 156603971, 156748696, 156738224, 156224682, 155461479, 154171973, 152465889, 150518407, 148169037, 145567318, 142673650, 139767804, 137160558, 134740924, 132567829, 130816314, 129328503, 128175995, 127451061, 127009137, 126505132, 126016810, 125416643, 124688830, 123643640, 122093555, 120206614, 117868044, 115486302, 112760366, 109933823, 107095425, 104407982, 101847971, 99442998, 97159180, 94926301, 93051631, 91122796, 89307853, 87341599, 85623927, 83963313, 82314606, 80608723, 78946763, 77345932, 75727922, 74042106, 72402526, 71041831, 69643225, 68330543, 67052845, 65878194, 64724320, 63820463, 62981984, 62260011, 61708619, 61215234, 60799340]
3168F0799340m35538l37197j98211N6411l0252l3937J21175K16973K78294M80817
3158F0917875N26429O78063Q02919J044031J322999J449090J582216J834720K125612
3149G2283954K358721K545995K992107L237378L461420L796179L946968M015489
3141I8638211M075734M122424L920082L688956L313998K967039K443413K015760
3133A25185617J650585J113033O01820K42251j65503m30866o22199r09086j086343
3124A25579309j098903j404609j634683j820429j928869k443477k740011k872937
3116A09635391l141616l314433l399030l368735l445132l349939l168220k974135
3108H3474151k710389k608059k244605j875587j755057j464573j166197r03756
$$ y = [60799340, 60363802, 60026605, 59828394, 59884805, 59854553, 59820616, 59941791, 60158764, 60437058, 60917875, 61444304, 62122367, 62925286, 63969317, 65292316, 66741406, 68323622, 70158342, 72283954, 74642675, 77188670, 80180777, 83418155, 86879575, 90675754, 94622722, 98638211, 102713945, 106836369, 110756451, 114445407, 117759405, 120726444, 123169857, 125185617, 126836202, 127949235, 128551055, 128793306, 128627803, 128196937, 127574738, 126665652, 125579309, 124480406, 123075797, 121441114, 119620685, 117691816, 115248339, 112508328, 109635391, 106493775, 103179342, 99780312, 96411577, 92966445, 89616506, 86448286, 83474151, 80763762, 78155703, 75911098, 74035511, 72280454, 70815881, 69649684, 68745928]
3100F8745928p25872n16953k48566K6996J52711K34461L50244K16079K61975K95868
3090F8792871K47120J19678l2670L8099r0979l92155n24283o05501p54835q23777
3080F5973568j008323r66293r60125r86287q82364p61413p96761o33342m33648
3071E8545012k60013j88985j15257P261j2625Q1143N2939M4056J36488J0224j21346
3060E8178897j66252l01053n15209o38824q74720j037919j111707j292023j493081
3051E0748109j501800j621732j588174j673288j617599j591248j613582j448079
3043C8092607j383419j361843j245807j097595j144837j232980r59349q26463
3035B8840314q00630p99790q19115n79919o24367n00315o70917n10190m89528
$$ y = [68745928, 68020056, 67503103, 67254537, 67281533, 67434244, 67668705, 68018949, 68235028, 68497003, 68792871, 69039991, 69159669, 69126999, 69165098, 69074119, 68681964, 68157681, 67552180, 66797345, 65973568, 64965245, 63998952, 63038827, 62052540, 61170176, 60408763, 59612002, 58978660, 58545012, 58284999, 58096014, 57980757, 57988018, 57975393, 58056536, 58109475, 58153531, 58290019, 58300243, 58178897, 58012645, 57711592, 57196383, 56557559, 55682839, 54644920, 53533213, 52241190, 50748109, 49246309, 47624577, 46036403, 44363115, 42745516, 41154268, 39540686, 38092607, 36709188, 35347345, 34101538, 33003943, 31859106, 30626126, 29666777, 28840314, 28039684, 27239894, 26420779, 25840860, 25216493, 24716178, 24045261, 23535071, 23045543]
3026B3045543m68872l36812m25041k67588k90296k88481k50987q4100j24071j63796
3016B0345499p8724j43029J25848J19325L1193J6695k9875Q8819J05684Q3988
3006B0665423J44803J49211k886J05108J56373j10377P2602K1584j09302p3737
2996B1018802j96908l04637k01445j63636k31081j93996k25693k22545l12086
2987A8966775j80763k49314j89885j08155j25357o1475r646m7022l4842O5382
2977A8025698O9737J8713K93J58049K32524J77982J68602J61161K35971K09583
2967A9458313J80838L86774J47701K27285K55207J69379L30671K91509K42995
2958B1690672K22532L33980L32399L24596L46842K86120K61717L58778K05948
$$ y = [23045543, 22576671, 22239859, 21814818, 21547230, 21256934, 20968453, 20717466, 20633366, 20509295, 20345499, 20266775, 20123746, 20249594, 20368919, 20400112, 20416807, 20386932, 20475751, 20581435, 20665423, 20810226, 20959437, 20956551, 21061659, 21218032, 21107655, 21180257, 21201841, 21092539, 21018802, 20821894, 20517257, 20315812, 20152176, 19921095, 19727099, 19501406, 19278861, 18966775, 18786012, 18536698, 18346813, 18238658, 18113301, 18051826, 18042180, 17995158, 17960316, 18025698, 18095435, 18114148, 18114441, 18272490, 18505014, 18682996, 18851598, 19012759, 19248730, 19458313, 19639151, 20025925, 20173626, 20400911, 20656118, 20825497, 21156168, 21447677, 21690672, 21913204, 22247184, 22579583, 22904179, 23251021, 23537141, 23798858, 24157636, 24363584]
2949B4363584J90029K67728K09746P9543J41700K66487K1170M4030l0639j8581
2939B5534797J57305N8936k4441Q4043J56705L8596J63666K44116K74004J49605
2929B6837332J66825J57180K43354K99945K98676K97365M17328M06137L21800
2920B9445942L41457M24163N09312N22296M70746M97948O14116O74156O90792
2911C4190928P00079P23732P77653Q82572R97294J104060J059448J201742J173584
2902D2811092J185979J355762J527597J540236J568353J629627J618356J738283
2894E4975285J836435J762022J837955J600498J655739J594918J637333J639277
2886F8539462J696665J681598J504559J507739J660372J653975J746800J938164
$$ y = [24363584, 24553613, 24821341, 25031087, 25110630, 25252330, 25518817, 25539987, 25584017, 25553378, 25534797, 25692102, 25751038, 25726597, 25810640, 25967345, 26005941, 26169607, 26413723, 26687727, 26837332, 27004157, 27161337, 27404691, 27704636, 28003312, 28300677, 28718005, 29124142, 29445942, 29787399, 30211562, 30720874, 31243170, 31713916, 32211864, 32825980, 33500136, 34190928, 34891007, 35614739, 36392392, 37274964, 38272258, 39376318, 40435766, 41637508, 42811092, 43997071, 45352833, 46880430, 48420666, 49989019, 51618646, 53237002, 54975285, 56811720, 58573742, 60411697, 62012195, 63667934, 65262852, 66900185, 68539462, 70236127, 71917725, 73422284, 74930023, 76590395, 78244370, 79991170, 81929334]
2878H1929334J756179J878253K077634K004139K029505K088922K012892J841129
2870I7617987J915307J834325J896894J941765K050964K316066K587243L052449
2862A15213000L410082L848773M382163M853100N062548M771679M197796L962493
2854A49701634L935080M328478M775515N380465O405325P721571R235321J0969692
2846B02453081J2682405J3994126J5061659J5587390J5214634J3498039R768372
2839B98259706M125301k340473p859107j1920332j4626609j6410585j7420599
2832B31807302j7283617j6293272j4998851j3253468j1864163j0619065r450540
2825A38044326q510540p826468p168666o515920n966791n463538m875882m457801
$$ y = [81929334, 83685513, 85563766, 87641400, 89645539, 91675044, 93763966, 95776858, 97617987, 99533294, 101367619, 103264513, 105206278, 107257242, 109573308, 112160551, 115213000, 118623082, 122471855, 126854018, 131707118, 136769666, 141541345, 145739141, 149701634, 153636714, 157965192, 162740707, 168121172, 174526497, 182248068, 191483389, 202453081, 215135486, 229129612, 244191271, 259778661, 274993295, 288491334, 298259706, 302385007, 300044534, 292185427, 280265095, 265638486, 249227901, 231807302, 214523685, 198230413, 183231562, 169978094, 158113931, 147494866, 138044326, 129533786, 121707318, 114538652, 108022732, 102055941, 96592403, 91716521, 87258720]
2817H7258720m165417l815351l739007l534264l374107l217040l024330k863207
2809E9525997k842196k501153k351972k246072k100329j886147j711246j488010
2801D2398872j412831j280637j270240j089983j050920j040029q32373q85805
2793C3536054o88719q55290p06677p63221p33414o90978p57258p04130p39005
2784B6897362n80738p66447p14813n16171p49068n13305n20175m75624n07797
2775B1553224l60096m52799l93114l34868l70950l97709l35044m33965l22201
2766A8152478l28995l90442k87075k53707k90499j81815j30114j74671k53017
2757A5862143k99505j74427j00507j96488k23568k31633k63426j18282j46143
$$ y = [87258720, 83093303, 79277952, 75538945, 72004681, 68630574, 65413534, 62389204, 59525997, 56683801, 54182648, 51830676, 49584604, 47484275, 45598128, 43886882, 42398872, 40986041, 39705404, 38435164, 37345181, 36294261, 35254232, 34421859, 33536054, 32847335, 31992045, 31285368, 30522147, 29788733, 29097755, 28340497, 27636367, 26897362, 26316624, 25550177, 24835364, 24319193, 23570125, 23056820, 22536645, 22061021, 21553224, 21193128, 20740329, 20347215, 20012347, 19641397, 19243688, 18908644, 18474679, 18152478, 17823483, 17433041, 17145966, 16892259, 16601760, 16419945, 16289831, 16115160, 15862143, 15562638, 15388211, 15287704, 15091216, 14867648, 14636015, 14372589, 14254307, 14108164]
2748A4108164j60371j21723j39652r5994j20837q9184q9890m6810L8025j33634
2738A3148094M6687L4663J10244K1481r908P8114J20974K11627J62691J47913
2728A4072580L8529R2849K79456K35320K33984K87121K44844L12082L82886K04226
2718A6383877M33643L06441L52841K72245K99828L53744K52647J94246J51824
2709A9001336n2405l5968j91193l28588l72194l66865l76846l72816l67516l84990
2699A6151955l79513k50220l55935m88205m09731l05342k77364m04264l77184
2690A2904197k83479l06608k33112l55710k50743k29340j48658j75796k09341
2681A0711410l47512k18928k46699k36232l58480k83267k94662k52582l15806
$$ y = [14108164, 13947793, 13826070, 13686418, 13590424, 13469587, 13380403, 13290513, 13243703, 13281728, 13148094, 13194781, 13229444, 13339688, 13361169, 13351261, 13429375, 13550349, 13761976, 13924667, 14072580, 14111109, 14203958, 14483414, 14718734, 14952718, 15239839, 15484683, 15796765, 16179651, 16383877, 16817520, 17123961, 17476802, 17749047, 18048875, 18402619, 18655266, 18849512, 19001336, 18948931, 18912963, 18721770, 18393182, 18020988, 17654123, 17277277, 16904461, 16536945, 16151955, 15772442, 15522222, 15166287, 14678082, 14268351, 13963009, 13685645, 13281381, 12904197, 12620718, 12314110, 12080998, 11725288, 11474545, 11245205, 11096547, 10920751, 10711410, 10363898, 10144970, 9898271, 9662039, 9303559, 9020292, 8725630, 8473048, 8157242]
2672H157242k31541j81511l32854j94833k65505j10886q8115j7001k06955j92174
2662F335867j05919l5082j43584q9304p7439j1202j90282n3396j44461J9870j18857
2651E386211j34608j06423k47441k1453p9034p0414l5070p5732r0729j4574n6494
2640D454239q2896j35475m7168K1195L8941k06509p7110N3337o4062L2927k41738
2629C745681p8154r0624Q4803k2139k3202m6333j71605l3274J48185o2916m8132
2618C402290J9190n0359l7380q0883m8272k064J84J3693N2965p077j02614j3605
2606C146068J81986Q409j85054r4967K9086M3335l5799L7284M2292l7403o4483
2595C070754Q7776Q369j36788l3473M0045j09914k4135m3590O311N6082M7445
$$ y = [8157242, 7925701, 7744190, 7411336, 7216503, 6950998, 6840112, 6751997, 6734996, 6528041, 6335867, 6229948, 6194866, 6051282, 5961978, 5884539, 5873337, 5683055, 5629659, 5485198, 5505068, 5386211, 5251603, 5145180, 4897739, 4876286, 4797252, 4726838, 4691768, 4616036, 4525307, 4510733, 4454239, 4371343, 4235868, 4188700, 4209895, 4248836, 4042327, 3965217, 4018554, 3954492, 3987419, 3745681, 3667527, 3576903, 3661706, 3639567, 3616365, 3570032, 3398427, 3365153, 3513338, 3450422, 3402290, 3421480, 3371121, 3333741, 3252858, 3204586, 3202522, 3202706, 3216399, 3269364, 3262287, 3159673, 3146068, 3328054, 3336463, 3151409, 3056442, 3085528, 3128863, 3093064, 3130348, 3172640, 3135237, 3070754, 3158530, 3166899, 3030111, 2996638, 3036683, 2926769, 2902634, 2859044, 2865355, 2921437, 2968882]
2584B968882k5897j9760n2360M0303m3612K9407K4690j07082R8657N4646p3695
2573B894179Q549J20550K2371l2112N0618J5685M8146J12007l0431J389J06200
2562C317151O6730J0913L9831N2879J41944m598M6065m5224n3581J2210j44073
2551C440247j40642M6259j08021r7413j18981n5903j33327L8422j35093n0554
2541B684994j44952L43K7703j35879o1679L767K081j23528j09667p474K2601j4326
2529B143984P4937n6182n7184k5916q1280m574j34354P2906N5037L6183p7548
2518A946009n1685J05985k1875o6690j72416L1695N3935j1045P0017j1292j4586
2507A858052j6881q899N5240l5612k2633l74L122j4215l9007j38421P8450P1916
$$ y = [2968882, 2942985, 2923225, 2870865, 2911168, 2867556, 2896963, 2921653, 2814571, 2913228, 2967874, 2894179, 2902728, 3023278, 3045649, 3013537, 3064155, 3079840, 3127986, 3239993, 3209562, 3210951, 3317151, 3383881, 3394794, 3434625, 3487504, 3629448, 3624850, 3670915, 3625691, 3572110, 3584320, 3440247, 3299605, 3345864, 3237843, 3140430, 3021449, 2965546, 2832219, 2870641, 2735548, 2684994, 2540042, 2540385, 2568088, 2432209, 2370530, 2374297, 2376378, 2252850, 2143183, 2135709, 2158310, 2143984, 2218921, 2162739, 2105555, 2079639, 1998359, 1993785, 1859431, 1932337, 1987374, 2023557, 1946009, 1894324, 2000309, 1978434, 1911744, 1739328, 1771023, 1824958, 1813913, 1883930, 1872638, 1858052, 1841171, 1832272, 1887512, 1851900, 1829267, 1828893, 1832015, 1817800, 1778793, 1640372, 1718822, 1790738]
2495A790738L416o5395Q5346P2598j08059N2654J66734j71200j53476j30194j0586
2484A532576N3406J0402N6282j40917j5111R9242M6465j25182L2609J6321r1893
2473A474200k3127m7860M8733q917P570l1841p3207N6476J2372j3926k4113k4693
2461A351667n0471q2967K8511n3130N3012m5151j37477n4540J4520P3116Q204
2450A105294L7234P7603N0097p2721J8813j12069R2799j18556j2061J5303q4123
2439I97613k2188N5932m5538p9116J09246k7360Q0190k4680p6107M9493K1796
2428A039281m3867k051r3131P8504K2941j05845r1783l5475J9242J594M1222o6362
2416G64270P1289R6717l0111J561j31502l1267P8810L3731o9729m276J8193q3779
$$ y = [1790738, 1794154, 1728759, 1814105, 1886703, 1778644, 1831298, 1998032, 1826832, 1673356, 1543162, 1532576, 1585982, 1596384, 1652666, 1511749, 1496638, 1595880, 1642345, 1517163, 1549772, 1566093, 1474200, 1451073, 1403213, 1451946, 1443029, 1450599, 1418758, 1345551, 1402027, 1414399, 1400473, 1376360, 1351667, 1301196, 1218229, 1246740, 1193610, 1246622, 1201471, 1063994, 1009454, 1023974, 1097090, 1105294, 1142528, 1220131, 1270228, 1197507, 1216320, 1104251, 1197050, 1078494, 1066433, 1081736, 997613, 975425, 1031357, 985819, 906703, 1015949, 988589, 1068779, 1044099, 967992, 1017485, 1039281, 995414, 993363, 900232, 978736, 1001677, 895832, 804049, 768574, 787816, 789410, 830632, 764270, 835559, 932276, 902165, 903726, 772224, 740957, 819767, 853498, 783769, 779493, 797686, 713907]
2404G13907J02147k7457l4482o9381j42763J21448M0833J764K4932l7280p0201
2393F23467j6546J28785k6132r9708k0613K7359J2395l6405K1555N664J00651
2382G20472o4943k9243l3628j9058P274M2614L4377m9080l0282m2353O1233k2667
2370E74716j17360O2150K0062K575Q027J31765j9448k7508j7239p2122l7422M2511
2358E50707J55941Q137j60908M826L0753r3077O9015J33190o1989l0306p630r4917
2346E03742O691O6416j3538k1222M5585r186P9306k1001p4397N7478N7839J8398
2334F96111j11693k8025m3628r9816Q8434R1908P165L7918p6154L6745M3111o8319
2322E73757J01505j29050J7658N9978n1802P5196o1955k6828L5068P423r8583
$$ y = [713907, 816054, 788597, 754115, 684734, 541971, 663419, 704252, 706016, 730948, 693668, 623467, 606921, 735706, 709574, 609866, 589253, 616612, 629007, 592602, 614157, 619821, 720472, 655529, 626286, 592658, 573600, 580874, 623488, 657865, 608785, 578503, 536150, 597383, 574716, 457356, 519506, 539568, 542143, 550170, 681935, 662487, 634979, 617740, 545618, 508196, 550707, 706648, 714785, 553877, 558703, 589456, 496379, 565394, 698584, 636595, 606289, 598659, 503742, 510433, 576849, 563311, 542089, 587674, 578488, 657794, 636793, 562396, 619874, 677713, 696111, 584418, 556393, 512765, 412949, 501383, 593291, 600456, 638374, 562220, 598965, 642076, 573757, 675262, 546212, 563870, 623848, 572046, 647242, 585287, 558459, 593527, 600950, 502367]
2311E02367R862N6200k6357m8808j00385Q8976j3096L4953m2976J2276K6108q7095
2299D12025P2801M758m0731O763L584j17797O0395P0503p9632L7663l8601K8746
2287D20477k9372p6394o231M9875J12712l2423L350o3078P0859p771q0742P4044
2275D35306l586O062N4675N3396o6061m0735j9655N4386o8228J4539r5374P3524
2263C98249N4390l5988n875K4372o5425j60006r118J58371J1867L7896p2865q765
2251C27103L2817K8205M7555P589p5016r5940M551P9211K6222L7445j0292k1705
2239C87745N6376m2428m671Q226N7210p9264j53931J82655N7157K649J0014q6524
2227C95214N5873O5875O0146J3733j16543p4965J1053n255j4432P4208P670o1788
$$ y = [502367, 512229, 568429, 542072, 493264, 392879, 481855, 468759, 503712, 460736, 473012, 499120, 412025, 484826, 489584, 448853, 455616, 459200, 341403, 401798, 472301, 392669, 430332, 391731, 420477, 391105, 314711, 308480, 358355, 471067, 438644, 441994, 378916, 449775, 442004, 361262, 435306, 431720, 437782, 492457, 545853, 479792, 439057, 419402, 473788, 405560, 420099, 324725, 398249, 452639, 416651, 410776, 435148, 369723, 209717, 200599, 358970, 370837, 408733, 335868, 327103, 359920, 388125, 435680, 443269, 368253, 272313, 276864, 356075, 382297, 419742, 409450, 387745, 444121, 401693, 397022, 405248, 462458, 383194, 229263, 411918, 469075, 471724, 481738, 395214, 451087, 516962, 577108, 590841, 474298, 399333, 410386, 405131, 390699, 464907, 472577, 410789]
2215D10789L8311o3394K1538n4025l2839P0201m359K0898M2189J1043l6749P6456
2203E00059m9401R4448K1078o5745l7630m5078J01826K2494P5432j68242K8911
2192D78152n3945M3621j7142r1587l7731J37450N3621r5596J0653N0234p2844
2181D04886L4707N4808P9048L7524j55130m7957P6046l9751P953k7856L2714L8301
2169D95293j6341j5776J3509J09504J9239k5195Q2720k8857m268n3327N0288l522
2157F23267r8581N7189P9852J6177J05362O5045j3256j30647M9015p3188L8511
2146G18746L6040O6536j3837j3668N1444m668j7539N4807R6154j37614L2788N8886
2134I28075J9723o7754l3948J4215N0606m502J127O6113P0350K5112m3409K5162
$$ y = [410789, 449100, 385706, 407244, 353219, 320380, 390581, 386222, 407120, 449309, 460352, 423603, 500059, 450658, 545106, 566184, 500439, 462809, 417731, 519557, 542051, 617483, 449241, 478152, 424207, 467828, 450686, 359099, 321368, 458818, 512439, 416843, 427496, 477730, 404886, 439593, 494401, 573449, 610973, 455843, 407886, 483932, 444181, 452134, 424278, 456992, 495293, 478952, 463176, 476685, 586189, 605428, 580233, 662953, 634096, 629828, 576501, 626789, 623267, 524686, 581875, 661727, 677904, 783266, 848311, 835055, 704408, 753423, 680235, 718746, 754786, 821322, 807485, 793817, 845261, 840593, 823054, 877861, 974015, 836401, 869189, 928075, 947798, 880044, 846096, 860311, 910917, 906415, 907542, 973655, 1044005, 1069117, 1025708, 1050870]
2122A050870J22899M5650M2354J8860M0057j5978J1260o0826j7496P8399J34575
2111A450624L0797R677J09520o0501l7503M7144O3967Q1131P6228J320J3513J96353
2099A982270J02312L740N3543R9547P2235O7452O3679J27904j08429J82756J81298
2088B828307R6886K15840K08935J9199J19040J21929J19095J77765J57053J40493
2078D204542L44005K75569K44235M13112M57861M18988N06421M00425N16804M52826
2068H234788N21521O48546P45455R41196J286058J564027J889739J998104K135793
2059A9965227K279955K687287K792028J199962q96128j879099k096257k145955
2051B1907020k314341k525962k425964k073777j660340j358556r97912p45226
$$ y = [1050870, 1173769, 1219419, 1261773, 1280633, 1320690, 1304712, 1315972, 1255146, 1237650, 1316049, 1450624, 1481421, 1491098, 1600618, 1540117, 1502614, 1549758, 1613725, 1694856, 1771084, 1772404, 1785917, 1982270, 2084582, 2088322, 2141865, 2241412, 2313647, 2381099, 2444778, 2572682, 2464253, 2647009, 2828307, 2925193, 3141033, 3349968, 3369167, 3488207, 3610136, 3729231, 3906996, 4064049, 4204542, 4548547, 4824116, 5068351, 5481463, 5939324, 6358312, 6864733, 7265158, 7781962, 8234788, 8756309, 9404855, 10150310, 11091506, 12377564, 13941591, 15831330, 17829434, 19965227, 22245182, 24932469, 27724497, 28924459, 28028331, 26149232, 24052975, 21907020, 19592679, 17066717, 14640753, 12566976, 10906636, 9548080, 8550168, 7804942]
2043G804942n36873o10804n40443m00564l76118l45204l62925k86775j70401k96751
2033C878084k58337l05376k10178m9410j21720k35689j98783j40613j07864j07013
2023B143101n1812n6957o6335q2229j47632j27042p0401L7567L0419j46970k6076
2012A435633P501k9496q5112j00661k0034O1134n3806l2446r8807j7452j5533
2001A050921k3079J5082l0607j1446P2730j44513j31124L1377J9896n7594p4481
1990G17162j2832M5814j5680q3478m3027L7308l2263N4956J737r0073J8560P7178
1978F75362j0913k7320j12066p469n5462Q6487m2076N4531j6640l1810J0687n8162
1966D65149L8944L4343j8225j17981P1981q9578j5376O3674q6416n9816J05339
$$ y = [7804942, 7268069, 6657265, 6116822, 5716258, 5340140, 4994936, 4632011, 4345236, 4174835, 3878084, 3619747, 3314371, 3104193, 3054783, 2933063, 2697374, 2498591, 2357978, 2250114, 2143101, 2091289, 2034332, 1967997, 1885768, 1738136, 1611094, 1540693, 1578260, 1608679, 1461709, 1435633, 1443134, 1413638, 1328526, 1227865, 1207831, 1268965, 1215159, 1182713, 1083906, 1066454, 1050921, 1027842, 1042924, 1012317, 1000871, 1073601, 929088, 797964, 829341, 849237, 791643, 717162, 704330, 750144, 734464, 650986, 607959, 645267, 613004, 667960, 669697, 579624, 598184, 675362, 664449, 637129, 525063, 517594, 462132, 548619, 506543, 561074, 544434, 512624, 523311, 465149, 504093, 538436, 520211, 402230, 474211, 384633, 369257, 432931, 346515, 286699, 392038]
1955C92038M511N294k6063l6290P5575p2047n8720R6058N286R040R864o1799j39960
1942B02787M1784Q9816L3586p0693M2826J6087r878L6681r407n7416M6703J2933
1930C75809l8658m193k9911r819k5181K9166m3981o316P2964n3494O5144n775
1918C25755r8476J4739K4648N405N5312k9943j45662P2116L4340O5535l0412q9533
1906B03824J05024O299j9998P9561r5426K4234O997k9403O9942j13252q8388J18698
1894B68112M0992m0706k880p974R597j40327K4484J09706K3082j40582L9305k7801
1882A55008j02264J4599J6526Q1772R2581P7702p1979j55405k8804K8192J0524
1871A18452K4952J85245j1780k8938o8071r2426M1460J22045j6049j8609R299
$$ y = [392038, 396549, 401843, 375780, 339490, 415065, 343018, 284298, 380356, 385642, 394682, 404546, 342747, 202787, 244571, 334387, 367973, 297280, 340106, 356193, 346315, 382996, 373589, 316173, 362876, 375809, 337151, 332958, 303047, 293228, 268047, 297213, 253232, 246916, 319880, 266386, 331530, 325755, 227279, 242018, 266666, 272071, 327383, 297440, 151778, 223894, 258234, 323769, 293357, 203824, 308848, 315147, 295149, 374710, 279284, 303518, 310515, 281112, 351054, 237802, 149414, 268112, 309104, 268398, 265518, 257544, 267141, 126814, 151298, 261004, 284086, 143504, 182809, 155008, 52744, 67343, 83869, 165641, 258222, 335924, 263945, 108540, 79736, 107928, 118452, 143404, 328649, 316869, 287931, 219860, 127434, 168894, 290939, 274890, 256281, 265580]
1860B65580j79944P1995K4118L9793j9114n8644O0500N9723l3305l1749r8588
1849A00365Q902l6376M625k6594J01860J3346M8663r101j2994K7772r1213M3330
1837A72585J4138L3117r3982L9721J8691R907p7464R3269p0135k9315j7238J08677
1825B01971l7969j21325J57812r903j5879O8426J1414L383p841o5843K8698O5807
1813B78751l5785p015k2993o3522K5739J1063k1272m4675j6875O6431J4558P630
1801A92035N6678O7939q479p3606j42675K2190J1031M8167j6k0885J04007M3755
1789C00141O0107M0250o5031K8150M3414j38689m2210Q8294J7212j12298J225
1778B20565r1670j3350N8489R0544m429l1916p5108J4980Q937n0628o7133o133
$$ y = [265580, 85636, 157631, 181749, 221542, 202428, 143784, 204284, 264007, 230702, 198953, 100365, 109267, 72891, 77516, 50922, 152782, 166128, 214791, 205690, 192696, 220468, 129255, 172585, 186723, 219840, 125858, 165579, 184270, 194177, 116713, 209982, 139847, 110532, 93294, 201971, 164002, 42677, 200489, 190586, 174707, 243133, 254547, 257930, 250089, 184246, 212944, 278751, 242966, 235951, 212958, 149436, 175175, 186238, 164966, 120291, 103416, 169847, 184405, 192035, 248713, 316652, 308173, 234567, 91892, 114082, 125113, 173280, 173264, 152379, 256386, 300141, 360248, 400498, 335467, 363617, 407031, 268342, 226132, 314426, 331638, 219340, 220565, 128895, 115545, 174034, 264578, 260149, 228233, 153125, 168105, 177042, 126414, 59281, 53148]
1766E3148K0117j3537m9480M9373j0583j8378L1351M8712R2586p0824M2439l4316
1754A40608n0226j4187q640N4581k1429l0897r4349J01928J55698o0236q5771
1743H7080n521j9943O2066n3345M5011q762k3234q8032j091P5157l4229l1600
1731C557J07891L3850K5286o2612m537p0761k1394M1283O8685p646o7982N8127
1719A03747J1447J0587j95522N2971L5291L9671j2012l1736n389R4667K2246l964
1707A22004o0191K3829M8890K360L5457L7625j81893p0970N2948L3516l2052j00141
1695h8618K7352L1192N8108L2087k3152l1629O0265k4158O4726q3888N953O7896
1683I6134m2287m4125K8635K6729p1775J6320m1974j5041K9645J0317J324o3800
$$ y = [53148, 73265, 59728, 10248, 59621, 49038, 30660, 62011, 110723, 203309, 132485, 174924, 140608, 90382, 76195, 67555, 122136, 100707, 69810, -24539, 77389, 233087, 172851, 87080, 81559, 61616, 123682, 70337, 115348, 106586, 83352, -4680, -5771, 69386, 35157, 3557, 111448, 145298, 170584, 107972, 103435, 32674, 11280, 52563, 121248, 113602, 45620, 103747, 115194, 125781, -69741, -16770, 18521, 58192, 46180, 14444, 9055, 103722, 125968, 122004, 61813, 85642, 134532, 136892, 172349, 209974, 28081, -42889, 10059, 43575, 11523, -88618, -61266, -30074, 28034, 60121, 36969, 5340, 65605, 41447, 106173, 22285, 28238, 96134, 53847, 9722, 38357, 65086, -6689, 9631, -32343, -47384, -17739, -7422, -6098, -69898]
1671f9898J62461R3784j53719N7408n7574l542L5295j2852j33387P7444N3411
1660D8831L4166n56p8727Q686K0656k27l102k1243J8302O2846r0019m0067P2387
1647C1933N973q053Q3741o8858O8636n8449k8183K1841j626l6866j6529Q2571
1635G6131P2053m4281o1637O8916K0350k5069l0315O7371r0189j07031M4603j654
1623a0752Q4062q2210O8953K369p0133m9110K2045N6334K1143n2463j5764P3032
1611D7506j96094J35631P3978J05173k0145m4572J670k8199J8988L3345O2239
1600A89520J2933q5727m8554j6157r1370P854j0329j2240L3139K2539N7944j24571
1588f5019M5107L1179l591R0956l0308K306p7862P0045j4425m3890j2995m8373
$$ y = [-69898, 92563, 186347, 32628, 90036, 32462, 28920, 64215, 51363, -82024, -4580, 48831, 82997, 82441, 3714, 12400, 33056, 32829, 29727, 8484, 26786, 89632, -387, -40454, 31933, 37906, 29853, 113594, 44736, 113372, 54923, 26740, 48581, 46955, 10089, -6440, 76131, 148184, 103903, 42266, 111182, 131532, 106463, 76148, 143519, 53330, -53701, -9098, -10752, 73310, -8900, 60053, 62422, -7711, -56821, -34776, 21558, 42701, -9762, -25526, 47506, -148588, -12957, 61021, 166194, 146049, 101477, 103147, 74948, 93936, 127281, 189520, 202453, 116726, 68172, 52015, -39355, -31501, -41830, -54070, -20931, 1608, 59552, -65019, -19912, 11267, 7676, 98632, 68324, 70630, -7232, 62813, 48388, 4498, -8497, -56870]
1576e6870P0701j950M3232k1077M8885Q630M7163o1348o4794j1886K4574K241
1564B7501p710l5682Q3453M2838j16398M1586m5261j760J38657P1139j50897o2730
1552a5264m208R6975l8774l6499K6377q9598n0001P490P3969l1593R5050M0030
1540G3954m2271k8424M467J3684K8070J27246k9205p7416M3376K0065J0977j4371
1528A30152r3739M8319L2294o047l9636j2433r5019R6207o6716K0012o766J1215
1516A7843O646K5101J2019O7555K4532r0128j7287k0188N9618r7384j17582J07764
1504b1491J11874J04437j80390j095J04076j2781m1184j44418k7511R5262P9873
1493F6652k9639n1692Q5734N7091p0237j25516q347N7464K3166n2625j9099J13154
$$ y = [-56870, 13831, 11881, 55113, 34036, 82921, 91551, 138714, 77366, 12572, 686, 25260, 27501, 19791, -15891, 67562, 110400, -5998, 35588, -9673, -11433, 127224, 198363, 47466, -15264, -19472, 77503, 38729, 2230, 28607, -60991, -110992, -103502, -29533, -61126, 33924, 73954, 31683, 3259, 7726, 21410, 49480, 176726, 147521, 70105, 113481, 133546, 144523, 130152, 36413, 84732, 117026, 110979, 71343, 58910, -36109, 60098, -6618, 13394, 6628, 17843, 24489, 49590, 61609, 129164, 153696, 63568, 46281, 26093, 85711, -11673, -129255, -21491, 90383, 194820, 14430, 13335, 117411, 104630, 63446, -80972, -108483, -13221, 66652, 37013, -14679, 71055, 128146, 57909, -67607, -75954, -18490, 4676, -47949, -67048, 46106]
1481D6106o6818n219M6134l2446L2865m1962K461M0442J1835k2481j34978j0207
1469a34268Q9874N9150P9783M2360j49875N3738K6236j0076N2462J6621j376k7853
1457I6776o1817o5987o9215P1860N4753j02444P9532M2280k0628K4839p1204p075
1445b8330K0527l8759P8746N1810k7604l9680M1734K9692j3257L9336j34399N613
1433a4571J1049K8439M5776M7309n2044K350O7001L6327j41517J8093l4330p3870
1421e9988O9233r42j0274k0057K0694N584o8747Q3441p1124l7734N9464M2832
1409A2382j1329J3679j6945J6467N7375m9642q9728Q6627l3952L5833j6321L7912
1397D2358K7603j04896m7755L5182Q0938m1136N7292j0005o7924k2914Q378j9104
$$ y = [46106, -20712, -25931, 20203, -12243, 20622, -21340, -18879, 21563, 33398, 10917, -124061, -134268, -44394, 14756, 94539, 136899, -12976, 40762, 66998, 56922, 109384, 126005, 124629, 96776, 34959, -31028, -100243, -28383, 26370, -76074, 3458, 45738, 25110, 49949, -21255, -28330, -7803, -46562, 32184, 83994, 56390, 16710, 58444, 88136, 74879, 114215, -20184, -14571, -3522, 24917, 70693, 118002, 65958, 68308, 135309, 171636, 30119, 48212, 13882, -59988, 9245, 8303, -1971, -22028, -1334, 4250, -64497, 18944, -52180, -89914, -30450, 12382, 1053, 14732, -2213, 14254, 71629, 21987, -67741, 18886, -15066, 20767, 4446, 42358, 69961, -34935, -82690, -47508, 33430, -7706, 49586, 39581, -28343, -51257, -42879, -61983]
1385f1983J2037N1299N3417p9205J914J2950N6278j9383l9565j20208j7603Q9361
1373f0691N9196J7645M054m500K8387j1788J7727l5274L933o3944j1929j6939
1361g4123K4499L8127L5581N678r9435k4073L9059q2668R1556K9069n8336o6528
1349a41594L5864J51645N4162k1299K974J1235o4547J37589j5464j15474r0635
1338e5544M9836J09257m3630k4429l5469j121R2645m4557o8323j6852M4278j6486
1326a0395m5619k0229P5970K5876q6650Q4015K6130q3043O8237O2567j1522l7005
1314D8332j25591m6200n0999O2001P1900O1721J9630m9911P0576j0213p8902l242
1302c0898r5823N718M2931k8959Q033P5228N3923k4127J16358K2845j08924m5554
$$ y = [-61983, -49946, 1353, 54770, -24435, -22521, -9571, 46707, 27324, -12241, -132449, -150052, -60691, -1495, 16150, 20204, 15704, 44091, 32303, 50030, 14756, 18689, -45255, -57184, -74123, -49624, -11497, 24084, 29762, -69673, -93746, -54687, -137355, -45799, -16730, -75066, -141594, -105730, 45915, 100077, 78778, 81752, 92987, 28440, 166029, 150565, 35091, -55544, -5708, 103549, 59919, 35490, 21, -1100, 91545, 46988, -21335, -38187, 6091, -10395, -56014, -76243, -273, 25603, -61047, 22968, 49098, -33945, 34292, 96859, 85337, 48332, -77259, -123459, -174458, -112457, -40557, 21164, 40794, -9117, 61459, 51246, -27656, -30898, -126721, -121003, -78072, -107031, -98998, -23770, 30153, 6026, 122384, 145229, 36305, -9249]
1290i249o3329l877M5130L8168M4693P0043j2571p7893O1380J0466n5749k3244
1278B3968L9789l2572p2300l396J42771n5656P4648Q618j34764J5039r8854Q8115
1266d594R9338j9223r4225L1481J35637r0637o9461L3009j24691J14557J00320
1255A11511k4587n9666L4192j1305M2068n1046p0387J7557J14958O8131j05953
1244F5473l2740j8202L1971k1851J7605P1139K2389M570j04289o8881P4059M0646
1232H1889j3108r2599m113J6706O6999n2939j8889J14804p9494n4386k3058J9597
1220c8591m41J13907N2162q1436J04217l3525j05217j5462l359j43917k1765N5820
1208a17607R9102N6242m0528O9131n4568J0319J58804K3275p189j35355j3920
$$ y = [-9249, -72578, -76455, -31325, 6843, 51536, 121579, 109008, 31115, 92495, 102961, 47212, 23968, 63757, 31185, -41115, -44511, 98260, 42604, 117252, 125870, -8894, 6145, -92709, -4594, 94744, 75521, -18704, 12777, 148414, 57777, -11684, 21325, -103366, 11191, 111511, 86924, 27258, 61450, 50145, 92213, 41167, -29220, -11663, 103295, 171426, 65473, 32733, 14531, 46502, 24651, 42256, 113395, 135784, 140354, 36065, -32816, 41243, 81889, 68781, -23818, -27931, -11225, 55774, 2835, -16054, 98750, 19256, -35130, -58188, -38591, -39032, 74875, 127037, 45601, 149818, 116293, 11076, -4386, -7745, -151662, -173427, -117607, -18505, 37737, -2791, 66340, 11772, 22091, 180895, 204170, 196981, 61626, 47706]
1197D7706M204N000p6496l4927O4984N7275j13412J3209M2491M0754k1861l5245
1185f318l0406L8458L6276K5933m2973o351K4887l1434k6287L2718L0581j3061
1173C2023L7593q6395O1039P979N4384L3981k5910k9534j1012J22n2821N6032
1161G7481l1332k2525Q605L2515l4391q1180M3723l2455j0100P4125r332r56L8018
1148E2196P6333r9849l4116O747l1621M3008Q1317n292j07165j7082j6936J4980
1136c7480p113O7588M1947j19470q4650K6675O0817J00725o4533R5762j9206r8141
1124c7079o4679l0595R4812K4717l6741R096P778J25944j5038k3512j18990r759
1112g4046N7155R8852r2760n0826K8965O7307M4694q3076K923O0922n8296r3130
$$ y = [47706, 51910, 56910, -19586, -54513, 10471, 67746, -45666, -32457, 10034, 50788, 28927, -6318, -36724, 1734, 38010, 63943, 20970, 14619, 39506, 8072, -18215, 14503, 45084, 32023, 69616, -16779, 44260, 52239, 106623, 140604, 114694, 85160, 74148, 74270, 21449, 77481, 46149, 23624, 32229, 64744, 30353, -50827, -7104, -39559, -49659, 24466, 15134, 14178, 52196, 128529, 28680, -5436, 1311, -30310, 12698, 94015, 88723, -18442, -35524, -52460, -37480, -44593, 22995, 64942, -54528, -139178, -112503, -51686, 49039, -15494, 80268, 61062, -37079, -101758, -132353, -37541, -12824, -49565, -40469, -32691, 93253, 78215, 54703, -64287, -74046, -16891, 81961, -10799, -61625, -32660, 34647, 79341, -3735, -812, 60110, 1814, -91316]
1100i1316O1710k1893m6461k1449Q8521o4065K272P5927k7593P8631P703J111
1088D3098m5515M1648Q7056l7369p5235M939j0543J3336M2292k3389p0787M2207
1076A1738Q0389p6918k9434J24234q2552j37973O8911K3858k0158j6882K9237
1065b5550J685O5401P1411k0070j03751j05964J32433m4775P701R8199j4054j5332
1053D7334r5406p9497N9579K3395K3908L3264r9351J08486l6433r0109o2784M6995
1041a20619K6599m550R6104K7376M6021r7870n1948k2212n4175R6422M6666l2123
1029d4309l6838M3085j24033J46672n7036k2372l5803Q5220k8799N0810M3128
1018A9725K6628k1382r0836L0827R1826N2769o2244j29852J2145L6985m4534M5534
$$ y = [-91316, -29606, -51499, -97960, -119409, -30888, -94953, -92681, -16754, -44347, 34284, 41987, 43098, -2417, 39231, 126287, 88918, 13683, 18622, 8079, 21415, 63707, 40318, -30469, 11738, 92127, 15209, -14225, 110009, 27457, -110516, -41605, -17747, -37905, -54787, -25550, -23865, 41536, 112947, 92877, -10874, -116838, 15595, -29180, -21479, 76720, 62666, 47334, -48072, -127569, -67990, -44595, -20687, 12577, -86774, 21712, -14721, -104830, -167614, -120619, -94020, -98570, -2466, 24910, 70931, -26939, -78887, -101099, -155274, -58852, -12186, -44309, -81147, -38062, -162095, -15423, -72459, -94831, -130634, -45414, -74213, -23403, 19725, 46353, 24971, -65865, -35038, 56788, 109557, 47313, -82539, -70394, -33409, -77943, -32409]
1006c2409K7081k4401L2242K3316m5366K0520p5985M0642k8576L8706Q8158l0274
994C3654k8392J13073K0796k0263l440r5435q0551R5283n7593l5472q884M8155
982a9069N2127j8699o6494j1780l8128m1938Q8410L0257J0033L2523j1699n6253
970e0710j398O6582L550n2597k4059P086L3363L7605P5163j82656m6542J49568
958A4955J8206n4328L9177m138n2587L1211L6336P806k02858k6568R5554R4364
946b870q6043L570L8533P9536J06168j79001k3374J24921p1262O9151r80q7509
934b9160M2307j01607N7727J50895N6114o0806j51571Q2630m131n8833j0961K3180
922d216J3389j7347l1664k0373j1500l3927P5538J7834l5513N943q3669O5302
$$ y = [-32409, -5328, -29729, 2513, 25829, -19537, 983, -75002, -34360, -62936, -24230, 63928, 33654, 5262, 118335, 139131, 118868, 115428, 19993, -60558, 34725, -22868, -58340, -67224, -19069, 33058, 14359, -52135, -63915, -102043, -143981, -55571, -25314, -15281, 17242, 5543, -50710, -52108, 14474, 18024, -34573, -58632, -51546, -18183, 19422, 94585, -88071, -134613, 14955, 33161, -21167, 18010, 13872, -38715, -7504, 28832, 36638, -166220, -192788, -97234, -2870, -88913, -85343, -46810, 32726, 138894, -40107, -63481, 61440, -9822, 59329, 58349, -29160, 13147, -88460, -30733, 120162, 176276, 115470, -36101, 46529, 42398, -16435, -27396, -4216, 9173, -8174, -39838, -60211, -71711, -105638, -30100, -12266, -47779, -41836, -125505, -60203]
910f0203M7013l724L7140j6927n0716j2970L282n057k2920l4357R3265K1147j9507
897b4534P2028O239J1167k4878k9664j3078L2109l9318j07977j9235j20142N0519
885b06764J01996J00151n7576r157K2213J7974L1195j7803P9105k1159q1453o5966
873a07244P5974J7069K2009r5719k1951J38121j4322q4638M5636J01120j9308
862E6747L3332m5117j35700l3223N871n1746P1151O2026N0026m1547M3754M9807
850F5381n6124q2239Q4668J29230r2684K2333Q1768k4720n6810j3648J1226j25862
838e7481M6805M2782j0807K9269K0205P798k8176l9476n5824M6523N0096k7276
826B4438N7386j4368j02904P3602J06778m7754j60107n0437o960J1041q6589J61996
$$ y = [-60203, -13190, -16914, 20226, 3299, -47417, -60387, -57105, -62162, -85082, -119439, -26174, -5027, -24534, 47494, 53733, 64900, 40022, 10358, -2720, 29389, -9929, -117906, -137141, -257283, -206764, -104768, -4617, -62193, -71350, -49137, -31163, 32, -17771, 61334, 40175, -41278, -107244, -31270, -14201, 7808, -87911, -109862, 28259, 13937, -70701, -25065, 76055, 56747, 90079, 44962, -90738, -123961, -118090, -169836, -98685, -36659, 13367, -28180, 15574, 65381, 9257, -72982, 11686, 140916, 48232, 70565, 152333, 127613, 70803, 57155, 68381, -57481, -10676, 32106, 21299, 50568, 70773, 78571, 50395, 10919, -44905, 1618, 51714, 24438, 81824, 67456, -35448, 38154, 144932, 97178, -62929, -113366, -120326, -109285, -195874, -33878]
814c3878J67386n0964j502N5942n254p1037K5031m980K4750j19790J0188J50775
802A46667j67409p8508J54887j9669m2279N8894K9892j636o0006j53567R3361
791c9373M7295L7849L555k1866j4209M1867j10080l8217Q8753o4923J32500l970
779E9181n5208J2156n8348J0042O8026r3194L6395J30063l4338K6132j16227m6149
767f1469L6196K1085N7838j16136k4173R850O7258J1122M7076m6129p097J41816
755A37237n3389j41402q3584J69978L5084j33995J9306J3387l9459O1509J1621
744c707M579n5408L8073L9452n5594l659N6230p5224k130Q8534q8571J29796r2213
731a9842l0592k2003p3812j121M3519j6239Q2786j2636o3114O8784l123l9606
$$ y = [-33878, 133508, 82544, 81042, 136984, 131730, 60693, 85724, 80744, 105494, -14296, -4108, 146667, -20742, -99250, 55637, 35968, -6311, 52583, 82475, 80839, 20833, -132734, -39373, 7922, 45771, 49326, 27460, 13251, 55118, -54962, -93179, -4426, -69349, 63151, 59181, 3973, 16129, -42219, -32177, 35849, -57345, -20950, 109113, 74775, 100907, -15320, -61469, -25273, -4188, 53650, -62486, -86659, -76809, -9551, 1571, 48647, 2518, -4579, 137237, 83848, -57554, -141138, 28840, 63924, -70071, -50765, -37378, -76837, -15328, -3707, 872, -54536, -16463, 22989, -32605, -36264, 19966, -55258, -57388, 31146, -57425, 72371, -19842, -50434, -72437, -146249, -147370, -103851, -120090, -37304, -49940, -113054, -44270, -47393, -86999]
719h6999O4652n5500K7355l4339K3551L8552k532n054P2802q7580L0562L4243
707A9713k5645K852L0043O9731n6163j02325k2417M5156J9642J02130q8922l4313
695d0518P272N2980K4633M6673r2529L3326N236o931m1848J3438L8664m853k218
682C3325j02118o5290P1608m8770J05480j2071q2017J41382m9019m0488M3338
671d640k942O2218J504j516k9566p7085l0939J6124K8231P3751j1723j8684M8687
658E3420P7750r7608o8489j8970J05802Q2076j9349p6959m5265O6866q0224r803
646c0753n8759m9456J4131P1216N571o5859O1480N560p3380P9337Q455R154M3091
633A9788m3860J5470J0667j2615M6787l4533n7959r4355P1952R4398n0493j52332
$$ y = [-86999, -22347, -77847, -50492, -84831, -61280, -22728, -25260, -30314, 42488, -45092, -14530, 19713, -5932, -3080, 26963, 96694, 40531, -61794, -84211, -39055, -19413, 82717, -6205, -40518, -33246, 19734, 44367, 91040, -1489, 31837, 37073, 30142, -11706, 1732, 40396, 35543, 33325, -68793, -134083, -62475, -111245, -5765, -17836, -99853, 41529, -7490, -47978, -4640, -7582, 54636, 56140, 54624, 25058, -52027, -82966, -66842, -38611, 35140, 23417, 4733, 53420, 131170, 33562, -34927, -53897, 51905, 133981, 114632, 37673, -7592, 59274, -20950, -30753, -89512, -138968, -124837, -53621, -48050, -113909, -52429, -46869, -120249, -40912, -32457, -23303, 19788, -24072, -8602, 2065, -10550, 36237, 1704, -56255, -150610, -78658, 15740, -34753, -187085]
621a87085N6206Q2059n62j6432j2785j1621n1386P4562q4738L4605Q1847j14586
609a49916O6853o289L028j1788N6857q2616q438J21828Q80J410j4298J23276q7824
596A2963n9282o5286P5782L2859r6615J06551M5083k1360m2099q438l7566j9050
584g6458m8843P2100M7532o9595P3679R1082K8725p8633L808m7897k1337q0090
572a05927N4625q4232L89L1279P3841J3027m8946R4975j333n2265L6611M3374
560E5418J1685O0709j49425P213O2929p1206P8299K5338K9435q5131K7489Q2750
548A35503j4563p9367L6945k5905j64777r1761M9315K11002l6754j2913K4252
537C0977p207k0345M5304q7094p671m7975M2824O9415J1672K0216j9107P799K8508
$$ y = [-187085, -130879, -48820, -49382, -65814, -78599, -90220, -141606, -67044, -151782, -117177, -35330, -149916, -83063, -89352, -86324, -98112, -41255, -123871, -132309, -10481, -9601, -8191, -22489, 100787, 12963, -46319, -111605, -35823, -2964, -99579, 6972, 52055, 30695, -11404, -19842, -57408, -76458, -125301, -53201, -5669, -75264, -1585, 89497, 118222, 39589, 43397, -4500, -25837, -105927, -51302, -135534, -135145, -103866, -30025, -16998, -65944, 29031, 27698, -24567, 12044, 55418, 67103, 127812, -21613, -14400, 48529, -22677, 55622, 80960, 110395, 25264, 52753, 135503, 120940, 41573, 78518, 52613, -112164, -203925, -154610, 56392, 19638, 6725, 30977, 23770, 3425, 48729, -38365, -46036, -94011, -51187, 18228, 29900, 50116, 31009, 38808, 67316]
524F7316q9859K4495J5731n6487N0223K6903l5376p8243P563r682R8589k5124
512c951j7320l474o1176K6125N4607l6194n8551k2011M6446K3033o3720Q6368
500b9818Q9773N5261r7331P402q4908q2705L2271P6166j72Q6640r3105j9140N2814
487f852L2456n1627n9358J33169P0402l5550j06449P1574N5209n6311P1155j04340
475A3478q1042N6687L1630K6524k8811m2372p0710k4478J7281P7775L1421K2401
463B9784n2857k6257o1834O1300J72799k3069j53351k6367k6018P9057j4384P4506
451C3309J0211j04356J7332o01J2624R3582k6106j08218l6852M643J16326J1019
439B2913L1007j6983k5866j01469J6676Q1961o3707o354N2331j188o0283J4581
$$ y = [67316, -22543, 1952, 17683, -38804, 11419, 38322, 2946, -75297, -67734, -77416, 21173, -3951, -21271, -24745, -85921, -59796, -5189, -41383, -99934, -121945, -75499, -52466, -116186, -29818, 59955, 115216, 17885, 25287, -59621, -142326, -110055, -33889, -34061, 52579, -40526, -59666, -6852, 25604, -26023, -85381, 47788, 118190, 82640, -23809, 47765, 102974, 46663, 117818, 13478, -67564, -10877, 20753, 47277, 18466, -23906, -94616, -119094, -101813, -24038, 7383, 29784, -23073, -49330, -111164, -49864, 122935, 99866, -53485, -79852, -105870, -26813, -41197, 33309, 43520, -60836, -43504, -44105, -31481, 62101, 35995, -72223, -109075, -104432, 11894, 22913, 53920, 36937, 11071, -90398, -73722, 8239, -55468, -61822, -9491, -10679, -70962, -56381]
427e6381l6637o0010K9621O8364j5247l2219L0637m455J4343J3913l0566J04895
415B6258M4280n4931o4530j4010q653J12900O2297l4512r5733j7873R1696J3011
403F0200M041k7753n0005QK3129q119j7137L5219o2264J20422K970n5681P5367
390A00397Q661q0347q9744J0194L3003J0792m2380l8062Q3645q414j9431o9764
378a01450j619K080l5431O2308m63O4599P9641l2062K6748o747l324l8393L362
365A9249n8517P5493j6903k7700K9714N5346j5593J2471k5480j03574N5446l1478
353c1526N6043J1339r2095L8738N8174r866j9293r387O6635j10145J7218m2154
341f6319R4630l8569N824N5641N3281k5929K2523m1799N960M9506o2803l6730
$$ y = [-56381, -93018, -153028, -123407, -55043, -70290, -102509, -71872, -76327, -61984, -48071, -78637, 26258, 70538, 15607, -48923, -62933, -71586, 41314, 103611, 69099, -26634, -44507, 47189, 60200, 64241, 36488, -13517, -13509, 9620, 1501, -15636, 19583, -42681, 77741, 80711, 25030, 100397, 109058, 28711, -61033, -50839, -17836, -7044, -49424, -87486, -3841, -12255, -31686, -101450, -103069, -100989, -136420, -74112, -74575, -9976, 69665, 37603, 64351, 57604, 54280, 15887, 19249, -39268, 36225, 19322, -8378, 21336, 76682, 61089, 73560, 48080, -55494, -48, -31526, 24517, 35856, -56239, -17501, 40673, 30807, 11514, 2127, 68762, -41383, -24165, -66319, 28311, -10258, -4434, 51207, 104488, 78559, 101082, 59283, 65243, 114749, 51946, 15216]
329A5216p255K5939M4869j3589n2266n5085K9539J7779j2708P819O8523p0409
317a628j7646m4224Q6311O0910j4308L2899p71k8887j28945p3973J36780L1558
305C8076k0223J25521o7033k393l8224l512l9021o8479R3547K0493q289m3024
293a2561n7637M3474j124m6718k8128k2764K0027L5655P3870q433J5507n0412
281c9244K8449j8015q0475P8437N0022Q436n8672K9933j0559N012n5403r940q715
268h0734l6913M4641N2702R6011K0956q9621M6303j6518M870k4585m5856K5563
256c181o7091O5709J6363n3112K9380n0730L3367M0673M662J8395K1391M6996
244A02822J5086M3913q3274j20211L7133j9900Q5319k6233K0018k6092r2378M5063
$$ y = [15216, 7961, 33900, 78769, 65180, 12914, -42171, -12632, 5147, -7561, 258, 68781, -1628, -19274, -63498, 22813, 83723, 69415, 102314, 101543, 72656, -56289, -130262, 6518, 38076, 17853, 143374, 76341, 73948, 35724, 32212, -6809, -75288, 18259, 38752, 30463, -12561, -70198, -26724, -27848, -74566, -102694, -125458, -105431, -69776, 4094, -4339, 11168, -39244, -10795, -28810, -109285, -30848, 19174, 27610, -31062, -1129, -11688, -6676, -62079, -72019, -80734, -117647, -73006, -20304, 75707, 96663, 7042, 53345, 36827, 41697, 17112, -28744, -3181, -70272, -4563, 11800, -41312, -11932, -62662, -29295, 11378, 16040, 34435, 55826, 102822, 117908, 161821, 78547, -41664, -4531, -24431, 60888, 34655, 54673, 28581, -63797, -18734]
232a8734J8922L80M3042N2722l1062r0977M5801J0647o7227q665j1552O4008l2865
219b5560m8808q4776R8357J19945L1558N929r6408P4993j01380J2945k7139M0984
207F40j1494M8244k8224J5935L5378k5132J3336j36548j4833L5683k833N2975
195a6873k2917J3434R059L4428J8417n3891m8542K088J07797l696J7063o1239
183d872n9146P0790Q7646j1701L699j5236k0769l6417j3678l8129M1909o227o3683
170f5814M771O7176m7883P8083N0993q0200j01054K8457O0296j6061l2920J9128
158c5028l7676Q7395k9639n9356R9448l6285l0847L3196L9509J5094l2042k7391
146a3622J9159r899m9611j9192M7801J02291O6129j07501m1560p2866N0919k5881
$$ y = [-18734, 188, 568, 43610, 96332, 65270, -25707, 20094, 30741, -36486, -45151, -56703, 7305, -25560, -74368, -159144, -60787, 59158, 90716, 96645, 237, 75230, -26150, -13205, -40344, 640, -10854, 37390, 9166, 25101, 60479, 35347, 48683, -87865, -102698, -67015, -69848, -16873, -39790, -26356, -17297, 17131, 35548, -18343, -66885, -64797, 43000, 39304, 56367, -4872, -64018, 6772, 94418, 82717, 86416, 71180, 50411, 13994, 316, -37813, 4096, -2131, -65814, -61043, 6133, -41750, 36333, 87326, 7126, -93928, -65471, -5175, -21236, -54156, -35028, -72704, 14691, -14948, -74304, 25144, -11141, -41988, -8792, 30717, 45811, 13769, -13622, 5537, -4362, -53973, -73165, -25364, 76927, 143056, 35555, -6005, -78871, -27952, -53833]
134e3833m920J21820P88r83O5210m8340o5887j4142K9252j1584K4447L7966o2119
121A7675R936k8888k2430k3313M4333J5124j2212j13143P7006N1422m7927L6756
109D339j0509l2190N5753M090l1737P877J678M0343M21n2646K8157k4197j1677
96b0298J6120r751J4416l4748J4242r383j2009j8970m6278J3448r636N1465J55897
83A04515k8759j10163r725O998j9642m3625P0450j8446K961K1120O930M1358j7001
70F971l8268j1930O8579l8084J0267k880O91L6885P783j5190m6125q633n102m0173
56g5209K0312J7292J6269k0897l0205N5344N1894N1912j7518M8294L0410j29430
44A8468K3863l9885J2658J2894m5719Q842k6826l3247J36416j5304n743l0862
$$ y = [-53833, -58753, 63067, 63855, 62872, 128082, 79742, 13855, -287, 28965, 17381, 41828, 79794, 17675, 27611, -1277, -23707, -47020, -2687, 12437, 225, -112918, -35912, 15510, -32417, 4339, -6170, -38360, 17393, 21483, -10254, -2377, -699, 39644, 40065, -12581, 15576, -8621, -20298, -4178, -13929, 487, -34261, -20019, -29402, -41411, -60381, -106659, -93211, -102847, -51382, 104515, 75756, -34407, -44132, -37134, -56776, -100401, -29951, -48397, -45436, -24316, -17386, 23972, 6971, -31297, -43227, 25352, -12732, -2465, -5345, -4654, 32231, 40014, 24824, -21301, -29934, -35036, -75209, -54897, -37605, -21336, -42233, -72438, -17094, 34800, 86712, 69194, 117488, 147898, 18468, 42331, 2446, 15104, 27998, -17721, -8879, -35705, -68952, 67464, 52160, 46417, 15555]
32A5555k1445k613k8500j0018n4039R5273M6086k2144p6561K1121l3746L3166
20c7865O6477l7076j9832k1238N4359J415m1913R503j09028M1726Q3057m4639
8e5054P3953N7728l7160p0504m2708L8628L6519J02167
0A03569
$$ y = [15555, -5890, -8503, -37003, -47021, -101060, -5787, 40299, 18155, -58406, -37285, -71031, -37865, 28612, -8464, -28296, -49534, 4825, 6240, -35673, -26170, -135198, -93472, -10415, -55054, 18899, 76627, 39467, -31037, -73745, -35117, 1402, 103569]
$$ Imaginary data points
##PAGE= N=2
##DATA TABLE= (X++(I..I)), XYDATA
16383b278859O2163N3226l425r84Q1336L3880L8297O2752K2295M1278K2804n3609
16371a918846J06923P9625j1435j0321M4376R3130L1424K9053J6818R3010K3424
16360a422819j1957m886L6930o0794N6628L3673m912O4298l5674J36672J8831
16349a194010L6989l0991r311R4618J09627j4757j0471j5493K5552J17718L5706
16338h54823o676K4642m842l4009P0883K8945J5554P1941N7368j7588P9739m731
16326e73597l8332O5828k2256L583J51055j5300j325L544P3708Q1771N1548j5733
16314b35506l489j3440P9204P911q8424J3030K56N113J07812l661O5512P2977
16302G295K3526R1640M2522p5894N0519O9440p1075M8536Q947Q718K3504J01677
$$ y = [-2278859, -2216696, -2163470, -2166895, -2167879, -2086543, -2052663, -2014366, -1951614, -1929319, -1888041, -1865237, -1918846, -1811923, -1732298, -1743733, -1754054, -1709678, -1616548, -1585124, -1556071, -1539253, -1446243, -1422819, -1434776, -1439662, -1402732, -1463526, -1406898, -1373225, -1378137, -1313839, -1349513, -1212841, -1194010, -1157021, -1188012, -1197323, -1102705, -993078, -1007835, -1018306, -1033799, -1008247, -890529, -854823, -861499, -836857, -841699, -875708, -804825, -775880, -760326, -688385, -631017, -648605, -568866, -573597, -611929, -546101, -568357, -564774, -413719, -429019, -430344, -426800, -353092, -271321, -219773, -235506, -238995, -252435, -173231, -165320, -253744, -240714, -240458, -235345, -127533, -131194, -65682, 7295, 30821, 122461, 164983, 89089, 139608, 209048, 137973, 186509, 195456, 204174, 227678, 329355]
16290C29355j7168M1391O5860J045Q2178q398l243O710L6859M4210m5501j7373
16278E15925J4504k0804j878Q0339L119J17591M729M6167k7526m9672M9091J999
16266G33584P6070Q68r683P7601N4159l2510j8537P599n5671O6599O1154P672
16254I68905O8736J7772P219k2301j3192K7306J7199O1574O5031j9115k3211J47342
16242A303265m2010J98o5894q1630L8433R1169P1273q015K6519n7571J6651J07520
16230A399908N1227k7657o4886l2801J02870O5529N9400j04032N3722N131L5751
16219A544162K1802l6758p3402O7835L9162P5034l8467j1954P0541j4365j5652
16208A627938q9242k7104K0617L262K8177J17030M1202n2156L1786N0020n4157
$$ y = [329355, 312187, 353578, 419438, 420483, 502661, 494263, 491020, 497730, 534589, 578799, 533298, 515925, 530429, 509625, 507747, 588086, 591205, 708796, 713525, 759692, 732166, 682494, 731585, 733584, 809654, 810522, 800839, 878440, 932599, 900089, 881552, 889151, 833480, 900079, 961233, 968905, 1037641, 1055413, 1062632, 1040331, 1027139, 1054445, 1071644, 1133218, 1198249, 1179134, 1155923, 1303265, 1261255, 1261453, 1195559, 1113929, 1152362, 1243531, 1314804, 1306789, 1333308, 1275737, 1292388, 1399908, 1451135, 1423478, 1358592, 1325791, 1428661, 1494190, 1553590, 1449558, 1503280, 1508411, 1544162, 1565964, 1529206, 1455804, 1523639, 1562801, 1637835, 1599368, 1587414, 1657955, 1643590, 1627938, 1538696, 1511592, 1532209, 1535471, 1563648, 1680678, 1721880, 1669724, 1701510, 1751530, 1697373]
16197A697373K6584N7911k9843K3546M9301m1375P8909o0242N8060M3649j6282
16186A887591M3571M6093l7573n2697M0945j1819M7214K0517k7954N5446K8666
16175B040000N0650J5241j07141l3965L9157j8061k0555L5398L3001r5244L1574
16164A970055J73M2019L569L798N1952P8170p5160O7694m5032o8463J25812m2546
16152B112041k5748l4934J18490J527j3381n7603L7340p609j8796N2459J2394
16141B176180n1427J3877Q0888j7099P783M1582j8702k5336J5434N0721p6340
16130B197561J3847l0050n6318N4283M5942J01373M7306O01r3119P7772m6170
16119B313028j1880O5613q382o5379q9443L6417K6826L1752N0217o725j1022l5207
$$ y = [1697373, 1723957, 1781868, 1752025, 1775571, 1824872, 1783497, 1862406, 1802164, 1860224, 1903873, 1887591, 1931162, 1977255, 1939682, 1886985, 1927930, 1916111, 1963325, 1983842, 1955888, 2011334, 2040000, 2090650, 2105891, 1998750, 1964785, 2003942, 1985881, 1965326, 2000724, 2033725, 1938481, 1970055, 1970228, 2012247, 2015816, 2019614, 2071566, 2149736, 2074576, 2142270, 2097238, 2028775, 2154587, 2112041, 2086293, 2051359, 2169849, 2171376, 2157995, 2100392, 2137732, 2130123, 2111327, 2163786, 2176180, 2124753, 2138630, 2219518, 2202419, 2210202, 2251784, 2233082, 2207746, 2223180, 2273901, 2197561, 2211408, 2181358, 2125040, 2179323, 2225265, 2326638, 2373944, 2374545, 2281426, 2359198, 2313028, 2301148, 2366761, 2358379, 2293000, 2203557, 2239974, 2266800, 2298552, 2348769, 2342044, 2331022, 2295815]
16107B295815l7781L2848Q657L5655r4425k5596M5764k2894M7357j6006K8165
16096B297559n6090J4331O6190l3431O8265J03401r0109K7220P153n1399m0668
16085B312422j8950J06255k9272k1592j9932J07600n4156J7584j9914r2143j3118
16074B274784J1818K6788m4100J91107P917p1465k1621J8852J6877o1274O2307
16063B411990L9149n5913N4160j1715q5505l0699K8940j01025j14M6917k3768
16052B272417J51212j3071n0963k5691O1984q899j66527J8799J74842n86K4517
16041B438034m2388J8974K1698m7836p0458N8203J00392r5423m0952L7868l5999
16030B342113O0396q129k5940p6860j1265K3952J11906k0785m1356J9741O0491
$$ y = [2295815, 2258034, 2290882, 2299539, 2335194, 2240769, 2215173, 2260937, 2238043, 2285400, 2269394, 2297559, 2241469, 2255800, 2321990, 2288559, 2356824, 2460225, 2370116, 2397336, 2404489, 2353090, 2312422, 2293472, 2399727, 2370455, 2348863, 2328931, 2436531, 2382375, 2399959, 2380045, 2287902, 2274784, 2286602, 2313390, 2269290, 2460397, 2468314, 2396849, 2375228, 2394080, 2410957, 2349683, 2411990, 2451139, 2395226, 2449386, 2437671, 2352166, 2321467, 2350407, 2249382, 2249268, 2296185, 2272417, 2423629, 2410558, 2359595, 2333904, 2395888, 2386989, 2220462, 2239261, 2414103, 2413517, 2438034, 2395646, 2414620, 2436318, 2388482, 2318024, 2376227, 2476619, 2381196, 2340244, 2378112, 2342113, 2402509, 2394380, 2368440, 2291580, 2280315, 2304267, 2416173, 2395388, 2354032, 2373773, 2434264]
16019B434264j2213j2872N2252m363l9909n8875K5787K2122R5227p7706j11876
16008B311838r3834Q1185Q3150L0664k2651l9224P7479R4128j37196O4739K0086
15997B470364j26180J45764J16163j06303j35742j04825L556J20822K2993m7840
15987B358772j5247J24534m9752n3183J16549o3497q6285k4102k0545O7808n5430
15976B299622K3748J38029L600j0477m9648K8427o8805j2604M363N6767N9347
$$ y = [2434264, 2422051, 2409179, 2461431, 2457068, 2417159, 2358284, 2384071, 2406193, 2501420, 2423714, 2311838, 2218004, 2299189, 2382339, 2413003, 2390352, 2351128, 2428607, 2522735, 2385539, 2450278, 2470364, 2344184, 2489948, 2606111, 2499808, 2364066, 2259241, 2262797, 2383619, 2406612, 2358772, 2343525, 2468059, 2418307, 2365124, 2481673, 2418176, 2331891, 2307789, 2287244, 2355052, 2299622, 2323370, 2461399, 2464999, 2454522, 2404874, 2433301, 2364496, 2351892, 2356255, 2413022, 2472369]
$$ [...]
##END NTUPLES=NMR SPECTRUM
##END=
