##TITLE=1H_EC-3289(V)oc
 CDCl3
 8 sc, 
 21.3.2023
##JCAMPDX= 6.0         $$ Bruker NMR JCAMP-DX V2.0
##DATA TYPE= NMR SPECTRUM
##DATA CLASS= NTUPLES
##ORIGIN= UXNMR, Bruker Analytische Messtechnik GmbH
##OWNER= root
$$ XWIN-NMR		Version 3.5
$$ Tue Mar 21 14:46:16 2023 Russian Standard Time (UT+4h)  she@DPX200
##.OBSERVE FREQUENCY= 200.13135
##.OBSERVE NUCLEUS= ^1H
##.ACQUISITION MODE= SIMULTANEOUS
##.ACQUISITION SCHEME= undefined
##.AVERAGES= 8
##.DIGITISER RES= 18
##SPECTROMETER/DATA SYSTEM= spect
##.PULSE SEQUENCE= zg30
##.SOLVENT NAME= CDCl3
##.SHIFT REFERENCE= (INTERNAL, CDCl3, 0, 15.7524)
##AUDIT TRAIL= $$ (NUMBER, WHEN, WHO, WHERE, WHAT)
$$ ##TITLE= Audit trail, XWIN-NMR		Version 3.5
$$ ##JCAMPDX= 5.01
$$ ##ORIGIN= Bruker BioSpin GmbH
$$ ##OWNER= she
$$ F:/spectra/data/she/nmr/H-F/1/pdata/1/auditp.txt
$$ ##AUDIT TRAIL=  $$ (NUMBER, WHEN, WHO, WHERE, WHAT)
(   1,<2023-03-21 14:44:13.85 +0400>,<she>,<DPX200>,
      <created by zg, POWCHK disabled, PULCHK disabled
       configuration hash MD5:
       00 E9 B6 7A A2 85 ED C7 34 08 36 98 17 FE 4E 26
       data hash MD5: 16K
       8A FE 11 B8 FB 47 FC 6E 90 26 21 0C D2 E9 B0 83>)
(   2,<2023-03-21 14:44:17.28 +0400>,<she>,<DPX200>,
      <Start of raw data processing
       efp BC_mod = 2 LB = 0.24 FT_mod = 6 PKNL = 1 PHC0 = -19108.86 PHC1 = 13.80075 SI = 16K 
       data hash MD5: 16K
       54 86 EC 9F 47 2C C1 9E C4 8A CC 72 2A 2F B3 47>)
(   3,<2023-03-21 14:45:20.29 +0400>,<she>,<DPX200>,
      <pk PHC0 = 1.923322 PHC1 = 0 
       data hash MD5: 16K
       C8 C7 6C C0 08 77 F1 2B 67 3B 18 87 CE 5A 93 98>)
(   4,<2023-03-21 14:45:24.87 +0400>,<she>,<DPX200>,
      <abs ABSG = 5 
       data hash MD5: 16K
       96 E9 9F 59 A2 7A 51 74 8E 8F AE 9F EB C2 72 21>)
$$ ##END=
$$ 
$$ hash MD5
$$ A6 DC A1 EA 6E 3F E5 F8 0B 2A 1F D3 7C ED FA 1A
##$RELAX= 
##$RELAX= 
##$RELAX= 
##$RELAX= 
##$RELAX= 
##$RELAX= 
$$ Bruker specific parameters
$$ --------------------------
##$DU= <F:/spectra>
##$EXPNO= 1
##$NAME= <H-F>
##$PROCNO= 1
##$TYPE= <nmr>
##$USER= <she>
##$AMP= (0..31)
100 100 100 100 100 100 100 100 100 100 100 100 100 100 100 100 100 100 
100 100 100 100 100 100 100 100 100 100 100 100 100 100 
##$AQSEQ= 0
##$AQ_mod= 1
##$AUNM= <au_zg>
##$AUTOPOS= <>
##$BF1= 200.13
##$BF2= 200.13
##$BF3= 200.13
##$BF4= 200.13
##$BF5= 200.13
##$BF6= 200.13
##$BF7= 200.13
##$BF8= 200.13
##$BYTORDA= 1
##$CFDGTYP= 0
##$CFRGTYP= 5
##$CHEMSTR= <none>
##$CNST= (0..31)
1 1 145 1 1 1 1 1 1 1 1 1 1 1 1 1 1 1 1 1 1 1 1 1 1 1 1 1 1 1 1 1 
##$CPDPRG= <>
##$CPDPRG1= <>
##$CPDPRG2= <>
##$CPDPRG3= <>
##$CPDPRG4= <mlev>
##$CPDPRG5= <mlev>
##$CPDPRG6= <mlev>
##$CPDPRG7= <mlev>
##$CPDPRG8= <mlev>
##$CPDPRGB= <>
##$CPDPRGT= <>
##$D= (0..31)
0 1.2 0 0 0 0 0 0 0 0.06 0 0.03 0 0 0 0 0.0002 0 0 0 0 0 0 0 0 0 0 0 0 
0 0 0 
##$DATE= 1679395453
##$DBL= (0..7)
120 120 120 120 120 120 120 120 
##$DBP= (0..7)
150 150 150 150 150 150 150 150 
##$DBP07= 0
##$DBPNAM0= <>
##$DBPNAM1= <>
##$DBPNAM2= <>
##$DBPNAM3= <>
##$DBPNAM4= <>
$$ [...]
##$SUBNAM3= <"">
##$SUBNAM4= <"">
##$SUBNAM5= <"">
##$SUBNAM6= <"">
##$SUBNAM7= <"">
##$SUBNAM8= <"">
##$SUBNAM9= <"">
##$SW= 18.05172834244
##$SWIBOX= (0..15)
0 0 2 0 0 0 0 0 0 0 0 0 0 0 0 0 
##$SW_h= 3612.71676300578
##$TD= 16384
##$TD0= 1
##$TE= 0
##$TE2= 300
##$TE3= 300
##$TEG= 300
##$TL= (0..7)
0 120 120 120 120 120 120 120 
##$TP= (0..7)
150 150 150 150 150 150 150 150 
##$TP07= 0
##$TPNAME0= <>
##$TPNAME1= <>
##$TPNAME2= <>
##$TPNAME3= <>
##$TPNAME4= <>
##$TPNAME5= <>
##$TPNAME6= <>
##$TPNAME7= <>
##$TPOAL= (0..7)
0.5 0.5 0.5 0.5 0.5 0.5 0.5 0.5 
##$TPOFFS= (0..7)
0 0 0 0 0 0 0 0 
##$TUNHIN= 0
##$TUNHOUT= 0
##$TUNXOUT= 0
##$USERA1= <user>
##$USERA2= <user>
##$USERA3= <user>
##$USERA4= <user>
##$USERA5= <user>
##$V9= 5
##$VALIST= <valist>
##$VCLIST= <CCCCCCCCCCCCCCC>
##$VD= 0
##$VDLIST= <DDDDDDDDDDDDDDD>
##$VPLIST= <PPPPPPPPPPPPPPP>
##$VTLIST= <TTTTTTTTTTTTTTT>
##$WBST= 1024
##$WBSW= 4
##$XGAIN= (0..3)
0 0 0 0 
##$XL= 0
##$YL= 0
##$YMAX_a= 195641
##$YMIN_a= -340404
##$ZGOPTNS= <>
##$ZL1= 120
##$ZL2= 120
##$ZL3= 120
##$ZL4= 120
##$ABSF1= 15.72926
##$ABSF2= -2.322589
##$ABSG= 5
##$ABSL= 3
##$ALPHA= 0
##$AQORDER= 0
##$ASSFAC= 0
##$ASSFACI= 0
##$ASSFACX= 0
##$ASSWID= 0
##$AUNMP= <proc_1d>
##$AZFE= 0.1
##$AZFW= 0.1
##$BCFW= 0
##$BC_mod= 2
##$BYTORDP= 0
##$COROFFS= 0
##$CY= -3
##$DATMOD= 1
##$DC= 0
##$DFILT= <>
##$DTYPP= 0
##$F1P= 0
##$F2P= 0
##$FCOR= 1
##$FTSIZE= 16384
##$FT_mod= 6
##$GAMMA= 0
##$GB= 0
##$INTBC= 1
##$INTSCL= 3.70164e-10
##$ISEN= 128
##$LB= 0.24
##$LEV0= 0
##$LPBIN= 0
##$MAXI= 10000
##$MC2= 0
##$MEAN= 0
##$ME_mod= 0
##$MI= 1.114404
##$NCOEF= 0
##$NC_proc= -7
##$NLEV= 6
##$NOISF1= 3.799351
##$NOISF2= 2.8
##$NSP= 0
##$NTH_PI= 0
##$NZP= 0
##$OFFSET= 15.7524
##$PC= 1
##$PHC0= -19106.94
##$PHC1= 13.80075
##$PH_mod= 1
##$PKNL= yes
##$PPARMOD= 0
##$PSCAL= 0
##$PSIGN= 0
##$REVERSE= no
##$SF= 200.130003830264
##$SI= 16384
##$SIGF1= 3
##$SIGF2= 2
##$SINO= 5.538805
##$SIOLD= 16384
##$SREGLST= <1H.CDCl3>
##$SSB= 0
##$STSI= 16384
##$STSR= 0
##$SW_p= 3612.71676300578
##$SYMM= 0
##$S_DEV= 0
##$TDeff= 16384
##$TDoff= 0
##$TI= <>
##$TILT= no
##$TM1= 0
##$TM2= 0
##$TOPLEV= 0
##$USERP1= <user>
##$USERP2= <user>
##$USERP3= <user>
##$USERP4= <user>
##$USERP5= <user>
##$WDW= 1
##$XDIM= 16384
##$YMAX_p= 371010900
##$YMIN_p= -518637
$$ End of Bruker specific parameters
$$ ---------------------------------
##NTUPLES= NMR SPECTRUM
##VAR_NAME=  FREQUENCY,     SPECTRUM/REAL,   SPECTRUM/IMAG
##SYMBOL=    X,             R,               I
##VAR_TYPE=  INDEPENDENT,   DEPENDENT,       DEPENDENT
##VAR_FORM=  AFFN,          ASDF,            ASDF
##VAR_DIM=   16384,         16384,           16384
##UNITS=     HZ,            ARBITRARY UNITS, ARBITRARY UNITS
##FACTOR=    0.220516191357247, 1,           1
##FIRST=     3152.5279520385, 0,             0
##LAST=      -460.188810967276, 0,           0
##MIN=       -460.188810967276, -518637,     0
##MAX=       3152.5279520385, 371010900,     0
$$ Real data points
##PAGE= N=1
##DATA TABLE= (X++(R..R)), XYDATA
$$ [...]
5626D851341M6147P9374n4471R1166L10706J50733L5282j10223K23113L35559
$$ 4851341 4897488 4976862 4922391 5013557 5324263 5474996 5510278 5400055 5623168 5958727
5616E958727J62424O6311K15131K99581J41754J33248M80352K85774J99903M97884
$$ 5958727 6121151 6187462 6402593 6702174 6843928 6977176 7457528 7743302 7943205 8441089
5606H441089K04990L78305M41009M72879M78269M97371N22785N60227O92159P34062
$$ 8441089 8646079 9024384 9465393 9938272 10416541 10913912 11436697 11996924 12689083 13423145
5596A3423145Q02380R13008P35581N36253O34403K86180K89160k4270k95813k07358
$$ 13423145 14225525 15138533 15874114 16410367 17044770 17330950 17620110 17595840 17300027 17092669
5586A7092669j78277l97588m21774n65317m87726m19100k66054j95600j80319
$$ 17092669 16914392 16516804 16095030 15529713 15041987 14622887 14356833 14161233 13980914
5577A3980914r6868p3985M8205N7815J69790L29188K77644K58088J17905N69572
$$ 13980914 13884046 13810061 13858266 13916081 14085871 14415059 14692703 14950791 15068696 15638268
5567A5638268N56821N01827M60018N88216P51729R42356J075896P76567J041539
$$ 15638268 16195089 16696916 17156934 17745150 18496879 19439235 20515131 21291698 22333237
5558B2333237R23344R88505O66851L36006N01668N66485M46602M22152N0627N2254
$$ 22333237 23256581 24245086 24911937 25247943 25749611 26316096 26762698 27184850 27235477 27287731
5548B7287731O9757j89267n19621n15307m44604q89880j049029q89559q99314
$$ 27287731 27357488 27168221 26648600 26133293 25688689 24798809 23749780 22860221 21960907
5539B1960907r43382j038613j025095q55363n10041n87141o41560k28357n22389
$$ 21960907 21017525 19978912 18953817 18098454 17588413 17001272 16359712 16131355 15608966
5530A5608966j15364l68799k28034K51711o8999j7596L00672K64489L83665P29657
$$ 15608966 15493602 15124803 14896769 15148480 15079481 15061885 15362557 15627046 16010711 16740368
5520A6740368P7807K84493P01778L63710O25204L40763L78093L04053k30656j66310
$$ 16740368 16818175 17102668 17804446 18168156 18793360 19134123 19512216 19816269 19585613 19419303
5510A9419303m19317o91827r17089q80829o76451p23903p77285q58714p62980
$$ 19419303 18999986 18308159 17391070 16510241 15833790 15109887 14332602 13473888 12710908
5501A2710908p91788m33910l23622n57909n17674m15436l56224l78133k50976
$$ 12710908 11919120 11485210 11161588 10603679 10086005 9670569 9314345 8936212 8685236
5492H685236j04190k67394j24071j49442k31905j8071k22887j25034n3542O3011
$$ 8685236 8581046 8313652 8189581 8040139 7808234 7790163 7567276 7442242 7388700 7451711
5482G451711Q4204M1440j58751N5751q3078L8542P7601j94317p8189R086M2001
$$ 7451711 7535915 7577355 7418604 7474355 7391277 7429819 7507420 7313103 7234914 7244000 7286001
5471G286001j13670k10378M2927J03258j44665j90544j28636k04691M8583J21609
$$ 7286001 7172331 6961953 7004880 7108138 6963473 6772929 6644293 6439602 6488185 6609794
5461F609794p5362j49393l8883R491J24644l7295Q5959K58674J9989Q2819J63794
$$ 6609794 6534432 6385039 6346156 6355647 6480291 6442996 6528955 6787629 6807618 6890437 7054231
5450G054231K6210J46825J88152J44381L91392K08914J81886P3350J47752L16746
$$ 7054231 7080441 7227266 7415418 7559799 7951191 8160105 8341991 8415341 8563093 8879839
5440H879839N3071K72119J35229R0235K352k034P5952j15548k58905j43352j96090
$$ 8879839 8932910 9205029 9340258 9430493 9432845 9430811 9506763 9391215 9132310 8988958 8792868
5429H792868M9664k23080k59277k54642j86485l49057j65096K8978Q1921j65768
$$ 8792868 8842532 8619452 8360175 8105533 7919048 7569991 7404895 7433873 7515794 7350026
5419G350026j92157k75165L283J62717J50926J71449n4542K19996K1313K58997
$$ 7350026 7157869 6882704 6885987 7048704 7199630 7371079 7316537 7536533 7557846 7816843
5409G816843J41007O9665K52199K13658k03428K0588K90647L11125l5794Q8332
$$ 7816843 7957850 8027515 8279714 8493372 8289944 8310532 8601179 8912304 8876510 8964842
5399H964842k899M9989K612K6605j89605j91696k05912j51516j71311k51010Q5356
$$ 8964842 8961943 9011932 9014544 9041149 8851544 8659848 8453936 8302420 8131109 7880099 7965455
5388G965455L503k13669J99260l2622K79496L01691k02134J38968J83600j4208
$$ 7965455 7968958 7755289 7954549 7921927 8201423 8503114 8300980 8439948 8623548 8609340
5378H609340K42636L61920L43266L71023J04935J81233J82216L73127m7870n5037
$$ 8609340 8851976 9213896 9557162 9928185 10033120 10214353 10396569 10769696 10721826 10666789
5368A0666789P7506J09920J69529L765o3738k92563j18405M0352J73406K0264
$$ 10666789 10744295 10854215 11023744 11027509 10963771 10671208 10552803 10593155 10766561 10786825
5358A0786825J01576J10920K55734R5076J52448K1885P8101M44771L91897m8844
$$ 10786825 10888401 10999321 11255055 11350131 11502579 11524464 11602565 12047336 12439233 12390389
5348A2390389L41764M03634J63987N07495O74735J21828M95782P14705M89782
$$ 12390389 12732153 13135787 13299774 13807269 14482004 14603832 15099614 15814319 16304101
5339A6304101K92973N48037L89271J5299j19884j36896j34606j39158j6152l30861
$$ 16304101 16597074 17145111 17534382 17549681 17429797 17292901 17158295 17019137 17002985 16672124
5329A6672124k23586l12980p0413k76481l74172n2772q4509j05825J52179N8911
$$ 16672124 16448538 16135558 16065145 15788664 15414492 15361720 15277211 15171386 15323565 15382476
5319A5382476L10760K43230L24150N17438R12442Q47632Q93884J282483J135539
$$ 15382476 15693236 15936466 16260616 16778054 17690496 18538128 19432012 20714495 21850034
5310B1850034R50827J105740Q13930O75434L05273L52978K84181K62493M65561
$$ 21850034 22800861 23906601 24720531 25395965 25701238 26054216 26338397 26600890 27066451
5301B7066451N59255N69884L07088j42459l47567r72731j206148j144525q45471
$$ 27066451 27625706 28195590 28502678 28360219 28012652 27039921 25833773 24689248 23843777
5292B3843777r37959n56750k78146l48430O0283K38838M15952N89629J057121
$$ 23843777 22905818 22349068 22070922 21722492 21782775 22021613 22437565 23027194 24084315
5283B4084315Q72552R88434J403207J432553J584731J351958J017307J147090
$$ 24084315 24956867 25945301 27348508 28781061 30365792 31717750 32735057 33882147
5275C3882147J284581J511678J193569P04519M61348J13485n03173j054341j357741
$$ 33882147 35166728 36678406 37871975 38576494 39037842 39151327 38648154 37593813 36236072
5266C6236072j308577j303684j074772j096583p29406m78556n37201j36224K9072
$$ 36236072 34927495 33623811 32549039 31452456 30723050 30244494 29707293 29571069 29600141
5257B9600141M1031L17381J87480L27690K86778j3105j05118k91107o40244n39805
$$ 29600141 29641172 29958553 30146033 30473723 30760501 30747396 30642278 30351171 29710927 29171122
5247B9171122l94134o80177o22111k92450j45035j89933j93209O9946Q9104R4483
$$ 29171122 28776988 28096811 27474700 27182250 27037215 26847282 26654073 26724019 26813123 26907606
5237B6907606O75480N60249P31190R22545J401997J331144J508282J334661J281449
$$ 26907606 27583086 28143335 28874525 29797070 31199067 32530211 34038493 35373154 36654603
5228C6654603J238094N32246j6777m32657p49280j147521q43629o28068o95717
$$ 36654603 37892697 38424943 38408166 37975509 37226229 36078708 35235079 34607011 33911294
5219C3911294p23389o30311o67370m63206k90119l12303N6525J16240o706K29160
$$ 33911294 33187905 32557594 31890224 31427018 31136899 30824596 30881121 30997361 30990655 31219815
5209C1219815M68825P08323O90157O58260M04820M52195M84841j7635j12333n10080
$$ 31219815 31688640 32396963 33087120 33745380 34150200 34602395 35087236 35069601 34957268 34447188
5199C4447188q21572r36833r68232r21196q14250q23705o68031p20473p67450
$$ 34447188 33625616 32688783 31720551 30799355 29985105 29161400 28493369 27772896 27005446
5190B7005446o54263o92418p07969q58800q76947r74519j031586o34041m07876
$$ 27005446 26351183 25658765 24950796 24091996 23215049 22240530 21208944 20574903 20167027
5181B0167027o17477o73533l18175j6915j47341J42744J50462J66787K82723J09422
$$ 20167027 19549550 18876017 18557842 18540927 18393586 18536330 18686792 18853579 19136302 19245724
5171A9245724O6301K87779L07435L50225L58682N94951O07024M25837M68146N29955
$$ 19245724 19312025 19599804 19907239 20257464 20616146 21211097 21818121 22243958 22712104 23242059
5161B3242059J79196K6939J27452O0482K87727K89595L19050J109823J060129
$$ 23242059 23421255 23448194 23575646 23636128 23923855 24213450 24532500 25642323 26702452
5152B6702452J370590J689852J980530K509038K649699K785174K451679J546390
$$ 26702452 28073042 29762894 31743424 34252462 36902161 39687335 42139014 43685404
5144D3685404L32707r34701q61040q99489q15752n28942p6759Q49972J134519
$$ 43685404 44018111 43083410 42222370 41322881 40507129 39978187 39901428 40751400 41885919
5135D1885919J616131K535344L271379L988671M736899O006685P500304R086569
$$ 41885919 43502050 46037394 49308773 53297444 58034343 64041028 71541332 80627901
5127H0627901J1023347J2616521J2551289R580134M202092l692231r558414j1984550
$$ 80627901 91651248 104267769 116819058 126399192 130601284 126909053 117350639 105366089
5119A05366089j2572650j2431053j1177264r231432p138001n923788n128250m205732
$$ 105366089 92793439 80362386 69185122 59953690 52815689 46891901 41763651 37557919
5111C7557919l443599k712729k367567k005586j995046j735871j673599j288644
$$ 37557919 34114320 31401591 29034024 27028438 25033392 23297521 21623922 20335278
5103B0335278r28990j022540j114650p06922l22169p37192p70773m85278m52648
$$ 20335278 19406288 18383748 17269098 16562176 16240007 15502815 14732042 14246764 13794116
5094A3794116o95934m46724n24845o32868l43937m38287k08841j42571k98872
$$ 13794116 13098182 12651458 12126613 11493745 11149808 10711521 10502680 10360109 10061237
5085A0061237n99095k69715k17638J29796k81081n24115k55130j43907p9581l36917
$$ 10061237 9462142 9192427 8974789 9104585 8823504 8299389 8044259 7900352 7820771 7483854
5075G483854k2212k31969k27887o6758q213q6752l23186j31944j22945Q4233m7542
$$ 7483854 7461642 7229673 7001786 6935028 6926815 6840063 6516877 6384933 6261988 6346221 6298679
5064F298679k02764l8123q5778k95321l1695J43843j05159P2834r2100j50724
$$ 6298679 6095915 6057792 5972014 5676693 5644998 5788841 5683682 5756516 5664416 5513692
5054E513692P6852j65086k20611m437j34905k0587r9592j48533j95706o4589P1651
$$ 5513692 5590544 5425458 5204847 5200410 5065505 5044918 4945326 4796793 4601087 4536498 4608149
5043D608149m2911n2214j65573k6093n5050r7994L9977r0895L0259K9808J54672
$$ 4608149 4565238 4513024 4347451 4321358 4266308 4168314 4208291 4117396 4147655 4177463 4332135
5032D332135m1185L3959o0628J18091k5121K6270Q6924J35561M7839J17219J50712
$$ 4332135 4290950 4324909 4264281 4382372 4357251 4383521 4470445 4606006 4653845 4771064 4921776
5021D921776J78796J54973J99496K76538K35299j58636J47263l6225k13908m4380
$$ 4921776 5100572 5255545 5455041 5731579 5966878 5808242 5955505 5919280 5705372 5660992
5011E660992l41071l29650k57J09926k15546k12788j3428l9942J05337J07486
$$ 5660992 5319921 4990271 4990014 5099940 4884394 4671606 4658178 4618236 4723573 4831059
5001D831059O4850J61971j32314j46887j66013j0708j2338M8914N1147J66981
$$ 4831059 4895909 5057880 4925566 4778679 4612666 4601958 4589620 4638534 4689681 4856662
4991D856662K14687L00037K33745J40578K50669K05838R9659J87876o6776p9815
$$ 4856662 5071349 5371386 5605131 5745709 5996378 6202216 6301875 6489751 6422975 6343160
4981F343160k68526j67787j09310q5771j47996m8846M5869m6637j45829r4989
$$ 6343160 6074634 5906847 5797537 5711766 5563770 5514924 5560793 5514156 5368327 5273338
4971E273338P0661l25674O4340o7530J61908R1193j90672o9554j3905n5186J38688
$$ 5273338 5343999 5018325 5082665 5015135 5177043 5268236 5077564 5008010 4994105 4938919 5077607
4960E077607P5638p4672K81925O1268R4222M543N0056k7031K6430P6159J76747
$$ 5077607 5153245 5078573 5360498 5421766 5515988 5520531 5570587 5543556 5569986 5646145 5822892
4949E822892J30989Q756L36266N8856J18602J42684K309L51488J78419L22041
$$ 5822892 5953881 5962637 6298903 6357759 6476361 6619045 6621354 6972842 7151261 7473302
4939G473302J64967M38808M91886N65804K81055N76388O07604O57754Q12830Q64781
$$ 7473302 7638269 8077077 8568963 9134767 9415822 9992210 10599814 11257568 12070398 12935179
4929A2935179Q27298R71961J048930P77194O27032L68326k6932o09488n61438
$$ 12935179 13762477 14734438 15783368 16560562 17187594 17555920 17528988 16919500 16358062
4920A6358062p15231j033423q76110r91924q82331p93959r60082n85645l86083
$$ 16358062 15642831 14609408 13733298 12741374 11859043 11065084 10105002 9519357 9133274
4911I133274m75012m78871k62946k71536k01897j78640k50726n9884j13639p8067
$$ 9133274 8658262 8179391 7916445 7644909 7443012 7264372 7013646 6953762 6840123 6762056
4901F762056j40146J78747j04337j80964J2417r5602m3446j1904P9957m8854o9309
$$ 6762056 6621910 6800657 6696320 6515356 6527773 6432171 6388725 6376821 6456778 6407924 6338615
4890F338615J27053J78716j27892q3213J77811J89845L5832m3885j86864M2898
$$ 6338615 6465668 6644384 6516492 6433279 6611090 6800935 6836767 6792882 6606018 6648916
4880F648916p9044k20736j75916J7230k5158K80372N6839r2041q299K25865K53882
$$ 6648916 6569872 6349136 6173220 6190450 6165292 6445664 6502503 6410462 6402163 6628028 6881910
4869F881910o2391J04790M7245J90559K97965K62210J54995K96973K08712K29670
$$ 6881910 6819519 6924309 6971554 7162113 7460078 7722288 7877283 8174256 8382968 8612638
4859H612638K25113K84800N35717M02339K09319K89005L76686M97760P86549M93760
$$ 8612638 8837751 9122551 9658268 10060607 10269926 10558931 10935617 11433377 12219926 12713686
4849A2713686P15278P08964P88180Q82989J231993J333194J455264J991221K212575
$$ 12713686 13428964 14137928 14926108 15809097 17041090 18374284 19829548 21820769 24033344
4840B4033344K618834K818019L738845M828361N796906P808047R357866Q970063
$$ 24033344 26652178 29470197 33209042 38037403 43834309 51642356 61000222 69970285
4832F9970285P324119L377632l811977p851842q695389q545158q192791o999788
$$ 69970285 77294404 80672036 76860059 69008217 60312828 51767670 43574879 36575091
4824C6575091n060369m008240l432411k725980j756299j715827j506325j143438
$$ 36575091 31514722 27506482 24074071 21348091 19591792 17875965 16369640 15226202
4816A5226202j011850r62085r45947p23647o01523m70965k70968n62563k53428
$$ 15226202 14214352 13252267 12306320 11582673 10981150 10510185 10239217 9676654 9423226
4807I423226q085l37249k27144k02908j82035k82247m14027m34486j98277k37102
$$ 9423226 9415141 9077892 8850748 8647840 8465805 8183558 7769531 7335045 7136768 6899666
4797F899666j77774j00760l01348j04393k39476j12830r64k93685k45041j44583
$$ 6899666 6721892 6621132 6319784 6215391 5975915 5863085 5862121 5568436 5323395 5178812
4787E178812j50229J36285j92508l6247l9964l87097r5852J57046k1778j33685
$$ 5178812 5028583 5164868 4972360 4936113 4896149 4509052 4413200 4570246 4548468 4414783
4777D414783k11628m8129K2575n5950o0221j44352J57332j18381n1822m552P2844
$$ 4414783 4203155 4155026 4177601 4121651 4061430 3917078 4074410 3956029 3904207 3899655 3972499
4766C972499M9491j38363j0837M9334r6072j08329k6093j89596M2583j6783j57905
$$ 3972499 4021990 3883627 3872790 3922124 3826052 3717723 3691630 3502034 3544617 3527834 3369929
4755C369929O4964q2155J27486m7707n5707M5596o5274N2647j55144J21875l69964
$$ 3369929 3434893 3352738 3480224 3432517 3376810 3422406 3357132 3409779 3254635 3376510 3006546
4744C006546L802J24194m1577O7473m8251j90829p3264J71952m6465K83625r6652
$$ 3006546 3010348 3134542 3092965 3160438 3112187 2921358 2848094 3020046 2973581 3257206 3160554
4733C160554N569l0726o8689j6001m1631p8194J015K97729L6025k91015P8007
$$ 3160554 3166123 3135397 3066708 3050707 3009076 2930882 2931897 3229626 3265651 2974636 3052643
4722C052643J02558m0334K96600j43428p8124j14434K27494O3263j63436J69990
$$ 3052643 3155201 3114867 3411467 3268039 3189915 3075481 3302975 3366238 3202802 3372792
4712C372792o7640k61012j40310J63303Q5439l7878J01113j65733J01643N0387
$$ 3372792 3305152 3044140 2903830 3067133 3152572 3114694 3215807 3050074 3151717 3202104
4702C202104M9548J9195K0700j81928l6953J8547J84299J63679j94917J07962
$$ 3202104 3251652 3270847 3291547 3109619 3072666 3091213 3275512 3439191 3244274 3352236
4692C352236J72488j40751j14173J92076j54102k57409m6817K51422j39911L41795
$$ 3352236 3524724 3383973 3269800 3461876 3307774 3050365 3003548 3254970 3115059 3456854
4682C456854r3102n5157L19549j72267J0012J08676L05172L8582M8507n5552P973
$$ 3456854 3363752 3308595 3628144 3455877 3465889 3574565 3879737 3918319 3966826 3911274 3919247
4671C919247J24612L1463q3558N8292K48518J24430J63418Q9226j31427K76953
$$ 3919247 4043859 4075322 3991764 4050056 4298574 4423004 4586422 4675648 4544221 4821174
4661D821174P2029J51287P2006l6051K45389k512J76432K33983l5572O6722L70774
$$ 4821174 4893203 5044490 5116496 5080445 5325834 5323322 5499754 5733737 5698165 5764887 6135661
4650F135661K69153k21427J23263J29754m5850K00609K67991K98322J51755Q0668
$$ 6135661 6404814 6183387 6306650 6436404 6390554 6591163 6859154 7157476 7309231 7389899
4640G389899J11898K08283M3045J91454J19330J30648J29974K78615J01029N5632
$$ 7389899 7501797 7710080 7753125 7944579 8063909 8194557 8324531 8603146 8704175 8759807
4630H759807K84577K85662J59539M73095L70660K39814J57697L66988L17696L52936
$$ 8759807 9044384 9330046 9489585 9962680 10333340 10573154 10730851 11097839 11415535 11768471
4620A1768471N30297M75944M99443M20984O23228O50811O89551P57075P07417
$$ 11768471 12298768 12774712 13274155 13695139 14318367 14969178 15658729 16415804 17123221
4611A7123221P28637J024578Q87553R49680P09680R24849J185665J350217J458168
$$ 17123221 17851858 18876436 19763989 20713669 21423349 22348198 23533863 24884080 26342248
4602B6342248J552360J886383J877450K248810K252841K837241L437351L909244
$$ 26342248 27894608 29780991 31658441 33907251 36160092 38997333 42434684 46343928
4594D6343928M721718N268018O003305P344072R163167J1029813J3094510J6010009
$$ 46343928 51065646 56333664 62336969 69681041 78844208 89874021 102968531 118978540
4586A18978540J9161223J9859135J6274488P122552n545598j4145919j7051928
$$ 118978540 138139763 157998898 174273386 181395938 175850340 161704421 144652493
4579A44652493j7857683j7310170j6048930j3491530j0607245r043803o840008
$$ 144652493 126794810 109484640 93435710 79944180 69336935 60293132 53453124
4572E3453124n391256m711047m130903l301849k953251k699040k165096k102471
$$ 53453124 48061868 43350821 39219918 35918069 32964818 30265778 28100682 25998211
4564B5998211j855010j322997j270293j107561j015201r03854r37207p51352o86320
$$ 25998211 24143201 22820204 21549911 20442350 19427149 18523295 17586088 16834736 16148416
4555A6148416p02446o94464q25207o28783o65792o14451k96189j79145m54052
$$ 16148416 15445970 14751506 13926299 13297516 12631724 12017273 11721084 11541939 11087887
4546A1087887l49927k84234m52827l92290k75522j52360k21500l63310k8678j90314
$$ 11087887 10737960 10453726 10000899 9608609 9333087 9180727 8959227 8595917 8567239 8376925
4536H376925l12652k46158l29367j90905j61409k38332m11j20029k32594k69062
$$ 8376925 8064273 7818115 7488748 7297843 7136434 6898102 6897691 6777662 6545068 6276006
4526F276006j81578k5544j2624j27680R9355k59107p7704J09032k02846j06681
$$ 6276006 6094428 6068884 6056260 5928580 6027935 5768828 5691124 5800156 5597310 5490629
4516E490629j85577Q83j65425M4907j98581k40724k32133k82673j43549j7413
$$ 5490629 5305052 5305935 5140510 5185417 4986836 4746112 4513979 4231306 4087757 4070344
4506D070344J17553j38822j26230J6757L09277k72362l17078Q0188J28787p4132
$$ 4070344 4187897 4049075 3922845 3939602 4248879 3976517 3659439 3739627 3868414 3794282
4496C794282r7092j83582j66051N405J0443q9944L4914K6314m9325j82828J21758
$$ 3794282 3697190 3513608 3347557 3352962 3363405 3273461 3308375 3334689 3285364 3102536 3224294
4485C224294r6466k13920j62051p5876K03590K5729k5286P6293J58640o1680j74480
$$ 3224294 3127828 2913908 2751857 2675981 2879571 2905300 2880014 2956307 3114947 3053267 2878787
4474B878787n5448j8072J5688N3492j29523m4829J0122J16301j14029k3097j8581
$$ 2878787 2823339 2805267 2820955 2874447 2744924 2700095 2710217 2826518 2712489 2689392 2670811
4463B670811j90310O7000O7807L91691k38468k19915K7521J1994M1674p8045P1666
$$ 2670811 2480501 2547501 2615308 3006999 2768531 2548616 2576137 2588131 2629805 2551760 2623426
4452B623426O2764q4701l76128K18574J35021O5608Q3210l4001j50523L940Q6957
$$ 2623426 2686190 2601489 2225361 2443935 2578956 2644564 2727774 2693773 2543250 2547190 2634147
4441B634147j30456J54231k03866n6464J41191J22918J57879Q6121J388j80508
$$ 2634147 2503691 2657922 2454056 2397592 2538783 2661701 2819580 2905701 2907089 2726581
4431B726581k61221O4223R5724Q887K3932Q5958N3760J62170n8942l1610J21401
$$ 2726581 2465360 2529583 2625307 2634194 2658126 2744084 2797844 2960014 2901072 2869462 2990863
4420B990863p2999p6867j6904J92467n9616j65798n0280o041J39645m4784J06423
$$ 2990863 2917864 2840997 2824093 3016560 2956944 2791146 2740866 2734825 2874470 2829686 2936109
4409B936109n3464k46575J45709L30678M7466j77396P0168O7238K2581k23406
$$ 2936109 2882645 2636070 2781779 3112457 3159923 2982527 3052695 3119933 3142514 2919108
4399B919108J01768J07290n5170J02655J82178J17265j67103j85284J22577J41285
$$ 2919108 3020876 3128166 3072996 3175651 3357829 3475094 3307991 3122707 3245284 3386569
4389C386569P7125j51626J14186k9464L2979J41865J73205J9855J02903O8044
$$ 3386569 3463694 3312068 3426254 3396790 3429769 3571634 3744839 3764694 3867597 3935641
4379C935641J4951q7092j44856J32479K40476J96197J25037Q0146j53541M2980
$$ 3935641 3950592 3863500 3718644 3851123 4091599 4287796 4412833 4492979 4339438 4382418
4369D382418N2513M4853L10691n1938n6644n6263K32176j51121P1612L23563K16328
$$ 4382418 4434931 4479784 4790475 4738537 4681893 4625630 4857806 4706685 4778297 5101860 5318188
4358E318188m4666j08809J92520J37520Q3586J83269L79965K90496J27669j40686
$$ 5318188 5273522 5164713 5357233 5494753 5578339 5761608 6141573 6432069 6559738 6419052
4348F419052J77064J46923J84677L48173l0447J47945M10735N21692J10393J94830
$$ 6419052 6596116 6743039 6927716 7275889 7245442 7393387 7804122 8325814 8436207 8631037
4338H631037M59112K49963M8444J95153M56756L84629L44550M06068L35214N89911
$$ 8631037 9090149 9340112 9388556 9583709 10040465 10425094 10769644 11175712 11510926 12100837
4328A2100837K03310J94965M41459M68110O54951N02085L97533L89758L76203
$$ 12100837 12304147 12499112 12940571 13408681 14063632 14565717 14963250 15353008 15729211
4319A5729211K60617Q02936M33597M27137L39542L89895m0032K24148O34249L65770
$$ 15729211 15989828 16792764 17226361 17653498 17993040 18382935 18342903 18567051 19201300 19567070
4309A9567070J82066M4930L45827M05363J07911L83229L26652K52475j9470k12476
$$ 19567070 19749136 19794066 20139893 20545256 20653167 21036396 21363048 21615523 21596053 21383577
4299B1383577j26748N5337j39744l84885k86307r5630k84507j49788l19090l09374
$$ 21383577 21256829 21312166 21172422 20787537 20501230 20405600 20121093 19971305 19652215 19342841
4289A9342841k75091j99044m03743k72065l54620j20604m67410o02897l74888
$$ 19342841 19067750 18868706 18464963 18192898 17838278 17717674 17250264 16647367 16272479
4280A6272479m20955k74513l54237k87631m60715o24127n45482l71248n29374
$$ 16272479 15851524 15577011 15222774 14935143 14474428 13850301 13304819 12933571 12404197
4271A2404197m85346l24625n41237m45685m34986m60205m45441k07184L911l41525
$$ 12404197 11918851 11594226 11052989 10607304 10172318 9712113 9266672 9059488 9063399 8721874
4261H721874m28909j88051k75930k33758M5066k81500j84377j78836q7902j59782
$$ 8721874 8292965 8104914 7828984 7595226 7640292 7358792 7174415 6995579 6907677 6747895
4251F747895k12596l97484l09988j21340J69404o8664j50860m11170j55237J40358
$$ 6747895 6535299 6137815 5827827 5706487 5875891 5807227 5656367 5245197 5089960 5230318
4241E230318J13086j19405n9017k21363k05783P6585j97545k18290o1249j1244
$$ 5230318 5343404 5223999 5164982 4943619 4737836 4814421 4616876 4398586 4337337 4326093
4231D326093o1087o7308P0424m48J04582k93852o9580j00173k1726P8426k40651
$$ 4326093 4265006 4197698 4268122 4267674 4372256 4078404 4008824 3908651 3886925 3965351 3724700
4220C724700K12854r3511j23802J57281k3884k7693j55645M4374J61424k02481
$$ 3724700 3937554 3844043 3720241 3877522 3853638 3825945 3670300 3714674 3876098 3673617
4210C673617m3544Q003o7638J93601j45699j90486j26710k9947K21722J57571
$$ 3673617 3630073 3638076 3570438 3764039 3618340 3427854 3301144 3271197 3492919 3650490
4200C650490k45712j2353Q7063l08779k8008O7378j6145J25723K7440J63887l7824
$$ 3650490 3404778 3392425 3479488 3170709 3142701 3210079 3193934 3319657 3347097 3510984 3473160
4189C473160j46908J91309p7395K882m905O277J59352J39046j7356Q084r104p420
$$ 3473160 3326252 3517561 3440166 3443048 3438143 3444420 3603772 3742818 3725462 3733546 3724442 3717022
4177C717022o5514J9981j6968o6632K31556L5914j87151J85479N7124Q5605O8646
$$ 3717022 3651508 3671489 3654521 3587889 3819445 3855359 3668208 3853687 3910811 3996416 4065062
4166D065062P5349M4802m2112k13296K54302k1592p0633k6490J48424J63798K7169
$$ 4065062 4140411 4185213 4143101 3929805 4184107 4162515 4091882 4065392 4213816 4377614 4404783
4155D404783j3739K7864J66418j48764l8379J29288j35730p5132J96364J1504
$$ 4404783 4391044 4418908 4585326 4436562 4398183 4527471 4391741 4316609 4512973 4524477
4145D524477R0605j6304q7595J23662K47512n4387q0818N0963J17497K06082k03559
$$ 4524477 4615082 4598778 4511183 4634845 4882357 4827970 4747152 4798115 4915612 5121694 4918135
4134D918135m0595Q8385p4858n1838J34694L9961R3152K52105Q38L9062j58057
$$ 4918135 4877540 4965925 4891067 4839229 4973923 5013884 5107036 5359141 5359979 5399041 5240984
4123E240984l4608J77803N3351l3171K32312J2337K1023k6291Q9084J88193M9288
$$ 5240984 5206376 5384179 5437530 5404359 5636671 5649008 5670031 5643740 5732824 5921017 5970305
4112E970305M7084L72238J05055K74175J05104r556J59208K89056J24995L65391
$$ 5970305 6017389 6389627 6494682 6768857 6873961 6864405 7023613 7312669 7437664 7803055
4102G803055J68201L38607M19458L10740L37435K98205J93520L39151N37371M61598
$$ 7803055 7971256 8309863 8729321 9040061 9377496 9675701 9869221 10208372 10745743 11207341
4092A1207341N16888M32233M54019L73360O40093N01134O00813O24942N70974
$$ 11207341 11724229 12156462 12610481 12983841 13623934 14125068 14725881 15350823 15921797
4083A5921797M60081N38764M91867P21599R09157Q14663N83690N68384O14375
$$ 15921797 16381878 16920642 17412509 18134108 19043265 19857928 20441618 21010002 21624377
4074B1624377O96830N37419N61154N38253O08796L00485L44821P89085O81811
$$ 21624377 22321207 22858626 23419780 23958033 24566829 24867314 25212135 26001220 26683031
4065B6683031M39276L78349N75606N22678P582J74104M40163M1528m1059L1747
$$ 26683031 27122307 27500656 28076262 28598940 28606522 28780626 29220789 29262317 29221258 29253005
4055B9253005k29432k31384l6830j24260j10947K35884k0112j68294k73284l87362
$$ 29253005 29023573 28792189 28755359 28631099 28520152 28756036 28735924 28567630 28294346 27906984
4045B7906984o77308o89525n56628o95405p38860q24954n41816n61862m58177
$$ 27906984 27229676 26540151 25983523 25288118 24549258 23724304 23182488 22620626 22162449
4036B2162449k44300k97130o50678p28632o31319o56533o90186p23232r65023
$$ 22162449 21918149 21621019 20970341 20241709 19610390 18953857 18263671 17540439 16575416
4027A6575416p96448o27777p72576n26096o23754m94706m96943j56355m98463
$$ 16575416 15778968 15151191 14378615 13852519 13228765 12734059 12237116 12080761 11582298
4018A1582298m63710n59560n77664l36122o79489m58024k47101l51895l21007
$$ 11582298 11118588 10559028 9981364 9645242 8965753 8507729 8260628 7908733 7587726
4009G587726l87542j15539l87890k45928j47212k93051r0924k93127q9731k83560
$$ 7587726 7200184 7084645 6696755 6450827 6303615 6010564 5919640 5626513 5536782 5253222
3999E253222j34955o4430j86483k08828j06247l14365l0751j68733o4761J69186
$$ 5253222 5118267 5053837 4867354 4658526 4552279 4237914 4207163 4038430 3973669 4142855
3989D142855q7094k72798J97323j70710o3284j05766k02306j92355J14734L24572
$$ 4142855 4055761 3782963 3980286 3809576 3746292 3640526 3438220 3245865 3360599 3685171
3979C685171j67572O3214P0736O586p9196j22750J08707j49165k42111Q1557j81371
$$ 3685171 3517599 3580813 3651549 3658135 3578939 3456189 3564896 3415731 3173620 3255177 3073806
3968C073806j71849n4672N5536q9323p7151J22903j5115o8999m8043J38136M9545
$$ 3073806 2901957 2847285 2902821 2813498 2736347 2859250 2844135 2775136 2727093 2865229 2914774
3957B914774k3090j37062o5043J01106N9309J23447J7960j48603J55658O7392
$$ 2914774 2891684 2754622 2689579 2790685 2849994 2973441 2991401 2842798 2998456 3065848
3947C065848m08581K76M5004q4859Q3686j4806l6241J8459P5867n768j82410n9273
$$ 3065848 2657267 2657543 2702547 2617688 2701374 2686568 2650327 2668786 2744653 2738885 2556475 2497202
3935B497202J38297M1226j09706j12511J64965J61092j32903l29196J54829J23091
$$ 2497202 2635499 2676725 2567019 2454508 2619473 2780565 2647662 2318466 2473295 2596386
3925B596386L5421k0368r1159J9634K7213J68867p6975l7317j91011O7282N2057
$$ 2596386 2631807 2611439 2520280 2539914 2567127 2735994 2659019 2621702 2430691 2497973 2550030
3914B550030J08203r9305R62P9195k30072n6586j79177J27880R9503J0963j32225
$$ 2550030 2658233 2558928 2559890 2639085 2409013 2352427 2173250 2301130 2400633 2411596 2279371
3903B279371K11213K09752k30981O1046j24962J36125M1995m2557K93767q408
$$ 2279371 2490584 2700336 2469355 2530401 2405439 2541564 2583559 2541002 2834769 2826361
3893B826361o6485o523r5874K68423J0352p3474k5888J54029j35040N9088j55515
$$ 2826361 2759876 2753353 2657479 2925902 2936254 2862780 2836892 2990921 2855881 2914969 2759454
3882B759454j13249J94211K49207k53828o8860J41271j0055J00487J58117J16482
$$ 2759454 2646205 2840416 3089623 2835795 2766935 2908206 2898151 2998638 3156755 3273237
3872C273237J90100M0058k39122q7490M3391Q3234l2170L9441L41727K17170r6630
$$ 3273237 3463337 3503395 3264273 3176783 3220174 3303408 3271238 3310679 3652406 3869576 3772946
3861C772946k4021k19663Q0285J11250J28636J29433K1631q4534L05290J80940
$$ 3772946 3748925 3529262 3609547 3720797 3849433 3978866 4000497 3915963 4221253 4402193
3851D402193J18827q8831n4417K81061P9453k9416K68158J77020K2771m6335L10653
$$ 4402193 4521020 4432189 4377772 4658833 4738286 4708870 4977028 5154048 5176819 5130484 5441137
3840E441137J39087J87383M82745K43691L5779J20134K33777K60278L45510L04897
$$ 5441137 5580224 5767607 6250352 6494043 6529822 6649956 6883733 7144011 7489521 7794418
3830G794418J70374L55081L07805K39136K97762L46225M29498L54799J97113J05336
$$ 7794418 7964792 8319873 8627678 8866814 9164576 9510801 9940299 10295098 10492211 10597547
3820A0597547J84151L84465L46213K67572m4521O0703J81305K65585J08726N1273
$$ 10597547 10781698 11166163 11512376 11779948 11735427 11796130 11977435 12243020 12351746 12403019
3810A2403019R9666m7389p31J51042k1782j30983R6307J44243N5822J6701j63972
$$ 12403019 12502685 12455296 12454565 12605607 12583825 12452842 12549149 12693392 12749214 12765915 12601943
3799A2601943K66376P8194j19361J93013N3292j98049J7878J90332m7725K76643
$$ 12601943 12868319 12946513 12827152 13020165 13073457 12875408 12893286 13083618 13035893 13312536
3789A3312536R2036J74313K60650L76334N05241N02360M38172N18933P13844P21410
$$ 13312536 13404572 13578885 13839535 14215869 14721110 15223470 15661642 16180575 16894419 17615829
3779A7615829Q71177P70946J017617J032734Q75200J148842J242688J382628J259179
$$ 17615829 18487006 19257952 20275569 21308303 22183503 23332345 24575033 25957661 27216840
3770B7216840J497383J550500J350511J125335J132349J081467R92053Q65258
$$ 27216840 28714223 30264723 31615234 32740569 33872918 34954385 35946438 36811696
3762C6811696M98014K69210o6049J57852K90235l29224K319Q9467j75399j92686
$$ 36811696 37309710 37578920 37512871 37670723 37960958 37631734 37634053 37723520 37548121 37355435
3752C7355435N984k46876n42769q07331n93168q38229q91636r92201j227991j268822
$$ 37355435 37361419 37114543 36571774 35764443 35171275 34333046 33441410 32449209 31221218 29952396
3742B9952396j418837j360624j474826j338836j293314j412971j145381j179168
$$ 29952396 28533559 27172935 25698109 24359273 23065959 21652988 20507607 19328439
3734A9328439j095427r06301p17304r86655p06472m99893q81484n90987m52312
$$ 19328439 18233012 17326711 16609407 15622752 14916280 14416387 13534903 12943916 12491604
3725A2491604n43704o68202n40051l32059m64148o8475k89261k47881j68485k57113
$$ 12491604 11947900 11279698 10739647 10407588 9943440 9874965 9585704 9337823 9169338 8912225
3715H912225j81383k25566l06971p9235m657k44230k70902j70119j99722j82921
$$ 8912225 8730842 8505276 8198305 8119070 8114413 7870183 7599281 7429162 7229440 7046519
3705G046519p462l8982k5633r4482J39780k02684M0172j14617j29124n567r0740
$$ 7046519 7039057 7000075 6974442 6879960 7019740 6817056 6857228 6742611 6613487 6607920 6517180
3694F517180j14739P2318L5018j78200l58649K21067m3104k62820r1376J04392
$$ 6517180 6402441 6474759 6509777 6331577 5972928 6193995 6150891 5888071 5796695 5901087
3684E901087R79r0598j02330p6003O8889J47445p7608k82183N2184j0435k5338
$$ 5901087 5902066 5811468 5709138 5633135 5702024 5849469 5771861 5489678 5541862 5531427 5506089
3673E506089M3313Q0301J16411l7240j62792j73714J00426o816O1961M8059M5127
$$ 5506089 5549402 5629703 5746114 5708874 5546082 5372368 5472794 5465978 5527939 5575998 5621125
3662E621125k36048j25733J13381M5431J51373q6581k8167J8217Q6343O5421J14358
$$ 5621125 5385077 5259344 5372725 5418156 5569529 5482948 5454781 5472998 5559341 5624762 5739120
3651E739120M6657P1679M0091r194Q2049J17294j28794J16333J0544J16575J54991
$$ 5739120 5785777 5857456 5897547 5888353 5970402 6087696 5958902 6075235 6085779 6202354 6357345
3640F357345J85492J73177J4562l9929L0107L78714P5399o4959J12091Q577L37028
$$ 6357345 6542837 6716014 6730576 6690647 6720754 7099468 7174867 7109908 7221999 7230576 7567604
3629G567604J15493K14423O4796r1223J83422L13860J42105r393O4074K12048
$$ 7567604 7683097 7897520 7962316 7871093 8054515 8368375 8510480 8501087 8565161 8777209
3619H777209M2492J6852K1108K01157K00684j34888j58927N1247j86743j72863
$$ 8777209 8819701 8836553 8857661 9058818 9259502 9124614 8965687 9016934 8830191 8657328
3609H657328J68783p5624L22563q2065J87962n3707m9108q705K14204P0647P2794
$$ 8657328 8826111 8750487 9073050 8990985 9178947 9125240 9076132 9067427 9281631 9352278 9425072
3598I425072J64622K16324J970J57241J86239P6395K28825l0431K23522L02294
$$ 9425072 9589694 9806018 9807988 9965229 10151468 10227863 10456688 10426257 10649779 10952073
3588A0952073K84986O43459K90817K55429K72756K72138M44255L64215L53582
$$ 10952073 11237059 11880518 12171335 12426764 12699520 12971658 13415913 13780128 14133710
3579A4133710N21960M30168M05287O64038M83535N50692N72777M03163L31030
$$ 14133710 14655670 15085838 15491125 16155163 16638698 17189390 17762167 18165330 18496360
3570A8496360K26725L18460L29371J06395J99772J05131L59862J85491J9490M67216
$$ 18496360 18723085 19041545 19370916 19477311 19677083 19782214 20142076 20327567 20347057 20814273
3560B0814273K11113P6507M73617L62262K20216M26205L76962K48881M61716M98654
$$ 20814273 21025386 21101893 21575510 21937772 22157988 22584193 22961155 23210036 23671752 24170406
3550B4170406J60598J44006M85126J26838M967k5538P9892J044P0777o5435M7957
$$ 24170406 24331004 24475010 24960136 25086974 25091941 25066403 25146295 25147339 25218116 25152681 25200638
3539B5200638l99269p0929P3124O6218J61698J50479M1796K16150M03595L22232
$$ 25200638 24801369 24730440 24803564 24869782 25031480 25181959 25223755 25439905 25843500 26165732
3529B6165732J75539L53808M31740M11261L48177M63608L8629L32179N57145L83073
$$ 26165732 26341271 26695079 27126819 27538080 27886257 28349865 28388494 28720673 29277818 29660891
3519B9660891M37332L83745O36880O00482P51444P87771R74936R75105Q60103
$$ 29660891 30098223 30481968 31118848 31719330 32470774 33258545 34233481 35208586 36068689
3510C6068689J156433J373598J635575J595084J420886J695304J740302J682080
$$ 36068689 37225122 38598720 40234295 41829379 43250265 44945569 46685871 48367951
3502D8367951J537842J555125J530459J339886J008907J151074Q19770M72387
$$ 48367951 49905793 51460918 52991377 54331263 55340170 56491244 57311014 57783401
3494E7783401K65457n6386k36002m80895k98557n20847o02339n25180o06662n61595
$$ 57783401 58048858 57992472 57756470 57275575 56977018 56456171 55853832 55328652 54721990 54160395
3484E4160395m68034j54122j87292Q5410K71646J11887L49548N40176M22796N60859
$$ 54160395 53692361 53538239 53350947 53436357 53708003 53819890 54169438 54709614 55132410 55693269
3474E5693269K83413L15269K83910j33486J14198k27338l92701l97463p43833
$$ 55693269 55976682 56291951 56575861 56442375 56556573 56329235 55936534 55539071 54795238
3465E4795238r83115j498659j368258j353935j336718j588378j546673j642666
$$ 54795238 53812123 52313464 50945206 49591271 48254553 46666175 45119502 43476836
3457D3476836j453823j464277j537259j473784j285596j174467r38444q37653
$$ 43476836 42023013 40558736 39021477 37547693 36262097 35087630 34149186 33311533
3449C3311533r70637n61407o50591o04596m97821n08774k57474j42764k65448
$$ 33311533 32340896 31779489 31128898 30524302 30026481 29517707 29260233 29117469 28852021
3440B8852021l94961k59806o6903M8185P4922M0454j41672J71738J86248J70339
$$ 28852021 28457060 28197254 28130351 28178536 28253458 28293912 28152240 28323978 28510226 28680565
3430B8680565L37575L41523K84721K95461N88347N92556K21440K38175L17596
$$ 28680565 29018140 29359663 29644384 29939845 30528192 31120748 31342188 31580363 31897959
3421C1897959O98688O25024K81978K86681M75545L34614K99115L61188j49011
$$ 31897959 32596647 33221671 33503649 33790330 34265875 34600489 34899604 35260792 35111781
3412C5111781K66364J9368M7492l9001M7359k37456j0585O1444O7141K65732j01694
$$ 35111781 35378145 35397513 35445005 35406004 35453363 35215907 35205322 35266766 35333907 35599639 35497945
3401C5497945N17533J12027K98315N21596L41951N61955O15492J77105P62473
$$ 35497945 36015478 36127505 36425820 36947416 37289367 37851322 38466814 38643919 39406392
3392C9406392P92193P07670R57182J016215J023032J193498J337823J287358J637968
$$ 39406392 40198585 40906255 41863437 42879652 43902684 45096182 46434005 47721363 49359331
3383D9359331J670308J643689J271393J450313J752245J389317J587487J553260
$$ 49359331 51029639 52673328 53944721 55395034 57147279 58536596 60124083 61677343
3375F1677343J944594K430116K396249K645797K777360K851788L248624L524301
$$ 61677343 63621937 66052053 68448302 71094099 73871459 76723247 79971871 83496172
3367H3496172L963026L965533M007999M518554M530010M366785M606608M152102
$$ 83496172 87459198 91424731 95432730 99951284 104481294 108848079 113454687 117606789
3359A17606789M217746M476660M021833L756960L102796K944705K568226K023792
$$ 117606789 121824535 126301195 130323028 134079988 137182784 140127489 142695715 144719507
3351A44719507J618773J419922Q53768P67811M13292O3521k39511m71808j132488
$$ 144719507 146338280 147758202 148611970 149379781 149793073 149856594 149617083 149145275 148012787
3342A48012787j435400j611951k116736k434936k620048l051639l277411l334314
$$ 148012787 146577387 144965436 142848700 140413764 137793716 134742077 131464666 128130352
3334A28130352k931262k858680k770612k653104k534403k271158k105013k045203
$$ 128130352 125199090 122340410 119569798 116916694 114382291 112111133 110006120 107960917
3326A07960917j926448k092656j923876j705343j939593j977919j560706j398588
$$ 107960917 106034469 103941813 102017937 100312594 98373001 96395082 94834376 93435788
3318I3435788j367120j206274q33223q85569n05228l17553o68927q28644q85439
$$ 93435788 92068668 90862394 90029171 89143602 88638374 88320821 87651894 86823250 85937811
3309H5937811j029139j226557j204415j237277j235024j350016j315857j206039
$$ 85937811 84908672 83682115 82477700 81240423 80005399 78655383 77339526 76133487
3301G6133487j111462r48935q87007o84699l48569n12661k77133k3373K45505
$$ 76133487 75022025 74073090 73186083 72501384 72152815 71640154 71363021 71339648 71585153
3292G1585153N06860O42678Q36965O89904J018388J091822J279011J351281J690064
$$ 71585153 72092013 72734691 73571656 74261560 75279948 76371770 77650781 79002062 80692126
3283H0692126J870973J836551K034659J631106K353473K647984K834237K621709
$$ 80692126 82563099 84399650 86434309 88065415 90418888 93066872 95901109 98522818
3275I8522818K745813L216755L255959L712698L980435M148629M638715N072621
$$ 98522818 101268631 104485386 107741345 111454043 115434478 119583107 124221822 129294443
3267A29294443N388448N773313O074494O286992O537350O341327O146961N784956
$$ 129294443 134682891 140456204 146530698 152817690 159355040 165696367 171843328 177628284
3259A77628284M836878L845342L149339K103730J602853P28826L99927L0993M5073
$$ 177628284 182465162 186310504 189459843 191563573 193166426 193895252 194295179 194326172 194371245
3250A94371245P3525J16110J53730j69293k24867p30123r54745j744252k948282
$$ 194371245 194444770 194560880 194714610 194545317 194320450 193590327 192635582 190891330 187943048
3241A87943048l435686m056501m941449m937893n842736o256621o154186o168568
$$ 187943048 184507362 180450861 175509412 170571519 164728783 158472162 152317976 146149408
3233A46149408n922694n439493n161099m828963l815125l522828l094553k904062
$$ 146149408 140226714 134787221 129626122 124797159 120982034 117459206 114364653 111460591
3225A11460591k610548k260507k465156k456874k292704k310343k265025j916984
$$ 111460591 108850043 106589536 104124380 101667506 99374802 97064459 94799434 92882450
3217I2882450k166086k276970k027481j911518k005048j978012j348021j203885
$$ 92882450 90716364 88439394 86411913 84500395 82495347 80517335 79169314 77965429
3209G7965429j295711q79734r18892j103927r68920q93548q15006p54820j117599
$$ 77965429 76669718 75789984 74871092 73767165 72798245 71904697 71089691 70334871 69217272
3200F9217272j237819r48185j062191j079545j092601p93296q83386p54259p41774
$$ 69217272 67979453 67031268 65969077 64889532 63796931 63003635 62120249 61365990 60624216
3191F0624216n43275l64054k42256l65636K18821n2953P9366O22860M12160M93902
$$ 60624216 60080941 59716887 59474631 59108995 59327816 59274863 59354229 59977089 60389249 60883151
3181F0883151O22791Q01416O89500J072407R27675J258750J233306J110536J072662
$$ 60883151 61505942 62307358 62996858 64069265 64996940 66255690 67488996 68599532 69672194
3172F9672194J203254J219559J183533J042304J202772J145606Q59313J193495
$$ 69672194 70875448 72095007 73278540 74320844 75523616 76669222 77528535 78722030
3164G8722030J144128J332076J291818J371168J930217J838277J847274J995246
$$ 78722030 79866158 81198234 82490052 83861220 85791437 87629714 89476988 91472234
3156I1472234J907507K442255K244524K011549K055402J682351J658308J267582
$$ 91472234 93379741 95821996 98066520 100078069 102133471 103815822 105474130 106741712
3148A06741712Q09330O59233L57124L20002k7954q1136o9573K01399L557O4381
$$ 106741712 107551042 108210275 108567399 108887401 108859447 108778311 108708738 108910137 108913694 108978075
3138A08978075P25356R05113J472488J440638K132683K570837K429230K623562
$$ 108978075 109703431 110608544 112081032 113521670 115654353 118225190 120654420 123277982
3130A23277982L008599K763202K606662K583051K474525J938963J481135J172520
$$ 123277982 126286581 129049783 131656445 134239496 136714021 138652984 140134119 141306639
3122A41306639M91780k07607m60139j363017j399685j825846k278361k083887
$$ 141306639 141798419 141590812 141130673 139767656 138367971 136542125 134263764 132179877
3114A32179877k389874k043457k060550k095976k078077k034331k124438k010368
$$ 132179877 129790003 127746546 125685996 123590020 121511943 119477612 117353174 115342806
3106A15342806k139799k228336k015351j862432j871965k085763j770603j713652
$$ 115342806 113203007 110974671 108959320 107096888 105224923 103139160 101368557 99654905
3098I9654905j833311j739796j878887j941158j816305j951668j975543j611722
$$ 99654905 97821594 96081798 94202911 92261753 90445448 88493780 86518237 84906515
3090H4906515j325659j418845r87904p67518o98721o13533m44158l33912k21723
$$ 84906515 83580856 82162011 81174107 80406589 79707868 79094335 78650177 78316265 78094542
3081G8094542j96260l52865n67244k40236l40551o45624n60904q54889j154060
$$ 78094542 77898282 77545417 76978173 76737937 76397386 75751762 75190858 74335969 73181909
3072G3181909j279699j455639j553291j548400j754796j849726k164656j863473
$$ 73181909 71902210 70446571 68893280 67344880 65590084 63740358 61575702 59712229
3064E9712229j889035j738082j701531j905472j680329j459785j604354j571805
$$ 59712229 57823194 56085112 54383581 52478109 50797780 49337995 47733641 46161836
3056D6161836j336350j207772r89018j161214j132835q45003p08103p99449n59490
$$ 46161836 44825486 43617714 42628696 41467482 40334647 39489644 38781541 37982092 37422602
3047C7422602o22379n63348k38242l69237k08777l57908j31538P0072j1990J36226
$$ 37422602 36800223 36236875 35998633 35629396 35420619 35062711 34931173 35001245 34989255 35125481
3037C5125481J01832M7108K07728M60890L98531J06683L44805N38814L95338K10428
$$ 35125481 35227313 35274421 35482149 35943039 36341570 36448253 36793058 37331872 37727210 37937638
3027C7937638O73817Q31228M71213P21135O71571O85258O23857P74871P54466
$$ 37937638 38611455 39442683 39913896 40635031 41306602 41991860 42615717 43390588 44145054
3018D4145054Q30245J014197Q36287Q84685P87625R99698R44835J019443J307809
$$ 44145054 44975299 45989496 46825783 47710468 48498093 49497791 50442626 51462069 52769878
3009E2769878J513534J695989J759572K054693K209160K339736K546302K965685
$$ 52769878 54283412 55979401 57738973 59793666 62002826 64342562 66888864 69854549
3001F9854549L525403L865944M370691M757248M933910N127957N093279M930123
$$ 69854549 73379952 77245896 81616587 86373835 91307745 96435702 101528981 106459104
2993A06459104M721768M097104M043195M579548N212236N480321O727723Q285833
$$ 106459104 111180872 115277976 119321171 123900719 129112955 134593276 141320999 149606832
2985A49606832R378858J0785496J1642665J1851861J0478054P347227L485103
$$ 149606832 158985690 169771186 181413851 193265712 203743766 211090993 214576096
2978B14576096j639509o451536j0002353j2178925j3269703j3115257j2824895
$$ 214576096 212936587 206485051 196482698 184303773 171034070 157918813 145093918
2971A45093918j1846702j0298346q935267q025569p003241o152878n417849n052725
$$ 145093918 133247216 122948870 114013603 105988034 98984793 92831915 87414066 82361341
2963H2361341m550707l966071l668015l023941k806599k820691k250585j957051
$$ 82361341 77810634 73844563 70176548 67152607 64346008 61525317 59274732 57317681
2955E7317681j897549j765163j761891j388720j092859r89957j006000q27317
$$ 57317681 55420132 53654969 51893078 50504358 49411499 48421542 47415542 46588225
2947D6588225o96740p86905p74934l33422k69562l06416j78741r8978J48039J18537
$$ 46588225 45891485 45104580 44329646 43996224 43726662 43420246 43241505 43142527 43290566 43409103
2937D3409103l6451J99346L23878N13926N62525O93524N97174N79342J034725
$$ 43409103 43372652 43571998 43895876 44409802 44972327 45665851 46263025 46842367 47877092
2928D7877092J330531J176317J245373J216274J782856J869203J838843J930590
$$ 47877092 49207623 50383940 51629313 52845587 54628443 56497646 58336489 60267079
2920F0267079J929438J970163J863527J044423Q42317L81521O7084R8451k3534
$$ 60267079 62196517 64166680 66030207 67074630 67916947 68298468 68365552 68464003 68440469
2911F8440469j03158J7411m8554q634J12976M03407M20071L55983L98313R50539
$$ 68440469 68337311 68354722 68306168 68297534 68410510 68813917 69233988 69589971 69988284 70938823
2901G0938823J122555J303056J780898J652165J938257K373430K764134K983069
$$ 70938823 72061378 73364434 75145332 76797497 78735754 81109184 83873318 86856387
2893H6856387L779889M162300M683087M535192M315565L269486K515749K584002
$$ 86856387 90636276 94798576 99481663 104016855 108332420 111601906 114117655 116701657
2885A16701657K929854L656942M016006N017417O024458O999691Q104035R207817
$$ 116701657 119631511 123288453 127304459 132321876 138346334 145346025 153450060 162657877
2877A62657877R834068J0037911J0371994J0739075J1024428J2168788J3963710
$$ 162657877 172491945 182529856 192901850 203640925 214665353 226834141 240797851
2870B40797851J6514131J9248735K2404278K3891430K2509064J7509334Q136077
$$ 240797851 257311982 276560717 298964995 322856425 345365489 362874823 371010900
2863C71010900l504419j3404065k0557778k4232518k5382030k4841138k3031729
$$ 371010900 367506481 354102416 333544638 309312120 283930090 259088952 236057223
2856B36057223k0478674j8084377j6095293j4452740j3210680j1778399j1032405
$$ 236057223 215578549 197494172 181398879 166946139 153735459 141957060 130924655
2849A30924655r902789q923008p798460p195758o144690n725785n217899m544641
$$ 130924655 121021866 112098858 104300398 97104640 90959950 85234165 80016266 75471625
2841G5471625m231853l761881l402585l128017k776888k539329k457866k418144
$$ 75471625 71239772 67477891 64075306 60947289 58170401 55631072 53173206 50755062
2833E0755062k041121k220862k149848j953617j499769j475834j532356j373116
$$ 50755062 48713941 46493079 44343231 42389614 40889845 39414011 37881655 36508539
2825C6508539j270492j303961j053383j035191j091462r47284o98008q07448r14351
$$ 36508539 35238047 33934086 32880703 31845512 30754050 29806766 29108758 28301310 27386959
2816B7386959q05818q55120p30590p57570o15076o63707p43008o62689n45663
$$ 27386959 26581141 25726021 24995431 24237861 23622785 22959078 22216070 21553381 21007718
2807B1007718m26088n65740m81163k85151j35519m21187n91059k03918o31727
$$ 21007718 20581630 20015890 19534727 19249576 19114057 18692870 18101811 17897893 17266166
2798A7266166l70447n48501l66685m92280l36644m33112l88170k38474n16991
$$ 17266166 16895719 16347218 15980533 15488253 15151609 14718497 14330327 14091853 13574862
2789A3574862l83997l57183o6561l27671l68427l05282j55654k72938m77291m24101
$$ 13574862 13190865 12833682 12767121 12439450 12071023 11765741 11610087 11337149 10859858 10435757
2779A0435757k70880M9100j15274j43829k67652k92935k42181k6787L2634k54890
$$ 10435757 10164877 10213977 10098703 9954874 9687222 9394287 9152106 9125319 9157953 8903063
2769H903063k06233l03748q0763j50507j08113q738k50786k82858j83889j66500
$$ 8903063 8696830 8393082 8312319 8161812 8053699 8044961 7794175 7511317 7327428 7160928
2759G160928K88719j33217m26877L2658K2178j21905k56256m2735N5903k17973
$$ 7160928 7449647 7316430 6889553 6922211 6944389 6822484 6566228 6523493 6579396 6361423
2749F361423j63988q4437j95245k82614M4166j34932O2624K34118j84082j41448
$$ 6361423 6197435 6112998 5917753 5635139 5679305 5544373 5606997 5841115 5657033 5515585
2739E515585j49431j97014j92544J04542j39870n4843j09741M880q6046l5375
$$ 5515585 5366154 5169140 4976596 5081138 4941268 4886425 4776684 4781564 4695518 4660143
2729D660143J50695l42678l14865J01634Q2783l8821J51780r4173k2003r806k15484
$$ 4660143 4810838 4468160 4153295 4254929 4337712 4298891 4450671 4356498 4334495 4324689 4109205
2718D109205q0570k9943k9183m4615n6407j53620J18371q4015j49032K63884J81086
$$ 4109205 4028635 3998692 3969509 3924894 3868487 3714867 3833238 3749223 3600191 3864075 4045161
2707D045161j25860k20243N7946L5J0324r2225K13J55036j39336n698L0916N1000
$$ 4045161 3919301 3699058 3757004 3757039 3767363 3675138 3675351 3830387 3691051 3685353 3716269 3767269
2695C767269J35660J52559k30108r8059r7216k7389J2312k22097k20531k6765
$$ 3767269 3902929 4055488 3825380 3727321 3630105 3602716 3615028 3392931 3172400 3145635
2685C145635K38803j25717j86911J2615q3260p3491j395q8700k29422l801L0159
$$ 3145635 3384438 3258721 3071810 3084425 3001165 2927674 2926279 2837579 2608157 2604356 2634515
2674B634515J81600j69359m17436K07314Q0673n6226m4098o2157R1057L6611j43703
$$ 2634515 2816115 2646756 2229320 2436634 2517307 2461081 2416983 2354826 2445883 2482494 2338791
2663B338791j94417k22317P9932K55718J1278k80947J4245N5359J85212j18426
$$ 2338791 2144374 1922057 2001989 2257707 2268985 1988038 2002283 2057642 2242854 2124428
2653B124428k26841J51230j55542j57519J41815o0083q2173J25635j74004J01859
$$ 2124428 1897587 2048817 1893275 1735756 1877571 1817488 1735315 1860950 1686946 1788805
2643A788805q4P3015P8571k0625N8999m6635q9795O9799J77256M9909k7968k06150
$$ 1788805 1788721 1861736 1940307 1919682 1978681 1932046 1842251 1912050 2089306 2139215 2111247 1905097
2631A905097J01604M3016n2643L5472L4915j74790j37396q2098J12410m9842k05454
$$ 1905097 2006701 2049717 1997074 2032546 2067461 1892671 1755275 1673177 1785587 1735745 1530291
2620A530291K33122K9898K37569J31558p0293o0180k06215J33106j11760q1028
$$ 1530291 1763413 1793311 2030880 2162438 2092145 2031965 1825750 1958856 1847096 1766068
2610A766068k2395J24857P8449n9086n916J4108J6100J09986k84166O8678J17181
$$ 1766068 1743673 1868530 1946979 1887893 1881977 1896085 1912185 2022171 1738005 1806683 1923864
2599A923864q074J49998n3711K8312Q4803K01709j8318j7726j54388Q7163J68015
$$ 1923864 1915790 2065788 2012077 2040389 2125192 2326901 2308583 2290857 2136469 2223632 2391647
2588B391647p6799K12073J16661R8671l6881M353K13009j43748J22602M3149o3999
$$ 2391647 2314848 2526921 2643582 2742253 2705372 2709725 2922734 2778986 2901588 2944737 2880738
2577B880738j15493J7703j90370k41784j5462n9911j71182j38698K7944l8135
$$ 2880738 2765245 2782948 2592578 2350794 2335332 2275421 2104239 1965541 1993485 1955350
2567A955350l4663j32187j52882j23116k0958M0676j01640q5963l03925j00496
$$ 1955350 1920687 1788500 1635618 1512502 1491544 1532220 1430580 1344617 1040692 940196
2557I40196M58116j81901k82176L29394q870J38150k27328r177L0282j68762j97676
$$ 940196 1398312 1216411 934235 1263629 1254759 1392909 1165581 1156404 1186686 1017924 820248
2546H20248n4534Q6264R5621k7832J95154P8496k34926q4225j30567L3448N2071
$$ 820248 765714 851978 947599 919767 1114921 1193417 958491 874266 743699 777147 829218
2535H29218n7007P2983o3347j51333L01616j03470J04578o8569j01569K2849Q8656
$$ 829218 772211 845194 781847 630514 932130 828660 933238 864669 763100 785949 874605
2524H74605J58729j24118M4305L4380l08692j32405R3236P3783L9239K7913J08011
$$ 874605 1033334 909216 953521 987901 679209 546804 640040 713823 753062 780975 888986
2513H88986J06807j65758k30500J68254m8533J0113k8883l2031N6946r6067L8698
$$ 888986 995793 830035 599535 767789 719256 729369 700486 668455 725401 629334 668032
2502F68032R3647Q5768K118j05968j58631J46739Q6068j36735n5625j16404J32588
$$ 668032 761679 847447 849565 743597 584966 731705 817773 681038 625413 509009 641597
2491F41597O1910J2484n2490l6486J2849k06958J46895m1547N9904p2782J96528
$$ 641597 703507 715991 663501 627015 639864 432906 579801 538254 598158 525376 721904
2480G21904p1126r7270K915Q4022Q3800q0227r3684K5770l171p5656P8208O1111
$$ 721904 650778 553508 556423 640445 724245 644018 550334 576104 572933 497277 575485 636596
2468F36596r7103K1820L1270N572q9288q3994l5572P6400M3459M0259O211m3374
$$ 636596 539493 561313 592583 598155 508867 424873 389301 465701 509160 549419 555630 512256
2456E12256r306p7116n4096R5046O9804r261J35856k54025k424Q8601J31775R112
$$ 512256 502950 425834 371738 466784 536588 527327 663183 409158 406734 495335 627110 636222
2444F36222j58897j85474k26218M14889P6057j04506N9214k35842O4490J60608
$$ 636222 477325 291851 65633 480522 556579 452073 511287 275445 339935 500543
2434E00543J62103k93910j53841l7301P4661m5066M9619K20533j9301j24683K13497
$$ 500543 662646 368736 214895 177594 252255 207189 256808 477341 458040 333357 546854
2423E46854J7461J53680K2653j36374j09908N5496j22910K05913m8062j14783
$$ 546854 564315 717995 740648 604274 494366 549862 426952 632865 584803 470020
2413D70020Q5716k79142J49127j30376k06831j42302K17326Q7548Q2132M5387
$$ 470020 555736 276594 425721 295345 88514 -53788 163538 251086 333218 378605
2403C78605j35247j7678L1638k6530J70018q6544m4883J64402q8627J38738k85938
$$ 378605 243358 225680 257318 230788 400806 314262 269379 433781 345154 483892 197954
2392A97954o5952K70285J23708r8046j57229L1776J43964J08763L8230j39510
$$ 197954 132002 402287 525995 427949 270720 302496 446460 555223 593453 453943
2382D53943p9215R975R3415o9181k9515K05709n0715J69307k1609j33593j48196
$$ 453943 374728 384703 478118 408937 379422 585131 534416 703723 682114 548521 400325
2371D00325J05436m2208j66728J70194R6251q0413o5692K17526k3621r6605r267
$$ 400325 505761 463553 296825 467019 563270 482857 417165 634691 611070 514465 505198
2360E05198p5120l7974J89559J23488j89389J94858J61236j8252k10204j53495
$$ 505198 430078 392104 581663 705151 515762 710620 871856 853604 643400 489905
2350D89905m5554j5328N5609k32155J78371R0342N9888M6068l33728o8021J48446
$$ 489905 444351 429023 484632 252477 430848 521190 581078 627146 293418 225397 373843
2339C73843O6322k5668j56046L9727M7874N6702J06380J69481j91230j01232J3254
$$ 373843 440165 414497 258451 298178 346052 402754 509134 678615 487385 386153 399407
2328C99407j07578K01154n0522r6582j50966K59045J53683k08841k213k0768m9832
$$ 399407 291829 492983 442461 345879 194913 453958 607641 398800 396587 375819 325987
2317C25987k57782n415O3851J6839J16653j09173P7566o0728n7674O1981L88172
$$ 325987 68205 62790 126641 143480 260133 150960 228526 167798 110124 172105 560277
2306E60277o3878l61793N1099J24278j40335m3755J6019K25671J94645J4347m09515
$$ 560277 496399 134606 185705 309983 169648 125893 141912 367583 562228 576575 167060
2295A67060N4126J14239j5183R4385l7913j66985K18584J29905k30482j4393Q4082
$$ 167060 221186 335425 320242 414627 376714 209729 428313 558218 327736 313343 397425
2284C97425j86442J97614J14961k79172N3721j6473q0198j7506J1055k8620J58159
$$ 397425 210983 408597 523558 244386 298107 281634 201436 183930 194985 166365 324524
2273C24524J7207J15344j07473Q1863J68824J33583k24858n2513j34853J66661
$$ 324524 341731 457075 349602 431465 600289 733872 509014 456501 321648 488309
2263D88309L9138R7078m9564P2942j90150n7701J86225j1481l30135M5612L32259
$$ 488309 527447 624525 574961 647903 457753 400052 586277 574796 244661 290273 622532
2252F22532l7721N1622k14174N1709R5287K51639k13513j14708l4463k7529J89576
$$ 622532 584811 636433 422259 473968 569255 820894 607381 492673 458210 430681 620257
2241F20257p904n4124K7381R4443J23315j3338q0150K7831j46920r8486K16897
$$ 620257 612353 558229 585610 680053 803368 790030 709880 737711 590791 492305 709202
2230G09202M675j93988l2712M9512j27088q4687J78839k0524o9731M9751n1277
$$ 709202 713877 519889 487177 536689 409601 324914 503753 483229 413498 463249 411972
2219D11972J2183K44226k5872k03031J76695K6920J9516m7862r9849j27002J42973
$$ 411972 424155 668381 642509 439478 616173 643093 662609 614747 514898 387896 530869
2208E30869j3385Q594J33753n3096j45891J09790N6897P6014p0101r0497P0261
$$ 530869 517484 526078 659831 606735 460844 570634 627531 703545 633444 542947 613208
2197F13208K81687r574k73645J9185L2225K131J6514J9543J69407o6137j52693
$$ 613208 894895 885321 611676 630861 663086 665217 681731 701274 870681 804544 651851
2186F51851J13407M0350J73063j01035O6214J2581k39044J09339J83354n5391
$$ 651851 765258 805608 978671 877636 943850 956431 717387 826726 1010080 954689
2176I54689N1810K1964k0598M1548Q1878Q8721j57130m2877l2800N0609L53831
$$ 954689 1006499 1028463 1007865 1049413 1131291 1220012 1062882 1020005 987205 1037814 1391645
2165A391645Q5929l4947j71023K55147j29708J42525J73013N4395J31269p0328
$$ 1391645 1477574 1442627 1271604 1526751 1397043 1539568 1712581 1766976 1898245 1827917
2155A827917j56650k0203J03210k1498l4866O9542J30547J70024J28241K17950
$$ 1827917 1671267 1651064 1754274 1732776 1697910 1767452 1897999 2068023 2196264 2414214
2145B414214n1377n497j71378q9228K30714P2216j10892L0436M85598K7922n2157
$$ 2414214 2362837 2357340 2185962 2096734 2327448 2399664 2288772 2319208 2804806 2832728 2780571
2134B780571n6885J77621J44437n3176J48987J27582l3189J87133K08036J19030
$$ 2780571 2723686 2901307 3045744 2992568 3141555 3269137 3235948 3423081 3631117 3750147
2124C750147J18781J97705J66294J82698J03251L27329J40916K12315K36099M62779
$$ 3750147 3868928 4066633 4232927 4415625 4518876 4846205 4987121 5199436 5435535 5898314
2114E898314L99937K11101L14620M21689L72091M02199N38810P47014R30109O20005
$$ 5898314 6298251 6509352 6823972 7245661 7617752 8019951 8558761 9305775 10235884 10855889
2104A0855889R63731R19462J073608O10880R60478J205993J593517J763972J907166
$$ 10855889 11819620 12739082 13812690 14423570 15384048 16590041 18183558 19947530 21854696
2095B1854696K942993L538880M322767N444999O857506R145503R251532Q128586
$$ 21854696 24797689 28336569 32659336 38104335 44961841 54107344 63358876 71487462
2087G1487462L379251n432780q018768q064970p781107p273649o815173m730831
$$ 71487462 74866713 69433933 61415165 53350195 45569088 38295439 31480266 26749435
2079B6749435l595397k720654k101644j602697j264160j134648p73054j018427
$$ 26749435 23154038 20433384 18331740 16729043 15464883 14330235 13557181 12538754
2071A2538754q66973j048785q83312o97348n50252o20249n72238k21838l99255
$$ 12538754 11671781 10622996 9739684 9042336 8492084 7871835 7299597 7077759 6678504
2062F678504m77698j48417j56043k72953m07875k10542l73437k42541j36796k16400
$$ 6678504 6200806 6052389 5896346 5623393 5215518 5004976 4631539 4388998 4252202 4035802
2052D035802k07260l62534n7057o4913j1284j44342J32587j08394k40120j03813
$$ 4035802 3828542 3466008 3408951 3344038 3332754 3188412 3320999 3212605 2972485 2868672
2042B868672j8976j37050p5936p8995j27761P0559r2775j5245j01802Q8221j11778
$$ 2868672 2849696 2712646 2636710 2557715 2429954 2500513 2407738 2392493 2290691 2378912 2267134
2031B267134j87794l528K2248j417k9410j08515j02208N9431m3246L8033j44532
$$ 2267134 2079340 2075812 2098060 2096643 2067233 1958718 1856510 1915941 1872695 1910728 1766196
2020A766196K5601k904k40937L4336j28768j29364k34458m5877K42100n5407j29565
$$ 1766196 1791797 1788893 1547956 1582292 1453524 1324160 1089702 1043825 1285925 1230518 1100953
2009A100953Q6734m2052j01994J74430j4551L0685N5273j75448k64702q1309r484
$$ 1100953 1187687 1145635 1043641 1218071 1203520 1234205 1289478 1114030 849328 768019 758535
1998G58535j62426K30605R4187j68388k8713J7145K8282J0782K3837J9124K0529
$$ 758535 596109 826714 920901 752513 723800 740945 769227 780009 803846 822970 843499
1987H43499R3161o5583j80416j07331K3264M9084j17258k5589m1249R1230l3605
$$ 843499 936660 871077 690661 583330 606594 655678 538420 512831 471582 562812 529207
1976E29207J28591J14621p1120k15475J64650k5982k43240j06071J82109K40489
$$ 529207 657798 772419 701299 485824 650474 624492 381252 275181 457290 697779
1966F97779r3227j28248l3801J2580k1309n3985J50983J01901j76999Q64M0048
$$ 697779 604552 476304 442503 455083 433774 379789 530772 632673 455674 456538 496586
1955D96586k8213J12054P8638k01382n2038L1946J88088p6728k64108L7442l608
$$ 496586 468373 580427 659065 457683 405645 437591 625679 548951 284843 322285 318677
1944C18677l4976l527k13381Q8218P5533R695P3871k58904L20988j27854k7597
$$ 318677 283701 280174 66793 155011 230544 240239 314110 55206 376194 248340 220743
1933B20743J52044j17362J8503J4086J21275N2467j50708j96437J81851L0274
$$ 220743 372787 255425 273928 288014 409289 461756 311048 114611 296462 326736
1923C26736J1394N9445l9657q3068j5543k32728L39821K8971r2162M0229k60482
$$ 326736 338130 397575 357918 274850 259307 26579 366400 395371 303209 343438 82956
1912H2956O1814K08040j81282j46323J00243k8113O5035J82956o4812j69223o5429
$$ 82956 144770 352810 171528 25205 125448 97335 162370 345326 280514 111291 45862
1901D5862J64225O846O2178O5602j70516K21476J29587k90114m3305j60486j10300
$$ 45862 210087 216933 279111 344713 174197 395673 525260 235146 191841 31355 -78945
1890g8945k6360L5M72938O4434n8757k28446j48112Q2134O6946J66282L2048j90759
$$ -78945 -105305 -105270 367668 432102 373345 144899 -3213 78921 145867 312149 344197 153438
1878A53438m3005q424R0800J34460j77084R7878J07194l06412m3723J57366J67271
$$ 153438 110433 102009 192809 327269 150185 248063 355257 48845 5122 162488 329759
1867C29759J16468j33666k92144n3479K38900N2619o9867N7998j4488o3461J48862
$$ 329759 446227 312561 20417 -33062 205838 258457 188590 246588 232100 168639 317501
1856C17501L7573j56725L57408m5230o6242k39732j6806K0331l0755k63504J32021
$$ 317501 355074 198349 555757 510527 444285 204553 187747 208078 177323 -86181 45840
1845D5840K37245k717Q7173p0510n5469J6666j01433j49529R9180P0226L1053
$$ 45840 283085 280368 367541 297031 241562 258228 156795 7266 106446 176672 207725
1834B07725J07001N1292k09940L9414K28370r0861n6335J0231m7797J02346m831
$$ 207725 314726 366018 156078 195492 423862 333001 276666 286897 239100 341446 336615
1823C36615Q8899J5985j58718M9972L3979O7867K29918j70337j43000q3864P3338
$$ 336615 425514 441499 282781 332753 366732 434599 664517 494180 351180 267316 340654
1812C40654P3373k0865k90548k8422Q7930L0719L5152J41402p8120m1895k60383
$$ 340654 414027 393162 102614 74192 162122 192841 227993 369395 291275 249380 -11003
1801a1003J26387j47008M4090O6439O8655L4724j07088p4706Q3389n9522n3376
$$ -11003 115384 -31624 12466 78905 147560 182284 75196 490 83879 24357 -29019
1790b9019L2251K2076K18980K2558r5031k196m6112j28529L2428N0705M1520r7693
$$ -29019 3232 25308 244288 266846 171815 169619 123507 -5022 27406 78111 119631 21938
1778B1938j869K06366O4057j21432r3048l8014J83188q8243M5633j86497K8880
$$ 21938 20069 226435 290492 169060 76012 37998 221186 132943 178576 -7921 20959
1767B0959J31673k27558R7571K536N9915l0949q8914M338j5666r904J98280l6745
$$ 20959 152632 -74926 22645 25181 85096 54147 -34767 -30429 -46095 -55999 142281 105536
1755A05536j63180R6520Q938L3133p1613Q261p8133N969j03642K02359J56911
$$ 105536 -57644 38876 47814 80947 9334 17595 -60538 -54569 -158211 44148 201059
1744B01059j13546n2344j09888j88634J38180k2246J27024j3691q0983K64927
$$ 201059 87513 35169 -74719 -263353 -125173 -147419 -20395 -34086 -115069 149858
1734A49858j84700N7415n8363o5022K11462J6018j3893j6624J3568p1643K5462
$$ 149858 -34842 22573 -35790 -100812 110650 126668 112775 96151 109719 38076 63538
1723F3538k3602o0517N4547K9137j09377j80523J84409M03m9930N9231k6095J36264
$$ 63538 39936 -20581 33966 63103 -46274 -226797 -42388 -41985 -91915 -32684 -58779 77485
1711G7485q0664P1218K03000n601k55756R5461q0761K096o4580m7781P6117Q3438
$$ 77485 -3179 68039 271039 265438 9682 105143 24382 26478 -38102 -85883 -9766 73672
1699G3672l8246M2524J65271j73774o4545r7680O7775n2934j98813L09519M2773
$$ 73672 35426 77950 243221 69447 4902 -92778 -25003 -77937 -276750 32769 75542
1688G5542K4629O6239j12954R2946M3949r7128O5603j31220q7989K89205J8316
$$ 75542 100171 166410 53456 146402 190351 93223 158826 27606 -60383 228822 247138
1677B47138n3555j42883j9058j1125q688J44470j21549o6312m3431K13528p1096
$$ 247138 193583 50700 31642 20517 11829 156299 34750 -31562 -74993 138535 67439
1666F7439N1520Q4792q2715j47550N377J19714Q3772j48189P767Q0399k01377
$$ 67439 118959 203751 121036 -26514 -21137 98577 182349 34160 41927 122326 -79051
1655g9051J7348R8495j48968k22123Q8149q291K07629O0611L2473P2739j19439
$$ -79051 -61703 36792 -112176 -334299 -246150 -254441 -46812 13799 46272 119011 -428
1644d28j8506L12738r5164j0625M3378k21505m4668P0411P7626k6396J12349M1257
$$ -428 -18934 293804 198640 188015 231393 9888 -34780 35631 113257 86861 199210 240467
1632B40467k98832J14808o8764J62471O1855J1806j31088k00449J04684K38723
$$ 240467 -58365 56443 -12321 150150 212005 223811 92723 -107726 -3042 235681
1622B35681j98949m0980K60338p0952k18245J83603J74755r5611j04276j94152
$$ 235681 36732 -4248 256090 185138 -33107 150496 325251 229640 125364 -68788
1612f8788N8896J40120k19617k01724j0963J70249J47867J37513L0589J0233O2156
$$ -68788 -9892 130228 -89389 -291113 -302076 -131827 16040 153553 184142 194375 256531
1601B56531j78669P9336J11145j75940q8003K9951q515J27217K2640m188m3827
$$ 256531 77862 157198 268343 92403 4400 34351 25836 153053 175693 171505 127678
1590A27678j19053n1903L2260k7538N1501j50806o2615M6373L14893N3284j3756
$$ 127678 8625 -43278 -11018 -38556 12945 -137861 -200476 -154103 160790 214074 200318
1579B00318K0871j35054L4454J05508n7158j11172j63309k38994J24869J56826
$$ 200318 221189 86135 120589 226097 168939 57767 -105542 -344536 -219667 -62841
1569f2841M1011N6227J11479O2261q3741k1905O7048K4966j32293J10662J8680
$$ -62841 -21830 34397 145876 208137 124396 102491 169539 194505 62212 172874 191554
1558A91554j10139m7620r7630J59733k47603K2566J14028l75J02210Q081k9255
$$ 191554 81415 33795 -63835 95898 -151705 -129139 -15111 -15486 86724 94805 65550
1547F5550k00438p2157J23429k9564J23321J6531j40638J6796N8368j77873J51106
$$ 65550 -134888 -207045 -83616 -113180 10141 26672 -113966 -97170 -38802 -216675 -65569
1536f5569J31929q5353l0148J09621O9579p9834J13308J58663N8838j70382j47809
$$ -65569 66360 -18993 -49141 60480 130059 50225 163533 322196 381034 210652 62843
1525F2843J909J0994K9019k2015j67136j65364K19738k9766o7483n6288m8651
$$ 62843 64752 75746 104765 82750 -84386 -249750 -30012 -59778 -127261 -183549 -232200
1514b32200K52149Q8953j12342j11809j25227L8296J27545r3724K05833j00095
$$ -232200 19949 108902 -3440 -115249 -240476 -202180 -74635 -168359 37474 -62621
1504f2621Q985J69982J7569p6169J8330O9462j33685j67814K10888o0511K3011
$$ -62621 -53636 116346 133915 57746 76076 145538 11853 -155961 54927 -5584 17427
1493A7427O9993n0597k12314L7939K46206J42404l26967j56095R2665J06537N691
$$ 17427 87420 36823 -175491 -137552 108654 251058 -75909 -232004 -139339 -32802 -27111
1482b7111J45189q7006j91580q6020M4171M5795l7578K47426J8562p7630J31660
$$ -27111 118078 31072 -160508 -246528 -202357 -156562 -194140 53286 71848 -5782 125878
1471A25878K9592O4073r2906L4680R9607o4020J89884m21611k39289K12871j5914
$$ 125878 155470 219543 126637 161317 260924 196904 386788 -34823 -274112 -61241 -77155
1460g7155M0571M8609J91661J13288k28950j99703J3743J2650J42550M5085k33773
$$ -77155 -36584 12025 203686 316974 88024 -111679 -97936 -85286 57264 102349 -131424
1449a31424J93598O7475l8423O2631n5678J20701j63836l9671n5991n0986K79811
$$ -131424 62174 129649 91226 153857 98179 218880 55044 15373 -40618 -91604 188207
1438A88207j26075R6389k11888L1032J26944m9503o0364p887n4228J86134K17972
$$ 188207 62132 158521 -53367 -22335 104609 55106 -5258 -13145 -67373 118761 336733
1427C36733k04220n8882m8100R2438j22677P775k3202L4249J61105r2460j23725
$$ 336733 132513 73631 25531 117969 -4708 3067 -20135 14114 175219 82759 -40966
1416d0966R2488r579r3608J93335q5268j31629n9683j166L5731J73956l7069j58435
$$ -40966 51522 41943 -51665 141670 56402 -75227 -134910 -136076 -100345 73611 36542 -121893
1404a21893J82520K21784j85075j16762J04646N2873J9243j49693j78629J97138
$$ -121893 60627 282411 97336 -19426 85220 138093 157336 7643 -170986 26152
1394B6152J01267k37634j18205Q3436l4234q1526j8427Q2453L11071q4508k00219
$$ 26152 127419 -110215 -228420 -144984 -179218 -260744 -279171 -196718 114353 29845 -170374
1383a70374J7117J80657m2773j10893K6896J0644J12181p2253m4993L142r1756
$$ -170374 -153257 27400 -15373 -126266 -99370 -88726 23455 -48798 -93791 -90649 -182405
1372a82405o1717L06604Q474j37057N6696p7693J4266L1201j5300Q6417J09994
$$ -182405 -244122 62482 70956 -66101 -9405 -87098 -72832 -41631 -56931 29486 139480
1361A39480k0941l700O5585j8093j29342j17920J30885L8438r1816o1041K01029
$$ 139480 118539 114839 180424 162331 32989 -84931 45954 84392 -7424 -68465 132564
1350A32564k07662m334R8937Q3893q9813j31135J04096o8305J10924n4027O4807
$$ 132564 -75098 -79432 19505 103398 13585 -117550 -13454 -81759 29165 -24862 39945
1339C9945k749m0053j16160j24984J09991j88882R9616J4465P2667Q3787m3532
$$ 39945 37196 -2857 -119017 -244001 -134010 -322892 -223276 -208811 -136144 -52357 -95889
1328i5889K33669J06273q9772j09791L246O9380j96556j16003j13571j5350M0800
$$ -95889 137780 244053 154281 44490 47736 117116 -79440 -195443 -309014 -324364 -283564
1317b83564K95598j23733J18863L6945r3475Q8625p4829J47210j31057M7311K245
$$ -283564 12034 -111699 7164 44109 -49366 39259 -35570 111640 -19417 27894 30139
1306C0139j03423J21991K42230k52952K15089n8615r1028n2415o0122j01084L0308
$$ 30139 -73284 48707 290937 37985 253074 194459 103431 51016 -9106 -110190 -79882
1295g9882J11232J82240l3516k05599M4785M0130k05383L6177K12637j29491J8719
$$ -79882 31350 213590 180074 -25525 19260 59390 -145993 -109816 102821 -26670 -7951
1284g951J88362k54027J96380n4529k31501Q0772j26956p1888K01270J76370q0675
$$ -7951 180411 -73616 122764 68235 -163266 -82494 -209450 -281338 -80068 96302 15627
1273A5627q1784n4166n9865k0188J93072R536M2075J49269J22912j55469k37079
$$ 15627 -66157 -120323 -180188 -200376 -7304 2232 44307 193576 316488 161019 -76060
1262g6060j28990j9876J10450j79308K70251l84j18125p55l3948K4724L00922
$$ -76060 -205050 -224926 -114476 -293784 -23533 -23917 -142042 -142797 -176745 -152021 148901
1251A48901k8034M3287k9614L3835j37090n8547j39665R027N7230K5795K2904
$$ 148901 120867 164154 134540 168375 31285 -27262 -166927 -157900 -100670 -74875 -51971
1240e1971N6123J95254j25636j60887N1105K5892L861J05204j54034J05458j08027
$$ -51971 4152 199406 73770 -87117 -36012 -10120 -6259 98945 -55089 50369 -57658
1229e7658o977q9314K62011R22J5717K41344j4919j58857M4000k74134j46782
$$ -57658 -64635 -153949 108062 108984 124701 366045 351126 192269 236269 -37865 -184647
1218a84647K06062J265J58467k4787p8150k1656m1260K03398j41901M4678j13753
$$ -184647 21415 22680 181147 156360 78210 56554 15294 218692 76791 121469 7716
1207G716p2725P3291O1423J66438j76855O5102J49353k67346k6767M0971J9906
$$ 7716 -65009 8282 69705 236143 59288 124390 273743 6397 -20370 20601 40507
1196D0507R345Q6878k05960J2519j72189K67842R5415j08220Q1057O7162j62639
$$ 40507 49852 136730 -69230 -56711 -228900 38942 134357 26137 107194 174356 11717
1185A1717j85301O1718M4784j0704R6135m0095L0796J94168M2762r3399q6759
$$ 11717 -173584 -111866 -67082 -77786 18349 -21746 9050 203218 245980 152581 65822
1174F5822J78299k00457M2255p1578K1930R8706r9260m1952j29350M8058R7768
$$ 65822 244121 43664 85919 14341 36271 134977 35717 -6235 -135585 -87527 10241
1163A0241o000j46405P1289K03439J11093j10141m1242j19193J9702q9074L4224
$$ 10241 4241 -142164 -70875 132564 243657 133516 92274 -26919 -7217 -96291 -62067
1152f2067L50790j57810j93308N174n214K57196j9346j48672K24545j41804j87729
$$ -62067 288723 130913 -62395 -57221 -62435 194761 175415 26743 251288 109484 -78245
1141g8245K2899P084Q2684p1042J02841J7455k9026J14581j00673l0952k3918
$$ -78245 -55346 -48262 34422 -36620 66221 83676 54650 169231 68558 37606 13688
1130A3688J8668k00126M9042j3384J93096r1913k7342n5470o9955k18894K63419
$$ 13688 32356 -167770 -118728 -132112 60984 -30929 -58271 -113741 -183696 -402590 -139171
1119a39171J26698N053l4690n8873o5866J74396L7390j54044k7179n6593K21362
$$ -139171 -12473 -7420 -42110 -100983 -166849 7547 44937 -109107 -136286 -192879 28483
1108B8483K6476q7869L08030N8968j81110p5963Q8842p3675o8007n9111M1492
$$ 28483 54959 -32910 275120 334088 152978 77015 165857 92182 24175 -34936 6556
1097F556O1734o4721J30669l6444P4644p1050M5573j62390l2950j20057r4061
$$ 6556 68290 3569 134238 97794 172438 101388 146961 -15429 -48379 -168436 -262497
1086b62497J02696J28674O3905m0942J43618j18701j3137k3315j6140J1416M7358
$$ -262497 -159801 -31127 32778 -8164 135454 16753 3616 -19699 -35839 -24423 22935
1075B2935N0842j79018P2144R1286O4926j96750p4389n9511K53953N8249J40819
$$ 22935 73777 -105241 -33097 58189 123115 -73635 -148024 -207535 46418 104667 245486
1064B45486r7621o4081J12710k63987p072O6358N5125l672j60138P5168o3487
$$ 245486 147865 83784 196494 -67493 -74565 -8207 46918 43246 -116892 -41724 -105211
1053a05211J16283J34797j17518J58494K4325j05720k00481P7666P3373Q6922
$$ -105211 11072 145869 28351 186845 211170 105450 -95031 -17365 56008 142930
1043A42930l3551r6751l1721J37634m1895r3157P6935r6808k54747K5968J72905
$$ 142930 109379 12628 -19093 118541 76646 -16511 60424 -36384 -291131 -265163 -92258
1032i2258k03229J76597K38019q4429j86174m7979J90860L4577r0703K24718o7487
$$ -92258 -295487 -118890 119129 34700 -151474 -199453 -8593 25984 -64719 159999 92512
1021I2512k0225m2151j17512O6421J25409J64591J180j21261K9660J12462N8006
$$ 92512 72287 30136 -87376 -20955 104454 269045 270225 148964 178624 291086 349092
1010C49092k49084j19402j66685M5837K3785J08141j3861p947L9643n8208K09070
$$ 349092 100008 -19394 -186079 -140242 -116457 -8316 -22177 -30124 9519 -48689 160381
999A60381r7989K28549k59029o7741J15752j89145j76947J79608J18942j4074
$$ 160381 62392 290941 31912 -35829 79923 -109222 -286169 -106561 12381 -1693
989a693J09967K2413m7572m318p4804j7960M0587N6832K3961j0256O9431j3300
$$ -1693 108274 130687 83115 78797 3993 -13967 26620 83452 107413 97157 166588 153288
977A53288j81594q1498K7534j31396K7387L740l4120J02268k16635J544K37204
$$ 153288 -28306 -109804 -82270 -213666 -186279 -182539 -216659 -114391 -331026 -329482 -92278
966i2278L69581k5128k63452R5065N5609j19004n1606j2949k74948J87795J97486
$$ -92278 277303 252175 -11277 83788 139397 20393 -31213 -44162 -319110 -131315 66171
955F6171N5943j43098J05476L7098l63029P0259J13941o6078K10792O8746j85890
$$ 66171 122114 -20984 84492 121590 -241439 -171180 -57239 -123317 87475 156221 -29669
944b9669m280Q4388l2421n2096N3406P6408l8901L2126Q6135k28303L7243j52549
$$ -29669 -33949 50439 18018 -34078 19328 95736 56835 88961 175096 -53207 -15964 -168513
932a68513K9937J17870J30014j76870J0627O4313J2004K930j28581O6899J18088
$$ -168513 -138576 -20706 109308 -67562 -56935 7378 19382 22312 -106269 -39370 78718
921G8718o1302r7893P1219m6781q1524N1180O9143r7979j03007N2208O0864R5978
$$ 78718 17416 -80477 -9258 -56039 -137563 -86383 -17240 -115219 -218226 -166018 -105154 -9176
909i176m2669m4432J97552M4987P5606k2896N0105J90684o6823l85070n8165j00134
$$ -9176 -51845 -96277 101275 146262 221868 198972 249077 439761 372938 -12132 -70297 -170431
897a70431J0954J58494k396Q1940o6445j15863O9246L4934K6570m0813j59649
$$ -170431 -159477 -983 -3379 78561 12116 -103747 -34501 433 27003 -13810 -173459
886a73459L9943N6461n2655Q1323N6804L7308k41672j12809N4690J54707R1766
$$ -173459 -133516 -77055 -129710 -48387 8417 45725 -195947 -308756 -254066 -99359 -7593
875g593O202l5785L2073j12421J56372m2587j96987J53147N5090p2981j9569j4615
$$ -7593 -1391 -37176 -5103 -117524 38848 -3739 -200726 -47579 7511 -65470 -85039 -99654
863i9654J30327J20409L17k45165J15251M0599q6021J23259R0018m9458m349o9985
$$ -99654 30673 151082 151399 -93766 21485 62084 -23937 99322 189340 139882 135533 65548
851F5548j22877N266P406j1510K2099j58891r4949O0971J20399M5817j31324P971
$$ 65548 -57329 -52063 -44657 -56167 -34068 -192959 -287908 -226937 -106538 -60721 -192045 -184074
839a84074R5858J57816R2049j51328p3634Q5980j0969k64413J21801n3533j2078
$$ -184074 -88216 69600 161649 10321 -63313 22667 11698 -252715 -130914 -184447 -196525
828a96525J77834O45K06118n1363q071M4492p3342l47212J94540P2431n2227P010
$$ -196525 -18691 -18046 188072 136709 128638 173130 99788 -247424 -52884 19547 -32680 -25670
816b5670j47787l45180M38323J51946k9312N9847j13819O1119J4885q947k27125
$$ -25670 -173457 -518637 -80314 71632 42320 102167 -11652 49467 64352 55405 -171720
805a71720j26305J37480J83672M8564m527j36109j02106J44241o6221J37979L6313
$$ -171720 -298025 -160545 23127 71691 67164 -68945 -171051 -26810 -93031 44948 81261
794H1261j44827J5983J00573k35085m4164K84406p2968K4898p1783q6156M7680
$$ 81261 -63566 -47583 52990 -182095 -226259 58147 -14821 10077 -61706 -147862 -100182
783a00182K78077J08877j81320n3909r8211k5580J91405p7363o8960J5005o6851
$$ -100182 177895 286772 105452 51543 -46668 -72248 119157 41794 -27166 -12161 -79012
772g9012n8324j2847R3679o0088J7907j20771p7852J96714K79933k02132l17288
$$ -79012 -137336 -150183 -56504 -116592 -98685 -219456 -297308 -100594 179339 -22793 -340081
761c40081J91958J96781j31767J10016j06833R5938j2851q04j63159L7227o0388
$$ -340081 -148123 48658 -83109 26907 -79926 16012 3161 2357 -160802 -123575 -183963
750a83963K40196J76601j5972Q0288o2999k31648o3131J31220j8546r0313j03390
$$ -183963 56233 232834 216862 297150 234151 2503 -60628 70592 52046 -38267 -141657
739a41657K4224N1611J21066q1421j06148k32553Q2444J93282J65453j11319K3863
$$ -141657 -117433 -65822 55244 -26177 -132325 -364878 -282434 -89152 76301 -35018 -11155
728a1155j37026j1802Q7598M2900j77277Q9394m6238j05341L20780j63099j33154
$$ -11155 -148181 -159983 -72385 -29485 -206762 -117368 -163606 -268947 51833 -111266 -244420
717b44420K17700O0312M4333j99162M0585M7956J90715j53355N2851J0831k3130
$$ -244420 -26720 33592 77925 -121237 -80652 -32696 158019 4664 57515 68346 45216
706D5216J25153j95414k33902K44064P035j05448J32446n8682n2017K4994j39375
$$ 45216 170369 -25045 -258947 -14883 -7848 -113296 19150 -39532 -91549 -66555 -205930
695b05930M1902Q4799K7709K1590k62076J27690K5379M2748J44663q3358j47368
$$ -205930 -164028 -79229 -51520 -29930 -292006 -164316 -138937 -96189 48474 -34884 -182252
684a82252R5936L24802Q6102k28007j10741j73598M9408J42367j2895J9150j38307
$$ -182252 -86316 238486 324588 96581 -14160 -187758 -138350 4017 -8878 10272 -128035
673a28035L7530Q5959k0848N9283M7527o5803L9091J30955k4622q3554Q9545o7991
$$ -128035 -90505 -4546 -25394 33889 81416 15613 54704 185659 161037 77483 167028 99037
661I9037j11627j00876K29010k52775k362J61219N364l8838K8275O5663o2620
$$ 99037 -12590 -113466 115544 -137231 -139593 21626 26990 -11848 16427 82090 19470
650A9470j031l7778j5718q0124j25805J2361k7766j09760L05636j9037k39449
$$ 19470 18439 -19339 -35057 -115181 -240986 -228625 -256391 -366151 -60515 -79552 -319001
639c19001L3293R5965O6069P9737Q6263r0325j5473R0788P1030j57045j42026
$$ -319001 -285708 -189743 -123674 -43937 42326 -47999 -63472 27316 98346 -58699 -200725
628b00725K16924j48319j50481N8318k182O3743L027o3180p286J42203m2085M5038
$$ -200725 16199 -132120 -282601 -224283 -226465 -162722 -159695 -222875 -230161 -87958 -130043 -85005
616h5005K46508j13647j47555J41477J17458k77775J11169q9796J81218n0976
$$ -85005 161503 47856 -99699 41778 159236 -118539 -7370 -97166 84052 33076
606C3076K7414J06681j38636j51758q0952J87225K50345k61890m6084j2313J1449
$$ 33076 60490 167171 28535 -123223 -204175 -16950 233395 -28495 -74579 -86892 -75443
595g5443L4396J35235j08464j03999p8121L6072l7837J05572J48610j12457K6822
$$ -75443 -41047 94188 -14276 -118275 -196396 -160324 -198161 -92589 56021 -56436 -29614
584b9614J95919j49232N4093J0480l00375J42267K20994K5452j18151L36153j32414
$$ -29614 166305 17073 71166 81646 -218729 -76462 144532 169984 51833 387986 255572
573B55572m2584m2001k21829j66021K6937J86072N5802P1932n8503J60648j74966
$$ 255572 212988 170987 -50842 -216863 -189926 -3854 51948 123880 65377 226025 51059
562E1059j09082J02336J9535l5223k17655J20945l5513J73030K2740M3732K3890
$$ 51059 -58023 44313 63848 28625 -189030 -68085 -103598 69432 92172 135904 159794
551A59794l36298q0437K38246q988J74495q0368r7529J25085l62582J02107K57007
$$ 159794 -176504 -256941 -18695 -27683 146812 66444 -31085 94000 -268582 -166475 90532
540I0532j09570L4997j12367J36859P6880m8321j52907R4019J68161p9706R2127
$$ 90532 -19038 15959 -96408 40451 117331 69010 -83897 10122 178283 98577 190704
529A90704k4026j19248j07520j21362k7890N7937J80264M7461m543m5315j28214
$$ 190704 166678 47430 -60090 -181452 -209342 -151405 28859 76320 71777 26462 -101752
518a01752J2476q6773Q010r1704J47547K1605J20513j06547j06405P2624o5422
$$ -101752 -89276 -176049 -168039 -259743 -112196 -90591 29922 -76625 -183030 -110406 -175828
507a75828J53498P4482J7319r2706o9076q8830n9795m6795J94143K16151N2859
$$ -175828 -22330 52152 69471 -23235 -92311 -181141 -240936 -287731 -93588 122563 175422
496A75422p8264j75456j1958j46804J28324J6422j20892p4649J25727J57929j29966
$$ 175422 97158 -78298 -90256 -237060 -108736 -92314 -213206 -287855 -162128 -4199 -134165
485a34165J3107R7595J34224n4009M4929k9733j99124q3757L5985n0922L51954
$$ -134165 -121058 -23463 110761 56752 101681 71948 -127176 -210933 -174948 -225870 126084
474A26084O8824k23383N5382k5498j12584M6363L936L7989l3816k8515j28894
$$ 126084 194908 -28475 26907 1409 -111175 -64812 -60876 -22887 -56703 -85218 -214112
463b14112j46521K50968J70061J20526K0340j31184l5418p6911K3616P8960j45673
$$ -214112 -360633 -109665 60396 180922 201262 70078 34660 -42251 -18635 60325 -85348
452h5348l1634J73077L3773l6545k17605K31511k55679N9935J14021p1557j53887
$$ -85348 -116982 56095 89868 53323 -164282 67229 -188450 -128515 -14494 -86051 -239938
441b39938o275p8107K77585J78489J770j94501r1137J50707o8737J16535l6535
$$ -239938 -246213 -324320 -46735 131754 133524 -60977 -152114 -1407 -70144 46391 9856
430I856m6868j71532l0505J17741J81408R7588J28853j26104m2246k01088J00142
$$ 9856 -37012 -208544 -239049 -121308 60100 157688 286541 160437 118191 -82897 17245
419A7245r4525p2843J443k7700L0276M19398j97507k30201m986j41188N7174Q5846
$$ 17245 -77280 -150123 -148680 -176380 -146104 273294 75787 -154414 -159400 -300588 -243414 -157568
407a57568J11844R9202j94273p9325J51583J26896p0421r6245K6147j16170m9198
$$ -157568 -45724 53478 -140795 -220120 -68537 58359 -12062 -108307 -82160 -198330 -247528
396b47528J7194P4168k60374L6231K34112J83140P4447q2228k36524K5503J73531
$$ -247528 -230334 -156166 -416540 -380309 -146197 36943 111390 29162 -207362 -181859 -8328
385h328M496j5314M5676R263L9987J6757j73279Q3385j3057N7881j23581Q7730
$$ -8328 -3832 -19146 26530 35793 75780 92537 -80742 2643 -10414 47467 -76114 11616
373A1616l7234j09809j02817p8136J14479j64403j2906L65439k28781K4609K10315
$$ 11616 -25618 -135427 -238244 -316380 -201901 -366304 -379210 -13771 -242552 -217943 -7628
362g628j0526N6811J16366j38026o788j53210L3778N6504J312N1566P4292j17630
$$ -7628 -18154 38657 155023 16997 10209 -143001 -109223 -52719 -51407 159 74451 -43179
350d3179j39980j02500J8208K28730R0838j10632m2416P2530j59473j54480m019
$$ -43179 -183159 -285659 -267451 -38721 52117 -58515 -100931 -28401 -187874 -342354 -346373
339c46373R3303j25636Q1211o4382J18488j32384K13996K5394r0516n444N208
$$ -346373 -253070 -378706 -297495 -361877 -243389 -375773 -161777 -136383 -226899 -232343 -227135
328b27135J35848j47350O1524K73183l5555o8255O1443N6628O5944j36963m5622
$$ -227135 -91287 -238637 -177113 96070 60515 -7740 53703 110331 176275 39312 -6310
317f310j95785J57925L6301r7234P5820l0703j7439r0656J22880N5362j50828
$$ -6310 -202095 -44170 -7869 -105103 -29283 -59986 -77425 -168081 -45201 10161 -140667
306a40667j38315J63411k1232k138k5362L20223l5758j01105r2247K171l1701
$$ -140667 -278982 -115571 -136803 -138941 -164303 155920 120162 19057 -73190 -71019 -102720
295a02720l4514M4979m4202k3191k06684K4843J01626m0717J26184L7838J51971
$$ -102720 -137234 -92255 -136457 -159648 -366332 -341489 -239863 -280580 -154396 -116558 35413
284C5413J4400j33522Q3706L5678p479p8229m6260j54807M8965R1211J13073l417
$$ 35413 49813 -83709 -3 35675 28196 -50033 -96293 -251100 -202135 -110924 2149 -1268
272a268n0269k5851M6237p5715j12222j577p4092R9405Q1131m4421J03365P8514
$$ -1268 -51537 -77388 -31151 -106866 -219088 -220665 -294757 -195352 -114221 -158642 -55277 23237
260B3237k17015J5761q8456J25085K15824j00048r1560K20384j39593k45510q2045
$$ 23237 -193778 -178017 -266473 -141388 74436 -25612 -117172 103212 -36381 -281891 -363936
249c63936K30666J17196j99557k924K20327M9591N7749j32151j28664N3515r135
$$ -363936 -133270 -16074 -215631 -218555 1772 51363 109112 -23039 -151703 -98188 -107323
238a07323L27542o4335j08738j206j02634N2617P9451k3118j8109o8585j18133
$$ -107323 220219 155884 47146 45940 -56694 -4077 75374 52256 34147 -34438 -152571
227a52571o6732O0561r44J73652j86258L487J65544k75710r4013K76467n1563
$$ -152571 -219303 -158742 -159686 13966 -172292 -168805 -3261 -278971 -372984 -96517 -148080
216a48080R7858P9702k9536k87846j62919J95111M3078l9887J14980J54091J34880
$$ -148080 -50222 29480 -56 -287902 -450821 -255710 -212632 -252519 -137539 16552 151432
205A51432j38519j22158J05820j87442P1081J60494o3140J15062j40651j71055
$$ 151432 12913 -109245 -3425 -190867 -119786 40708 -22432 92630 -48021 -219076
195b19076k266l2602j2476R6402J7485N4648J3111R2168j75439q5728J30655k1394
$$ -219076 -221342 -253944 -266420 -170018 -152533 -97885 -84774 7394 -168045 -253773 -123118 -144512
183a44512K042J09920N2479n3341j32801N4685J61554j10644p743q2738K0792
$$ -144512 -142470 -32550 19929 -33412 -166213 -111528 50026 -60618 -68361 -151099 -130307
172a30307N6732N6539k08357N8978M9322O1759L818O1957J87223l98030p4552
$$ -130307 -73575 -17036 -225393 -166415 -117093 -55334 -51516 10441 197664 -200366 -274918
161b74918J07457P576R3559P5045m9605K0268j56612J20128K04539l09486j17799
$$ -274918 -167461 -159885 -66326 8719 -40886 -20618 -177230 -57102 147437 -162049 -279848
150b79848m0887Q0607n0563K35438q3725j0886l6800N5684K57293j12483j80025
$$ -279848 -320735 -240128 -290691 -55253 -138978 -149864 -186664 -130980 126313 13830 -166195
139a66195O8225k7377o9727J10471J24275j7761j90624q607q637J25060p9868
$$ -166195 -97970 -125347 -195074 -84603 39672 21911 -168713 -177320 -185957 -60897 -140765
128a40765n3427q0465M1509M9080J20667K8158r6777J22427o0093o4296J80115
$$ -140765 -194192 -274657 -233148 -184068 -63401 -35243 -132020 -9593 -69686 -133982 46133
117D6133J435j00192j34112N2717R2049J0568l4153R4526j5574k32393p5148J80562
$$ 46133 47568 -52624 -186736 -134019 -41970 -31402 -65555 28971 13397 -218996 -294144 -113582
105a13582j14870J470Q6337K8994R5393j57119K4155M1207j944j88636K535J23763
$$ -113582 -228452 -226982 -140645 -111651 -16258 -173377 -149222 -108015 -109959 -298595 -296060 -172297
93a72297L2447N1938N7682k2599J15433k849m021p2490M6612O6693j47797j42827
$$ -172297 -139850 -87912 -30230 -52829 62604 59755 55734 -16756 29856 96549 -51248 -194075
81a94075O5541j7477L9055q4442J05801J46222m7254j40021J1196N9032k6826
$$ -194075 -128534 -146011 -106956 -191398 -85597 60625 13371 -126650 -115454 -56422 -83248
70h3248m3398n6662J24665j45336o450K1294K43400k7406j4968j395m827j14797
$$ -83248 -126646 -183308 -58643 -203979 -210429 -189135 54265 26859 11891 10496 5669 -109128
58a09128o8067O837K6494J9917N799N354J8174N4441l2896O1091l0525m1942m866
$$ -109128 -177195 -170358 -143864 -123947 -118148 -112794 -94620 -40179 -73075 -11984 -42509 -84451 -89317
45h9317L568j458M3458j29832K9513J32317m9366R1995l9136j48932m8953K5403
$$ -89317 -85749 -87207 -43749 -173581 -144068 -11751 -61117 30878 -8258 -157190 -206143 -180740
33a80740K04202j39209K6425k6201K8139L6990m2746r6468j2365O3608J23330
$$ -180740 23462 -115747 -89322 -115523 -87384 -50394 -93140 -189608 -201973 -138365 -15035
22a5035k44007n3524J28190k1094K9694j22710O0709J97059P5892q7579M8524
$$ -15035 -259042 -312566 -184376 -205470 -175776 -298486 -237777 -40718 35174 -52405 -3881
11c881k44560P0709J84020R7276j24462K471m4443m5834r0669J13634L6953
$$ -3881 -248441 -177732 6288 103564 -20898 -18427 -62870 -108704 -199373 -85739 -48786
0d8786
$$ -48786
$$ Imaginary data points
##PAGE= N=2
##DATA TABLE= (X++(I..I)), XYDATA
16383c093441P6680p0476j23725J39972J24949J27361J31546k9143M9007m7226
$$ -3093441 -3016761 -3087237 -3210962 -3070990 -2946041 -2818680 -2687134 -2716277 -2667270 -2714496
16373b714496k7834J24487p8205L3230J64529M0216m0045n7306k744J48755M7897
$$ -2714496 -2742330 -2617843 -2696048 -2662818 -2498289 -2458073 -2498118 -2555424 -2558168 -2409413 -2361516
16362b361516m3030N7744m8434K073K25104Q7821r6989P5987J94014o1413J51656
$$ -2361516 -2404546 -2346802 -2395236 -2393163 -2168059 -2080238 -2177227 -2101240 -1907226 -1968639 -1816983
16351a816983R7655r0348J36847M1155L5108j34662J7614J64184m2410J5905K84493
$$ -1816983 -1719328 -1809676 -1672829 -1631674 -1596566 -1731228 -1713614 -1549430 -1591840 -1575935 -1291442
16340a291442p2868m7396l1030r9349R3205k2740J41162O7925l9697R2516O0830
$$ -1291442 -1364310 -1411706 -1442736 -1542085 -1448880 -1471620 -1330458 -1262533 -1302230 -1209714 -1148884
16329a148884N3170K6342J27042N7631J04730J5788j73989K9871o4873R1187O4888
$$ -1148884 -1095714 -1069372 -942330 -884699 -779969 -764181 -938170 -908299 -973172 -881985 -817097
16318h17097R9902J10509J68770K0157j95746R8531O7553J95J61843R276m7080
$$ -817097 -717195 -606686 -437916 -417759 -613505 -514974 -447421 -447226 -285383 -276107 -323187
16307c23187L5536o7243Q0712J91128r9826Q623o7193j7458l179K31012J87373
$$ -323187 -287651 -354894 -274182 -83054 -182880 -174257 -241450 -258908 -262087 -31075 156298
16296A56298m6108j0198k7613n8875J01839J24429l2471K8859q1397P9158r2779
$$ 156298 110190 99992 72379 13504 115343 239772 207301 236160 154763 233921 141142
16285A41142n9779J00618J44957O7632J23617L1P5564m0050n2933o7479K5620
$$ 141142 81363 181981 326938 394570 518187 518218 593782 553732 500799 433320 458940
16274D58940K14966N1584J24591N0275j5253J0793q8793Q7719l5416n2272L26
$$ 458940 673906 725490 850081 900356 885103 895896 807103 894822 859406 807134 807460
16263H07460j9415J04955M2071O2252J66601j42658n4404J27360r6908L1728l9414
$$ 807460 788045 893000 935071 997323 1163924 1021266 966862 1094222 997314 1029042 989628
16252I89628J7049j56805J66490J23069L1594R7056n8077P6920l1729J30371J3268
$$ 989628 1006677 849872 1016362 1139431 1171025 1268081 1210004 1286924 1255195 1385566 1398834
16241A398834k42171Q1085K49259J0463k02155N371J79611J07418j9651j03348
$$ 1398834 1156663 1237748 1487007 1497470 1295315 1300686 1480297 1587715 1568064 1464716
16231A464716Q5653N7030N0336J39173j10920j68466M9636j35256O7914k9613
$$ 1464716 1550369 1607399 1657735 1796908 1685988 1517522 1567158 1431902 1499816 1470203
16221A470203J57791J1681k2924p1041m1544J71497k9706K13466K4110j26865
$$ 1470203 1627994 1639675 1616751 1545710 1504166 1675663 1645957 1859423 1883533 1756668
16211A756668N7162j17609p7118K01140O5598m9776J53561J12696k3321k1829
$$ 1756668 1813830 1696221 1619103 1820243 1885841 1836065 1989626 2102322 2079001 2057172
16201B057172p020J10671j3159m6314O562r4655j01245K71055M2743j42984J06716
$$ 2057172 2050152 2160823 2147664 2101350 2107912 2013257 1912012 2183067 2225810 2082826 2189542
16190B189542N1980P0454q7966p0927p8292o7390j5670M2172J00010J61252Q9933
$$ 2189542 2241522 2311976 2224010 2153083 2074791 2007401 1991731 2033903 2133913 2295165 2385098
16179B385098m1750L2764k0203l7791j5508J5367j9670o5561m8154q3503K6184
$$ 2385098 2343348 2376112 2355909 2318118 2302610 2317977 2298307 2232746 2184592 2101089 2127273
16168B127273L89850o2880j09257J3684l3539j54753Q7751r42P8525L2367J68455
$$ 2127273 2517123 2454243 2344986 2358670 2325131 2170378 2258129 2257187 2335712 2368079 2536534
16157B536534J1629k93610J07850K03966j48813n4815q6569J07874J84212N5253
$$ 2536534 2548163 2254553 2362403 2566369 2417556 2362741 2276172 2384046 2568258 2623511
16147B623511q0009o3351j2508k6401R88J1838k30581l7531L03774J06969K08417
$$ 2623511 2543502 2480151 2467643 2441242 2442230 2454068 2223487 2185956 2489730 2596699 2805116
16136B805116j76313j24399J77891N0954o5229q5291J70741J0455j18273L7938
$$ 2805116 2628803 2504404 2682295 2733249 2668020 2582729 2753470 2763925 2645652 2683590
$$ [...]
##END NTUPLES=NMR SPECTRUM
##END=
