##TITLE=1H_EC-3289(V)
 CDCl3
 8 sc, 
 21.3.2023
##JCAMPDX= 6.0         $$ Bruker NMR JCAMP-DX V2.0
##DATA TYPE= NMR SPECTRUM
##DATA CLASS= NTUPLES
##ORIGIN= UXNMR, Bruker Analytische Messtechnik GmbH
##OWNER= root
$$ XWIN-NMR		Version 3.5
$$ Tue Mar 21 14:51:54 2023 Russian Standard Time (UT+4h)  she@DPX200
##.OBSERVE FREQUENCY= 200.13135
##.OBSERVE NUCLEUS= ^1H
##.ACQUISITION MODE= SIMULTANEOUS
##.ACQUISITION SCHEME= undefined
##.AVERAGES= 8
##.DIGITISER RES= 18
##SPECTROMETER/DATA SYSTEM= spect
##.PULSE SEQUENCE= zg30
##.SOLVENT NAME= CDCl3
##.SHIFT REFERENCE= (INTERNAL, CDCl3, 0, 15.7645)
##AUDIT TRAIL= $$ (NUMBER, WHEN, WHO, WHERE, WHAT)
$$ ##TITLE= Audit trail, XWIN-NMR		Version 3.5
$$ ##JCAMPDX= 5.01
$$ ##ORIGIN= Bruker BioSpin GmbH
$$ ##OWNER= she
$$ F:/spectra/data/she/nmr/H-F/1/pdata/1/auditp.txt
$$ ##AUDIT TRAIL=  $$ (NUMBER, WHEN, WHO, WHERE, WHAT)
(   1,<2023-03-21 14:50:30.04 +0400>,<she>,<DPX200>,
      <created by zg, POWCHK disabled, PULCHK disabled
       configuration hash MD5:
       00 E9 B6 7A A2 85 ED C7 34 08 36 98 17 FE 4E 26
       data hash MD5: 16K
       30 C2 5F 0A 7D B9 20 3B A2 84 86 D5 AC 7F C3 16>)
(   2,<2023-03-21 14:50:32.95 +0400>,<she>,<DPX200>,
      <Start of raw data processing
       efp BC_mod = 2 LB = 0.24 FT_mod = 6 PKNL = 1 PHC0 = -19106.94 PHC1 = 13.80075 SI = 16K 
       data hash MD5: 16K
       16 B9 34 17 8D 14 E7 4F B4 53 DD CD 78 AE 4B 91>)
(   3,<2023-03-21 14:50:50.64 +0400>,<she>,<DPX200>,
      <pk PHC0 = -0.07526285 PHC1 = 0 
       data hash MD5: 16K
       77 9E 93 54 B9 58 3C 92 6C 12 47 D9 3B 45 43 8B>)
(   4,<2023-03-21 14:50:55.76 +0400>,<she>,<DPX200>,
      <abs ABSG = 5 
       data hash MD5: 16K
       0A D5 FC 43 D6 DB A7 9B CC B0 88 16 A4 CC F8 62>)
$$ ##END=
$$ 
$$ hash MD5
$$ 01 58 BE 10 71 15 D8 B5 07 10 E8 27 52 F3 FB EA
##$RELAX= 
##$RELAX= 
##$RELAX= 
##$RELAX= 
##$RELAX= 
##$RELAX= 
$$ Bruker specific parameters
$$ --------------------------
##$DU= <F:/spectra>
##$EXPNO= 1
##$NAME= <H-F>
##$PROCNO= 1
##$TYPE= <nmr>
##$USER= <she>
##$AMP= (0..31)
100 100 100 100 100 100 100 100 100 100 100 100 100 100 100 100 100 100 
100 100 100 100 100 100 100 100 100 100 100 100 100 100 
##$AQSEQ= 0
##$AQ_mod= 1
##$AUNM= <au_zg>
##$AUTOPOS= <>
##$BF1= 200.13
##$BF2= 200.13
##$BF3= 200.13
##$BF4= 200.13
##$BF5= 200.13
##$BF6= 200.13
##$BF7= 200.13
##$BF8= 200.13
##$BYTORDA= 1
##$CFDGTYP= 0
##$CFRGTYP= 5
##$CHEMSTR= <none>
##$CNST= (0..31)
1 1 145 1 1 1 1 1 1 1 1 1 1 1 1 1 1 1 1 1 1 1 1 1 1 1 1 1 1 1 1 1 
##$CPDPRG= <>
##$CPDPRG1= <>
##$CPDPRG2= <>
##$CPDPRG3= <>
##$CPDPRG4= <mlev>
##$CPDPRG5= <mlev>
##$CPDPRG6= <mlev>
##$CPDPRG7= <mlev>
##$CPDPRG8= <mlev>
##$CPDPRGB= <>
##$CPDPRGT= <>
##$D= (0..31)
0 1.2 0 0 0 0 0 0 0 0.06 0 0.03 0 0 0 0 0.0002 0 0 0 0 0 0 0 0 0 0 0 0 
0 0 0 
##$DATE= 1679395829
##$DBL= (0..7)
120 120 120 120 120 120 120 120 
##$DBP= (0..7)
150 150 150 150 150 150 150 150 
##$DBP07= 0
##$DBPNAM0= <>
##$DBPNAM1= <>
##$DBPNAM2= <>
##$DBPNAM3= <>
##$DBPNAM4= <>
$$ [...]
##$SUBNAM3= <"">
##$SUBNAM4= <"">
##$SUBNAM5= <"">
##$SUBNAM6= <"">
##$SUBNAM7= <"">
##$SUBNAM8= <"">
##$SUBNAM9= <"">
##$SW= 18.05172834244
##$SWIBOX= (0..15)
0 0 2 0 0 0 0 0 0 0 0 0 0 0 0 0 
##$SW_h= 3612.71676300578
##$TD= 16384
##$TD0= 1
##$TE= 0
##$TE2= 300
##$TE3= 300
##$TEG= 300
##$TL= (0..7)
0 120 120 120 120 120 120 120 
##$TP= (0..7)
150 150 150 150 150 150 150 150 
##$TP07= 0
##$TPNAME0= <>
##$TPNAME1= <>
##$TPNAME2= <>
##$TPNAME3= <>
##$TPNAME4= <>
##$TPNAME5= <>
##$TPNAME6= <>
##$TPNAME7= <>
##$TPOAL= (0..7)
0.5 0.5 0.5 0.5 0.5 0.5 0.5 0.5 
##$TPOFFS= (0..7)
0 0 0 0 0 0 0 0 
##$TUNHIN= 0
##$TUNHOUT= 0
##$TUNXOUT= 0
##$USERA1= <user>
##$USERA2= <user>
##$USERA3= <user>
##$USERA4= <user>
##$USERA5= <user>
##$V9= 5
##$VALIST= <valist>
##$VCLIST= <CCCCCCCCCCCCCCC>
##$VD= 0
##$VDLIST= <DDDDDDDDDDDDDDD>
##$VPLIST= <PPPPPPPPPPPPPPP>
##$VTLIST= <TTTTTTTTTTTTTTT>
##$WBST= 1024
##$WBSW= 4
##$XGAIN= (0..3)
0 0 0 0 
##$XL= 0
##$YL= 0
##$YMAX_a= 430014
##$YMIN_a= -731818
##$ZGOPTNS= <>
##$ZL1= 120
##$ZL2= 120
##$ZL3= 120
##$ZL4= 120
##$ABSF1= 15.7524
##$ABSF2= -2.299449
##$ABSG= 5
##$ABSL= 3
##$ALPHA= 0
##$AQORDER= 0
##$ASSFAC= 0
##$ASSFACI= 0
##$ASSFACX= 0
##$ASSWID= 0
##$AUNMP= <proc_1d>
##$AZFE= 0.1
##$AZFW= 0.1
##$BCFW= 0
##$BC_mod= 2
##$BYTORDP= 0
##$COROFFS= 0
##$CY= -3
##$DATMOD= 1
##$DC= 0
##$DFILT= <>
##$DTYPP= 0
##$F1P= 0
##$F2P= 0
##$FCOR= 1
##$FTSIZE= 16384
##$FT_mod= 6
##$GAMMA= 0
##$GB= 0
##$INTBC= 1
##$INTSCL= 3.70164e-10
##$ISEN= 128
##$LB= 0.24
##$LEV0= 0
##$LPBIN= 0
##$MAXI= 10000
##$MC2= 0
##$MEAN= 0
##$ME_mod= 0
##$MI= 1.114404
##$NCOEF= 0
##$NC_proc= -6
##$NLEV= 6
##$NOISF1= 3.799351
##$NOISF2= 2.8
##$NSP= 0
##$NTH_PI= 0
##$NZP= 0
##$OFFSET= 15.76452
##$PC= 1
##$PHC0= -19107.02
##$PHC1= 13.80075
##$PH_mod= 1
##$PKNL= yes
##$PPARMOD= 0
##$PSCAL= 0
##$PSIGN= 0
##$REVERSE= no
##$SF= 200.130001405125
##$SI= 16384
##$SIGF1= 3
##$SIGF2= 2
##$SINO= 5.538805
##$SIOLD= 16384
##$SREGLST= <1H.CDCl3>
##$SSB= 0
##$STSI= 16384
##$STSR= 0
##$SW_p= 3612.71676300578
##$SYMM= 0
##$S_DEV= 0
##$TDeff= 16384
##$TDoff= 0
##$TI= <>
##$TILT= no
##$TM1= 0
##$TM2= 0
##$TOPLEV= 0
##$USERP1= <user>
##$USERP2= <user>
##$USERP3= <user>
##$USERP4= <user>
##$USERP5= <user>
##$WDW= 1
##$XDIM= 16384
##$YMAX_p= 306754930
##$YMIN_p= -1086877
$$ End of Bruker specific parameters
$$ ---------------------------------
##NTUPLES= NMR SPECTRUM
##VAR_NAME=  FREQUENCY,     SPECTRUM/REAL,   SPECTRUM/IMAG
##SYMBOL=    X,             R,               I
##VAR_TYPE=  INDEPENDENT,   DEPENDENT,       DEPENDENT
##VAR_FORM=  AFFN,          ASDF,            ASDF
##VAR_DIM=   16384,         16384,           16384
##UNITS=     HZ,            ARBITRARY UNITS, ARBITRARY UNITS
##FACTOR=    0.220516191357247, 1,           1
##FIRST=     3154.95334800447, 0,            0
##LAST=      -457.763415001312, 0,           0
##MIN=       -457.763415001312, -1086877,    0
##MAX=       3154.95334800447, 306754930,    0
$$ Real data points
##PAGE= N=1
##DATA TABLE= (X++(R..R)), XYDATA
$$ [...]
5646A2649013J64824O7513j1032o580J05403K71188J53481K31418J92373J76048
5636A3993649K15299N5299K00662L07786J00405Q1802q6345k1910R6443J36047
5626A5079137J64010K56369J72209J32683J59160L59023J88696J64689o2243m9009
5616A6564724m5721j53360k6777q0800q4096l5672l319n2899J00955J26016K84898
5605A6593949K52792J47008J42267L78621K05836J60139J76724K62149K43861
5596A8563346L51264K85148K25257N49874N81143O02235O75284O96115P78733
5587B3308399P92480O90626M83216L55733j76835m13853o75295q06849q73539
5578B2684083p59518p29363o51310m45890k29216j63864k4977j07986M6246L92313
$$ y = [12649013, 12813837, 12881350, 12870318, 12863738, 12969141, 13240329, 13393810, 13625228, 13817601, 13993649, 14208948, 14264247, 14464909, 14772695, 14873100, 14954902, 14868557, 14846647, 14943090, 15079137, 15243147, 15499516, 15671725, 15804408, 15963568, 16322591, 16511287, 16675976, 16613733, 16564724, 16519003, 16365643, 16338866, 16258066, 16173970, 16138298, 16134979, 16082080, 16183035, 16309051, 16593949, 16846741, 16993749, 17136016, 17514637, 17720473, 17880612, 18057336, 18319485, 18563346, 18914610, 19199758, 19425015, 19974889, 20556032, 21158267, 21833551, 22529666, 23308399, 24100879, 24791505, 25274721, 25630454, 25453619, 25039766, 24364471, 23557622, 22684083, 21924565, 21195202, 20543892, 20098002, 19868786, 19704922, 19679945, 19571959, 19618205, 20010518]
5568B0010518L97867O47910O92687P13891P61687Q86469Q30570N43921K95468
5559B5780988J3115l13199o45917q20855q10962r29789q01731p52965o36292n70328
5549A9512065o47839n44530m77358m30402n44710n63959k60245k83116l79138
5540A5380768k86591j66028j86153k50262k23744j32751p0528o0120k19136o7258
5530A3718197m7232k6206j1001J39808q6524N3911J73477L1738j6541J01620J44943
5519A4176190q5230r82J00902J04442N354k6993q1501p9879k4068k2584m5070
5508A4020581N9943o0546K315M1154r8704P6545K1618p2319Q0358P1123L3523
5497A4175591k2363r0329k8622j3736n1342M3387j39656L343J07601k6518K6903
$$ y = [20010518, 20408385, 21056295, 21748982, 22462873, 23224560, 24111029, 24941599, 25485520, 25780988, 25794103, 25480904, 24834987, 24014132, 23203170, 22273381, 21471650, 20718685, 20082393, 19512065, 18864226, 18319696, 17842338, 17411936, 16867226, 16303267, 16043022, 15759906, 15380768, 15094177, 14928149, 14741996, 14491734, 14267990, 14135239, 14064711, 14004591, 13785455, 13718197, 13670965, 13644759, 13633758, 13773566, 13687042, 13740953, 13914430, 13946168, 13929627, 14031247, 14176190, 14090960, 14089978, 14190880, 14295322, 14300676, 14273683, 14192182, 14112303, 14088235, 14065651, 14020581, 14080524, 14019978, 14022293, 14063447, 13964743, 14041288, 14062906, 13990587, 14070945, 14142068, 14175591, 14153228, 14062899, 14034277, 14020541, 13969199, 14012586, 13872930, 13876273, 13983874, 13957356, 13984259]
5486A3984259M7973N6903N7416L6400K44888O8677p6471J95705J79288J22431
5476A4917469K53207K70206K77110J58850j3211J04642N9080l182j7411j34408
5466A5872352k12106j31983L392k6474j97294j17555j27436j16060l2666N0367
5456A4964537R3700P4203P2142K03255J61288K60193K79685K96770L09263L20932
5446A7035968M16416L76782K93032J51630K43034J20797J8976K44883N0833l7240
5436A8915111K9437M8470K25309N2888K0637j2370j5801j48497k32537j22042
5426A8760605l4106r0329r7077j1947O4201P0254O5789P6192L4699Q0835K08208
5415A9127324M5843N3162K49975J54287J60210L02854L45465M05440L04109M22543
$$ y = [13984259, 14032232, 14089135, 14146551, 14182951, 14427839, 14496516, 14420045, 14615750, 14795038, 14917469, 15170676, 15440882, 15717992, 15876842, 15863631, 15968273, 16027353, 16024171, 16006760, 15872352, 15660246, 15528263, 15531655, 15505181, 15307887, 15190332, 15062896, 14946836, 14914170, 14964537, 15058237, 15132440, 15204582, 15407837, 15569125, 15829318, 16109003, 16405773, 16715036, 17035968, 17452384, 17829166, 18122198, 18273828, 18516862, 18637659, 18656635, 18901518, 18952351, 18915111, 18944548, 18993018, 19218327, 19271215, 19291852, 19279482, 19263681, 19115184, 18882647, 18760605, 18726499, 18636170, 18539093, 18527146, 18591347, 18661601, 18727390, 18803582, 18838281, 18919116, 19127324, 19173167, 19226329, 19476304, 19630591, 19790801, 20093655, 20439120, 20844560, 21148669, 21571212]
5405B1571212M04811L94516M52559L12666L14842K85160J71050K49021J65900
5396B4321737J06507J57272P2449Q7803M6650k32348m09123m26196n84533p75110
5386B2365108o44618o34099o86498n97498n21555m08778j81663j98720K5110J44867
5376A8661656R3999J06474K27746K58616K80996N02611L41038K48126K90324J53002
5366B1164588J55205K16857J53515q0538k32310l26511m40065n23610p22517o08168
5356A8756446o82147n12980n43901n10767m14316k69466j57260p5277j97825l3037
5346A5359470j77364n5239N9568n0103l1781m7605n0564j17162m2249j38326j2708
5335A4695937o1376j3253O4295p9904l192O8151J48624K4994P9245n181J28614
$$ y = [21571212, 21976023, 22370539, 22823098, 23135764, 23450606, 23735766, 23906816, 24155837, 24321737, 24428244, 24585516, 24657965, 24745768, 24792418, 24560070, 24150947, 23724751, 23140218, 22365108, 21720490, 21086391, 20399893, 19802395, 19280840, 18872062, 18690399, 18491679, 18516789, 18661656, 18755655, 18862129, 19089875, 19348491, 19629487, 20132098, 20473136, 20721262, 21011586, 21164588, 21319793, 21536650, 21690165, 21609627, 21377317, 21050806, 20610741, 20087131, 19364614, 18756446, 18074299, 17561319, 17017418, 16506651, 16092335, 15822869, 15665609, 15590332, 15392507, 15359470, 15182106, 15126867, 15186435, 15136332, 15104551, 15056946, 15006382, 14889220, 14846971, 14708645, 14695937, 14634561, 14621308, 14685603, 14605699, 14602507, 14670658, 14819282, 14844276, 14923521, 14918340, 15046954]
5324A5046954K43503J84001J28200M5076L3084M5368P4827O1945Q1503L7389J54211
5313A6136061k8953L5541L92271L45356K42052L78844M56550M75889O05551N35487
5303A9574649O86310Q02083P17037P23646N75299O50621L61399K63056m9474k26078
5293B4078548k74882l08120k82969k28940k81342j54055r3644l45495q4494N9827
5283B2084434Q1076K4358J31510K71721L96202M38833M75764N82565P08480N44486
5273B5739429M41685M30877K55804K09411K295j28073k08577j93538r781k10066
5263B6329466k64655k80097l64245l33380l02359m50648m34138l49939l85375
5254B3164630m30312o74221o24241p29493n28750m79048n42316m90305l56062
$$ y = [15046954, 15290457, 15474458, 15602658, 15647734, 15680818, 15726186, 15801013, 15862958, 15944461, 15981850, 16136061, 16107108, 16142649, 16534920, 16880276, 17122328, 17501172, 17957722, 18433611, 19039162, 19574649, 20260959, 21063042, 21780079, 22503725, 23079024, 23729645, 24091044, 24354100, 24304626, 24078548, 23803666, 23495546, 23212577, 22983637, 22702295, 22548240, 22454596, 22109101, 22024607, 22084434, 22165510, 22189868, 22321378, 22593099, 22989301, 23428134, 23903898, 24486463, 25194943, 25739429, 26181114, 26611991, 26867795, 27077206, 27079501, 26951428, 26742851, 26549313, 26539532, 26329466, 26064811, 25784714, 25420469, 25087089, 24784730, 24334082, 23899944, 23550005, 23164630, 22734318, 22060097, 21435856, 20706363, 20177613, 19698565, 19156249, 18665944, 18309882]
5245A8309882j98050q8112j15549r851L9055m7868j0171J45124R95L960M8193
5234A8077608k2261l4770O8248j20663k80650l18266m25764m18431o22565n67989
5224A5334497m50768m03771l61676m06751m68881k99032k23307j81856k96637
5215A2241818j47513j97266k11986j96469j43834j29350k52299j22636l36631
5206A0503834k53479j47109k07568k23454k02641l19580k25224o8295j07523j36372
5196H612589j26701j13629j70759m3808j10970l2725j53214j00547L1498L408
5186G795142j10058m9319n5634O7179n0207r9207m3859l4659P3926L0762N948
5175G530014q3396R395n7972L3151J97L8627j130J9234O9675R5819k3702O9352
$$ y = [18309882, 18111832, 18023720, 17908171, 17898320, 17937375, 17889507, 17879336, 18024460, 18025455, 18029415, 18077608, 18055347, 18020577, 18088825, 17968162, 17687512, 17369246, 16943482, 16525051, 15902486, 15334497, 14883729, 14479958, 14118282, 13711531, 13242650, 12943618, 12720311, 12538455, 12241818, 12094305, 11897039, 11685053, 11488584, 11344750, 11215400, 10963101, 10840465, 10503834, 10250355, 10103246, 9895678, 9672224, 9469583, 9150003, 8924779, 8856484, 8748961, 8612589, 8485888, 8372259, 8201500, 8157692, 8046722, 8013997, 7860783, 7760236, 7791734, 7795142, 7685084, 7635765, 7580131, 7647310, 7597103, 7497896, 7454037, 7419378, 7493304, 7524066, 7530014, 7446618, 7456013, 7398041, 7431192, 7431389, 7470016, 7468886, 7488120, 7557795, 7653614, 7629912, 7699264]
5163G699264M0796j1502J03837O0755J25218J73130P0661K04766O1776P7746K71997
5152H878444Q6386J48757O4872J22322J77560K64206K92662J46550J87069J25741
5142A0494569J86048L16228K76711K28574M04576N29521L77156M38407N38557
5133A3790347N68979O78652Q86016Q75388R77605J080961J076105J185227J234521
5124B2353801J127345J056411Q77675O37910N45421L86828M08821M23544O88739
5115B8506495Q33546J180612J352478J250143J155152P99404K36585m74731j192256
5106C3647428j799701j973178k065399k003879j924402j701589j460346j363943
5098A9354991j107501q19892q31801p12708n85966l71329m53279k92699k24916
$$ y = [7699264, 7740060, 7728558, 7832395, 7893150, 8018368, 8191498, 8262159, 8466925, 8528701, 8606447, 8878444, 8964830, 9113587, 9178459, 9300781, 9478341, 9742547, 10035209, 10181759, 10368828, 10494569, 10680617, 10996845, 11273556, 11502130, 11906706, 12436227, 12813383, 13251790, 13790347, 14359326, 15037978, 15923994, 16799382, 17776987, 18857948, 19934053, 21119280, 22353801, 23481146, 24537557, 25415232, 26053142, 26598563, 26985391, 27394212, 27817756, 28506495, 29340041, 30520653, 31873131, 33123274, 34278426, 35077830, 35314415, 34839684, 33647428, 31847727, 29874549, 27809150, 25805271, 23880869, 22179280, 20718934, 19354991, 18247490, 17427598, 16595797, 15883089, 15297123, 14925794, 14472515, 14179816, 13954900]
5089A3954900l34391k21791q6716j90412q4002l3034q2438j27806j2548j7246
5079A2764516L4153O0931k2442K6830J07311P7327r436j27596j68074j85207j61844
5068A2396469j8393k24068j52645j54508j58388j26061j0267J4340l6695K8010
5058A1557794L7920J5283p5651K3226L0298L0783j39045j19484r376r461Q333
5047A1350620k1380j5815M7205j57282m0026J30709j03830j97946j56004o2426
5037A0773825n1775k6571j85919k23481j55757N21k3887O2009j22802L6902J04359
5026A0187424L5817J23047J88575J85467P3084J33369L54340J63719J86246J39302
5016A1770390P4382J09813J83636N1224O6356J84678P2344Q3935J47575J56500
$$ y = [13954900, 13620509, 13398718, 13312002, 13121590, 13037588, 13004554, 12922116, 12794310, 12781762, 12764516, 12798669, 12859600, 12837158, 12863988, 12971299, 13048626, 13039190, 12911594, 12743520, 12558313, 12396469, 12378076, 12154008, 12001363, 11846855, 11688467, 11562406, 11552139, 11566479, 11529784, 11557794, 11595714, 11610997, 11535346, 11558572, 11588870, 11619653, 11480608, 11361124, 11351748, 11342287, 11350620, 11329240, 11313425, 11360630, 11203348, 11163322, 11294031, 11190201, 10992255, 10836251, 10773825, 10722050, 10695479, 10509560, 10286079, 10130322, 10130843, 10106956, 10168965, 10046163, 10083065, 10187424, 10223241, 10346288, 10534863, 10720330, 10793414, 10926783, 11281123, 11444842, 11631088, 11770390, 11844772, 11954585, 12138221, 12189445, 12255801, 12440479, 12512823, 12596758, 12744333, 12900833]
5006A2900833J43692J14261J70094J95277K23439K48167L20255L69184L68509
4997A5053711K44620L68298M13017M59951M99151N29370P31340M44773L47031
4988A9091262K42402P9888P0891j88787k58246k11124q7177O461J39472j4036
4978A8871006j21182j4333J28003J42691J12295J30941J22212J89509K94440K97275
4968B0152857L97606L87769L19497N44983P01249Q01789Q00536J034586J115345
4959B6256217J184460J396101J637100J827348K034329K170522J925754J761879
4951D0193710J398717R28753N58588J96107L87010N29058Q15430J176674J451482
4942D7635529J417639J276760R52775P42064L56881L9965j39601k19792o62758
$$ y = [12900833, 13044525, 13158786, 13328880, 13524157, 13747596, 13995763, 14316018, 14685202, 15053711, 15298331, 15666629, 16079646, 16539597, 17038748, 17568118, 18299458, 18744231, 19091262, 19333664, 19413552, 19484443, 19295656, 19037410, 18826286, 18739109, 18745570, 18885042, 18871006, 18749824, 18735491, 18863494, 19006185, 19118480, 19249421, 19371633, 19561142, 19855582, 20152857, 20550463, 20938232, 21257729, 21802712, 22503961, 23305750, 24106286, 25140872, 26256217, 27440677, 28836778, 30473878, 32301226, 34335555, 36506077, 38431831, 40193710, 41592427, 42521180, 43079768, 43275875, 43662885, 44191943, 45007373, 46184047, 47635529, 49053168, 50329928, 51282703, 52024767, 52381648, 52421613, 52282012, 52062220, 51399462]
4933E1399462r92303j502961j727970k014267j748591j474129j332594j042984
4925C9563663q89739o45721n78824r33831q77078r51999j172622j261456j170485
4916C1081908j065969j058195r82701j034946j027143r98403q95383q07941q30142
4907B2381085q36463p60556o96472o88163n27516l09764m10435k76274k68529
4898A7606913l29449m57873j63133j59631j61376k21805l12333k85323j32364
4889A5383626k52761j35043q4090j04324l7178k33142k6980j01510j90481M1386
4879A4259503k7665O5742N8432J54299J2721P3857K05434M7602o16J77645R7364
4868A5124318Q5089J64073K28825J09062J92542K38142J98545L00636L62250L24144
$$ y = [51399462, 50407159, 48904198, 47176228, 45161961, 43413370, 41939241, 40606647, 39563663, 38673924, 38028203, 37449379, 36515548, 35638470, 34686471, 33513849, 32252393, 31081908, 30015939, 28957744, 27975043, 26940097, 25912954, 24914551, 24019168, 23211227, 22381085, 21544622, 20784066, 20087594, 19399431, 18871915, 18562151, 18151716, 17875442, 17606913, 17277464, 16819591, 16656458, 16496827, 16335451, 16113646, 15801313, 15515990, 15383626, 15130865, 14995822, 14911732, 14807408, 14770230, 14537088, 14510108, 14408598, 14218117, 14259503, 14231838, 14297580, 14356012, 14510311, 14523032, 14596889, 14802323, 14849925, 14849309, 15026954, 15124318, 15209407, 15373480, 15602305, 15711367, 15903909, 16142051, 16340596, 16641232, 17003482, 17327626]
4858A7327626L51987M53581M48093O92645O87532P07884Q96672J078954J168055
4849B3813029J461316J682726J870232K191609K477750K881434L456008L809216
4841D3643320M261434M905432N002600M454987L512051K125307L75315j908901
4833F6371545m052426n013908n166043m951608m582823m083480l463534k895823
4825C2161900k471608k139787j846798j591638j401368j153241j043979q45494
4817A9667987p53629o56397n17096o46480l91522n05678m62088j73211k48375
4808A5313511k51482j61653l56964j77332k41096l49357l26059k56370k80978
4799A2912220l14553k78438l09080l35248k56055k73675k41405q5856k24452j53840
$$ y = [17327626, 17679613, 18133194, 18581287, 19273932, 19961464, 20669348, 21566020, 22644974, 23813029, 25274345, 26957071, 28827303, 31018912, 33496662, 36378096, 39834104, 43643320, 47904754, 52810186, 57812786, 62267773, 65779824, 67905131, 68280446, 66371545, 62319119, 57305211, 52139168, 47187560, 42604737, 38521257, 35057723, 32161900, 29690292, 27550505, 25703707, 24112069, 22710701, 21557460, 20513481, 19667987, 18914358, 18257961, 17740865, 17094385, 16702863, 16197185, 15735097, 15561886, 15313511, 15062029, 14900376, 14543412, 14366080, 14124984, 13775627, 13449568, 13193198, 12912220, 12597667, 12319229, 12010149, 11674901, 11418846, 11145171, 10903766, 10817910, 10593458, 10439618]
4789A0439618j01776k8838r4063j20475n6822l4226j5249k0754j06536O0925J16808
4778A0038612J2739m9294N1077P4415P5253L3380n1694j16148j83191j87773j23188
4767I574188q6149k11497k38617k03130k25598l476q7005r5219j97103j02326
4757H124068q4767j84064q9308p9735j3144q0491J0334L8650p7498k0510L9175
4746G582710K5446M78P2358K843Q5166J76957N4975Q9698J8260R9525k7640K5533
4734H206309j46918j10363j39846p0232j4095j77816k30440j61119n1772j27268
4724F976440l3010p3279r9018M9394l3276q2926l849O3416R3253n4292o3965k387
4712F736501K5991K6501R6850l931n5015N1464P4417n857j8258R983J65839j9837
$$ y = [10439618, 10337842, 10309004, 10214941, 10094466, 10037644, 10003418, 9988169, 9967415, 9860879, 9921804, 10038612, 10051351, 10002057, 10053134, 10127549, 10202802, 10236182, 10184488, 10068340, 9885149, 9697376, 9574188, 9488039, 9276542, 9037925, 8834795, 8609197, 8605721, 8518716, 8423497, 8226394, 8124068, 8039301, 7855237, 7765929, 7686194, 7673050, 7592559, 7602893, 7641543, 7564045, 7543535, 7582710, 7608156, 7608634, 7680992, 7683835, 7769001, 7945958, 8000933, 8090631, 8108891, 8208416, 8180776, 8206309, 8059391, 7949028, 7809182, 7738950, 7724855, 7547039, 7316599, 7155480, 7103708, 6976440, 6943430, 6870151, 6771133, 6820527, 6787251, 6704325, 6700476, 6763892, 6857145, 6802853, 6738888, 6736501, 6762492, 6788993, 6885843, 6881912, 6826897, 6878361, 6952778, 6946921, 6928663, 6938646, 7104485, 7084648]
4700G084648j85516L316k999K4765k7744J6723J0648R1664J5150J0244J8086N6533
4688G115518K8518j6095k8994j9570P3197J16046M1444O2688J59540Q5387J9025
4677G636704P5530J91120L9783J91126J42107J51435J08491R2995K78407R2743
4667I000441o889M7021R4913k4230R0400L0310M4439N9373O7758J71397J56974
4656I731907J98932J89791L08552K03678J15373J19477J66413J18011m5446L0764
4646A1137452P5219N7846J13864R1602J46595J83596J39098J58561K20617J82305
4636A2506755K44341J37975L02610L70319L41496L24146M06674L43455L77694
4627A5355465M77396M46373N09435N25136N69188N66232N77750P45642P48119
$$ y = [7084648, 6899132, 6902448, 6899449, 6924214, 6896470, 6913193, 6923841, 7015505, 7030655, 7040899, 7058985, 7115518, 7144036, 7127941, 7098947, 7079377, 7152574, 7268620, 7310064, 7372752, 7532292, 7617679, 7636704, 7712234, 7903354, 7943137, 8134263, 8276370, 8427805, 8536296, 8629291, 8907698, 9000441, 8993552, 9040573, 9135486, 9111256, 9201656, 9231966, 9276405, 9335778, 9403536, 9574933, 9731907, 9930839, 10120630, 10429182, 10632860, 10748233, 10867710, 11034123, 11152134, 11106688, 11137452, 11212671, 11270517, 11384381, 11475983, 11622578, 11806174, 11945272, 12103833, 12324450, 12506755, 12751096, 12889071, 13191681, 13562000, 13903496, 14227642, 14634316, 14977771, 15355465, 15832861, 16279234, 16788669, 17313805, 17882993, 18449225, 19026975, 19772617, 20520736]
4618B0520736P04509Q55519R19285J017881J096628J155710J260086J413267J718546
4609C0662167J808253K116047K535491K908573L343690L781683M233616M687537
4601E6077057N341835N947684O792854P322741P572878P242517O073462M176190
4593A06547218J649931j164472m185321o648270p794739q087902p884534p282590
4585F5149321o569767n700801m879104m302637l656828l142017k634676k428686
4577C1834805k096890j836978j637572j454669j311854j204729j089784r93239
4569B0209090p12979p38794p40253q26409o14558n91472n27422n39302n52437
4560A4365464m92675m27978l34061m74494l47222k27827l97548l16037l38019
$$ y = [20520736, 21225245, 22080764, 23000049, 24017930, 25114558, 26270268, 27530354, 28943621, 30662167, 32470420, 34586467, 37121958, 40030531, 43374221, 47155904, 51389520, 56077057, 61418892, 67366576, 74159430, 81482171, 89055049, 96297566, 102371028, 106547218, 108197149, 107032677, 102847356, 96199086, 88404347, 80316445, 72431911, 65149321, 58579554, 52878753, 47999649, 43697012, 40040184, 36898167, 34263491, 31834805, 29737915, 27900937, 26263365, 24808696, 23496842, 22292113, 21202329, 20209090, 19496111, 18757317, 18017064, 17190655, 16576097, 15984625, 15457203, 14917901, 14365464, 13872789, 13444811, 13110750, 12636256, 12289034, 12061207, 11663659, 11347622, 11009603]
4551A1009603k04867P450k17713k31501j03517l6577k47415j17079P553q4795
4541I781142l01150r8766j05539j67155j43635j22199r5778K6208j21219l2324
4531H619585j01324p1147o1778j2209j45501J1947R6524r0760j00983l6680o5105
4520H042569j66441o7721r5893k69159j26464j10799k05427q0960j41760j59903
4510F618042o4256k8132j25962p5477P2170j13614K0601O8035M6646J6054J4256
4499F448363L1975m2801r2259J7032J31018l1512o9719j26660m9554J4779k77541
4488E953121j77647n8131l0392j08279j24813j06992m4357K3530m6281n5345j47407
4477E077007j12819j9754M5800n7923n0578j7216K6473j3397m5471M0936p2196
$$ y = [11009603, 10804736, 10812186, 10594473, 10362972, 10259455, 10222878, 9975463, 9858384, 9865937, 9781142, 9479992, 9381226, 9275687, 9108532, 8964897, 8842698, 8746920, 8773128, 8651909, 8619585, 8518261, 8447114, 8385336, 8373127, 8227626, 8239573, 8336097, 8245337, 8144354, 8107674, 8042569, 7876128, 7808407, 7712514, 7443355, 7316891, 7206092, 7000665, 6919705, 6777945, 6618042, 6553786, 6525654, 6399692, 6324215, 6396385, 6282771, 6303372, 6371407, 6418053, 6434107, 6448363, 6480338, 6437537, 6345278, 6362310, 6493328, 6461816, 6392097, 6265437, 6215883, 6230662, 5953121, 5775474, 5717343, 5686951, 5578672, 5453859, 5346867, 5302510, 5326040, 5279759, 5224414, 5077007, 4964188, 4944434, 4990234, 4932311, 4881733, 4864517, 4890990, 4877593, 4832122, 4873058, 4800862]
4466D800862p5736j4471j5029J56538O8375q645K6560O3635R4892J60955j10704
4455E147232r7716l1149O0861o5389q0274j61710o3325J1625r0491L974J6298
4444D649936p330r2020k8950N4750K3004j2338L4893k5086J2226J30114m1581
4433D697618k4670J07678P8955K1606R4716o2162k976J3017o2844j53108p7452
4422D630378o5192o3916j08392K5114j57281J2422j06050o0445p474j32411r0171
4411C876582l2332l4986j07709j3166k1772o6933p9812L3532J3564l6330M7070
4400C577708o6068n1774L0173J049o7079j49475J46198q4334p6544L4844J34445
4389C429143n1074M056K5943m22L7084J6258r747k0711K1090R7220K8784l5823
$$ y = [4800862, 4725126, 4710655, 4695626, 4852164, 4920539, 4911894, 4938454, 5002089, 5096981, 5257936, 5147232, 5049516, 5018367, 5079228, 5013839, 4933565, 4771855, 4708530, 4720155, 4629664, 4633638, 4649936, 4642606, 4550586, 4521636, 4576386, 4599390, 4587052, 4621945, 4596859, 4609085, 4739199, 4697618, 4672948, 4780626, 4859581, 4881187, 4975903, 4913741, 4910765, 4923782, 4860938, 4707830, 4630378, 4565186, 4501270, 4392878, 4417992, 4260711, 4273133, 4167083, 4106638, 4099164, 3966753, 3876582, 3844250, 3809264, 3701555, 3688389, 3666617, 3599684, 3519872, 3553404, 3566968, 3530638, 3577708, 3511640, 3459866, 3490039, 3491088, 3424009, 3274534, 3420732, 3336398, 3259854, 3294698, 3429143, 3378069, 3382125, 3408068, 3407646, 3444730, 3460988, 3451241, 3430530, 3451620, 3548840, 3577624, 3541801]
4377C541801l5432Q7731p8659K209Q0620K8856O6057q4698J5327O0925L1554J31161
4365C847452K758l1564p207j1856N1922N6660k4932R1952J05934K4571q5566M8129
4353D068253k8281Q1939L3004n6023J14217J5282J8081O4779p8628J59554Q5258
4342D477435J6282n2556J4713J71403P5020M1557J11295J22529O104O4037J9765
4331E067584Q9441N7363O3615J19628O5456M9861J06209J25983J15175j130k1161
4320E838024m2899J85175K21128P2566O4422P3456K05542M8387R6381K03585O451
4309F972218R9100J94759P2859N5836J86401K46295J00972N2888J67988O5198
4299H214514O3806J8590J87402J43943J89354M5145P8645J31674J21829Q3111
$$ y = [3541801, 3506369, 3594100, 3515441, 3517650, 3598270, 3627126, 3693183, 3608485, 3623812, 3684737, 3716291, 3847452, 3850210, 3818646, 3811439, 3799583, 3851505, 3908165, 3883233, 3975185, 4081119, 4105690, 4020124, 4068253, 4039972, 4121911, 4154915, 4098892, 4213109, 4228391, 4246472, 4311251, 4232623, 4392177, 4477435, 4493717, 4441161, 4455874, 4627277, 4702297, 4743854, 4855149, 4977678, 4983782, 5047819, 5067584, 5157025, 5214388, 5278003, 5397631, 5463087, 5512948, 5619157, 5745140, 5860315, 5859185, 5838024, 5795125, 5980300, 6201428, 6273994, 6338416, 6411872, 6617414, 6665801, 6762182, 6965767, 6972218, 7071318, 7266077, 7338936, 7394772, 7581173, 7827468, 7928440, 7981328, 8149316, 8214514, 8278320, 8296910, 8484312, 8628255, 8817609, 8862754, 8941399, 9073073, 9194902, 9278013]
4289I278013N6997r499Q9197J12218j83333o0298k7201k8213m6472k26450j29710
4278H825249k1469l0638n7739j53762j22036j60556j61221j71679j42887q1065
4268G722197q0758j12725j63646q0959j88365j24297j29007j65766j47546j83884
4258F345244k9028j21432j93677r1610j58379j80789j42457m6045j06321r5886
4248E179620j03870K847j71167r3325j28050j50086r266j35663Q1538q2348q2011
4237D308219q9523N9997K520j47164q656o1862p6500j05716l4137J6859p1021
4226C793016o1349p7420J13017o6713O8237O6046O4690o6594r401N8144o6069
4215C815604k807n0866N3566P3956L7176N1308n8077J05769j4938J7964J27830
$$ y = [9278013, 9335010, 9325511, 9414708, 9526926, 9343593, 9283295, 9256094, 9227881, 9181409, 8954959, 8825249, 8803780, 8773142, 8715403, 8561641, 8439605, 8279049, 8117828, 7946149, 7803262, 7722197, 7641439, 7528714, 7365068, 7284109, 7095744, 6971447, 6842440, 6676674, 6529128, 6345244, 6316216, 6194784, 6001107, 5909497, 5751118, 5570329, 5427872, 5381827, 5275506, 5179620, 5075750, 5078597, 4907430, 4814105, 4686055, 4535969, 4526703, 4391040, 4472578, 4390230, 4308219, 4218696, 4278693, 4281213, 4134049, 4125393, 4063531, 3987031, 3881315, 3847178, 3864037, 3793016, 3731667, 3654247, 3767264, 3700551, 3768788, 3834834, 3899524, 3832930, 3823529, 3881673, 3815604, 3812797, 3761931, 3815497, 3889453, 3926629, 3977937, 3919860, 4025629, 4010691, 4028655, 4156485]
4204D156485O3816N8755Q6897J00450m0394J18474J05921Q580J4131J73743M1173
4193D888031P8346J81259J0293P2166J69227P9436J73964M4906P8319R9404K00014
4182F075365K9426q812J30761Q6108J82710J12711K5554P1289J11881J66543J53320
4171G136856O9770m0292l6328q810J03842O4393J03519L6466K7865M6432K881
4160G506594N210k1437L8311K8847L8330j2841l1139j06357o3907N9296j3214
4149G427693j07808R9301p0407q0564m3777n3356L768p9412o4069q6876n9875
4138F884618o4661l7336Q208N1444k407K461j72531m4127p86L8924O6528m533
4126F725802m4734j4986N0129l7382q11M6399J07524q0670J3814R4476Q0973J9093
$$ y = [4156485, 4220301, 4279056, 4365953, 4466403, 4426009, 4544483, 4650404, 4658984, 4673115, 4846858, 4888031, 4966377, 5147636, 5157929, 5230095, 5399322, 5478758, 5652722, 5697628, 5775947, 5875351, 6075365, 6104791, 6095979, 6226740, 6312848, 6495558, 6608269, 6633823, 6705112, 6816993, 6983536, 7136856, 7206626, 7166334, 7130006, 7121196, 7225038, 7289431, 7392950, 7429416, 7457281, 7503713, 7506594, 7511804, 7490367, 7528678, 7557525, 7595855, 7583014, 7551875, 7445518, 7381611, 7440907, 7427693, 7319885, 7419186, 7348779, 7268215, 7224438, 7171082, 7174850, 7095438, 7031369, 6944493, 6884618, 6819957, 6782621, 6790829, 6842273, 6839866, 6842327, 6669796, 6625669, 6624883, 6663807, 6730335, 6725802, 6681068, 6666082, 6716211, 6678829, 6678018, 6724417, 6831941, 6751271, 6765085, 6859561, 6940534, 6959627]
4114F959627L8208N6556J47777J00500Q6994J83448J10513J79006P0226K2990
4104G955845K12750K32778J68489K05588J40892J13613M37578K43120K10834K33243
4094A0154730M04068L49307K01094L80800M84900L78741L79123N71767M09417
4085A3713947M02050M65803N21513L96474M53358N00422M19593M66339O45645
4076A7985144O27257N82504N62060M15436O76939N17510L52438M37927M11686
4067B2568901M26967K75398L00272L99676L84110M56623M46608L74034L25519
4058B5958108K07916K63861P2510L9003M3002k04876r3766j29034j58159j35127
4048B5863438l31661r8672j04430r9023j48762l26688l80397m21621n37997n19156
$$ y = [6959627, 6997835, 7054391, 7202168, 7302668, 7389662, 7573110, 7683623, 7862629, 7932855, 7955845, 8168595, 8401373, 8569862, 8775450, 8916342, 9029955, 9467533, 9710653, 9921487, 10154730, 10558798, 10908105, 11109199, 11489999, 11974899, 12353640, 12732763, 13304530, 13713947, 14115997, 14581800, 15103313, 15499787, 15953145, 16453567, 16873160, 17339499, 17985144, 18612401, 19194905, 19756965, 20172401, 20849340, 21366850, 21719288, 22157215, 22568901, 22995868, 23271266, 23571538, 23971214, 24355324, 24811947, 25258555, 25632589, 25958108, 26166024, 26429885, 26502395, 26541398, 26584400, 26379524, 26285758, 26156724, 25998565, 25863438, 25531777, 25433105, 25328675, 25229652, 25080890, 24754202, 24373805, 23952184, 23414187, 22895031]
4038B2895031n07606n45328o37958o11106m46634m41542m76026m56500n34085
4029A8238246n77730m79390m34403n44777n92086m70239n24809n01875n31843
4020A3581094m45423n08790m62661n24778l92803l46344l60789l93190l30665
4011I815651l62274l28027l74524k86047k33798k42983k34968l09719k26417k40904
4001F975990k28603l92411k02282L0910p3541k62774k40455j9843j89916k00724
3991E196351L3426k35724r7520j43396j03595n0705j81842k6640o0747K6874n4517
3980D301965j33492j49510q0412p3888j6969K4099M723P1777r0078j07370J5385
3969C766230J1781l2498j00871n9409J7525m6710J2666n0902j37524o7974K8704
$$ y = [22895031, 22387425, 21842097, 21204139, 20593033, 20146399, 19704857, 19228831, 18772331, 18238246, 17660516, 17181126, 16746723, 16201946, 15609860, 15139621, 14614812, 14112937, 13581094, 13135671, 12626881, 12164220, 11639442, 11246639, 10900295, 10539506, 10146316, 9815651, 9453377, 9125350, 8750826, 8464779, 8230981, 7987998, 7753030, 7443311, 7216894, 6975990, 6747387, 6354976, 6152694, 6183604, 6110063, 5847289, 5606834, 5586991, 5397075, 5196351, 5229777, 4994053, 4896533, 4753137, 4649542, 4598837, 4416995, 4390355, 4329608, 4356482, 4301965, 4168473, 4018963, 3938551, 3864663, 3847694, 3871793, 3876516, 3948293, 3858215, 3750845, 3766230, 3778011, 3745513, 3644642, 3585233, 3602758, 3556048, 3568714, 3517812, 3380288, 3312314, 3341018]
3958C341018J0329k2251m9340q894n8992k6361l8633J65978o6594n8177K336o1832
3946C128587j12074J37563l0402K9296R4858m6540J9618K0448n4242p5761L2053
3935C143404J08965j8722j16890N1183O3365o8874l4850O8603j0337j04665N3067
3924C134249K0934l6142L8134l5708R5647N179N8327P2514L0973j23315r5593
3913C165199L9936K0817j957N8770K0137K2275o6625M6261P5034K8970J9822J2827
3901C441466J0108J4996j5796k6604R700J40901j3392L668L2045N6477P8668N5392
3889C787629L6962Q3052p410j2296M6688J60762O3453Q4997M0524k2077N810J13766
3877D381860j0330M8765j213j09232J36652R7025N7233K1022K7122L3957l1917
$$ y = [3341018, 3351347, 3329096, 3279756, 3270862, 3211870, 3185509, 3146876, 3312854, 3246260, 3188083, 3190419, 3128587, 3016513, 3154076, 3123674, 3152970, 3247828, 3201288, 3220906, 3241354, 3187112, 3111351, 3143404, 3252369, 3233647, 3116757, 3167940, 3231305, 3162431, 3127581, 3196184, 3185847, 3081182, 3134249, 3155183, 3119041, 3157175, 3121467, 3217114, 3222293, 3280620, 3353134, 3384107, 3260792, 3165199, 3205135, 3225952, 3223995, 3282765, 3302902, 3325177, 3258552, 3304813, 3379847, 3408817, 3428639, 3441466, 3451574, 3466570, 3450774, 3424170, 3433870, 3574771, 3561379, 3565047, 3597092, 3653569, 3732237, 3787629, 3824591, 3907643, 3900233, 3887937, 3934625, 4095387, 4158840, 4243837, 4284361, 4262284, 4268094, 4381860, 4371530, 4420295, 4419082, 4309850, 4446502, 4543527, 4600760, 4621782, 4648904, 4682861, 4650944]
3866D650944P9657J18212j03861J14750J14919M7262J42582p525o5541Q8917P5333
3855E255649m4860J8193K01826N5045L9187Q597O1378J0895m628j7397N7966K7730
3843E669581L5125J42082j3181J12997N8592p514Q0293j9709O2479Q30J14591
3832F236166R4782K9832K0955O7022J46797J7244J40742J01771J09195J31496
3822G096002R4564J09321J70415K4254P1029K01850J52775J46998J09280J21739
3812H298227J45993J70369J96090J20934J43791J43382R5966J98072J05579R0111
3802I708514R7641N0986J69590j5430L2213J24151P8418J90332J1635l6467o0532
3791A0351051N8760Q7511n8532J46373N2913Q034L6115K3187N5572j9097J42639
$$ y = [4650944, 4730601, 4848813, 4744952, 4859702, 4974621, 5021883, 5164465, 5156940, 5091399, 5180316, 5255649, 5210789, 5228982, 5430808, 5485853, 5525040, 5533637, 5595015, 5605910, 5601282, 5583885, 5641851, 5669581, 5704706, 5846788, 5833607, 5946604, 6005196, 5997682, 6077975, 6058266, 6120745, 6121575, 6236166, 6330948, 6360780, 6381735, 6448757, 6595554, 6612798, 6753540, 6855311, 6964506, 7096002, 7190566, 7299887, 7470302, 7494556, 7565585, 7767435, 7920210, 8067208, 8176488, 8298227, 8444220, 8614589, 8810679, 8931613, 9075404, 9218786, 9314752, 9512824, 9618403, 9708514, 9806155, 9857141, 10026731, 10011301, 10043514, 10167665, 10246083, 10436415, 10448050, 10411583, 10351051, 10409811, 10497322, 10438790, 10585163, 10638076, 10646110, 10682225, 10705412, 10760984, 10741887, 10884526]
3780A0884526R0442K2330O8494O8413K26055J78677J92504K26663L54024J58217
3770A2470345R2452K69035K45244K61554K34916K78319K50265K41389J66702J14732
3760A4624953J35551J68748L6779O7336m1446L7638K2078n4854p6800L918j18813
3749A4805088j01542k09659k24632k27823k36036j41417j77186k02397k19830
3740A3064566k66557l44529k92632m06019k53601k25974k44055j99258j93623
3731A0638318k59514l05328j76598j41122j99223k47260j82195r6766k66914j06617
3721H656781j57172j31063j36827j11129n6184o8271j13273k91o7782j06821m8156
3710G659812j28505n2596r865n3303m1751K5977L4918j02353l5780K1601o5485
$$ y = [10884526, 10974968, 10997298, 11065792, 11134205, 11360260, 11538937, 11731441, 11958104, 12312128, 12470345, 12562797, 12831832, 13077076, 13338630, 13573546, 13851865, 14102130, 14343519, 14510221, 14624953, 14760504, 14929252, 14966031, 15033367, 14991921, 15029559, 15051637, 14996783, 14919983, 14923901, 14805088, 14703546, 14493887, 14269255, 14041432, 13805396, 13663979, 13486793, 13284396, 13064566, 12798009, 12453480, 12160848, 11754829, 11501228, 11275254, 11031199, 10831941, 10638318, 10378804, 10073476, 9896878, 9755756, 9556533, 9309273, 9127078, 9030312, 8763398, 8656781, 8499609, 8368546, 8231719, 8120590, 8064406, 7996135, 7882862, 7882571, 7814789, 7707968, 7659812, 7531307, 7478711, 7468846, 7415543, 7373792, 7399769, 7434687, 7332334, 7296554, 7318155, 7252670]
3699G252670o5298q823M5252J9773k8907J08576L3845O580K2763l3165J3934r1480
3687G275720N9734N5626N2557j75299L4275N7896J69205J14923p9513l6037J27287
3676G656374j19187J02701k9229N7047J24474n7493j0741N0697M6606K8132J7336
3665G866717k027M4577J9549P5730P9897J4962L535J85283P1172J94444J52465
3654H706304n9417J28679M4376r320Q1975P2243J35680N8922J10431J13925J04414
3643I488212R3230K12241J68722J50302J52208J29256J44815K49883J17810J09527
3633A1016206J03978K25064K34882K25804J49706J69257K41762K91094K57603
3624A2915356J94666K52172L45861K49015L13220J65595L64686K64444K07150
$$ y = [7252670, 7187372, 7178549, 7223801, 7243574, 7214667, 7323243, 7357088, 7363668, 7386431, 7353266, 7367200, 7275720, 7335454, 7391080, 7443637, 7268338, 7302613, 7360509, 7529714, 7644637, 7565124, 7529087, 7656374, 7537187, 7639888, 7610659, 7667706, 7792180, 7734687, 7723946, 7774643, 7821249, 7849381, 7866717, 7864690, 7909267, 7928816, 8004546, 8084443, 8099405, 8102940, 8288223, 8359395, 8553839, 8706304, 8646887, 8775566, 8819942, 8810622, 8892597, 8964840, 9100520, 9159442, 9269873, 9383798, 9488212, 9581442, 9793683, 9962405, 10112707, 10264915, 10394171, 10538986, 10788869, 10906679, 11016206, 11120184, 11345248, 11580130, 11805934, 11955640, 12124897, 12366659, 12657753, 12915356, 13110022, 13362194, 13708055, 13957070, 14270290, 14435885, 14800571, 15065015, 15272165]
3615A5272165J96002L08335M04397L77238K77727L78076K75187K20258K35736
3606A7945121K18152J12250K16508K45695K21468L49032K54512L30806J97849
3597B0091393K96283L13697L67348K06453K66336M51749K72146J50149K31955
3588B2647509L00541J78202K71287K37485J34812N2767J00895Q2907K6507N6637
3578B4089549L419Q8711L7344K02234P1579K6001N2135N7609j6876M092o0878
3567B4554919j44250p1530r706j68139J217l0533j03621j05570k8867n6546m9454
3556B3787920o8984r4340J25602m9928M5502j37676K3157Q6788n1141K9044l0671
3545B3665273o0872k8888J31265P7780m9945L9756M4840Q8554J24707N921M2436
$$ y = [15272165, 15468167, 15776502, 16180899, 16558137, 16835864, 17213940, 17489127, 17709385, 17945121, 18163273, 18275523, 18492031, 18737726, 18959194, 19308226, 19562738, 19893544, 20091393, 20387676, 20701373, 21068721, 21275174, 21541510, 21993259, 22265405, 22415554, 22647509, 22948050, 23126252, 23397539, 23635024, 23769836, 23822603, 23923498, 24006405, 24032912, 24089549, 24092968, 24181679, 24219023, 24421257, 24492836, 24518837, 24570972, 24628581, 24611705, 24615797, 24554919, 24410669, 24339139, 24329433, 24161294, 24162511, 24131978, 24028357, 23922787, 23893920, 23837374, 23787920, 23718936, 23624596, 23750198, 23700270, 23745772, 23608096, 23631253, 23718041, 23666900, 23695944, 23665273, 23604401, 23575513, 23706778, 23784558, 23734613, 23774369, 23819209, 23907763, 24032470, 24038391, 24080827]
3534B4080827R5852J41929O6701J28024J17532K41686R1895J79924J87688J40450
3524B5472508K54687J07797O6093K02734J30727K50291K07821K20922J55940J84209
3514B7253729J59401K18838K84537K74460L17757L18811K00407M12162L67995
3505B9808097L11895M10653K92550K37917K47310J47898K03388J86281K2792J6320
3495C1885101M9106K0580J4052Q686N958l7927q7309k3735l9833P5254Q8952M9601
3483C2008486L6574J58514N4510J49947K41400J61893J12140K57792J52149P0363
3473C3403768J53380J03089M5865O1700Q2610j71791j50261r185j55059j28367
3463C3235749j98891j29192j13980j54495n2183l0856P7447O0901n6460J06415
$$ y = [24080827, 24176679, 24318608, 24385309, 24513333, 24630865, 24872551, 24964446, 25144370, 25332058, 25472508, 25727195, 25834992, 25901085, 26103819, 26234546, 26484837, 26692658, 26913580, 27069520, 27253729, 27413130, 27631968, 27916505, 28190965, 28508722, 28827533, 29027940, 29440102, 29808097, 30119992, 30530645, 30823195, 31061112, 31308422, 31456320, 31659708, 31845989, 31868781, 31885101, 31934207, 31954787, 31968839, 31977525, 31983483, 31945556, 31858247, 31834512, 31794679, 31869933, 31958885, 32008486, 32045060, 32203574, 32258084, 32408031, 32649431, 32811324, 32923464, 33181256, 33333405, 33403768, 33557148, 33660237, 33706102, 33767802, 33850412, 33678621, 33528360, 33519175, 33364116, 33235749, 33036858, 32907666, 32793686, 32639191, 32587008, 32556152, 32633599, 32694500, 32638040, 32744455]
3453C2744455P255K5252L35685K01896R3968J37662J78894L05358J95927J67869
3443C4394221J72287K89531J18867K08678K40296J79789K60516O0867J86764K60255
3433C6372071J75154J66826N1797P1947L2886J10793J4789J40746L4590l6077
3423C7135522L0328L3495P906j8171Q7091J49995Q6022O2144J10074K01219J70722
3412C8056347K99569L48015K36742K10137M36651N49529M47160L68233N06223
3403D1458606N71007N26681O20625P67469O18075O68558P87417P42003Q83617
3394D7644058Q18945R28637J088588R98928J041345J056945J202017J245319J154478
3385E7179260J199566J174413J273227J188806J129918J183808J411170J246527
$$ y = [32744455, 32751710, 32776962, 33112647, 33314543, 33408511, 33546173, 33725067, 34030425, 34226352, 34394221, 34566508, 34856039, 34974906, 35183584, 35423880, 35603669, 35864185, 35925052, 36111816, 36372071, 36547225, 36714051, 36765848, 36837795, 36870681, 36981474, 36996263, 37137009, 37171599, 37135522, 37165850, 37199345, 37207251, 37189080, 37276171, 37426166, 37512188, 37574332, 37684406, 37885625, 38056347, 38355916, 38703931, 38940673, 39150810, 39587461, 40136990, 40584150, 40952383, 41458606, 42029613, 42556294, 43176919, 43944388, 44562463, 45231021, 46018438, 46760441, 47644058, 48463003, 49391640, 50480228, 51479156, 52520501, 53577446, 54779463, 56024782, 57179260, 58378826, 59553239, 60826466, 62015272, 63145190, 64328998, 65740168, 66986695]
3377F6986695J282828J339138J246057J164376J196747J077068R11208P77807
3369G5981924O63223O48851O50247P73701P21872P74308R51892J085359J098439
3360H3349816J195842J300392J377770J398792J557076J590597J584433J654623
3352I5009341J481960J483783J411193J218271J066967R66379R53800P87146P32976
3343A05111816O50260O73737O26050O68018O47396M09058N44558L30173K31481
3334A09892547k9162j14315k96618n05315o96830p63676p71574q31064q33568
3325A05050425p92974q31836o44345o74003o39134o84638n78715o61119o23048
3316I8920613o24600n63827o07267o74905n63243m25794l66061l58654m01272
$$ y = [66986695, 68269523, 69608661, 70854718, 72019094, 73215841, 74292909, 75204117, 75981924, 76645147, 77293998, 77944245, 78717946, 79439818, 80214126, 81166018, 82251377, 83349816, 84545658, 85846050, 87223820, 88622612, 90179688, 91770285, 93354718, 95009341, 96491301, 97975084, 99386277, 100604548, 101671515, 102637894, 103591694, 104378840, 105111816, 105762076, 106435813, 107061863, 107729881, 108377277, 108786335, 109330893, 109661066, 109892547, 109863385, 109749070, 109452452, 108947137, 108250307, 107486631, 106715057, 105883993, 105050425, 104257451, 103425615, 102781270, 102107267, 101468133, 100783495, 100204780, 99543661, 98920613, 98296013, 97732186, 97124919, 96450014, 95886771, 95460977, 95094916, 94736262, 94334990]
3307I4334990l22593k09962k27531l81768k54403k46847k98667k34426l53944
3298I1804849k67432j84058j7702Q6468J64008L31548M76654N53569O87273O99288
3288I4334465J113351J136736J276407J503652J577201J784139J970217K097474
3280A06793642K218245K404523K675265K719738K970025L209648L342620L432868
3272A29766574L735603L915959M196922M473160M668635M956255N067230N236585
3264A66016923N250728N400686N417772N263101N263934M920654M789454M767212
3256B07090464M626051M375543M291495M293356M030277L954986L904949L687761
3248B40254882L414526L269300K983236K642944K399844K301343K348737K181557
$$ y = [94334990, 94012397, 93802435, 93574904, 93193136, 92938733, 92691886, 92393219, 92158793, 91804849, 91537417, 91353359, 91335657, 91422125, 91586133, 91917681, 92394335, 92947904, 93635177, 94334465, 95447816, 96584552, 97860959, 99364611, 100941812, 102725951, 104696168, 106793642, 109011887, 111416410, 114091675, 116811413, 119781438, 122991086, 126333706, 129766574, 133502177, 137418136, 141615058, 146088218, 150756853, 155713108, 160780338, 166016923, 171267651, 176668337, 182086109, 187349210, 192613144, 197533798, 202323252, 207090464, 211716515, 216092058, 220383553, 224676909, 228707186, 232662172, 236567121, 240254882, 243669408, 246938708, 249921944, 252564888, 254964732, 257266075, 259614812, 261796369]
3240B61796369K366039K593503K850342L066744L211471L168683K915823K683974
3232B84652948K152218J280014J85018r96664k399999l775229n044692o276206
3224B69777408o934934p686091p976654q026560p838275p774323p493041p094050
3216B08953480o883677o541128o423806o168509n836069n607926n310301n104826
3208A61077238m970756m645225m486066m166602l987689l807531l638130l554358
3200A27820881l335857l260870l203974k972811k853212k603020k355995k307233
3192A04927909k107554j924440j892282j769362j478233j447855j262371j062393
3184I1983419r63302q66169o53583n43065n31469m01304l15312j46537o9616k0237
$$ y = [261796369, 264162408, 266755911, 269606253, 272672997, 275884468, 279053151, 281968974, 284652948, 286805166, 288085180, 288270198, 287273534, 284873535, 281098306, 276053614, 269777408, 262842474, 255156383, 247179729, 239153169, 231314894, 223540571, 216047530, 208953480, 202069803, 195528675, 189104869, 182936360, 177100291, 171492365, 166182064, 161077238, 156106482, 151461257, 146975191, 142808589, 138820900, 135013369, 131375239, 127820881, 124485024, 121224154, 118020180, 115047369, 112194157, 109591137, 107235142, 104927909, 102820355, 100895915, 99003633, 97234271, 95756038, 94308183, 93045812, 91983419, 91020117, 90153948, 89500365, 88957300, 88425831, 88024527, 87709215, 87562678, 87493062, 87472825]
3174H7472825N0877J85936K86012J85472K63832L69439L98922N10355M85170N89446
3164I0798286O92178Q68832Q10384R96458J131963J209435J346867J479593J554118
3155A00888114J590269J579468J460770J401823J282930J004497Q78851O14529
3147A10701251L96210J26854k59282n84274o94064r10350j083383j162003j239611
3138A05291348j243877j388250j433559j566690j751355j586639j680631j785436
3130I2854911j758637j767534j826495j799463j693800j654853j430711j365510
3122G9557908j409905j206561j083793j054988p78430p37283n59745m62160m04658
3113G1860385l01361j62486j02598r3434j64520n9645J13670j3185j5852K0605
$$ y = [87472825, 87523702, 87709638, 87995650, 88181122, 88444954, 88814393, 89213315, 89723670, 90208840, 90798286, 91490464, 92359296, 93169680, 94166138, 95298101, 96507536, 97854403, 99333996, 100888114, 102478383, 104057851, 105518621, 106920444, 108203374, 109207871, 110086722, 110701251, 111097461, 111224315, 110965033, 110380759, 109686695, 108776345, 107692962, 106530959, 105291348, 104047471, 102659221, 101225662, 99658972, 97907617, 96320978, 94640347, 92854911, 91096274, 89328740, 87502245, 85702782, 84008982, 82354129, 80923418, 79557908, 78148003, 76941442, 75857649, 74802661, 74024231, 73286948, 72727203, 72265043, 71860385, 71559024, 71396538, 71293940, 71200506, 71035986, 70976341, 71090011, 71076826, 71060974, 71081579]
3103G1081579J8655N4826n7345p9465j21765r6568j97242n2424L7407N5809N1469
3092G0694936j15242J14195N1696L5060Q4049J04492k3298O8275m3366k20032
3082G0750765n4518j79622l29460l34484l58947n41258p51175q71548r01841q31704
3072F5596208j019012j105602j249058j324214j230973j379663j431663j457169
3064E5398854j332906j377509j540990j309941j450055j363945j343814j307803
3056D4371891j184749j048511j157296j083967q71319q74215o92930q50396o55410
3047C5953098n79081o07496n42548m33245l67674k92644k50759j91467j91014
3038C2497170k08306J585j12808L3712J50480R0087K08923J25774N1476J96429
$$ y = [71081579, 71100234, 71155060, 71097715, 71018250, 70896485, 70799917, 70602675, 70550251, 70587658, 70643467, 70694936, 70579694, 70693889, 70745585, 70780645, 70864694, 70969186, 70945888, 71014163, 70970797, 70750765, 70696247, 70516625, 70187165, 69852681, 69493734, 68952476, 68201301, 67329753, 66427912, 65596208, 64577196, 63471594, 62222536, 60898322, 59667349, 58287686, 56856023, 55398854, 54065948, 52688439, 51147449, 49837508, 48387453, 47023508, 45679694, 44371891, 43187142, 42138631, 40981335, 39897368, 39026049, 38151834, 37458904, 36608508, 35953098, 35374017, 34766521, 34223973, 33790728, 33423054, 33130410, 32879651, 32688184, 32497170, 32288864, 32290449, 32177641, 32211353, 32361833, 32451920, 32660843, 32786617, 32838093, 33034522]
3028C3034522L42618K90997L62336L70796K81928M10944M98072M29840N11599
3019C6533652M49138M97460K69426M79181N42819O02962N26144O44608N90137
3010D1135527O08695O81878O69479P81580P55316Q04795P14848P93107Q83829
3001D7829054Q78100Q82535Q14720Q16200Q25150P78745R42011Q73289R99960
2992E5639764J069175J114924J297642J521540J656314J690796J857885J946176
2984F7794216J844269J860096J841483J846052J632054J452849J483807J464909
2976H1219735J495015J458225J587332J352275R22305O59369K00831n13220j142727
2967H7239140j558821j807283k172443k385051k207710k271241j966921j784557
$$ y = [33034522, 33377140, 33668137, 34030473, 34401269, 34683197, 35094141, 35592213, 36022053, 36533652, 36982790, 37480250, 37749676, 38228857, 38771676, 39374638, 39900782, 40545390, 41135527, 41744222, 42426100, 43095579, 43877159, 44632475, 45437270, 46152118, 46945225, 47829054, 48707154, 49589689, 50404409, 51220609, 52045759, 52824504, 53766515, 54639804, 55639764, 56708939, 57823863, 59121505, 60643045, 62299359, 63990155, 65848040, 67794216, 69638485, 71498581, 73340064, 75186116, 76818170, 78271019, 79754826, 81219735, 82714750, 84172975, 85760307, 87112582, 88034887, 88694256, 88895087, 88381867, 87239140, 85680319, 83873036, 81700593, 79315542, 77107832, 74836591, 72869670, 71085113]
2959G1085113j564503j395185j205660j094484r78553p33264p51363o41210m32359
2950F2288532k75821k57052o8435K2662K61309M01304N39312O57024P75418J054141
2940F5398394J002026J253648J447110J503046J731469J845911K105914K296922
2932G8584440K490677K792969K662169K801470K972776L000269K856394K956573
2924A01117737K904823K891197L015630L044310L153613L030266K997924K926597
2916A25082097K570864K327872J855291J370314J323718R57979O97516M94655
2908A36680306L31982L63409J25623M0141O3450J77190J56420K91970N67526P16607
2898A39514624Q63596R70564J366957J576331J846156K172784K720482L207222
$$ y = [71085113, 69520610, 68125425, 66919765, 65825281, 64846728, 64113464, 63362101, 62720891, 62288532, 62012711, 61755659, 61687224, 61709886, 61971195, 62372499, 62911811, 63568835, 64344253, 65398394, 66400420, 67654068, 69101178, 70604224, 72335693, 74181604, 76287518, 78584440, 81075117, 83868086, 86530255, 89331725, 92304501, 95304770, 98161164, 101117737, 104022560, 106913757, 109929387, 112973697, 116127310, 119157576, 122155500, 125082097, 127652961, 129980833, 131836124, 133206438, 134530156, 135488135, 136185651, 136680306, 137012288, 137375697, 137501320, 137541461, 137604911, 137782101, 137938521, 138230491, 138798017, 139514624, 140378220, 141348784, 142715741, 144292072, 146138228, 148311012, 151031494, 154238716]
2890A54238716L530420M128491M717978N341427O049533O804661P677655Q184385
2882B00673266Q342964P969008P099438N877966M452973K910717J991843J883769
2874B41201944K541178L471334M560192N843312P228893Q315269Q837643Q491712
2866B90491477P332671N377784L099166M53832j708086l378009m373224m667804
2858B92627807m966961n200448n745056o367193p104482p717769q564589q984514
2850B37976795r369660r784096j0156248j0443984j0389520j0217056r983330
2843A67632901r696978r252789q601176q143394p575802p056249o435212o035551
2835A04835750n548628n091592m724141m275883m124629l867265l425677l203707
$$ y = [154238716, 157769136, 161897627, 166615605, 171957032, 178006565, 184811226, 192488881, 200673266, 209016230, 216985238, 224084676, 229962642, 234415615, 237326332, 239318175, 241201944, 243743122, 247214456, 251774648, 257617960, 264846853, 273162122, 281999765, 290491477, 297824148, 303201932, 306301098, 306754930, 305046844, 301668835, 297295611, 292627807, 287660846, 282460398, 276715342, 270348149, 263243667, 255525898, 246961309, 237976795, 228607135, 218823039, 208666791, 198222807, 187833287, 177616231, 167632901, 157935923, 148683134, 140081958, 131938564, 124362762, 117306513, 110871301, 104835750, 99287122, 94195530, 89471389, 85195506, 81070877, 77203612, 73777935, 70574228]
2827G0574228k957527k882806k699883k609160k324590k185414k123632j936443
2819E0854773j857656j835740j700625j459387j403932j495693j353879j323492
2811C8424369j207553j073418j145821j048515r20948q65155j011197q42279r26684
2802B9382799p54025o01089p59466p58463n44658o68651o35025p08793n60003
2793B3392626n55178o46498m57892o19466n93257l72939m41531m73914m03909
2784A8828042m45163m19731m97020l63733m13980m29804k52250l11563k79620
2775A5415178l68466l07855l55295l51723j87110k84741j95392k59945l71317
2766A2733334j83613k90553k58052j87962k55900k44365j23149j93906q9196j63478
$$ y = [70574228, 67616701, 64733895, 62034012, 59424852, 57100262, 54914848, 52791216, 50854773, 48997117, 47161377, 45460752, 44001365, 42597433, 41101740, 39747861, 38424369, 37216816, 36143398, 34997577, 33949062, 33028114, 32162959, 31151762, 30309483, 29382799, 28628774, 28027685, 27268219, 26509756, 25965098, 25296447, 24661422, 23952629, 23392626, 22837448, 22190950, 21733058, 21113592, 20520335, 20147396, 19705865, 19231951, 18828042, 18382879, 17963148, 17466128, 17102395, 16688415, 16258611, 16006361, 15694798, 15415178, 15046712, 14738857, 14383562, 14031839, 13844729, 13559988, 13364596, 13104651, 12733334, 12549721, 12259168, 12001116, 11813154, 11557254, 11312889, 11189740, 10995834, 10906638, 10743160]
2756A0743160j61067k33207r1235j09190j64720j68526j21601k00955j96602p9321
2746I216736j99486j71412j76754n8129j99168j74615m6410K527p4081k54861
2736G864347j28955j7502p3349k03965k17333n8475N7945q8198k13312n7422j5667
2725F848114r2840k0928j3760k07477K555j39438o4730p8520j04004j41306l4470
2714E953196m1573k8072j69135j7714q0722j71585o438L7748N848l1374j35791
2703E314388j25359j3886n4161p3640l3683n9532l6330r5878p823r674j30378
2692D674044l2324n0465O9604l7591q5946n5449j15453k9282k0799o4301K44O9944
2680D322226q5010j82975J93m2966j2041j04303m427j9378j5571k5720p4222q4383
$$ y = [10743160, 10582093, 10348886, 10257651, 10148461, 9983741, 9815215, 9693614, 9492659, 9296057, 9216736, 9017250, 8845838, 8669084, 8610955, 8411787, 8237172, 8190762, 8193289, 8119208, 7864347, 7735392, 7717890, 7644541, 7440576, 7223243, 7164768, 7222713, 7134515, 6921203, 6863781, 6848114, 6755274, 6734346, 6720586, 6513109, 6515664, 6376226, 6311496, 6232976, 6128972, 5987666, 5953196, 5911623, 5883551, 5714416, 5696702, 5615980, 5444395, 5437957, 5475705, 5481553, 5450179, 5314388, 5189029, 5175143, 5120982, 5047342, 5013659, 4954127, 4917797, 4821919, 4814096, 4804422, 4674044, 4641720, 4591255, 4660859, 4623268, 4537322, 4481873, 4366420, 4337138, 4316339, 4252038, 4252282, 4322226, 4237216, 4054241, 4054434, 4011468, 3999427, 3895124, 3890697, 3871319, 3855748, 3830028, 3755806, 3671423]
2668C671423o8274q7621l6280j7762r1739J6028Q1900p7198k5645O0555j30162
2657C295225m2988m2319l3663J24501o8541J1080l6223o2091K4507O1807o9878
2646C161417n9504J2376j00402Q6808M6423M814K5108j36230k947J0037R35J22622
2634C171457m4946r3185N7923J34606q1765j0216L961l9535M373j33428m8039
2623B921206Q8312J7045P2552l7095k3119p7742k9190J31703m6475o0673l1446
2612B925078k6309Q8246L8611n8884K0617m6747k3865l3141K4060q618P1608O2725
2600C033381m2613l9835L2296J4626J2328R3813O2599k4897m7166j51982J24698
2589C067248j7631l2873L4569m7171M0614L8272J1542M2915P8159M5068j9025
$$ y = [3671423, 3603149, 3515528, 3479248, 3461486, 3369747, 3385775, 3467675, 3390477, 3364832, 3425387, 3295225, 3252237, 3209918, 3176255, 3300756, 3232215, 3243295, 3207072, 3144981, 3169488, 3231295, 3161417, 3101913, 3114289, 3013887, 3100695, 3147118, 3151932, 3177040, 3040810, 3037863, 3047900, 3048835, 3171457, 3126511, 3033326, 3091249, 3225855, 3144090, 3133874, 3137835, 3098300, 3102673, 2969245, 2921206, 3009518, 3026563, 3099115, 3062020, 3038901, 2961159, 2931969, 3063672, 3017197, 2956524, 2925078, 2898769, 2987015, 3025626, 2966742, 2987359, 2940612, 2916747, 2883606, 2907666, 2899048, 2970656, 3033381, 2990768, 2950933, 2983229, 2997855, 3010183, 3103996, 3166595, 3141698, 3094532, 2942550, 3067248, 3049617, 3016744, 3051313, 3004142, 3044756, 3083028, 3094570, 3137485, 3215644, 3260712, 3241687]
2578C241687j27614j26167l7240L8007K914l1540j11731m3752l8630j4073j4120
2567B737741J3808l2272j1677j59932j10907Q220M6104j05396k21348k6743K3781
2556B161379j18467J3687j07759m0619p8756K4712k15285N9839N6296o341K9507
2545A778193k30029l8782r3912K6482L6035p0379M2926M4196j04700K4805Q707
2534A423542K5378J5143j34926m8155j8706m1095M3082M6672M9891j88492p2405
2523A099929j2446J45742O461r512r1675k9484L3316n3720K2981K2302J2213j7069
2511A129038M0908p5109q729l584l242r8568N9386J2573q4671m6969k4225O1714
2499I58522K1021p5470j3665n828J5600j7339j6188L3298j0723p4341P2001q965
$$ y = [3241687, 3114073, 2987906, 2950666, 2988673, 2991587, 2960047, 2848316, 2804564, 2765934, 2751861, 2737741, 2751549, 2719277, 2707600, 2547668, 2436761, 2444981, 2491085, 2385689, 2164341, 2137598, 2161379, 2042912, 2056599, 1948840, 1908221, 1829465, 1854177, 1638892, 1698731, 1755027, 1748686, 1778193, 1548164, 1509382, 1415470, 1441952, 1477987, 1407608, 1450534, 1494730, 1390030, 1414835, 1423542, 1448920, 1464063, 1329137, 1280982, 1262276, 1221181, 1264263, 1310935, 1360826, 1172334, 1099929, 1087483, 1233225, 1239686, 1230174, 1138499, 1109015, 1142331, 1088611, 1111592, 1133894, 1146107, 1129038, 1169946, 1094837, 1086108, 1082524, 1079282, 980714, 1040100, 1052673, 968002, 921033, 896808, 958522, 979543, 904073, 890408, 884580, 900180, 882841, 866653, 899951, 889228, 814887, 886888, 877923]
2487H77923M0825K8663n5434J4779Q936J2802k5138k5644m5626O0635n1647m5012
2475G96062o1075n4442O6424J45530q5955Q0408o161o2055N8558N7273m2548o2846
2463H29173m1272L2726P347p8200P3845N4207m0489K8908l5627n4142q8506j1829
2451F76141J27951j5409l0364n3560o1216L2152O7240Q1760J1968j67837o1928
2440F06898J9821O2204K8931q7167Q4367J50329q7657j34463k8181j9997R4600
2429F89685M1907j8698J01380n3961j38361n5687m2788L0566J65548M0353l7415
2418G22529k5233o2894l5319l5631N3887l4184j028R262M397N4113p4396M1956
2406F17459j9989k9004m9874m3106R9060n851O6607o9316m2195P5791M9651r6076
$$ y = [877923, 918748, 947411, 891977, 906756, 915692, 928494, 903356, 877712, 832086, 892721, 841074, 796062, 734987, 680545, 746969, 892499, 806544, 886952, 880791, 818736, 877294, 934567, 892019, 829173, 787901, 820627, 827974, 749774, 823619, 877826, 837337, 866245, 830618, 776476, 687970, 676141, 804092, 788683, 758319, 704759, 643543, 675695, 742935, 824695, 836663, 668826, 606898, 626719, 688923, 717854, 630687, 715054, 865383, 777726, 643263, 615082, 595085, 689685, 731592, 712894, 814274, 760313, 621952, 566265, 523477, 554043, 719591, 759944, 722529, 697296, 634402, 599083, 563452, 617339, 583155, 582127, 591389, 595786, 649899, 575503, 617459, 597470, 568466, 518592, 475486, 574546, 568695, 635302, 565986, 523791, 599582, 649233, 553157]
2394E53157N5530J6037j2835J308o4413J0845o8957N8315m4066q085O8990N9179
2382F25005n1351J2291K7123j6672n883R287J3982M2927n3644r4887j1495Q7823
2370E84506J6428q4122R4409K8576M337j50872n8719O5653j180J5368k4632K9331
2358E19083j3547n1j140K5412n3102j2848Q925O5662l7204J9123P8267O61R732
2345F08973n6822L8627P8014j17125K984N5901o8203o8329M1371N4750j11547
2334D58594l710L860m6757K9428Q63m1711J9325J7748J3581O8351n3740k7124
2322D38708k3120l5559J8592K0690l8333N2716k5340J7403N9191l3751l047J6583
2310D64733n5903R1010o3551j1491O3196j3959k8695j959N4971j22387J30931
$$ y = [553157, 608687, 624724, 611889, 613197, 548784, 559629, 490672, 548987, 504921, 496836, 565826, 625005, 573654, 585945, 613068, 596396, 590513, 599800, 613782, 656709, 603065, 508178, 496683, 584506, 600934, 516812, 611221, 639797, 644134, 493262, 434543, 500196, 499016, 514384, 489752, 519083, 505536, 505485, 504345, 529757, 476655, 463807, 472732, 538394, 501190, 520313, 598580, 599241, 608973, 552151, 590778, 668792, 551667, 554651, 610552, 542349, 474020, 515391, 570141, 458594, 454884, 458744, 411987, 441415, 442278, 400567, 419892, 437640, 451221, 519572, 465832, 438708, 415588, 380029, 398621, 419311, 380978, 433694, 408354, 425757, 484948, 451197, 448150, 464733, 408830, 499840, 436289, 424798, 487994, 474035, 445340, 443381, 498352, 375965, 506896]
2299E06896j5706o8627K2501N361m9714R1820n005N0165o0958l3201k5982l361
2287D14189P2106O5530j0813j0824p234q3192N9657j5945j67489L1175J24091
2276D71251k6821J15992k4325r5329m0229M0060m333Q613p349j7896k2735N2156
2264D49055N7482l992N1318K5017j64433k2403m8701l715J10487L545M5054m5655
2252D53059l1101l489N8600L5297m2551K8225o8579j17877J11178o6760j6120
2241C39882M1224O7721M0485L551J0113p9719L1747L5088L9111k6955j16867O2438
2229D47819R1907K1365k03705n4280Q1382J10576k9632l0233M935n4762q787j2125
2217C64460R2846P1525n5008K5188K696n5026L0182J0698K6880n9613N7441k0395
$$ y = [506896, 491190, 422563, 445064, 450425, 400711, 492531, 487526, 537691, 476733, 443532, 417550, 414189, 486295, 551825, 541012, 530188, 522954, 439762, 499419, 483474, 315985, 347160, 471251, 444430, 560422, 536097, 440768, 400539, 440599, 436266, 444879, 437530, 419634, 396899, 449055, 506537, 502545, 553863, 578880, 414447, 392044, 343343, 339628, 450115, 453660, 498714, 453059, 421958, 418469, 477069, 512366, 469815, 498040, 429461, 311584, 422762, 356002, 339882, 381106, 448827, 489312, 492863, 502976, 423257, 455004, 490092, 529203, 502248, 385381, 447819, 539726, 561091, 357386, 303106, 384488, 495064, 465432, 435199, 440134, 385372, 376585, 364460, 457306, 528831, 473823, 499011, 501707, 446681, 476863, 487561, 514441, 454828, 512269, 491874]
2205D91874l2330o6630j20746J40045Q9157M9850r5673M6259O8310p6016P18N7481
2193E52299p6062o6521J58046N5564j33496l2143J1911L5247K5108p7636p1933
2182C80384J37514k0147j23950P1479R5552J4927k7943J13539m1141O940j3602
2171E93552R2974l6243o7087K9141J03239l7040M6396j5218M7948M3324m6680
2160G54306K3488L5145K12r2131K3782K2015M1100M768j662M1902p4834P587L4528
2147H20206K7403J3007J7681P893K8223O9679n721k3890m5782L9288j6302R2580
2135A024265j8306P7315N2971O8159Q1342J5540q172j5832k406k1934J19921j33105
2123A239758N8480J86343L7384m8660J25721Q349N0917P1218L8289N7323L7690
$$ y = [491874, 459544, 392914, 272168, 412213, 501370, 551220, 455547, 501806, 570116, 494100, 494818, 552299, 476237, 409716, 567762, 623326, 489830, 457687, 469598, 504845, 529953, 452317, 380384, 517898, 497751, 373801, 445280, 540832, 555759, 527816, 641355, 600214, 607154, 593552, 686526, 650283, 583196, 612337, 715576, 678536, 724932, 709714, 757662, 800986, 754306, 777794, 812939, 813151, 721020, 744802, 766817, 807917, 812685, 811023, 852925, 778091, 785678, 820206, 847609, 860616, 878297, 886190, 914413, 984092, 978371, 954481, 908699, 947987, 931685, 1024265, 1005959, 1083274, 1136245, 1204404, 1285746, 1301286, 1293114, 1277282, 1274876, 1252942, 1372863, 1239758, 1298238, 1484581, 1521965, 1473305, 1599026, 1607375, 1658292, 1729510, 1767799, 1825122, 1862812]
2112A862812M8816R7345P8574J64529L1949K8160J73789P2251P5392J49657K13186
2101B996460K6308J83322J68415J75525K86995L08117J78105J94124L42323L62291
2091E221985M35607M72822N85249N91025P60035P83822R46721J247460J311843
2082A2356569J498534J515949J367083J025283O06588n6427p18676j407788j593026
2073A4594089j627688j496099j399356j209269r68896p61620n70432m80912m58322
2064E621495m49998l62305l31321l64003l46185k73007j10165j41979k31780j10709
2054B900043j15040k46812j68111o4824l8954p1456j82747j24185L5152n0796
2044A872270j58919j1406p0758j20995j22054k7314j1372m9391q1976J4306k0435
$$ y = [1862812, 1911628, 2008973, 2087547, 2252076, 2284025, 2312185, 2485974, 2558225, 2633617, 2783274, 2996460, 3022768, 3206090, 3374505, 3550030, 3837025, 4145142, 4323247, 4517371, 4859694, 5221985, 5657592, 6130414, 6715663, 7306688, 8066723, 8850545, 9797266, 11044726, 12356569, 13855103, 15371052, 16738135, 17763418, 18370006, 18313579, 17594903, 16187115, 14594089, 12966401, 11470302, 10070946, 8861677, 7892781, 7131161, 6560729, 6079817, 5621495, 5171497, 4809192, 4477871, 4113868, 3767683, 3494676, 3384511, 3242532, 3010752, 2900043, 2785003, 2538191, 2370080, 2305256, 2266302, 2194846, 2012099, 1887914, 1923066, 1872270, 1713351, 1701945, 1631187, 1510192, 1388138, 1360824, 1349452, 1300061, 1218085, 1232391, 1211956]
2033A211956q1782O853k1907l1760J200o2449J7852l0945q3509J9714o2426J075
2021H83872o3253J0877M9210p2815r2884J14317m1592q5184k4845m3730M931l6294
2009F02610M7037k0923o0806l8561N0625m8221J2355L3858l1513n8000J7943m3700
1997D62704n654M9474Q6962q8842k6429L4844n0031Q735K3895m8559L6041L9655
1985E22795J9257m3810j87686l0386r099K08091n3675p9253R803O0582J9742J43
1973D36504m4256l6846l8464J19680J9439n1030q2976p038O8383O2751q4559r8451
1961B63137j8910K0741K913q0886R9690M2114o8582l48P1118j24712L7094Q0709
1949C24078n788q0824l9230n365Q3893q2701p5032J59461N8768l6883O995l7366
$$ y = [1211956, 1130174, 1137027, 1115120, 1083360, 1084560, 1022111, 1039963, 1009018, 925509, 945223, 882797, 883872, 820619, 831496, 880706, 807891, 715007, 829324, 787732, 702548, 677703, 633973, 638904, 602610, 649647, 628724, 567918, 529357, 579982, 531761, 544116, 577974, 546461, 488461, 506404, 462704, 457050, 506524, 593486, 504644, 478215, 513059, 463028, 471763, 495658, 447099, 483140, 522795, 542052, 498242, 310556, 280170, 271071, 479162, 425487, 346234, 356037, 416619, 436361, 436504, 392248, 355402, 316938, 436618, 456057, 405027, 322051, 315013, 383396, 446147, 361588, 263137, 244227, 264968, 267881, 186995, 286685, 328799, 260217, 259869, 330987, 206275, 243369, 324078, 318290, 237466, 198236, 192871, 276764, 194063, 119031, 278492, 337260, 300377, 307372, 270006]
1937B70006Q0919j4671j49684n6311o4812M4926O1363r0907J05452O313l4020
1926A58574M9178l914m6563p510j7048K4754J28472J5173n9894m3025j6155l0863
1914A51179M3274M3220j1601J8506r7949J8524j8688j2166M1880L1012j1014l0986
1902A65191K9563K8041p0701L2402N9831j16735m3984J6687k9312M0812J44833
1891B56628o3554l6260k8826N5496k494O7729p3105j95104L3333J20601m1115
1880I3329q9795J35264q9209J0803Q8775K409j6320L6169N9771r0836N9236J9182
1868B18778o0141J6532j4600n4263M5632O8059m0553L9842n3416o3501l264l5251
1856F3854N4810J06538k5784K956n2908m8619m9291L4999M1669L1621Q1489j29909
$$ y = [270006, 350925, 336254, 186570, 130259, 65447, 110373, 171736, 80829, 186281, 192594, 158574, 207752, 203838, 157275, 149765, 132717, 157471, 285943, 301116, 241222, 198197, 182042, 151179, 194453, 237673, 226072, 244578, 146629, 165153, 146465, 134299, 176179, 207191, 196177, 165191, 194754, 222795, 152094, 184496, 244327, 127592, 83608, 100295, 70983, 111795, 256628, 193074, 156814, 127988, 183484, 180990, 248719, 175614, -19490, 13843, 134444, 93329, 3534, 138798, 49589, 60392, 149167, 151576, 135256, 171425, 231196, 140360, 199596, 218778, 158637, 175169, 160569, 106306, 151938, 219997, 179444, 219286, 165870, 102369, 99105, 63854, 118664, 225202, 199418, 202374, 149466, 100847, 51556, 86555, 128224, 159845, 241334, 111425]
1844A11425j8703j146J11940l3882L417j10815n9432M9113J9446o5240Q2975O2172
1832A51270K747O8578p8682M1618j5052j20444l5342R0335j5674M7418J7160P5479
1820B29411k9840j39219L3665J11984O5297Q4125j07313k0198Q6626j26122N9970
1809B48386j0948o3541M2741m5017r685m9994M4905j5278L1259n930J0355N81
1797A77834j11323J06239j6372j0674j04555k5544N6903j04963P6176N5846j3401
1786H6166l8977l5638Q9493N9612p7891J8294J09326k1743l9428j60981J9540
1775G773k5402Q0835N4437k5178r80r3795J22059r13j29607j5685M0167n663K32
1762H280l1347n4456Q7439l6036k815P5995L0179J4291M6567q9718J17066j0889
$$ y = [111425, 92722, 91576, 203516, 169634, 173051, 62236, 2804, 51917, 71363, 6123, 89098, 151270, 154017, 222595, 143913, 185531, 170479, 50035, 14693, 105028, 89354, 136772, 153932, 229411, 199571, 60352, 94017, 206001, 271298, 355423, 248110, 227912, 314538, 188416, 248386, 237438, 173897, 216638, 171621, 161936, 111942, 156847, 141569, 172828, 166898, 177253, 177834, 66511, 172750, 156378, 145704, 41149, 15605, 72508, -32455, 43721, 99567, 86166, 47189, 11551, 101044, 160656, 82765, 101059, 210385, 188642, 149214, -11767, 7773, -17629, 63206, 117643, 92465, 91485, -2310, 119749, 118836, -10771, -26456, 13711, 8048, 8280, -23067, -77523, 9916, -26120, -28935, 47060, 77239, 91530, 138097, 48379, 165445, 154556]
1750A54556p4800l8406m396P9824j3826l1644n0314J1950m5614K3901R7172n6338
1738E2065L3616N0856M2564J6221l4820l9289k0183O5331n0382n3130l8735J32830
1726A56944j188o7717j9473P0807o329j70o4761K4449R450l3115j1517J4608N4532
1713A26520q0626P859P1295l3873J9740q8176k6158k3799O2534L0517j1622p64
1701E3447p6975K6335n2263J22314p3846n5817m5083L3820J43537M405n949N628
1689G9553L938r2299Q3807O3403O3946j21536j48226P606K422J9620O8305l4303
1677c764M8872O6683N3620n4426p1740j06615O2268n3996K4205J7819p1332M8765
1665c9641M5945j1708K544M3468j6228k5459K1557m3835p9455J08117Q1475N1468
$$ y = [154556, 79756, 41350, 36954, 116778, 102952, 71308, 20994, 32944, -12670, 11231, 108403, 52065, 85681, 136537, 179101, 195322, 160502, 121213, 101030, 166361, 115979, 62849, 24114, 156944, 155756, 88039, 68566, 139373, 133044, 132874, 68113, 92562, 102012, 68897, 57380, 71988, 126520, 45894, 53753, 125048, 91175, 110915, 22739, -3419, -27218, 35316, 65833, 54211, 53447, -23528, 2807, -49456, 72858, -988, -56805, -101888, -68068, 75469, 79874, 73925, 79553, 83491, -8808, 74999, 138402, 202348, 80812, -67414, -59808, -57386, -37766, 30539, -3764, 45108, 111791, 165411, 110985, 39245, -67370, -5102, -59098, -34893, -17074, -88406, -39641, 6304, -5404, -2860, 40608, 24380, -1079, 20478, -23357, -102812, 5305, 86780, 138248]
1653A38248r1285l3894k5607P1363M6221N3932J6251o6708r5047l732l5050J01079
1641G5771L6661o5362O9757j566K8931o6482m7447Q7204L4319J326n8298P569
1629A02383Q8560J3097j50652O1727L5675j51514l2953o7401k649J96995m0835
1618E2433l3639P7522p303M6243j4223P058p9018n6678n5370J9144Q1935N6195
1606I4299J9214q0515l6342j20120k8522O6039L7477Q8181o5798K0019M2771J6252
1594E2955R4599r8066R3548K6271j10114j15149Q9998K5889j57311J37428O510
1583D6558o4872j9718Q1133J01193n3381o4957K3223m1775r2830N1013K3750O4396
1571E3733R260O1031n3352m4961l5610n550K9160P6644j7311j15639K3278n2783
$$ y = [138248, 46963, 13069, -12538, 58825, 105046, 158978, 175229, 108521, 13474, 9742, -25308, 75771, 112432, 47070, 116827, 115261, 144192, 77710, 30263, 117467, 151786, 153112, 94814, 102383, 190943, 204040, 53388, 115115, 150790, -724, -33677, -101078, -103727, 93268, 52433, 18794, 96316, 89013, 135256, 121033, 128091, 49073, -7605, -62975, -43831, 38104, 94299, 113513, 32998, -3344, -123464, -151986, -85947, -48470, 39711, -26087, -6068, 36703, 52955, 147554, 49488, 143036, 169307, 59193, -55956, 34042, 59931, -97380, 40048, 46558, -18314, -38032, 43101, 144294, 90913, 25956, 49179, 7404, -85426, -34413, -10663, 53733, 62993, 124024, 70672, 25711, -9899, -15449, 13711, 90355, 73044, -42595, -19317, -72100]
1559g2100N4848j6428J11613N0924q3872M3637m011k1405m3527j0594P1400j9067
1547F1418r6264N856L149j0736K4554J26034m5859n243L2934K3573j32940J3329
1535a95K0524l8524J54614K3151l6513L1591j8783q0108q6254j2128R3939p6038
1523b4724o637K3319p6026L3905J02534N6867l8700q27J4319l797n1998K4346
1511E2581J11254j26902Q0521k3630N7495k0010p603j05414j4352L137q3989n8400
1499a35312J12022J21711N9348j14871r7560J6110k2132Q2483m283k7923n6256
1488f6663J49961K871j04559J0916L0026K9060J3414m4550N7203J6749j808n8310
1476C4310R869l7483K6911l3933p1145N9486L9907o3114j5485J21879N338k5040
$$ y = [-72100, -17252, -33680, 77933, 128857, 44985, 88622, 84611, 63206, 19679, 9085, 80485, 61418, -34846, -28990, -25841, -36577, -12023, 114011, 68152, 62909, 95843, 119416, -13524, -195, 20329, -18195, 136419, 159570, 123057, 154648, 135865, 55757, -30497, -42625, 51314, -24724, -31361, -8042, -84068, -50163, 52371, 109238, 70538, 69711, 84030, 80233, 28235, 52581, 163835, 36933, 117454, 93824, 151319, 131309, 123706, 18292, 3940, 7077, -76912, -135312, -23290, 98421, 157769, 42898, -54662, -38552, -60684, 21799, 17516, -10407, -66663, 83298, 86169, -18390, -7474, 22552, 51612, 65026, 20476, 77679, 94428, 92620, 34310, 44179, 6696, 33607, -326, -71471, -11985, 27922, -35192, -50677, 71202, 76540, 51500]
1464E1500q8006J6239j21877k54J24704P8064q3323J7861M4783j4560k3979K0178
1452B1330N9943p3908p787J5150M2398l7873l9039o616j190j42349J04373R2928
1440B7360o93J0219J4690l723J2825k4125l3504p0289M9770L3557n4212M7116
1428H991r66Q5158n5824O6670n765o3686L114l0693L336P1837M386n2012N150
1415C9696P8406n0378o8212n6519J29324K0972l0466l1151J9706K5164o018q2488
1403a1964R9401k6995j94008J30747j1663N8827M166l758j15900K2825R484M021
1391c4817k4953Q819M6832M6632N0345o4442k6891J0793j2161M9945J4033P009
1379G1144K9192j4758p0147j1124p2223j8388j14845P8947O4236j15J20996n624
$$ y = [51500, -36506, -20267, -142144, -142398, -17694, 60370, -22953, -5092, 39691, 25131, 1152, 21330, 81273, 7365, -422, 14728, 57126, 19253, -19786, -26402, -27592, -169941, -65568, 27360, 26667, 36886, 51576, 47853, 60678, 36553, 3049, -67240, -17470, 16087, -38125, 8991, 8025, 93183, 37359, 104029, 98264, 34578, 37692, 6999, 10335, 82172, 86558, 34546, 39696, 118102, 67724, -488, -57007, 72317, 93289, 62823, 31672, 51378, 76542, 70524, -11964, 87437, 60442, -133566, -2819, -14482, 44345, 48511, 44753, -71147, -48322, -38838, -34817, -59770, -50951, -4119, 42513, 92858, 28416, 1525, 12318, 157, 50102, 64135, 71144, 100336, 85578, 15431, 4307, -67916, -86304, -201149, -122202, -57966, -58081, 62915, 57291]
1367E7291p6234K2043Q9747m7295K6034J4017p592p2906k0316O74n4817L126P1435
1354E207J2409O9782M423J5394j11228k2955J14587M5760o4118o9089P642k8803
1342b0989n4987N3690N1543l9676P037n7614L3966p8549l7903J03703R4381l5375
1330A9227K4780l9418L6812M3308l1598q0098j96715M6054j6077Q6992J19751
1319A3018r5495K2803M3304M3082J3965m1017m4428k4357M6141Q6846O416n5971
1307A4307Q3295r958l7309k3494k306n9416m2919O67o570R4213j11246M0471L1037
1294b9228j5988N9175J13677L3526n347l4846N5617K226j20129r7523Q2625K14449
1282B58234n9843m8209m4511K0434j57275n5941J12912J25646r9444k0559q524
$$ y = [57291, -18943, 3100, 92847, 45552, 71586, 85603, 78011, 5105, -15211, -14537, -69354, -66228, 5207, 17616, 87398, 91821, 107215, -4013, -26968, 87619, 133379, 69261, 172, 7814, -20989, -75976, -22286, 29257, -10419, -3382, -60996, -27030, -105579, -143482, -39779, 54602, 19227, 44007, 4589, 41401, 84709, 53111, -26987, -223702, -177648, -193725, -106733, 13018, -82477, -59674, -16370, 26712, 40677, -340, -44768, -69125, -22984, 63862, 70278, 14307, 97602, 87644, 50335, 26841, 24535, -34881, -77800, -77133, -83703, 10510, -100736, -60265, -29228, -45216, 13959, 127636, 161162, 155815, 120969, 176586, 178812, 58683, -38840, 43785, 258234, 198391, 150182, 105671, 126105, -31170, -87111, 25801, 151447, 52003, 31444, 22920]
1271B2920Q8323l211l8347n780j9511j4574M3488j6559k6186j7172m0785P7600
1259E0206o5150p1214J6679K8824P610P4752j42121M2577J16006j34610P5905
1248e36m569m6330P622M780o831R4646L3835k1526l1946p8699l6960J5097O6531
1235d886o8503L7280l7559O1657O653J6047j3757K1700N8436o4194n7171n2152
1223i6449L0123O0871M4825Q2169k15555R7721J697l5556J4354j55125L1680Q7684
1211e1561M8815l3605K9961k2965M1442J16143j00196k7076l6194r821M8094p2733
1199f9696Q0938N9002K5740J4994m7748j06839M2176l1640J5296O230j1339n0989
1187g3875J82895m6100k932M5221l1180O1893j52812j5915M3167o9609j2465K2935
$$ y = [22920, 111243, 108032, 69685, 63905, 44394, 29820, 73308, 56749, 30563, 13391, -27394, 50206, -14944, -86158, -69479, -40655, -33045, 41707, -100414, -57837, 58169, -76441, -536, -5105, -51435, -43813, -39033, -45864, 48782, 82617, 61091, 29145, -49554, -86514, -71417, -4886, -73389, -36109, -73668, -12011, -5358, 10689, -3068, 18632, 77068, 12874, -44297, -96449, -66326, -5455, 39370, 121539, -94016, 3705, 5402, -30154, -15800, -170925, -139245, -51561, -2746, -36351, -6390, -29355, 12087, 128230, 28034, 958, -35236, -45057, 3037, -69696, 11242, 70244, 95984, 110978, 63230, -43609, -1433, -33073, -17777, -11547, -22886, -73875, 109020, 62920, 59988, 105209, 74029, 135922, -16890, -32805, 10362, -59247, -71712, -48777]
1175d8777L6701M4858N0863q0306j5453l211K291m2508N9510J12064j90124r3638
1163a67730N9102Q2927J21847K4616K0579k2805j82144L2434N6778M0967j19922
1152e3351M4949J712l8010k1562k795L9006R4752J0119k2353j3128j14216K9886
1140d4991M6064o8674o875L7114P4449J7672j5146N5118p4166o1020m1623Q3953
1128A875M3978l3744n6544P8835J15848n455j37191P8884m0286k2727m7684L7538
1116A3327R2597J4931o8343r3535N4121n5225J0246o0569M6437m3319J2864m7412
1104a23880J7214K3168q595K1817M9602p9522l4898Q6692J5400k8425N9701l1093
1092c2819o1431J213Q608N7389K8798P97L6516P455r4459J7912O7034L2460o6770
$$ y = [-48777, -12076, 32782, 83645, 3339, -12114, -15325, -13034, -55542, 3968, 116032, -74092, -167730, -108628, -25701, 96146, 120762, 141341, 118536, -63608, -31174, 25604, 66571, -53351, -8402, -6690, -44700, -66262, -69057, -30051, 64701, 74820, 52467, 39339, -74877, -44991, 1073, -67601, -74476, -37362, 37087, 54759, 39613, 94731, 20565, -40455, -82078, 1875, 45853, 12109, -44435, 34400, 150248, 144793, 7602, 86486, 46200, 23473, -24211, 13327, 105924, 120855, 52512, -41023, 13098, -42127, -31881, -92450, -46013, -89332, -76468, -123880, -106666, -83498, -92093, -70276, -20674, -100196, -135094, -48402, -33002, -61427, -1726, -32819, -94250, -93037, -84429, -27040, 1758, 2555, 39071, 46526, -47933, -30021, 37013, 69473, 2703]
1079B703J2935N6544p4584k7126M6423k6172K182Q3025o1166o4534L8643q0038
1067i1165J00120K6112p8879M9108K1770o2432k6180Q1183J371N197m1332l4493
1055d9620N4454j04164K1480R5383o9705j1716M2703k6162k0127M6863L9564J5884
1043C4837o7002M7501n447n6850J3312j077k5004M9785n2491p2533M4745o145
1031i6369K3940K9006j81L3739K8827K863o0420M4875N5097m6378O5656p1483
1019I172j55874M4167k7229M6911P9818r515q6678k8782J63131n2191M3422P425
1007C3777o5267P3950q201j41490N9701K4939m1799J9066L8796M3375j8354k1341
995b848P5844k7883n3399J0732N303l0594K7927Q9915R40o7832m1853Q1953K7064
$$ y = [2703, 15638, 72182, -2402, -29528, 16895, -9277, -7095, 75930, 14764, -49770, -11127, -91165, 8955, 35067, -43812, 5296, 27066, -35366, -61546, 19637, 21008, 26205, -15127, -49620, 4834, -99330, -77850, 17533, -52172, -63888, -21185, -47347, -67474, -20611, 18953, 34837, -32165, 15336, 9889, -46961, -33649, -34726, -59730, -9945, -62436, -134969, -90224, -96369, -72429, -43423, -43604, -9865, 18962, 21825, -38595, 6280, 61377, 14999, 80655, 9172, -146702, -102535, -129764, -82853, -3035, -12550, -99228, -128010, 35121, -17070, 26352, 33777, -31490, 42460, 34259, -107231, -47530, -22591, -64390, -45324, -6528, 36847, 18493, -2848, 72996, 45113, -8286, 2446, 7749, -22845, 5082, 94997, 95937, 28105, -13748, 68205, 95269]
982I5269j4036J0745j07407k8863O858n5361O3347j6211K5158R694n0329k9259
970i0395k3160Q6330K5424K0848j17764P268O6936k7697L2711L6305M1797r813
958D8790p4608K7528k0880j554j9379J1262l1235L4011R6231p0065O497O2662
946F9260m058j81344k4103J99817j1071p1895K7346M0115L9482r2501o7445l1069
934a07466k2090m5624K118J28329N4859l3676j353J8486m3358M0737K1412j02294
922h9920K1624L4503m2980L5068K2885n3801j18882L1545M5335k378P4121p2512
910a15392J6572J0146J5447O3709p2635p1163J03256J7360l5524Q082m6800Q6143
898b0799K4676m0541J40525j04056k8533J5627N1K4157J3147q5043K4516Q1487
$$ y = [95269, 81233, 91978, -15429, -44292, -37434, -92795, -29448, -45659, -20501, -10807, -61136, -90395, -113555, -27225, -1801, 19047, -98717, -91449, -24513, -52210, -19499, 16806, 58603, 48790, -25818, 1710, -19170, -20724, -40103, -28841, -60076, -26065, 70166, 101, 6598, 69260, 65202, -116142, -140245, 59572, 48501, -23394, 3952, 44067, 83549, -8952, -76397, -107466, -129556, -175180, -173062, -44733, 10126, -23550, -24903, -6417, -49775, -9038, 12374, -89920, -68296, -33793, -76773, -41705, -18820, -72621, -191503, -159958, -114623, -117001, -42880, -115392, -98820, -88674, -73227, -9518, -82153, -153316, -50060, -32700, -68224, -60142, -106942, -20799, 3877, -36664, 103861, -195, -28728, -13101, -13050, 11107, 24254, -60789, -36273, 45214]
886D5214o4127o5899p981O8838k3248o7901K9611P4299M0465q3993J2879N1922
874A0079j81967r7079J86313R7611k9406K9339K403P8979K5182k28829k9471M1327
862i5519R4701o9970k8251j3870M5646Q6014r7529J2649N4518J9155n4027l9569
850h6052J00458k5278o4144n816k5551L2334R4868R9884m4895n8973k529N2646
838F6952l3060o8196J04176k0170j35882N2941N6974j05724O0798L055M473o1977
826g5640k1271M0220K9738K4705K4439Q1842j92356M5690J5442M2164j29699N1767
814f2959r894j2616j5136R0956L6656P619K5042J1979n0453O4987r8672j0791
802b3282R4678r7201M7259r4770l0086O3405k3968O7498L0508M0823r8118j23139
$$ y = [45214, -18913, -84812, -92793, -23955, -47203, -115104, -85493, -11194, 29271, -54722, -41843, 10079, -171888, -268967, -82654, 14957, -14449, 14890, 17293, 96272, 121454, -107375, -136846, -95519, -818, -70788, -99039, -112909, -67263, 18751, -78778, -66129, -11611, 7544, -46483, -86052, 14406, -10872, -75016, -80832, -106383, -74049, 20819, 120703, 75808, 16835, 14306, 66952, 33892, -34304, 69872, 49702, -86180, -33239, 23735, -81989, -21191, -18136, -13663, -75640, -96911, -56691, -26953, -2248, 22191, 104033, -88323, -42633, -27191, 14973, -114726, -62959, -72853, -85469, -100605, -9649, 27007, 34626, 59668, 71647, 21194, 86181, -12491, -23282, 71396, -25805, 21454, -73316, -103402, -39997, -63965, 3533, 34041, 74864, -23254, -146393]
790a46393N5258O7323j7116l0194k9661j4956J29175Q4580q5388p3198M6844J721
778a2005j3615p4382R3420Q6184q5672R576k0392q0550O7962O5631Q944K3451
766F8552m9249q4484L7697L326P229N0136L9268p445l5265K4708m921q190r0052
753d8690n0822M8787M2456K781n6328O2847p241K7601j9513Q4376K519j208p7489
740A0076o9253J185L3002J2665M2773N7721n6795j07045J9082L2403m9367O5611
728g942j31154p795N6610k1306Q456J1861L8071K0193L5715K0062j5636O6273
716G3408l3406k1399j7228O4484O1227j22299m5715J8194J5429p5796M2101R1072
704E0072o999m1936O9561m2966j19810k54Q7003q3566k2523r445R0754N2413o5356
$$ y = [-146393, -91135, -23812, -40928, -71122, -100783, -115739, 13436, 98016, 12628, -60570, -13726, -12005, -25620, -100002, -6582, 79602, -6070, 3506, -16886, -97436, -29474, 36157, 45101, 68552, 19303, -65181, -27484, -24158, -16929, 33207, 72475, 65030, 29765, 54473, 49552, 41362, -48690, -99512, -50725, -8269, -5488, -61816, 1031, -6210, 21391, 1878, 86254, 88773, 87565, 10076, -59177, -57992, -24990, -12325, 30448, 88169, 31374, -75671, -56589, -24186, -73553, -7942, -139096, -146891, -90281, -111587, -103131, -91270, -53199, -33006, 2709, 22771, 7135, 73408, 40002, 18603, 1375, 65859, 127086, 4787, -40928, -22734, -7305, -83101, -41000, 50072, 43073, 1137, 70698, 27732, -92078, -92332, -5329, -88895, -111418, -120863, -30109, 22304, -43052]
691d3052L8177k0855k6962p2954m7977J66682M1292L8593k212k6370M6938j53813
679f2513j5926j3396k2988J10961L9266n6869r5386L6252L4832o5734K2528l52
667h9325K3945J02483l7206k6087O1633m4767L9932L4879J1562n3735J28397j43612
655H099p3586P2647O8200j04935n5479P9170q3992Q9071K2043J871r9084j5574
643i1549N8677Q7598p1275k3311P513j19892L4325N047N064J25675m790O0072
631G3154R787j30194j05469P0547m0664p289J58950M0872K0999m6700l2304l9786
619b8097L0491o6434l7045R4928J4186m8712N6035m648j5306n2350N240r482j7161
606g8355n8390J15883J44106o1732n3833J2577j6052q0514L9311O3705M6314K530
$$ y = [-43052, -4875, -25730, -52692, -125646, -173623, -6941, 34351, 72944, 70732, 44362, 91300, -62513, -78439, -91835, -114823, -3862, 35404, -21465, -116851, -80599, -45767, -111501, -88973, -89325, -65380, 37103, -103, -26190, 35443, -9324, 30608, 65487, 77049, 23314, 151711, 8099, -65487, 7160, 75360, -29575, -85054, -5884, -89876, -805, 21238, 23109, -75975, -91549, -32872, 54726, -16549, -39860, -32347, -152239, -117914, -112867, -107803, 17872, 13082, 73154, 82941, -47253, -152722, -82175, -122839, -130128, 28822, 69694, 90693, 43993, 11689, -28097, 2394, -64040, -101085, -6157, 8029, -40683, 15352, 10704, -4602, -56952, -51712, -61194, -78355, -136745, -20862, 123244, 61512, 7679, 20256, 4204, -76310, -36999, 26706, 73020, 75550]
594G5550L120m7887k2786N680j15242J6391K3171m5731M356m625O0936m9840j3783
581a10690J9060Q3922J04423k6817r3510j43093m302M2124J37253l6911o5253
570i3794j176O5548Q694o7516N9297l9018J9612j4198j1286N9917Q8338l4228
558D0190p1254K3418l4887o1436J20955k432r2316J05717l190M3066k3462j6355
546B8014K6059m5811o094p5264k3462P0021Q8542L3286q2946m4540O0072l0628
534b751j3029R947o5271n400l7068j6915P1398j09279M8630P3835l5403K9343
522e1963J01742q5837k3978O2632J3016L5061L1325k7260j4529P0532q7524j33667
510a10450j460J9168O0410K7044Q778j8053r2817R3053L4035L8606K3457j10288
$$ y = [75550, 78670, 30783, 7997, 13677, -101565, -85174, -62003, -107734, -103378, -108003, -47067, -96907, -110690, -91630, -7708, 96715, 69898, -23612, -166705, -171007, -128883, 8370, -28541, -93794, -94970, -29422, -20728, -88244, -28947, -67965, -48353, -62551, -73837, -13920, 74418, 40190, -31064, -7646, -42533, -103969, 16986, 14554, -77762, 27955, 24765, 67831, 44369, 28014, 54073, 8262, 2168, -73096, -96558, -26537, 62005, 95291, 12345, -32195, 27877, -2751, -15780, -5833, -71104, -76504, -113572, -130487, -59089, -168368, -119738, -45903, -81306, -51963, 49779, -36058, -60036, 2596, 15612, 50673, 81998, 54738, 40209, 110741, 23217, -110450, -111910, -92742, -32332, -5288, 3490, -14563, -107380, -14327, 19708, 58314, 81771, -28517]
498b8517m7800j8472Q526K0993K1124k8889M8036P5357j12889K6661K16296j1248
486A69178n7754r5268L9572M344j04331m9009Q3347M1455p650n8533j0988n7171
474a02808R6813l4925j00138O2881j1526J01007m8274n4019K1502J09481R8829
463A38823o3943n6897o2554k7066N4392M7235L8975j35522K470P0349K1474J16335
451A44071K5356j18698O9374j08128N6054r0508k0537l1588Q5682K8630L1305
440G1013j01369O310m3144k1117K5108P9991q921r9108P4819K1138O7493p436
428F4777p9478m6957l5177M424O0121p166K9976K2139j0856n7148J06945K1113
416G2713n1396L1348n599j18684N3868k01q0706k9907O9224J2367m9352k0094
$$ y = [-28517, -76317, -94789, -86263, -65270, -44146, -73035, -24999, 50358, -62531, -35870, 180426, 169178, 111424, 16156, 55728, 60072, -44259, -93268, -9921, 31534, 23884, -34649, -45637, -102808, -5995, -40920, -141058, -78177, -89703, 11304, -36970, -90989, -69487, 39994, 138823, 74880, 17983, -44571, -71637, -17245, 29990, 68965, -66557, -64087, 6262, 27736, 144071, 169427, 50729, 120103, 11975, 68029, -22479, -43016, -74604, 11078, 39708, 71013, -30356, -24046, -67190, -88307, -63199, 16792, 7871, -91237, -16418, 4720, 72213, 64777, -14701, -61658, -96835, -92411, -32290, -39456, -9480, 12659, 1803, -55345, 51600, 72713, 21317, 52665, 47066, -71618, -17750, -17951, -98657, -128564, -59340, -46973, -96325, -116419]
404a16419Q1335J30605N8558j55630m1207M4967n4756l1782M5045q6162Q7497
393c7949K323J691J9145J04157M351m5962k8279k9585N2336P7398r2564j79355
381a52293l0314M0127L4203M0343J6398j7858J24645K4705l6501N7096l7937j1821
369E0793p486O2017O1056J0479j33474r5685J8834k4865K4820J2248j2622j6235
357e0120o8020M9530N1626m6238P0860j2572L359j2445k3387m6756o832N9417
345c1578J10166o7604o9837J3690l7370k2710O0609n1493m190O6365O365J17313
333H9726n3851p2602p1628L8940m1901R2906j23203M649J8974O5195J18910j33624
321f7509L0267m5003P4779J25846o2345q2185L2292j5591j8142n1001j7750k5926
$$ y = [-116419, -35084, 95521, 154079, -1551, -42758, 2209, -52547, -84329, -39284, -125446, -37949, -35626, -33935, -14790, 89367, 93718, 47756, 19477, -10108, 42228, 119626, 27062, -152293, -182607, -142480, -108277, -67934, -51536, -69394, 55251, 79956, 43455, 100551, 62614, 50793, 43307, 105324, 166380, 176859, 43385, -52300, -33466, -58331, -33511, -21263, -33885, -50120, -118140, -68610, -16984, -63222, 7638, -4934, -1575, -14020, -37407, -84163, -90995, -31578, 78588, 10984, -58853, -45163, -82533, -105243, -44634, -96127, -100317, -33952, -27587, 89726, 35875, -36727, -108355, -69415, -111316, -18410, -141613, -136964, -117990, -52795, 66115, -67509, -37242, -82245, -7466, 118380, 56035, -26150, 6142, -9449, -27591, -78592, -96342, -122268]
309a22268J20963p2483r4518J02618R0956l3537P998k1890J6422K290m4617K4750
297b3316N2180p4440l6866r2993J03591K7032N136O6995K4246R3685l9022k8114
285G8114p5786k4570J44886n7374O606J7766k5247n3084n1424J7574J9204q4718
273h8053N0859K7267M9294n6505L9361M9699j21594J1301n4909N1001k572P5757
261C0906K864n8588J0156m836l1882q4098R5092j7836N354L2189K4594P0539o0053
248A4401J6533j40957Q0802O4178J1741p5293k1404p895k1092M8354K3068n6742
236f4306L9590o8737Q654o12N6867N3817q6218L8989l5741Q5130q0399m0663M7129
223d6500N0236k8561n8425j5095q7175N3546R0190k0915j9111j3394P6577j1142
$$ y = [-122268, -1305, -73788, -168306, -65688, 25268, -8269, -271, -22161, -5739, -3449, -48066, -23316, 28864, -45576, -82442, -175435, -71844, -44812, -39676, 27319, 51565, 145250, 106228, 78114, 2328, -22242, 122644, 65270, 71876, 89642, 64395, 11311, -40113, -22539, -3335, -88053, -37194, -9927, 39367, -17138, 22223, 71922, -49672, -38371, -93280, -42279, -44851, 30906, 33770, -24818, -14662, -19498, -51380, -135478, -40386, -58222, -52868, -20679, 3915, 74454, 14401, 30934, -110023, -29221, 34957, 46698, -28595, -49999, -57894, -78986, -30632, -7564, -64306, -24716, -93453, -84799, -85411, -28544, 25273, -60945, -21956, -57697, 27433, -52966, -93629, -46500, 3736, -24825, -83250, -98345, -185520, -131974, -41784, -62699, -81810, -95204, -18627, -29769]
211b9769l077n6747J829P8499L1524M8380k2248N9613k6498j39648J39745K2533
199A04136j11363P7546o6691J8333k7375n7012L7503J0939J508J9747j3539R112
187B844O925m6169r4674o819K7734j2175Q8692L3953L8784M1136l0468o986m3902
174a125J01252q0394J3782K4901M1874p819n4520k4428k7748o3369L667J3049
162f0878q7068O1182Q0206k2718l8558R902m3990J5968P9738j8390j5362L3194
150f774p9749O4232J1548J1091J1742l8135l2938M3382J21041k7549m4701K8410
138F1600p0281k6300J49154o6993q5509n3634n1418L2255O3695O2362o6510q4858
126a36437K0790M0764P1303j7196k2010L4066M1255l8774n3433q4372Q8582P2635
$$ y = [-29769, -32846, -89593, -87764, -9265, 22259, 70639, 48391, 108004, 81506, -58142, 81603, 104136, -7227, 70319, 3628, 21961, -5414, -62426, -24923, -13984, -12476, 7271, -6268, 2844, 9769, -36400, -131074, -137893, -110159, -122334, -33642, 311, 39095, 80231, 49763, 42777, -1125, 100127, 19733, 33515, 58416, 100290, 92471, 37951, 13523, -14225, -77594, -73927, -60878, -147946, -86764, -6558, -29276, -67834, -57932, -101922, -85954, -6216, -24606, -39968, -6774, -86523, -22291, -10743, 348, 12090, -26045, -58983, -15601, 105440, 77891, 33190, 61600, -8681, -34981, 114173, 47180, -38329, -91963, -143381, -111126, -47431, 14931, -51579, -136437, -115647, -74883, -3580, -20776, -42786, -8720, 32535, -6239, -59672, -144044, -55462, 17173]
114A7173M5915n9533o1650J0610K5940P353l5298j04653M7669P2951m0225O8582
102e166r068Q6881q2540j6185J1745K6530K1778k9123n7382K9087j2044l2322
90f7809R575K0282p0319j5239o14P7187k2448O6013j1013J1434K0248M0037n3422
77C912m8182n9408o089J732j6128Q7360Q5022P1298L3652r9707L2074k1534o2564
64A438L5079M4424k1440o696k5318m8383M3928j8002k0644n7569L3537k6100m4257
51a10003J458J7660n2676N6006L3262M8176K0965P934J1919l217p0872k1407n5988
38a16783j8633J09761K0569M1161K6388n2205k819K0099k604M6597p331j03068
26c8868k6498K9622R811l806J0595n1795N1860N9520k3542k4037P889n6943J8614
$$ y = [17173, 63088, 3555, -58095, -47485, -21545, -14192, -49490, -154143, -106474, -33523, -73748, -5166, -14234, 72647, -9893, -26078, -14333, 12197, 33975, 4852, -52530, -23443, -35487, -67809, -58234, -37952, -108271, -123510, -124124, -46937, -69385, -3372, -14385, -2951, 17297, 57334, 3912, -44270, -103678, -109767, -108035, -124163, -36803, 48219, 119517, 153169, 53462, 85536, 64002, 1438, 36517, 80941, 59501, 52805, 27487, -20896, 23032, 5030, -15614, -73183, -39646, -65746, -110003, -108545, -90885, -143561, -87555, -54293, -6117, 14848, 22782, 34701, 31484, -39388, -60795, -116783, -135416, -25655, -5086, 36075, 62463, 10258, 7439, 27538, 24934, 71531, 64200, -38868, -65366, -35744, -25933, -29739, -19144, -70939, -19079, 40441, 16899, -7138, 751, -56192, -37578]
13c7578m0645R581j4124m967O8756O6173p6597k3437N6963j5842l1312L8422m9386
0e3993
$$ y = [-37578, -78223, -68642, -82766, -87733, -18977, 47196, -29401, -52838, 4125, -11717, -43029, -4607, -53993]
$$ Imaginary data points
##PAGE= N=2
##DATA TABLE= (X++(I..I)), XYDATA
16383c242113L6092J31131L8108k4584K1694L3814M2923O1616j018M3302J7139
16372b841896J44075N7856p1489N7417J1200J10907K7846l8743K8217N6568L0760
16361b427282P627l196O9821R0340J7641N4224N2820J0430P0825M7230K5455M6258
16349a937807Q0723J4422l151L2680K1623P6656L5791Q4612L5161j0812J19472
16338a450630q0589M8923n004J2271R2269Q7260k2216J1644Q4563O2821M2691
16327a115997J5972P3465M3591m084J710J16882O8787J4814O363K1399O7563K3477
16315f66058m356K3988N1730Q8955J7345n5974J07679Q5373N705K4493P0413o5254
16303c15961q707J03748L8589j9696N7653R2304L3367r789o3806O5527P9695N2053
$$ y = [-3242113, -3206021, -3074890, -3036782, -3061366, -3039672, -3005858, -2962935, -2901319, -2902337, -2859035, -2841896, -2697821, -2639965, -2711454, -2654037, -2642837, -2531930, -2504084, -2542827, -2514610, -2458042, -2427282, -2419655, -2422851, -2353030, -2262690, -2245049, -2190825, -2138005, -2127575, -2056750, -2009520, -1984065, -1937807, -1857084, -1842662, -1845813, -1813133, -1791510, -1714854, -1679063, -1594451, -1559290, -1570102, -1450630, -1531219, -1482296, -1487300, -1475029, -1382760, -1295500, -1317716, -1306072, -1221509, -1158688, -1115997, -1100025, -1026560, -982969, -987053, -985343, -868461, -799674, -784860, -778497, -757098, -689535, -666058, -670414, -646426, -594696, -505741, -488396, -544370, -436691, -351318, -345613, -321120, -250707, -315961, -324668, -220920, -182331, -202027, -144374, -52070, -18703, -28492, -92298, -26771, 52924, 104977]
16291A04977N8540J514j2365J6380J817P2284M9585J22662j02719P0218J8858
16280D01751P4118O4682J1521J15342j04226l417L7981M1199P0964K6992M1509
16269G78416j9684o5994L365J02260M0108j4053M3920N9166l0949N0562Q0763
16258A027880L9338K0318n5462N6690P5208o4923K2518O6742j5760k1472L7752
16247A188829R4380M3994l7526K7149m8084J26082R2313M4562j8559P6620k0371
16236A569389K0102j8604n8516N9773K1556m9105J2815J6161K3333R7584J391
16225A695879j5549N4405N1815K6665k3981N0939N0913K5157r9501o0247J12165
16214A868660L9242L0919j000O2390K0296k8085j6277M2295o8356Q3325J25372
$$ y = [104977, 163517, 165031, 152666, 169046, 170863, 243147, 292732, 415394, 312675, 382893, 401751, 475869, 540551, 552072, 667414, 563188, 559771, 597752, 638951, 709915, 736907, 778416, 758732, 692738, 696103, 798363, 838471, 824418, 868338, 927504, 896555, 947117, 1027880, 1067218, 1087536, 1032074, 1088764, 1163972, 1099049, 1121567, 1188309, 1172549, 1151077, 1188829, 1283209, 1327203, 1289677, 1316826, 1268742, 1394824, 1487137, 1531699, 1513140, 1589760, 1569389, 1589491, 1570887, 1512371, 1572144, 1593700, 1544595, 1557410, 1573571, 1596904, 1694488, 1695879, 1680330, 1734735, 1786550, 1813215, 1789234, 1840173, 1891086, 1916243, 1816742, 1756495, 1868660, 1907902, 1938821, 1937821, 2000211, 2020507, 1992422, 1976145, 2018440, 1950084, 2033409, 2158781]
16203B158781K8211j1086j8436K2211N5630j346p4774n9999K2386O6993P5114
16192B263685j40114P8037K8827J5404K635L5716M7409p4207R3446r9212M1990
16181B293616J58988j3608K0822R26r6499l4016J59815j0827j8805m8540L2643
16170B444515m6916O1444L3339k3426O400p2073J20666P9825j07003r978J26218
16159B613011J05820m8281j3301j03456j7509Q661J23321q7057m6059j404J00209
16148B633955R8793j00416l1698J4152L7424l5053L053O1339N9778J6780K3237
16137B781344n5232R3845j07305p4491K1345K522Q1659m3890R6315k7972L5921
16126B804061L1113j24669J6021J23961R7214j3317l7815J8759o0324o2194o6200
$$ y = [2158781, 2186992, 2175906, 2157470, 2179681, 2235311, 2233965, 2159191, 2099192, 2121578, 2188571, 2263685, 2123571, 2201608, 2230435, 2245839, 2248474, 2284190, 2331599, 2257392, 2350838, 2251626, 2293616, 2452604, 2438996, 2459818, 2460744, 2364245, 2330229, 2490044, 2479217, 2460412, 2411872, 2444515, 2397599, 2459043, 2492382, 2468956, 2475356, 2403283, 2523949, 2603774, 2496771, 2486793, 2613011, 2718831, 2670550, 2657249, 2553793, 2536284, 2544945, 2668266, 2581209, 2535150, 2533746, 2633955, 2732748, 2632332, 2600634, 2614786, 2652210, 2617157, 2620210, 2681549, 2741327, 2758107, 2781344, 2726112, 2819957, 2712652, 2638161, 2659506, 2662028, 2743687, 2699797, 2796112, 2768140, 2804061, 2835174, 2710505, 2726526, 2850487, 2947701, 2934384, 2896569, 2915328, 2855004, 2792810, 2726610]
16115B726610J6020J13029K2186N9024J2027r5593O422O0639m8969j8513R655
16104B862537J44373j9388j13177o1176N0106L9496J08995j06o9967m9065J7437
16093B910065N1605M5567j4242R7437J4116j40826n6682M9091L1704K1766J8300
16082C027901l2355J323l558p2755P9365L397m6715m4600J18348J95j08412m6089
16070B876045K0048N3699M7904m3112p6067M6849N4869n1101P1807P0714J1197
16059C082852j30114k3797J15159k7845K1031J9893p938n8093k3710M6830k7739
16048B986529P9729J0534M3327K8236j02986j08504K9826K1510J4107n8577k7525
16037B916206M2633Q1421M9744m7048L5178J4064n8504j05950L5480N9726m9147
$$ y = [2726610, 2742630, 2855659, 2877845, 2936869, 2948896, 2853303, 2859725, 2920364, 2871395, 2852882, 2862537, 3006910, 2987522, 2874345, 2813169, 2863275, 2902771, 3011766, 3011660, 2941693, 2892628, 2910065, 2961670, 3007237, 2992995, 3090432, 3104548, 2963722, 2907040, 2956131, 2987835, 3009601, 3027901, 2995546, 2996869, 2993311, 2920556, 2999921, 3003318, 2956603, 2912003, 3030351, 3030546, 2922134, 2876045, 2896093, 2949792, 2997696, 2954584, 2878517, 2925366, 2980235, 2929134, 3000941, 3071655, 3082852, 2952738, 2928941, 3044100, 3016255, 3037286, 3057179, 3049241, 2991148, 2967438, 3014268, 2986529, 3066258, 3076792, 3120119, 3148355, 3045369, 2936865, 2966691, 2988201, 3002308, 2943731, 2916206, 2958839, 3040260, 3090004, 3042956, 3078134, 3092198, 3033694, 2927744, 2963224, 3022950, 2973803]
16026B973803R0308j54387j7986N2486j34220O2473R1008J50222L2015K7729q7803
16015C085648o3814q4981K3540J11708m7150q6625k7211J09260Q354o8815j0353
16004B949561L3490J11590m838k9723n4756J10555o3649j15530L6892Q4479j14660
15993B943411M7095k3760P1197L1005N2533n1587O4860p2957j8593J47215p4474
15982C115945n4246K867M9961j20205J0054K5317k7570N1920J6899Q0250p9310
$$ y = [2973803, 3064111, 2909724, 2891738, 2944224, 2810004, 2872477, 2963485, 3113707, 3145722, 3173451, 3085648, 3021834, 2936853, 2960393, 3072101, 3024951, 2938326, 2911115, 3020375, 3028729, 2959914, 2949561, 2983051, 3094641, 3089803, 3060080, 3005324, 3115879, 3052230, 2936700, 2973592, 3058071, 2943411, 2990506, 2966746, 3037943, 3068948, 3121481, 3069894, 3134754, 3061797, 3043204, 3190419, 3115945, 3061699, 3064566, 3114527, 2994322, 3004376, 3029693, 3002123, 3054043, 3070942, 3151192, 3071882]
$$ [...]
##END NTUPLES=NMR SPECTRUM
##END=
