##TITLE=1H_EC-3289(IV)
 CDCl3
 8 sc, 
 9.2.2023
##JCAMPDX= 6.0         $$ Bruker NMR JCAMP-DX V2.0
##DATA TYPE= NMR SPECTRUM
##DATA CLASS= NTUPLES
##ORIGIN= UXNMR, Bruker Analytische Messtechnik GmbH
##OWNER= root
$$ XWIN-NMR		Version 3.5
$$ Thu Feb  9 13:49:14 2023 Russian Standard Time (UT+4h)  she@DPX200
##.OBSERVE FREQUENCY= 200.13135
##.OBSERVE NUCLEUS= ^1H
##.ACQUISITION MODE= SIMULTANEOUS
##.ACQUISITION SCHEME= undefined
##.AVERAGES= 8
##.DIGITISER RES= 18
##SPECTROMETER/DATA SYSTEM= spect
##.PULSE SEQUENCE= zg30
##.SOLVENT NAME= CDCl3
##.SHIFT REFERENCE= (INTERNAL, CDCl3, 0, 15.7447)
##AUDIT TRAIL= $$ (NUMBER, WHEN, WHO, WHERE, WHAT)
$$ ##TITLE= Audit trail, XWIN-NMR		Version 3.5
$$ ##JCAMPDX= 5.01
$$ ##ORIGIN= Bruker BioSpin GmbH
$$ ##OWNER= she
$$ F:/spectra/data/she/nmr/H-F/1/pdata/1/auditp.txt
$$ ##AUDIT TRAIL=  $$ (NUMBER, WHEN, WHO, WHERE, WHAT)
(   1,<2023-02-09 13:47:27.81 +0400>,<she>,<DPX200>,
      <created by zg, POWCHK disabled, PULCHK disabled
       configuration hash MD5:
       00 E9 B6 7A A2 85 ED C7 34 08 36 98 17 FE 4E 26
       data hash MD5: 16K
       98 68 99 1D 5D 35 7F 24 A6 2A B6 3F 53 B5 0D 44>)
(   2,<2023-02-09 13:47:30.12 +0400>,<she>,<DPX200>,
      <Start of raw data processing
       efp BC_mod = 2 LB = 0.24 FT_mod = 6 PKNL = 1 PHC0 = -19113.29 PHC1 = 13.20079 SI = 16K 
       data hash MD5: 16K
       C2 E8 09 B0 36 42 D4 A3 E7 59 78 30 A1 A3 8B FE>)
(   3,<2023-02-09 13:47:47.28 +0400>,<she>,<DPX200>,
      <pk PHC0 = -0.1948406 PHC1 = 0 
       data hash MD5: 16K
       11 3E B1 95 84 32 80 F8 44 CF 1B 51 D0 F3 13 71>)
(   4,<2023-02-09 13:47:52.71 +0400>,<she>,<DPX200>,
      <abs ABSG = 5 
       data hash MD5: 16K
       C7 47 84 19 D3 F8 CA 2B 12 08 84 40 22 E1 C1 71>)
(   5,<2023-02-09 13:48:32.12 +0400>,<she>,<DPX200>,
      <pk PHC0 = -0.3990297 PHC1 = 0 
       data hash MD5: 16K
       91 E7 A0 3D 26 64 6F 9F 8A 39 92 A2 7C 06 F1 5D>)
(   6,<2023-02-09 13:48:36.01 +0400>,<she>,<DPX200>,
      <abs ABSG = 5 
       data hash MD5: 16K
       F2 EF F9 1D 9B 6E 61 EB E4 2A 16 F6 F3 3F D0 94>)
$$ ##END=
$$ 
$$ hash MD5
$$ 62 27 B3 60 3C 47 17 9C C6 85 B4 0E 3B 28 5D 7F
##$RELAX= 
##$RELAX= 
##$RELAX= 
##$RELAX= 
##$RELAX= 
##$RELAX= 
$$ Bruker specific parameters
$$ --------------------------
##$DU= <F:/spectra>
##$EXPNO= 1
##$NAME= <H-F>
##$PROCNO= 1
##$TYPE= <nmr>
##$USER= <she>
##$AMP= (0..31)
100 100 100 100 100 100 100 100 100 100 100 100 100 100 100 100 100 100 
100 100 100 100 100 100 100 100 100 100 100 100 100 100 
##$AQSEQ= 0
##$AQ_mod= 1
##$AUNM= <au_zg>
##$AUTOPOS= <>
##$BF1= 200.13
##$BF2= 200.13
##$BF3= 200.13
##$BF4= 200.13
##$BF5= 200.13
##$BF6= 200.13
##$BF7= 200.13
##$BF8= 200.13
##$BYTORDA= 1
##$CFDGTYP= 0
##$CFRGTYP= 5
##$CHEMSTR= <none>
##$CNST= (0..31)
1 1 145 1 1 1 1 1 1 1 1 1 1 1 1 1 1 1 1 1 1 1 1 1 1 1 1 1 1 1 1 1 
##$CPDPRG= <>
##$CPDPRG1= <>
##$CPDPRG2= <>
##$CPDPRG3= <>
##$CPDPRG4= <mlev>
##$CPDPRG5= <mlev>
##$CPDPRG6= <mlev>
##$CPDPRG7= <mlev>
##$CPDPRG8= <mlev>
$$ [...]
##$SUBNAM3= <"">
##$SUBNAM4= <"">
##$SUBNAM5= <"">
##$SUBNAM6= <"">
##$SUBNAM7= <"">
##$SUBNAM8= <"">
##$SUBNAM9= <"">
##$SW= 18.05172834244
##$SWIBOX= (0..15)
0 0 2 0 0 0 0 0 0 0 0 0 0 0 0 0 
##$SW_h= 3612.71676300578
##$TD= 16384
##$TD0= 1
##$TE= 0
##$TE2= 300
##$TE3= 300
##$TEG= 300
##$TL= (0..7)
0 120 120 120 120 120 120 120 
##$TP= (0..7)
150 150 150 150 150 150 150 150 
##$TP07= 0
##$TPNAME0= <>
##$TPNAME1= <>
##$TPNAME2= <>
##$TPNAME3= <>
##$TPNAME4= <>
##$TPNAME5= <>
##$TPNAME6= <>
##$TPNAME7= <>
##$TPOAL= (0..7)
0.5 0.5 0.5 0.5 0.5 0.5 0.5 0.5 
##$TPOFFS= (0..7)
0 0 0 0 0 0 0 0 
##$TUNHIN= 0
##$TUNHOUT= 0
##$TUNXOUT= 0
##$USERA1= <user>
##$USERA2= <user>
##$USERA3= <user>
##$USERA4= <user>
##$USERA5= <user>
##$V9= 5
##$VALIST= <valist>
##$VCLIST= <CCCCCCCCCCCCCCC>
##$VD= 0
##$VDLIST= <DDDDDDDDDDDDDDD>
##$VPLIST= <PPPPPPPPPPPPPPP>
##$VTLIST= <TTTTTTTTTTTTTTT>
##$WBST= 1024
##$WBSW= 4
##$XGAIN= (0..3)
0 0 0 0 
##$XL= 0
##$YL= 0
##$YMAX_a= 190987
##$YMIN_a= -302898
##$ZGOPTNS= <>
##$ZL1= 120
##$ZL2= 120
##$ZL3= 120
##$ZL4= 120
##$ABSF1= 15.74469
##$ABSF2= -2.307159
##$ABSG= 5
##$ABSL= 3
##$ALPHA= 0
##$AQORDER= 0
##$ASSFAC= 0
##$ASSFACI= 0
##$ASSFACX= 0
##$ASSWID= 0
##$AUNMP= <proc_1d>
##$AZFE= 0.1
##$AZFW= 0.1
##$BCFW= 0
##$BC_mod= 2
##$BYTORDP= 0
##$COROFFS= 0
##$CY= -3
##$DATMOD= 1
##$DC= 0
##$DFILT= <>
##$DTYPP= 0
##$F1P= 0
##$F2P= 0
##$FCOR= 1
##$FTSIZE= 16384
##$FT_mod= 6
##$GAMMA= 0
##$GB= 0
##$INTBC= 1
##$INTSCL= 3.70164e-10
##$ISEN= 128
##$LB= 0.24
##$LEV0= 0
##$LPBIN= 0
##$MAXI= 10000
##$MC2= 0
##$MEAN= 0
##$ME_mod= 0
##$MI= 1.114404
##$NCOEF= 0
##$NC_proc= -6
##$NLEV= 6
##$NOISF1= 3.799351
##$NOISF2= 2.8
##$NSP= 0
##$NTH_PI= 0
##$NZP= 0
##$OFFSET= 15.74469
##$PC= 1
##$PHC0= -19113.88
##$PHC1= 13.20079
##$PH_mod= 1
##$PKNL= yes
##$PPARMOD= 0
##$PSCAL= 0
##$PSIGN= 0
##$REVERSE= no
##$SF= 200.130005374507
##$SI= 16384
##$SIGF1= 3
##$SIGF2= 2
##$SINO= 5.538805
##$SIOLD= 16384
##$SREGLST= <1H.CDCl3>
##$SSB= 0
##$STSI= 16384
##$STSR= 0
##$SW_p= 3612.71676300578
##$SYMM= 0
##$S_DEV= 0
##$TDeff= 16384
##$TDoff= 0
##$TI= <>
##$TILT= no
##$TM1= 0
##$TM2= 0
##$TOPLEV= 0
##$USERP1= <user>
##$USERP2= <user>
##$USERP3= <user>
##$USERP4= <user>
##$USERP5= <user>
##$WDW= 1
##$XDIM= 16384
##$YMAX_p= 279251158
##$YMIN_p= -740758
$$ End of Bruker specific parameters
$$ ---------------------------------
##NTUPLES= NMR SPECTRUM
##VAR_NAME=  FREQUENCY,     SPECTRUM/REAL,   SPECTRUM/IMAG
##SYMBOL=    X,             R,               I
##VAR_TYPE=  INDEPENDENT,   DEPENDENT,       DEPENDENT
##VAR_FORM=  AFFN,          ASDF,            ASDF
##VAR_DIM=   16384,         16384,           16384
##UNITS=     HZ,            ARBITRARY UNITS, ARBITRARY UNITS
##FACTOR=    0.220516191357247, 1,           1
##FIRST=     3150.98488259358, 0,            0
##LAST=      -461.731880412201, 0,           0
##MIN=       -461.731880412201, -740758,     0
##MAX=       3150.98488259358, 279251158,    0
$$ Real data points
##PAGE= N=1
##DATA TABLE= (X++(R..R)), XYDATA
$$ [...]
$$ plain form
5837 1325655 1347850 1369899 1141912 1103090 1146425 1160732 1083178 988548 1088349 1073559 1063991
5826 1063991 1041919 1049878 1134780 1119646 1279212 1338052 1281839 1258975 1333299 1334217 1349011 1459402
5814 1459402 1461173 1459723 1398669 1357917 1334738 1335747 1370568 1313604 1262046 1271731 1277358 1271855 1110454
5801 1110454 1081958 1200641 1183032 1298432 1199333 1206894 1296351 1337541 1336482 1364197 1304605
5790 1304605 1335683 1332848 1335898 1367037 1455563 1475894 1359745 1387366 1328620 1279351 1199381 1185066
5778 1185066 1217758 1112938 1141905 1143177 1081540 1106365 1060365 1115458 1110564 1211501 1195362
5767 1195362 1114069 1173982 1247746 1223675 1274211 1180705 1138520 1115973 1067798 1122775 1149028
5756 1149028 1193269 1213273 1172228 1125073 1178206 1181499 1222596 1145143 1151578 1114296 1162767 1223708
$$ packed form
5837A325655K2195K2049k27987l8822M3335J4307p7554r4630R9801j4790r568
5826A063991k2072P959Q4902j5134J59566N8840n6213k2864P4324R18J4794J10391
5814A459402J771j450o1054m0752k3179J009L4821n6964n1558R685N627n503j61401
5801A110454k8496J18683j7609J15400r9099P561Q9457M1190j059K7715n9592
5790A304605L1078k835L050L1139Q8526K0331j16149K7621n8746m9269p9970j4315
5778A185066L2692j04820K8967J272o1637K4825m6000N5093m894J00937j6139
5767A195362q1293N9913P3764k4071N0536r3506m2185k2547m8175N4977K6253
5756A149028M4241K0004m1045m7155N3133L293M1097p7453O435l7282M8471O0941
$$ plain form
5744 1223708 1114299 1058238 1116389 1076143 958299 1014038 1065077 1039679 979476 1036359 1053324
5733 1053324 1128719 1028479 971392 1065985 1096243 1069404 1110369 895762 908967 1099616 1139363
5722 1139363 1079297 1087325 1095560 986884 1008539 1003298 968469 1020462 1036496 1129499 1063046 1019972
5710 1019972 1050802 1116408 1181417 1145835 1095075 1097931 1152915 1012108 869945 971774 931682
5699 931682 969494 1107597 1131633 1122901 1142400 1099655 1039155 990443 1033634 1068024 1111146 1140259
5687 1140259 985500 1045615 1034955 1124230 1239993 1121871 1121834 1256325 1302343 1285577 1228570
5676 1228570 1154301 1151245 1145299 1167950 1329751 1226722 1172809 1115069 1121577 1160410 1203447 1218728
5664 1218728 1135359 1180312 1266156 1233317 1179820 1140174 1146231 1107015 1084522 1210028 1291570
$$ packed form
5744A223708j09409n6061N8151m0246j17844N5739N1039k5398o0203N6883J6965
5733A053324P5395j00240n7087R4593L0258k6839M0965k14607J3205J90649L9747
5722A139363o0066Q028Q235j08676K1655n241l4829N1993J6034R3003o6453m3074
5710A019972L0830O5606O5009l5582n0760K856N4984j40807j42163J01829m0092
5699I31682L7812J38103K4036q732J9499m2745o0500m8712M3191L4390M3122K9113
5687A140259j54759O0115j0660Q9275J15763j18122l7J34491M6018j6766n7007
5676A228570p4269l056n946K2651J61801j03029n3913n7740O508L8833M3037J5281
5664A218728q3369M4953Q5844l2839n3497l9646O057l9216k2493J25506Q1542
$$ plain form
5653 1291570 1283546 1245687 1313100 1347961 1326663 1333702 1449407 1581897 1548917 1673046 1752537
5642 1752537 1771558 1743039 1784317 1801347 1823704 1867293 1736455 1770568 1847986 1860170 1891690
5631 1891690 2011238 2035770 2004241 1888656 1790875 1751128 1763474 1794550 1772506 1729940 1720172
5620 1720172 1710989 1829437 1898605 1896637 1941724 1950325 1996497 1959509 2013638 2088458 2127503 2328280
5608 2328280 2281005 2286616 2327227 2326321 2289088 2228626 2262836 2232305 2277406 2308372 2301217 2462077
5596 2462077 2549990 2586021 2749442 2839605 3062498 3156451 3258981 3375015 3301085 3268689 3294044
5585 3294044 3156834 3228539 3348221 3509219 3693396 3906449 4028711 4222006 4523280 4689506
5575 4689506 4876148 4843311 4839265 4819157 4881030 5001503 4907445 4795817 4712696 4728684 4663292
$$ packed form
5653A291570q024l7859O7413L4861k1298P039J15705J32490l2980J24129P9491
5642A752537J9021k8519M1278J7030K2357M3589j30838L4113P7418J2184L1520
5631A891690J19548K4532l1529j15585r7781l9747J2346L1076k2044m2566r768
5620A720172r183J18448O9168j968M5087Q601M6172l6988N4129P4820L9045K00777
5608B328280m7275N611M0611r06l7233o0462L4210l0531M5101L0966p155J60860
5596B462077Q7913L6031J63421R0163K22893R3953J02530J16034p3930l2396K5355
5585C294044j37210P1705J19682J60998J84177K13053J22262J93295L01274J66226
5575D689506J86642l2837m046k0108O1873J20473r4058j11628q3121J5988o5392
$$ plain form
5564 4663292 4619096 4730392 4835120 4908237 5041174 5294159 5487585 5583058 5665915 5882293
5554 5882293 5968966 5894335 5812883 5708642 5691499 5609400 5408894 5357203 5191779 5028124 5010300
5543 5010300 4807689 4547485 4406963 4261554 4168527 4196783 4093899 4056059 4099643 4161869
5533 4161869 4166425 4196239 4286518 4287394 4379642 4484543 4512780 4641469 4687216 4780562 4761969 4567920
5521 4567920 4397785 4121428 3882014 3719765 3697342 3596390 3636701 3639540 3557816 3385642
5511 3385642 3319707 3370261 3340160 3372898 3353762 3439268 3445464 3422777 3552409 3616405 3567780
5500 3567780 3599989 3549963 3525191 3599973 3547308 3463228 3455526 3407154 3276681 3184872 3237007
5489 3237007 3093626 3170941 3175512 3158821 3288961 3242589 3291050 3297819 3284448 3229334 3249496
$$ packed form
5564D663292m4196J11296J04728P3117J32937K52985J93426R5473Q2857K16378
5554E882293Q6673p4631q1452j04241j7143q2099k00506n1691j65424j63655j7824
5543E010300k02611k60204j40522j45409r3027K8256j02884l7840M3584O2226
5533D161869M556K9814R0279Q76R2248J04901K8237J28689M5747R3346j8593j94049
5521D567920j70135k76357k39414j62249k2423j00952M0311K839q1724j72174
5511C385642o5935N0554l0101L2738j9136Q5506O196k2687J29632O3996m8625
5500C567780L2209n0026k4772P4782n2665q4080p702m8372j30473r1809N2135
5489C237007j43381P7315M571j6691J30140m6372M8461O769j3371n5114K0162
$$ plain form
5478 3249496 3332585 3374533 3315567 3256742 3273143 3386670 3492519 3510433 3550340 3698788 3702082
5467 3702082 3767083 3874034 4058060 4154386 4187400 4217698 4434816 4610170 4793044 4999611
5457 4999611 5324618 5559270 5700084 5816230 5877862 5887266 5800981 5723512 5780230 5741945 5727463
5446 5727463 5747158 5659538 5634898 5544439 5392962 5269158 5400705 5505551 5539923 5542245 5676299
5435 5676299 5733546 5849594 6090593 6264113 6597638 6993230 7230480 7611983 7987243 8347975
5425 8347975 8713875 8999119 9259611 9559796 9815425 10229217 10683370 11030033 11416072 11724041
5415 11724041 11707760 11651851 11548746 11245919 10869144 10396079 9945724 9552792 9245227 8997558
5405 8997558 8791897 8413928 8120582 7964730 7957904 7956014 7963345 8048597 8203198 8399446 8614819
$$ packed form
5478C249496Q3089M1948n8966n8825J6401J13527J05849J7914L9907J48448L294
5467C702082O5001J06951J84026R6326L3014L0298K17118J75354J82874K06567
5457D999611L25007K34652J40814J16146O1632R404q6285p7469N6718l8285j4482
5446E727463J9695q7620k4640r0459j51477j23804J31547J04846L4372K322J34054
5435E676299N7247J16048K40999J73520L33525L95592K37250L81503L75260L60732
5425H347975L65900K85244K60492L00185K55629M13792M54153L46663L86039L07969
5415A1724041j6281n5909j03105l02827l76775m73065m50355l92932l07565k47669
5405H997558k05661l77969k93346j55852o826j890P331Q5252J54601J96248K15373
$$ plain form
5394 8614819 8912560 9281215 9840113 10271631 10839213 11468699 12056344 12684393 13283536 13610582
5384 13610582 13523364 13443946 13186272 13023702 13117739 12945726 12796564 12559455 12001546 11223795
5374 11223795 10523784 9872819 9159247 8685146 8537940 8228549 8071177 7980629 7953131 8070946
5364 8070946 8152048 8176900 8215645 8459949 8638396 8879870 9186171 9523176 9819746 10093725
5354 10093725 10312285 10485578 10803644 11118755 11559746 12059678 12448111 12753838 12874351
5345 12874351 12956532 13136633 13403228 13894415 14586622 15474555 16260453 16957839 17503969 17630246
5335 17630246 17402376 17136520 16881451 16489551 16212712 16016184 15910382 15547262 15295034
5326 15295034 14923491 14482095 14195977 13904620 13744572 13759440 13835239 13995975 14272404 14707758
$$ packed form
5394H614819K97741L68655N58898M31518N67582O29486N87645O28049N99143L27046
5384A3610582q7218p9418k57674j62570R4037j72013j49162k37109n57909p77751
5374A1223795p00011o50965p13572m74101j47206l09391j57372r0548k7498J17815
5364H070946Q1102K4852L8745K44304J78447K41474L06301L37005K96570K73979
5354A0093725K18560J73293L18066L15111M40991M99932L88433L05727J20513
5345A2874351Q2181J80101K66595M91187O92207Q87933P85898O97386N46130J26277
5335A7630246k27870k65856k55069l91900k76839j96528j05802l63120k52228
5326A5295034l71543m41396k86118k91357j60048J4868P5799J60736K76429M35354
$$ plain form
5316 14707758 15372222 16238841 17161445 18343415 19813567 21472576 23062285 24611072 25898762
5307 25898762 26579317 27135718 27352456 27589923 27656769 27985489 28706157 29385701 30001149 30150720
5297 30150720 29458178 27971183 26023253 23969987 22158837 20342792 19118727 18221480
5289 18221480 17464798 16986934 16740199 16639045 16700676 16938982 17271254 17862357 18645624 19487891
5279 19487891 20289918 21052187 21420442 21717339 21961195 22460994 23112393 23873086 24439147
5270 24439147 24569714 24068698 22949499 21449445 19690580 18168720 16730702 15535753
5262 15535753 14628394 13922288 13400128 12946702 12633247 12410695 12152424 11992369 11745007
5253 11745007 11578309 11427364 11308350 11246082 11242386 11200967 11328502 11501685 11613606 11852338
$$ packed form
5316A4707758O64464Q66619R22604J181970J470152J659009J589709J548787J287690
5307B5898762O80555N56401K16738K37467O6846L28720P20668O79544O15448J49571
5297C0150720o92542j486995j947930k053266j811150j816045j224065q97247
5289A8221480p56682m77864k46735j01154O1631K38306L32272N91103P83267Q42267
5279A9487891Q02027P62269L68255K96897K43856M99799O51399P60693N66061
5270B4439147J30567n01016j119199j500054j758865j521860j438018j194949
5262A5535753r07359p06106n22160m53426l13455k22552k58271j60055k47362
5253A1745007j66698j50945j19014o2268l696m1419J27535J73183J11921K38732
$$ plain form
5243 11852338 12184833 12566546 12934053 13488083 14185184 14926465 15996672 17252376 18626991
5234 18626991 20324087 22009858 23573310 24926068 25624743 25573323 24766010 23855699 23002498
5225 23002498 22375843 22074935 21662908 21426039 21072558 20454742 19907643 19630650 19498364
5216 19498364 19692026 20064905 20681855 21447254 22371557 23340454 24314570 25607781 26957132
5207 26957132 28508033 29856992 30720378 31148737 30867740 30275146 29603475 28947111 28131032
5198 28131032 27447560 26948540 26287489 25522726 24972156 24543124 24041126 23510855 22737349
5189 22737349 21845093 20975452 20238291 19815827 19564899 19236929 18995515 18907242 18710945 18640764
5179 18640764 18640227 18727621 18985450 19367144 19731239 19983060 20101964 20014132 19911133 19834746
$$ packed form
5243A1852338L32495L81713L67507N54030O97101P41281J070207J255704J374615
5234A8626991J697096J685771J563452J352758O98675n1420q07313r10311q53201
5225B3002498o26655l00908m12027k36869l53481o17816n47099k76993j32286
5216A9498364J93662L72879O16950P65399R24303R68897R74116J293211J349351
5207B6957132J550901J348959Q63386M28359k80997n92594o71671o56364q16079
5198B8131032o83472m99020o61051p64763n50570m29032n01998n30271p73506
5189B2737349q92256q69641p37161m22464k50928l27970k41414q8273j96297p0181
5179A8640764n37Q7394K57829L81694L64095K51821J18904q7832j02999p6387
$$ plain form
5169 19834746 19833561 19836826 19773095 19637787 19253331 18330209 17213375 16025005 15121405 14295895
5159 14295895 13560855 12949388 12525659 12208721 11984434 11834169 11737095 11762739 11773574 11759760
5149 11759760 11885995 12105485 12453099 12627150 12779939 12948923 12812703 12539416 12393868
5140 12393868 12105415 11769142 11495863 11174508 10821647 10459644 10058763 9776857 9579750
5131 9579750 9401861 9221642 9003588 8893001 8771311 8519824 8245175 8155495 8066795 7841182
5121 7841182 7518419 7482482 7479928 7423771 7379279 7311332 7116300 6994510 6727735 6669094 6615522
5110 6615522 6662371 6762068 6752750 6823585 6695547 6577469 6640799 6623917 6543131 6365206 6278728
5099 6278728 6065204 5791224 5655285 5521639 5237867 5147943 4992619 4970185 4905726 4821116
$$ packed form
5169A9834746j185L265o3731j35308l84456r23122j116834j188370r03600q25510
5159A4295895p35040o11467m23729l16938k24287j50265r7074K5644J0835j3814
5149A1759760J26235K19490L47614J74051J52789J68984j36220k73287j45548
5140A2393868k88453l36273k73279l21355l52861l62003m00881k81906j97107
5131I579750j77889j80219k18054j10587j21690k51487k74649q9680q8700k25613
5121G841182l22763l5937k554n6157m4492o7947j95032j21790k66775n8641n3572
5110F615522M6849R9697r318P0835j28038j18078O3330j6882q0786j77925q6478
5099F278728k13524k73980j35939j33646k83772q9924j55324k2434o4459q4610
$$ plain form
5089 4821116 4779420 4556666 4378652 4377577 4201820 3992267 3931796 3861503 3912549 3872775 3747152
5078 3747152 3616890 3493478 3604749 3675729 3608383 3595784 3609987 3565043 3415202 3418571 3348668
5067 3348668 3321885 3362528 3354645 3375902 3496254 3488888 3573804 3592332 3579104 3616572 3620422 3644260
5055 3644260 3686047 3636197 3484267 3472854 3492666 3449799 3343569 3212987 3285125 3217928 3216244
5044 3216244 3241889 3155164 3089475 3107355 3088350 3086829 3101056 3093480 3038530 3074446 3020005 2987693
5032 2987693 2893745 2777144 2776336 2823297 2927093 3045967 3106522 2930834 2901583 2906869 2774425
5021 2774425 2778113 2837084 2978018 3009943 3001110 2985277 3011268 2903208 2897145 2907389 2895112 2958390
5009 2958390 3023060 3045989 3134100 3199419 3083669 3168347 3292790 3265467 3327029 3404420 3317574
$$ packed form
5089D821116m1696k22754j78014j075j75757k09553o0471p0293N1046l9774j25623
5078C747152j30262j23412J11271P0980o7346j2599J4203m4944j49841L369o9903
5067C348668k6783M0643p883K1257J20352p366Q4916J8528j3228L7468L850K3838
5055C644260M1787m9850j51930j1413J9812m2867j06230j30582P2138o7197j684
5044C216244K5645q6725o5689J7880j9005j521J4227p576n4950L5916n4441l2312
5032B987693r3948j16601q08M6961J03796J18874O0555j75688k9251N286j32444
5021B774425L688N8971J40934L1925q833j5833K5991j08060o063J0244j2277O3278
5009B958390O4670K2929Q8111O5319j15750Q4678J24443k7323O1562P7391q6846
$$ plain form
4998 3317574 3227063 3185510 3260879 3179541 3129294 3168684 3255946 3195222 3172956 3313811 3291657
4987 3291657 3297623 3279145 3291054 3427416 3479113 3524940 3618864 3636343 3607873 3582715 3585423 3711288
4975 3711288 3800977 3752406 3790492 3834016 3902288 4075054 4176219 4300375 4525751 4647499
4965 4647499 4819915 5034729 5295584 5639448 6015396 6407385 6866764 7409268 7973152 8679224
4955 8679224 9460405 10425696 11500019 12845208 14320569 15667547 16542567 16479599 15254075
4946 15254075 13835412 12461369 11001916 9745816 8798822 7948225 7420676 7084327 6601267
4937 6601267 6244968 5962586 5676683 5460924 5417655 5237533 5130582 4996144 4875247 4712162
4927 4712162 4682787 4635296 4556989 4609272 4577180 4534119 4504572 4447576 4579645 4579975 4535723 4584287
$$ packed form
4998C317574r0511m1553P5369q1338n0247L9390Q7262o0724k2266J40855k2154
4987C291657N966j8478J1909J36362N1697M5827R3924J7479k8470k5158K708J25865
4975C711288Q9689m8571L8086M3524O8272J72766J01165J24156K25376J21748
4965D647499J72416K14814K60855L43864L75948L91989M59379N42504N63884P06072
4955H679224P81181R65291J074323J345189J475361J346978Q75020o2968j225524
4946A5254075j418663j374043j459453j256100r46994q50597n27549l36349m83060
4937F601267l56299k82382k85903k15759m3269j80122j06951j34438j20897j63085
4927D712162k9375m7491p8307N2283l2092m3061k9547n6996J32069L30m4252M8564
$$ plain form
4915 4584287 4519265 4560742 4625320 4736496 4709371 4682769 4771842 4849833 4879226 4979735 5045142
4904 5045142 5054702 5065037 5076048 5179255 5166247 5195815 5204098 5197819 5439839 5543746 5549600 5505192
4892 5505192 5658028 5831371 5915666 5960768 5966755 6094631 6204256 6236137 6323417 6395065 6649383
4881 6649383 6786176 6828007 6883532 7164679 7214885 7358040 7501572 7598590 7761745 7892564
4871 7892564 8150434 8437756 8712025 8955371 9342410 9777338 10124889 10515520 10916507 11283943
4861 11283943 11696790 12068987 12378750 12845322 13207586 13618182 14180613 14782780 15537265
4852 15537265 16344245 17233239 18321603 19620333 21218399 23038120 24875653 27126670
4844 27126670 29882530 33060689 36697012 40918814 46225501 53121129 61999038 73039579
$$ packed form
4915D584287o5022M1477O4578J11176k7125k6602Q9073P7991K9393J00509O5407
4904E045142R560J0335J1011J03207j3008K9568Q283o279K42020J03907N854m4408
4892E505192J52836J73343Q4295M5102N987J27876J09625L1881Q7280P1648K54318
4881F649383J36793M1831N5525K81147N0206J43155J43532R7018J63155J30819
4871G892564K57870K87322K74269K43346L87039M34928L47551L90631M00987L67436
4861A1283943M12847L72197L09763M66572L62264M10596N62431O02167P54485
4852A5537265Q06980Q88994J088364J298730J598066J819721J837533K251017
4844B7126670K755860L178159L636323M221802N306687O895628Q877909J1040541
$$ plain form
4836 73039579 86024551 99393171 110687700 115920943 109187454 95115041 80371605
4829 80371605 66864616 55366982 46605837 39804386 34632918 30892397 27782639 25226319
4821 25226319 23041995 21124664 19607204 18275186 17106072 16217310 15454731 14811460 14171321
4812 14171321 13489839 12978127 12413727 11983535 11630781 11165783 10719642 10390929 10176948
4803 10176948 9833795 9776739 9590705 9520430 9606559 9547953 9490091 9552831 9488846 9606026 9627355
4792 9627355 9561051 9472500 9212709 8910235 8706697 8453862 8232661 7979116 7628546 7373379
4782 7373379 7191542 7003442 6809264 6700800 6685594 6607534 6506604 6597012 6549756 6616280
4772 6616280 6720008 6824036 6921272 6891433 6945972 6935693 6870005 6668166 6550275 6349585
$$ packed form
4836G3039579J2984972J3368620J1294529N233243o733489j4072413j4743436
4829H0371605j3506989j1497634q761145o801451n171468l740521l109758k556320
4821B5226319k184324j917331j517460j332018j169114q88762p62579o43271o40139
4812A4171321o81482n11712n64400m30192l52754m64998m46141l28713k13981
4803A0176948l43153n7056j86034p0275Q6129n8606n7862O2740o3985J17180K1329
4792I627355o6304q8551k59791l02474k03538k52835k21201k53545l50570k55167
4782G373379j81837j88100j94178j08464j5206p8060j00930R0408m7256O6524
4772F616280J03728J04028R7236k9839N4539j0279o5688k01839j17891k00690
$$ plain form
4762 6349585 6214130 6113138 6004286 5678231 5406053 5217741 5115669 4888818 4752267 4606822
4752 4606822 4359048 4245899 4138615 4136200 3962645 4010706 3991497 3906129 3731600 3693268 3714110
4741 3714110 3588551 3411619 3492972 3515720 3326728 3371968 3469491 3480290 3418896 3475079 3378538
4730 3378538 3287920 3182833 3116597 3036963 3017835 2979771 2998971 3068130 3031930 2931089 2873005
4719 2873005 2886299 2821432 2889611 2878986 2907643 2938478 3014676 2917382 2973433 2988758 2883245
4708 2883245 2959504 2895520 2960072 2868558 2818978 2888024 2919681 2870536 2957495 2976395 2970465 2911309
4696 2911309 2920973 2875901 2836230 2854840 2914410 2960362 2863184 2893259 2901806 2900222 2880524 2891662
4684 2891662 2959975 2914192 2856112 2918554 2850546 2860211 2926605 2917989 2997604 3061995 3170358 3102162
$$ packed form
4762F349585j35455j00992j08852l26055k72178j88312j02072k26851j36551j45445
4752D606822k47774j13149j07284k415j73555M8061j9209q5368j74529l8332K0842
4741C714110j25559j76932Q1353K2748j88992M5240R7523J0799o1394N6183r6541
4730C378538r0618j05087o6236p9634j9128l8064J9200O9159l6200j00841n8084
4719B873005J3294o4867O8179j0625K8657L0835P6198r7294N6051J5325j05513
4708B883245P6259o3984O4552r1514m9580O9046L1657m9145Q6959J8900n930n9156
4696B911309R664m5072l9671J8610N9570M5952r7178L0075Q547j584j9698J1138
4684B891662O8313m5783n8080O2442o8008R665O6394q616P9615O4391J08363o8196
$$ plain form
4672 3102162 3096770 3267787 3499565 3666915 3690383 3837947 3960959 4125974 4204526 4213501 4159743
4661 4159743 4208394 4152979 4105930 4124808 4161309 4342074 4323758 4425454 4609494 4771646 5100437
4650 5100437 5265241 5421661 5832753 6283795 6783222 7410437 8084075 8909767 9771984 11033008
4640 11033008 12488196 14265691 16427007 18634368 20715609 21975851 21400281 19445433
4632 19445433 17089463 14654139 12270489 10430973 8967731 7932208 7181966 6478284
4624 6478284 5904830 5357579 4939146 4733719 4509390 4162999 3965320 3635435 3583174 3446899
4614 3446899 3250970 3209093 3140305 2988344 2783675 2738913 2697514 2572200 2486068 2398588 2288518
4603 2288518 2108954 2200495 2260296 2223480 2167313 2070403 1961626 1898006 1885768 1928299 1948228
$$ packed form
4672C102162n392J71017K31778J67350K3468J47564J23012J65015P8552Q975n3758
4661D159743M8651n5415m7049J8878L6501J80765j8316J01696J84040J62152L28791
4650E100437J64804J56420M11092M51042M99427O27215O73638Q25692Q62217J261024
4640A1033008J455188J777495K161316K207361K081241J260242n75570j954848
4632A9445433k355970k435324k383650j839516j463242j035523p50242p03682
4624F478284n73454n47251m18433k05427k24329l46391j97679l29885n2261j36275
4614C446899j95929m1877o8788j51961k04669m4762m1399j25314q6132q7480j10070
4603B288518j79564R1541N9801l6816n6167r6910j08777o3620j2238M2531J9929
$$ plain form
4592 1948228 1842488 1812637 1696137 1669689 1638550 1561991 1644928 1631385 1522554 1542141 1540551
4581 1540551 1550612 1451291 1405802 1462224 1455565 1340927 1310811 1345005 1424410 1401962 1328545
4570 1328545 1271112 1353377 1426758 1400682 1441323 1373460 1261464 1219886 1163848 1242652 1344029
4559 1344029 1402791 1320106 1222844 1235649 1184564 1150823 1084010 1125250 1103284 1095027 1161068 1132684
4547 1132684 1106410 1163844 1146746 1229244 1201938 1159554 1134081 1137466 1046799 1014716 1090391 1173087
4535 1173087 1130082 1090372 1174521 1151222 1127268 1172818 1154053 1181417 1173934 1265425 1345396 1420643
4523 1420643 1401257 1329307 1347139 1429864 1462301 1500209 1549912 1593180 1583775 1441755 1376654
4512 1376654 1402833 1381881 1421377 1337686 1277790 1319352 1234828 1179936 1068248 1160197 1174770
$$ packed form
4592A948228j05740k9851j16500k6448l1139p6559Q2937j3543j08831J9587j590
4581A540551J0061r9321m5489N6422o659j14638l0116L4194P9405k2448p3417
4570A328545n7433Q2265P3381k6076M0641o7863j11996m1578n6038P8804J01377
4559A344029N8762q2685r7262J2805n1085l3741o6813M1240k1966q257O6041k8384
4547A132684k6274N7434j7098Q2498k7306m2384k5473L385r0667l2083P5675Q2696
4535A173087m3005l9710Q4149k3299k3954M5550j8765K7364p483R1491P9971P5247
4523A420643j9386p1950J7832Q2725L2437L7908M9703M3268r405j42020o5101
4512A376654K6179k0952L9496q3691n9896M1562q4524n4892j11688R1949J4573
$$ plain form
4501 1174770 1263618 1123566 1065408 1095923 1111581 1081789 1120706 1131228 1236575 1174078 1228284
4490 1228284 1286350 1222977 1204226 1112159 1111670 1132731 1142036 1039561 1038137 1012070 1086487 1174722
4478 1174722 1164321 1188923 1259464 1152198 1107905 1145657 1218234 1214788 1157352 1066417 1044865
4467 1044865 975468 967648 910425 937721 970815 997839 947035 888878 932997 908983 948113 970361
4455 970361 953693 965953 940208 806090 754504 788399 870812 886237 959952 948576 966367
4444 966367 973576 932280 858797 787186 847278 941479 983036 945654 972218 981793 841198 852390
4432 852390 879756 905198 831611 778312 855611 930544 870266 824502 874156 895774 875902 818410
4420 818410 742202 744822 710728 682561 785191 818805 742950 762506 831490 844573 832061 828611
$$ packed form
4501A174770Q8848j40052n8158L0515J5658k9792L8917J0522J05347o2497N4206
4490A228284N8066o3373j8751r2067m89K1061R305j02475j424k6067P4417Q8235
4478A174722j0401K4602P0541j07266m4293L7752P2577l446n7436r0935k1552
4467A044865o9397p820n7223K7296L3094K7024n0804n8157M4119k4014L9130K2248
4455I70361j6668J2260k5745j34118n1586L3895Q2413J5425P3715j1376J7791
4444I66367P209m1296p3483p1611O0092R4201M1557l7382K6564R575j40595J1192
4432H52390K7366K5442p3587n3299P7299P4933o0278m5764M9654K1618j9872n7492
4420H18410p6208K620l4094k8167J02630L3614p5855J9556O8984J3083j2512l450
$$ plain form
4408 828611 847996 815307 786507 750202 791564 665042 749248 848078 872831 772063 828002
4397 828002 826452 719318 738652 738125 725389 669455 659109 668986 719327 699665 718407 718793 717223
4384 717223 598277 644238 670676 632906 611628 633541 723951 768939 731566 615907 530462
4373 530462 559920 686301 654542 714313 811810 843694 745252 864944 745809 640401 649106
4362 649106 739979 883684 844616 868269 868132 865648 789155 799306 790787 775675 857970 902817
4350 902817 914513 878873 841965 763702 720280 771030 720129 820157 785667 758284 771518
4339 771518 794575 847562 944160 912433 842077 798694 820522 935771 1021613 1026639 963669 1006050
4327 1006050 991109 996218 1019532 981849 918428 943696 938086 998453 1041921 1021146 918891 932296
$$ packed form
4408H28611J9385l2689k8800l6305M1362j26522Q4206R8830K4753j00768N5939
4397H28002j550j07134J9334n27j2736n5934j0346R877N0341j9662J8742L86j570
4384G17223j18946M5961K6438l7770k1278K1913R0410M4988l7373j15659q5445
4373E30462K9458J26381l1759N9771R7497L1884r8442J19692j19135j05408Q705
4362F49106R0873J43705l9068K3653j37k484p6493J0151q519j5112Q2295M4847
4350I02817J1696l5640l6908p8263m3422N0750n0901J00028l4490k7383J3234
4339G71518K3057N2987R6598l1727p0356m3383K1828J15249Q5842N026o2970M2381
4327A006050j4941N109K3314l7683o3421K5268n610O0367M3468k0775j02255J3405
$$ plain form
4315 932296 944163 979439 946881 975233 1073631 942964 884019 935258 1031212 1015023 1076301
4304 1076301 1113607 1111319 1089498 1191620 1223014 1115765 1155752 1261869 1278724 1305524 1314362
4293 1314362 1328106 1351603 1341255 1322732 1471069 1480781 1299591 1379566 1410213 1490401 1467039
4282 1467039 1382836 1497496 1463410 1523391 1548906 1613904 1585869 1613041 1682857 1648424 1616437
4271 1616437 1604746 1628110 1620223 1511081 1563616 1686356 1586216 1603262 1600654 1537522 1448821
4260 1448821 1499772 1525538 1461811 1438537 1441110 1374883 1436790 1498257 1377729 1308126 1352133
4249 1352133 1304273 1246800 1208001 1167239 1180833 1134942 1157049 1089630 1026427 1032599 1067579 1048480
4237 1048480 947971 1083544 1119053 1038204 1029610 973674 925389 948788 1014542 940447 862841
$$ packed form
4315I32296J1867L5276l2558K8352R8398j30667n8945N1239R5954j6189O1278
4304A076301L7306k288k1821J02122L1394j07249L9987J06117J6855K6800Q838
4293A314362J3744K3497j0348j8523J48337R712j81190P9975L0647Q0188k3362
4282A467039q4203J14660l4086N9981K5515O4998k8035K7172O9816l4433l1987
4271A616437j1691K3364p887j09142N2535J22740j00140J7046k608o3132q8701
4260A448821N0951K5766o3727k3274K573o6227O1907O1467j20528o9603M4007
4249A352133m7860n7473l8799m0762J3594m5891K2107o7419o3203O172L4980j9099
4237A048480j00509J35573L5509q0849q594n5936m8285K3399O5754p4095p7606
$$ plain form
4226 862841 790969 830264 870067 890530 875813 808163 789348 742746 792609 846250 881279 879587
4214 879587 811832 729881 650572 708513 740642 751238 877624 868439 810353 769549 913699
4203 913699 966142 888802 901612 904174 984292 970494 910793 869345 902964 975953 797869 900310
4191 900310 936194 886129 1000030 970905 881818 841699 817581 1016030 1020844 1034082 1058984
4180 1058984 1009512 1032943 1037019 1050421 1139906 1081585 1123826 1255181 1232936 1126309 1138037
4169 1138037 1251779 1293886 1372099 1304316 1337170 1348277 1429245 1491720 1579291 1581052 1529794
4158 1529794 1646297 1801790 1807758 1924461 2009979 2149963 2336557 2511690 2661066 2620173
4148 2620173 2566415 2439065 2430259 2264785 2125073 2137620 2118793 2114250 2079474 2061700 2170587
$$ packed form
4226H62841p1872L9295L9803K0463j4717o7650j8815m6602M9863N3641L5029j692
4214H79587o7755q1951p9309N7941L2129J0596J26386r185n8086m0804J44150
4203I13699N2443p7340J2810K562Q0118j3798n9701m1448L3619P2989j78084J02441
4191I00310L5884n0065J13901k9125q9087m0119k4118J98449M814J3238K4902
4180A058984m9472K3431M076J3402Q9485n8321M2241J31355k2245j06627J1728
4169A138037J13742M2107P8213o7783L2854J1107Q0968O2475Q7571J761n1258
4158A529794J16503J55493N968J16703Q5518J39984J86594J75133J49376m0893
4148B620173n3758j27350q806j65474j39712J2547j8827m543l4776j7774J08887
$$ plain form
4137 2170587 2294588 2191491 2281634 2324918 2278952 2310481 2482609 2438938 2490324 2548767 2619280
4126 2619280 2781117 2899538 2996354 3020918 3054909 3206105 3327088 3432826 3503203 3641520
4116 3641520 3791323 3955192 4200252 4266242 4411966 4645302 4777522 4866671 5137675 5366651
4106 5366651 5628697 5826301 5972508 6129386 6379903 6722808 7109236 7411604 7737479 8040691
4096 8040691 8333071 8647289 8951319 9244342 9584611 9945702 10267911 10609902 11027345 11468503
4086 11468503 12187936 12918671 13621219 14248228 14964348 15569468 16242172 16833163 17325236
4077 17325236 18106970 18825985 19797443 21238813 23006169 25174111 27433180 29526729 30617698
4068 30617698 29742620 28346768 26865794 25381081 24097712 23150470 22343784 21821752 21438424
$$ packed form
4137B170587J24001j03097R0143M3284m5966L1529J72128m3671N1386N8443P0513
4126B619280J61837J18421R6816K4564L3991J51196J20983J05738P0377J38317
4116C641520J49803J63869K45060O5990J45724K33336J32220Q9149K71004K28976
4106E366651K62046J97604J46207J56878K50517L42905L86428L02368L25875L03212
4096H040691K92380L14218L04030K93023L40269L61091L22209L41991M17443M41158
4086A1468503P19433P30735P02548O27009P16120O05120O72704N90991M92073
4077A7325236P81734P19015R71458J441370J767356K167942K259069K093549J090969
4068C0617698q75078j395852j480974j484713j283369r47242q06686n22032l83328
$$ plain form
4059 21438424 21292843 21379350 21704162 22146493 22461034 22824802 23104360 23072497 22747526 22266455
4049 22266455 21700004 21009460 20384932 19897045 19518186 19374345 19344013 19349153 19303462 19292536
4039 19292536 19251810 19009648 18604856 18091370 17312826 16622503 15949906 15330777 14777334 14286091
4029 14286091 13868877 13525847 13267522 12931928 12560273 12167353 11803867 11344224 10904454
4020 10904454 10329631 9791301 9365363 8957159 8542010 8124118 7750698 7391251 7119461
4011 7119461 6880497 6612778 6318476 5937678 5670856 5432782 5244151 4974895 4699692 4560014
4001 4560014 4306431 4115404 3930778 3878393 3790812 3610362 3458060 3320403 3109518 3076197
3991 3076197 3019233 2943405 2791478 2598457 2600906 2442133 2321670 2392495 2371376 2349305 2173669
$$ packed form
4059B1438424j45581Q6507L24812M42331L14541L63768K79558l1863l24971m81071
4049B2266455n66451o90544o24528m87887l78859j43841l0332N140m5691j0926
4039A9292536m0726k42162m04792n13486p78544o90323o72597o19129n53443m91243
4029A4286091m17214l43030k58325l35594l71655l92920l63486m59643m39770
4020A0904454n74823n38330m25938m08204m15149m17892l73420l59447k71790
4011G119461k38964k67719k94302l80798k66822k38074j88631k69256k75203j39678
4001D560014k53583j91027j84626n2385q7581j80450j52302j37657k10885l3321
3991C076197n6964p5828j51927j93021K449j58773j20463P0825k1119k2071j75636
$$ plain form
3980 2173669 2196955 2220084 2164469 2027881 1910211 1850239 1791404 1720605 1575333 1617957 1455470
3969 1455470 1445623 1487510 1412477 1466915 1415622 1471566 1388773 1362981 1402983 1380148 1290822 1346307
3957 1346307 1460827 1404169 1321051 1360666 1319935 1225573 1285730 1205715 1087717 1073220 1009130
3946 1009130 1013559 1014048 899602 863353 928314 815130 838081 898615 891594 907852 881656 933093
3934 933093 942230 973514 930296 818228 888345 969957 878072 805437 911515 877736 856795
3923 856795 845999 804767 764828 844257 739721 555040 635092 636458 638618 542976 610186 635676
3911 635676 671925 570165 639494 701052 686845 691723 750288 720169 667525 674127 744277 756183
3899 756183 782041 710985 670504 661110 699061 692451 811509 752556 687732 747929 797080 790037
$$ packed form
3980B173669K3286K3129n5615j36588j17670n9972n8835p0799j45272M2624j62487
3969A455470r847M1887p5033N4438n1293N5944q2793k5792M0002k2835q9326N5485
3957A346307J14520n6658q3118L9615m0731r4362O0157q0015j17998j4497o4090
3946A009130M429M89j14446l6249O4961j13184K2951O0534p021J6258k6196N1437
3934I33093R137L1284m3218j12068P0117Q1612r1885p2635J06078l3779k0941
3923H56795j0796m1232l9939P9429j04536j84681Q0052J366K160r5642O7210K5490
3911F35676L6249j01760O9329O1558j4207M878N8565l0119n2644O602P0150J1906
3899G56183K5858p1056m0481r394L7951o610J19058n8953o4824O0197M9151p043
$$ plain form
3887 790037 705049 666646 651101 678334 665901 685610 696539 763487 743722 594399 548500
3876 548500 525447 587802 562027 597939 636267 688345 637606 601233 597897 555044 614665 644190
3864 644190 585829 530193 590473 594469 567206 545729 482205 584246 643411 586965 552626 452024
3852 452024 417086 480959 578389 604997 624176 591639 714237 675460 692522 618663 560342
3841 560342 564282 671870 679197 651354 670585 667954 615242 655704 706248 758070 824498 908242
3829 908242 825235 832579 818950 744478 786554 871859 862747 875566 986377 984942 928238 998349
3817 998349 907442 973623 960158 967017 960498 971816 980402 979730 1095531 1027785 921606 988339
3805 988339 998566 984535 1033224 987044 1072042 1014142 999062 934965 1026841 1124766 1054276 957778
$$ packed form
3887G90037q4988l8403j5545K7233j2433J9709J0929O6948j9765j49323m5899
3876E48500k3053O2355k5775L5912L8328N2078n0739l6373l336m2853N9621K9525
3864F44190n8361n5636O0280L996k7263k1477o3524J02041N9165n6446l4339j00602
3852D52024l4938O3873R7430K6608J9179l2537J22598l8777J7062p3859n8321
3841E60342L940J07588P327k7843J9231k631n2712M0462N0544N1822O6428Q3744
3829I08242q3007P344j3629p4472M2076Q5305r112J2819J10811j435n6704P0111
3817I98349r0907O6181j3465O859o519J1318Q586o72J15801o7746j06179O6733
3805I88339J0227j4031M8689m6180Q4998n7900j5080o4097R1876R7925p0490r6498
$$ plain form
3793 957778 918744 962607 1114329 1090045 1147137 1220633 1166912 1187749 1254337 1295256 1252413
3782 1252413 1351136 1428805 1492712 1553517 1583840 1584819 1765091 1844332 1934589 2053305 2200914
3771 2200914 2349416 2246932 2060964 2002248 2078990 2194795 2073946 1993174 1956027 1952576 1883505
3760 1883505 1820272 1880746 1916160 1978857 1949069 1963340 1909044 2082534 2008954 2138863 2242478
3749 2242478 2317336 2293959 2391181 2504615 2552574 2497948 2665144 2697334 2550232 2400033 2339872
3738 2339872 2277463 2178496 2069827 1991558 2011136 2045947 2094242 2012634 1892149 1912347 1970954
3727 1970954 1801785 1799357 1811889 1771839 1758041 1761223 1660431 1781268 1838511 1836439 1883266
3716 1883266 1930225 1981314 2096610 2128577 2133982 2122096 2135756 2178644 2296537 2332168 2443599
$$ packed form
3793I57778l9034M3863J51722k4284N7092P3496n3721K0837O6588M0919m2843
3782A252413R8723P7669O3907O0805L0323R79J80272P9241R0257J18716J47609
3771B200914J48502j02484j85968n8716P6742J15805j20849q0772l7147l451o9071
3760A883505o3233O0474L5414O2697k9788J4271n4296J73490p3580J29909J03615
3749B242478P4858k3377R7222J13434M7959n4626J67196L2190j47102j50199o0161
3738B339872o2409r8967j08669p8269J9578L4811M8295q1608j20485K0198N8607
3727A970954j69169k428J2532m0050j3798L182j00792J20837N7243k072M6827
3716A883266M6959N1089J15296L1967N405j1886J3660M2888J17893L5631J11431
$$ plain form
3705 2443599 2574058 2550596 2602359 2658686 2680982 2584186 2614649 2578634 2504899 2540830 2597941
3694 2597941 2717396 2685994 2652334 2593330 2533398 2449659 2392611 2439198 2414762 2368308 2375713
3683 2375713 2186289 2034228 1940141 1900016 1912116 1862915 1846133 1827313 1739190 1577698 1508838
3672 1508838 1455508 1481657 1449764 1420759 1401355 1386924 1325124 1324700 1179110 1141159 1283657
3661 1283657 1301517 1309239 1325189 1314302 1314528 1339889 1260295 1255357 1260361 1165674 1102330 1199124
3649 1199124 1149913 1166152 1176816 1121605 1078185 1182165 1122106 994359 1116587 1187576 1206387
3638 1206387 1312906 1392804 1425317 1345716 1198645 1019643 1055022 1142368 1183389 1301839 1292477
3627 1292477 1334679 1243539 1228971 1362982 1360522 1425690 1511396 1496743 1405093 1522553 1501543
$$ packed form
3705B443599J30459k3462N1763N6327K2296r6796L0463l6015p3735L5931N7111
3694B597941J19455l1402l3660n9004n9932q3739n7048M6587k4436m6454P405
3683B375713j89424j52061r4087m0125J2100m9201j6782j8820q8123j61492o8860
3672A508838n3330K6149l1893k9005j9404j4431o1800m24j45590l7951J42498
3661A283657J7860P722J5950j0887K26K5361p9594m938N004r4687o3344R6794
3649A199124m9211J6239J0664n5211m3420J03980o0059j27747J22228P0989J8811
3638A206387J06519P9898L2513p9601j47071j79002L5379Q7346M1021J18450r362
3627A292477M2202r1140j4568J34011k460O5168Q5706j4653r1650J17460k1010
$$ plain form
3616 1501543 1429193 1475890 1434197 1435432 1452738 1475458 1461719 1424350 1512370 1543652 1496965 1514268
3604 1514268 1427057 1451611 1370424 1304591 1480159 1520410 1506780 1519734 1535787 1592503 1597389
3593 1597389 1592195 1547195 1581269 1550790 1454205 1464351 1570044 1662279 1739218 1720168 1733594
3582 1733594 1731630 1847264 1890824 1875192 2077439 2131466 2088371 2084354 2097461 2027128 1974300
3571 1974300 2022612 2024972 2146831 2205240 2175805 2169714 2280646 2371525 2339499 2303923 2406686
3560 2406686 2401561 2406043 2462588 2545476 2654472 2692377 2696420 2796834 2890566 2980998 3017686 3127057
3548 3127057 3188763 3103151 3093362 3164620 3197742 3106005 3114349 3178559 3089342 3117515 3143667 3189798
3536 3189798 3267018 3336666 3371035 3410144 3430366 3385704 3474603 3576037 3528160 3502382 3527608
$$ packed form
3616A501543p2350M6697m1693J235J7306K2720j3739l7369Q8020L1282m6687J7303
3604A514268q7211K4554q1187o5833J75568M0251j3630J2954J6053N6716M886
3593A597389n194m5000L4074l0479r6585J0146J05693R2235P6939j9050J3426
3582A733594j964J15634M3560j5632K02247N4027m3095m017J3107p0333n2828
3571A974300M8312K360J21859N8409k9435o091J10932R0879l2026l5576J02763
3560B406686n125M482N6545Q2888J08996L7905M043J00414R3732R0432L6688J09371
3548C127057O1706q5612r789P1258L3122r1737Q344O4210q9217K8173K6152M6131
3536C189798P7220O9648L4369L9109K0222m4662Q8899J01434m7877k5778K5226
$$ plain form
3525 3527608 3587520 3720443 3702699 3775230 3803090 3798728 3839871 3944895 4024702 4076022 4103926
3514 4103926 4135324 4287939 4491936 4560774 4589339 4702795 4819190 4794269 4851507 4859008 4935564
3503 4935564 4871358 4775959 4925556 4993148 4923293 4994605 5078769 5114149 5182493 5141159 5134199
3492 5134199 5156165 5138364 5191489 5168445 5213825 5319031 5586444 5628867 5681150 5773633 5868059
3481 5868059 6027702 6159560 6255654 6297315 6291679 6398292 6446042 6508374 6630719 6793532 6801768
3470 6801768 6824505 6892250 7057855 7161410 7057774 7192627 7310040 7448404 7411645 7505060
3460 7505060 7652083 7568806 7519689 7649408 7680470 7723510 7715790 7712393 7747069 7741374 7738749 7722998
3448 7722998 7795579 7973234 8096851 8159465 8282067 8435963 8559873 8791729 8897940 9132117
$$ packed form
3525C527608N9912J32923j7744P2531K7860m362M1143J05024P9807N1320K7904
3514D103926L1398J52615K03997O8838K8565J13456J16395k4921N7238P501P6556
3503D935564o4206r5399J49597O7592o9855P1312Q4164L5380O8344m1334o960
3492E134199K1966j7801N3125k3044M5380J05206K67413M2423N2283R2483R4426
3481E868059J59643J31858R6094M1661n636J06613M7750O2332J22345J62813Q236
3470F801768K2737O7745J65605J03555j03636J34853J17413J38364l6759R3415
3460G505060J47023q3277m9117J29719L1062M3040p720l397L4676n695k625j5751
3448G722998P2581J77655J23617O2614J22602J53896J23910K31856J06211K34177
$$ plain form
3438 9132117 9234600 9355451 9674369 9839339 10119414 10425492 10600348 10824037 10986498 11316554
3428 11316554 11636655 11989421 12343190 12571700 13029942 13510557 14045642 14546855 14989097
3419 14989097 15518308 15956302 16510005 16944196 17392442 17881106 18088732 18281789 18518345
3410 18518345 18635901 18696286 18853905 19073211 19132982 19204255 19421090 19559715 19681097 19608393
3400 19608393 19504971 19587590 19514953 19236683 19117128 18931151 18873530 18810961 18788108 18893331
3390 18893331 18815364 18654642 18492092 18425226 18285523 18142168 18041668 17947314 17993379 18081184
3380 18081184 18132204 18201390 18304416 18430400 18581518 18871842 19123032 19228181 19375729 19565852
3370 19565852 19633503 19705664 19787880 19929588 20083853 20289668 20394182 20533302 20777096 21106411
$$ packed form
3438I132117J02483J20851L18918J64970K80075L06078J74856K23689J62461L30056
3428A1316554L20101L52766L53769K28510M58242M80615N35085N01213M42242
3419A4989097N29211M37994N53703M34191M48246M88664K07626J93057K36556
3410A8518345J17556O0385J57619K19306N9771P1273K16835J38625J21382p2704
3400A9608393j03422Q2619p2637k78270j19555j85977n7621o2569k2853J05223
3390A8893331p7967j60722j62550o6866j39703j43355j00500r4354M6065Q7805
3380A8081184N1020O9186J03026J25984J51118K90324K51190J05149J47548J90123
3370A9565852O7651P2161Q2216J41708J54265K05815J04514J39120K43794L29315
$$ plain form
3360 21106411 21484903 21743840 21870109 22344435 22920067 23416374 24072349 24728531 25407799
3351 25407799 26082468 26833172 27644531 28416374 29303430 30292056 31322373 32426223 33521914
3342 33521914 34979865 36516249 38175243 40102557 42181877 44336727 46549477 48772671
3334 48772671 50974837 52880086 54425633 55704231 56601666 57133365 57347204 57258874 56988316
3325 56988316 56603212 56419572 56260972 56189752 56236678 56452726 56715034 56800450 56723654 56396844
3315 56396844 55752288 54802270 53568281 52049057 50286853 48370314 46479616 44652374
3307 44652374 43005472 41347499 39968245 38794087 37813038 37061298 36380138 35891155 35692439
3298 35692439 35575512 35614946 35828876 36256587 36792032 37573819 38481904 39469415 40771126
$$ packed form
3360B1106411L78492K58937J26269M74326N75632M96307O55975O56182O79268
3351B5407799O74669P50704Q11359P71843Q87056R88626J030317J103850J095691
3342C3521914J457951J536384J658994J927314K079320K154850K212750K223194
3334D8772671K202166J905249J545547J278598Q97435N31699K13839q8330k70558
3325E6988316l85104j83640j58600p1220M6926K16048K62308Q5416p6796l26810
3315E6396844o44556r50018j233989j519224j762204j916539j890698j827242
3307D4652374j646902j657973j379254j174158r81049p51740o81160m88983j98716
3298C5692439j16927L9434K13930M27711N35445P81787R08085R87511J301711
$$ plain form
3289 40771126 42220420 43879884 45685035 47762920 50025151 52371969 54799137 57385533
3281 57385533 60007506 62599000 65217384 67897857 70504846 73228224 76226222 79553626
3273 79553626 83164294 87141587 91534250 96364665 101499480 106788216 112104098 117082867
3265 117082867 121596729 125383628 128161155 129991581 130888001 130949299 130342193 129195932 127460061
3256 127460061 125871391 124232687 122631715 121445234 120356411 119194166 117978084 116341645
3248 116341645 114161930 111346809 107939897 104026403 99575132 94847020 89880434 84646540
3240 84646540 79556990 74781272 70220762 66053487 62494816 59447228 56789029 54625970
3232 54625970 52598240 50819911 49286611 47860706 46651131 45655934 44770195 44105387 43597594
$$ packed form
3289D0771126J449294J659464J805151K077885K262231K346818K427168K586396
3281E7385533K621973K591494K618384K680473K606989K723378K997998L327404
3273G9553626L610668L977293M392663M830415N134815N288736N315882M978769
3265A17082867M513862L786899K777527J830426Q96420O1298o07106j146261j735871
3256A27460061j588670j638704j600972j186481j088823j162245j216082j636439
3248A16341645k179715k815121l406912l913494m451271m728112m966586n233894
3240H4646540n089550m775718m560510m167275l558671l047588k658199k163059
3232E4625970k027730j778329j533300j425905j209575r95197q85739o64808n07793
$$ plain form
3223 43597594 43238884 42971052 42852014 42739236 42897461 43075751 43222006 43261864 43338522 43533230
3213 43533230 43631577 43588744 43602156 43503823 43307840 42938232 42861228 42562639 42199508 41931830
3203 41931830 41734767 41516172 41220442 41028591 40742441 40469158 40247329 39957128 39645285
3194 39645285 39203534 38934337 38498664 38111615 37836158 37579105 37406575 37148064 36960322
3185 36960322 36773165 36723609 36508964 36446130 36370229 36309986 36186205 36081704 35995580 35786590
3175 35786590 35579650 35631376 35617530 35551625 35730183 35839683 36036830 36460716 36759397 37179913
3165 37179913 37618202 37995196 38313339 38660447 38937128 39326148 39499646 39741748 40029522
3156 40029522 40326867 40684743 41102735 41602634 42173169 42904448 43695160 44503453 45442253
$$ packed form
3223D3597594l58710k67832j19038j12778J58225J78290J46255L9858P6658J94708
3213D3533230R8347m2833J3412r8333j95983l69608p7004k98589l63131k67678
3203D1931830j97063k18595k95730j91851k86150k73283k21829k90201l11843
3194C9645285m41751k69197m35673l87049k75457k57053j72530k58511j87742
3185C6960322j87157m9556k14645o2834p5901o0243j23781j04501q6124k08990
3175C5786590k06940N1726j3846o5905J78558J09500J97147M23886K98681M20516
3165C7179913M38289L76994L18143L47108K76681L89020J73498K42102K87774
3156D0029522K97345L57876M17992M99899N70535P31279P90712Q08293R38800
$$ plain form
3147 45442253 46552072 47940629 49566217 51414551 53535487 56126311 59005867 62271649
3139 62271649 65884545 69839085 73884567 77998464 82224855 86304085 90277406 94147463
3131 94147463 97781811 101287204 104399878 106936427 109050825 110421551 111318560 111714629
3123 111714629 111648281 111094204 110294078 109246167 107995605 106429884 104728522 102960354 101018251
3114 101018251 98866824 96635161 94161897 91510158 88795301 86118592 83726376 81320432
3106 81320432 79053794 77029828 74988092 72872174 70628187 68433131 66177810 63866296
3098 63866296 61645324 59300008 57102594 54941497 52895591 51197438 49649142 48435951
3090 48435951 47453007 46724975 46139266 45847765 45740925 45804297 45886927 46009127 46114547 46142992
$$ packed form
3147D5442253J109819J388557J625588J848334K120936K590824K879556L265782
3139F2271649L612896L954540M045482M113897M226391M079230L973321L870057
3131I4147463L634348L505393L112674K536549K114398J370726Q97009L96069
3123A11714629o6348n54077q00126j047911j250562j565721j701362j768168j942103
3114A01018251k151427k231663k473264k651739k714857k676709k392216k405944
3106H1320432k266638k023966k041736k115918k243987k195056k255321k311514
3098F3866296k220972k345316k197414k161097k045906j698153j548296j213191
3090D8435951r82944p28032n85709k91501j06840O3372Q2630J22200J05420K8445
$$ plain form
3080 46142992 46083893 45885321 45319802 44602430 43768342 42666082 41547715 40337134 38974879
3071 38974879 37566007 36268475 34923494 33580524 32205159 30945331 29807335 28564595
3063 28564595 27439955 26398972 25318093 24339730 23474636 22563200 21753190 20943242 20115145
3054 20115145 19418515 18823306 18279748 17694219 17321008 16947136 16527242 16181169 15744894
3045 15744894 15404692 15190203 14889279 14615037 14423268 14246677 13939469 13850402 13698666 13629117
3035 13629117 13526495 13393360 13387155 13353202 13244108 13275094 13382386 13366270 13502451 13553487
3025 13553487 13647115 13740230 13725335 13692017 13668653 13634786 13592695 13433790 13351229 13115297 12880826
3014 12880826 12596147 12240690 12083004 11779873 11540594 11409246 11349362 11119955 10974287 10961607
$$ packed form
3080D6142992n9099j98572n65519p17372q34088j102260j118367j210581j362255
3071C8974879j408872j297532j344981j342970j375365j259828j137996j242740
3063B8564595j124640j040983j080879r78363q65094r11436q10010q09948q28097
3054B0115145o96630n95209n43558n85529l73211l73872m19894l46073m36275
3045A5744894l40202k14489l00924k74242j91769j76591l07208q9067j51736o9549
3035A3629117j02622j33135o205l3953j09094L0986J07292j6116J36181N1036
3025A3553487R3628R3115j4895l3318k3364l3867m2091j58905q2561k35932k34471
3014A2880826k84679l55457j57686l03131k39279j31348n9884k29407j45668j2680
$$ plain form
3004 10961607 11033952 11110573 11161156 11156636 11290205 11517593 11510205 11532558 11612521 11649440 11887299
2993 11887299 11969756 12113271 12307257 12518816 12899957 13184210 13434067 13793695 14081911 14303439
2983 14303439 14691363 14847209 15167396 15625607 16116089 16777263 17429003 18260714 18972967
2974 18972967 19659037 20289236 20776220 21054651 21070179 20927363 20385220 19578243 18681268 17840343
2964 17840343 16988796 16197356 15464822 14857855 14340818 13936547 13642573 13379893 13138940
2955 13138940 13081190 12922190 12861716 12910379 13010612 13097719 13008013 13149101 13280647 13314832
2945 13314832 13430172 13607394 13862742 14004896 14223262 14455804 14602819 14674980 14821737 15001455
2935 15001455 15253912 15489318 15707406 15914978 16239818 16596045 16783862 17259330 17647643
$$ packed form
3004A0961607P2345P6621N0583m520J33569K27388p388K2353P9963L6919K37859
2993A1887299Q2457J43515J93986K11559L81141K84253K49857L59628K88216K21528
2983A4303439L87924J55846L20187M58211M90482O61174O51740Q31711P12253
2974A8972967O86070O30199M86984K78431J5528j42816n42143q06977q96975q40925
2964A7840343q51547p91440p32534o06967n17037m04271k93974k62680k40953
2955A3138940n7750j59000o0474M8663J00233Q7107q9706J41088J31546L4185
2945A3314832J15340J77222K55348J42154K18366K32542J47015P2161J46757J79718
2935A5001455K52457K35406K18088K07572L24840L56227J87817M75468L88313
$$ plain form
2926 17647643 17891670 18282276 18754519 19269815 19761451 20217233 20716724 21146051 21666227
2917 21666227 22193161 22781204 23497429 24102315 24706937 25349840 26092219 26965921 27913011
2908 27913011 28947580 29984412 31149617 32300181 33608230 35155505 36926773 38783252
2900 38783252 40665323 42804430 45001710 47551206 50311400 53444090 56835214 60701212
2892 60701212 65086085 70136833 75779981 82352924 89898408 98457325 107749427 116832707
2884 116832707 125197667 131703442 136248221 140018281 143643352 148131793 154195460 162781758
2876 162781758 174619689 189949845 209014961 230626477 252468683 270220643 279251158
2869 279251158 276216161 262048549 241053979 217657507 195784180 177366658 162593842
$$ packed form
2926A7647643K44027L90606M72243N15296M91636M55782M99491M29327N20176
2917B1666227N26934N88043P16225O04886O04622O42903P42379Q73702R47090
2908B7913011J034569J036832J165205J150564J308049J547275J771268J856479
2900C8783252J882071K139107K197280K549496K760194L132690L391124L865998
2892F0701212M384873N050748N643148O572943P545484Q558917R292102R083280
2884A16832707Q364960O505775M544779L770060L625071M488441O063667Q586298
2876A62781758J1837931J5330156J9065116K1611516K1842206J7751960R030515
2869B79251158l034997j4167612k0994570k3396472k1873327j8417522j4772816
$$ plain form
2862 162593842 151322404 142020567 133974469 126258486 118853806 111755622 105111868 98808118
2854 98808118 92440044 85941266 79653847 73703446 68114159 63041394 58511867 54266229
2846 54266229 50457343 47112270 44110281 41350779 38846884 36674571 34662134 32889551
2838 32889551 31120310 29575851 28214528 27049255 25935899 24819251 23729119 22744197
2830 22744197 21891361 20995943 20242369 19541188 18766804 18086785 17436450 16890873 16226884
2821 16226884 15790603 15234033 14621580 14241501 13755275 13357034 13017750 12655601 12326045
2812 12326045 11968777 11722164 11431495 11203263 10972544 10701408 10422081 10086591 9769328
2803 9769328 9609628 9371539 9112528 8896970 8586207 8362939 8161888 7962277 7784357 7640778
$$ packed form
2862A62593842j1271438r301837q046098p715983p404680p098184o643754o303750
2854I8808118o368074o498778o287419n950401n589287n072765m529527m245638
2846E4266229l808886l345073l001989k759502k503895k172313k012437j772583
2838C2889551j769241j544459j361323j165273j113356j116648j090132r84922
2830B2744197q52836q95418p53574p01181p74384o80019o50335n45577o63989
2821A6226884m36281n56570o12453l80079m86226l98241l39284l62149l29556
2812A2326045l57268k46613k90669k28232k30719k71136k79327l35490l17263
2803I769328j59700k38089k59011k15558l10763k23268k01051j99611j77920j43579
$$ plain form
2793 7640778 7391525 7326862 7196256 6991624 6767258 6681253 6586899 6397175 6207881 6076865
2783 6076865 5981829 5895431 5743527 5541412 5409219 5186943 5093057 4984755 4806795 4743436
2773 4743436 4678248 4531690 4468072 4413814 4428622 4274546 4038757 3972309 4015821 3894541 3810271
2762 3810271 3729737 3653463 3596864 3552978 3420156 3323660 3277320 3266468 3236568 3288378 3211088
2751 3211088 3158476 3064835 3063758 2950503 2930524 2919183 2735881 2669193 2795216 2863048 2723371
2740 2723371 2605094 2704231 2659584 2509226 2663690 2607955 2560771 2535135 2589405 2600465 2461684
2729 2461684 2377792 2455606 2282584 2281627 2263677 2258497 2278653 2205598 2074735 2048656 2069685 1998675
2717 1998675 1905589 1817892 1847605 1898951 1891431 1771175 1594887 1705183 1745611 1641586 1562373
$$ packed form
2793G640778k49253o4663j30606k04632k24366q6005r4354j89724j89294j31016
2783F076865r5036q6398j51904k02115j32193k22276r3886j08302j77960o3359
2773D743436o5188j46558o3618n4258J4808j54076k35789o6448M3512j21280q4270
2762C810271q0534p6274n6599m3886j32822r6496m6340j0852k9900N1810p7290
2751C211088n2612r3641j077j13255j9979j1341j83302o6688J26023O7832j39677
2740B723371j18277R9137m4647j50358J54464n5735m7184k5636N4270J1060j38781
2729B461684q3892P7814j73022r57j7950n180K0156p3055j30863k6079K1029p1010
2717A998675r3086q7697K9713N1346p520j20256j76288J10296M0428j04025p9213
$$ plain form
2706 1562373 1553133 1488341 1448098 1530498 1506777 1512584 1433323 1466264 1320134 1215889 1293956
2695 1293956 1104722 1169461 1285156 1355811 1336104 1269114 1262344 1275529 1179778 1207560 1277114
2684 1277114 1260247 1221790 1170378 1334378 1246210 1165176 1153932 1042035 1086633 1051813 1067006
2673 1067006 1062543 1032695 1059336 1083842 989971 978342 1036547 1030832 1010610 1055560 913507 909423
2661 909423 865153 745846 877219 831132 879792 802389 776462 773344 776603 841769 819552 736265
2649 736265 738816 763230 743171 817501 904847 835554 838773 779594 885355 994443 879162
2638 879162 824578 757738 772500 798199 894515 966700 872459 832035 785561 766651 852496 827325
2626 827325 762386 739190 709315 670852 720126 806850 800833 788203 845304 816674 762156 772428
$$ packed form
2706A562373r240o4792m0243Q2400k3721N807p9261L2941j46130j04245P8067
2695A293956j89234O4739J15695P0655j9707o6990o770J3185r5751K7782O9554
2684A277114j6867l8457n1412J64000q8168q1034j1244j11897M4598l4820J5193
2673A067006m463k9848K6641K4506r3871j1629N8205n715k0222M4950j42053m084
2661I09423m4270j19307J31373m6087M8660p7403k5927l118L259O5166k2217q3287
2649G36265K551K4414k0059P4330Q7346o9293L219n9179J05761J09088j15281
2638H79162n4584o6840J4762K5699R6316P2185r4241m0424m6474j8910Q5845k5171
2626H27325o4939k3196k9875l8463M9274Q6724o017j2630N7101k8630n4518J0272
$$ plain form
2614 772428 688428 737346 771250 917736 869534 856342 844749 886971 864607 892875 1026899
2603 1026899 1069816 1068730 1120882 1214539 1184316 1229537 1272300 1286961 1221730 1296622 1291861 1428158
2591 1428158 1562736 1553518 1695634 1756697 1809398 1852029 1868630 1745458 1623336 1404795 1413537
2580 1413537 1374798 1212255 1255136 1237552 1200613 1096751 1039392 1040666 960759 869604 905299
2569 905299 814573 677093 612017 607101 545301 510089 607854 711421 740149 647688 647884 585414
2557 585414 522344 492194 473399 461503 383363 378963 417419 363877 284270 453737 522082 512767
2545 512767 451886 450823 400693 441404 451576 462258 395187 386135 296051 422837 426036 364888
2533 364888 367048 318333 292014 352741 411804 452115 446390 345793 417254 433534 361389 327479
$$ packed form
2614G72428q4000M8918L3904J46486m8202j3192j1593M2222k2364K8268J34024
2603A026899M2917j086N2152R3657l0223M5221M2763J4661o5231P4892m761J36297
2591A428158J34578r218J42116O1063N2701M2631J6601j23172j22122k18541Q742
2580A413537l8739j62543M2881j7584l6939j03862n7359J274p9907r1155L5695
2569I05299r0726j37480o5076m916o1800l5212R7765J03567K8728r2461J96o2470
2557E85414o3070l0150j8795j1896p8140m400L8456n3542p9607J69467O8345r315
2545E12767o0881j063n0130M0711J0172J0682o7071r052r0084J26786L199o1148
2533C64888K160m8715k6319O0727N9063M0311n725j00597P1461J6280p2145l3910
$$ plain form
2521 327479 380536 443207 430076 473430 379749 322007 344739 288928 280373 263556 362656 236536
2509 236536 245103 322970 259195 256251 244211 261781 304794 271355 280075 267148 186501 198394
2497 198394 189391 114802 305208 388732 327478 223317 244516 168477 87080 180885 236096
2486 236096 289127 287722 346350 259272 186186 221065 209379 180586 125253 94744 135728 183545
2474 183545 185804 186359 221840 247473 210864 211160 183644 101196 58741 96887 170966 108661 94516
2461 94516 128509 4837 6108 93515 60156 43595 35668 111048 169655 146767 198781 134794
2449 134794 144813 169141 81000 46522 156964 240015 179885 86536 137749 252186 181554
2438 181554 126378 61674 80951 180861 143002 185436 111727 139937 191630 150650 21960
$$ packed form
2521C27479N3057O2671j3131M3354r3681n7742K2732n5811q555j6817R9100j26120
2509B36536Q567P7867o3775k944j2040J7570M3013l3439Q720j2927q0647J1893
2497A98394r003p4589J90406Q3524o1254j04161K1199p6039q1397R3805N5211
2486B36096N3031j405N8628q7078p3086L4879j1686k8793n5333l0509M0984M7817
2474A83545K259N55L5481K5633l6609K96k7516q2448m2455L8146P4079o2305j4145
2461I4516L3993j23672J271Q7407l3359j6561p927P5380N8607k2888N2014o3987
2449A34794J0019K4328q8141l4478J10442Q3051o0130r3349N1213J14437p0632
2438A81554n5176o4704J9277R9910l7859M2434p3709K8210N1693m0980j28690
$$ plain form
2427 21960 91278 106616 166584 162982 130467 149048 107057 49886 122905 99883 87573 123286
2415 123286 97846 178900 112773 189130 227525 95983 94930 188838 182191 166839 131844 41663
2403 41663 156983 284837 227483 261114 240967 232565 182803 100488 88964 77460 68038 136304
2391 136304 107587 171382 46075 -22551 20073 71523 149556 163108 231667 175660 97063
2380 97063 101985 141022 191148 165169 139644 96920 117402 164780 243071 194508 86518 225717
2368 225717 260827 157341 173947 193604 303615 240240 251294 250967 197603 168366 190196 214580
2356 214580 229079 238324 171048 205991 234564 169867 144312 135840 86775 142132 68961 105047
2344 105047 174075 192136 232146 138257 84529 121027 101075 99727 183677 147420 93837 65919
$$ packed form
2427B1960O9318J5338N9968l602l2515J8581m1991n7171P3019k3022j2310L5713
2415A23286k5440Q1054o6127P6357L8395j31542j053R3908o647j5352l4995r0181
2403D1663J15320J27854n7354L3631k0147q402m9762q2315j1524j1504r422O8266
2391A36304k8717O3795j25307o8626M2624N1450P8033J3552O8559n6007p8597
2380I7063M922L9037N0126k5979k5525m2724K0482M7378P8291m8563j07990J39199
2368B25717L5110j03486J6606J9657J10011o3375J1054l27n3364k9237K1830K4384
2356B14580J4499R245o7276L4943K8573o4697k5555q472m9065N5357p3171L6086
2344A05047O9028J8061M0010r3889n3728L6498j9952j348Q3950l6257n3583k7918
$$ plain form
2332 65919 77283 110541 117003 75455 17488 64387 153949 200541 199809 150618 63219 21343
2320 21343 45683 26396 42286 140437 219796 284178 249585 225553 122988 136923 125727 86517
2308 86517 80790 103183 251588 174909 204562 154119 107272 221633 222316 63259 78960 87058
2296 87058 104492 88701 114071 154749 135836 214710 149430 132766 168922 109376 18702 17426
2284 17426 62140 184837 201205 182964 59965 141749 190825 186683 112920 216892 156722
2273 156722 215446 176151 165090 183774 222657 142568 200776 262508 201087 233040 180186 120864
2261 120864 48551 68857 174178 205506 75500 43624 93968 215008 175255 216701 163059
2250 163059 274624 336006 230136 173101 179863 66017 97938 202557 151553 152104 166096
$$ packed form
2332F5919J1364L3258O462m1548n7967M6899Q9562M6592p32m9191q7399m1876
2320B1343K4340j9287J5890R8151P9359O4382l4593k4032j02565J3935j1196l9210
2308H6517n727K2393J48405p6679K9653n0443m6847J14361O83j59057J5701Q098
2296H7058J7434j5791K5370M0678j8913P8874o5280j6664L6156n9546r0674j276
2284A7426M4714J22697J6368j8241j22999Q1784M9076m142p3763J03972o0170
2273A56722N8724l9295j1061J8684L8883q0089N8208O1732o1421L1953n2854n9322
2261A20864p2313K0306J05321L1328j30006l1876N0344J21040l9753M1446n3642
2250A63059J11565O1382j05870n7035O762j13846L1921J04619n1004N51J3992
$$ plain form
2239 166096 138155 148058 196015 164041 142158 146417 168415 202958 204076 352869 282095 221830
2227 221830 252764 336904 257753 177435 239068 309344 274475 261677 344059 449814 497304
2216 497304 462141 394071 491059 460970 408173 328111 404459 358570 343911 345907 356966 402291
2204 402291 481861 499998 359977 329391 392335 423774 465823 489094 459108 495730 457396
2193 457396 513648 371457 470841 467116 580796 536125 605179 587833 604937 630123 582150
2182 582150 561602 585581 667389 645666 630687 643829 592685 734459 761615 743951 740909 725332
2170 725332 816071 898642 941560 1003817 1009135 946207 916258 987021 1049533 1112474 1175344 1144971
2158 1144971 1302357 1354183 1424839 1404513 1412349 1409698 1452893 1502464 1511257 1531279 1511778 1649242
$$ packed form
2239A66096k7941R903M7957l1974k1883M259K1998L4543J118J48793p0774o0265
2227B21830L0934Q4140p9151q0318O1633P0276l4869j2798Q2382J05755M7490
2216D97304l5163o8070R6988l0089n2797q0062P6348m5889j4659J996J1059M5325
2204D02291P9570J8137j40021l0586O2944L1439M2049K3271k9986L6622l8334
2193D57396N6252j42191R9384l725J13680m4671O9054j7346J7104K5186m7973
2182E82150k0548K3979Q1808k1723j4979J3142n1144J41774K7156j7664l042j5577
2170G25332R0739Q2571M2918O2257N318o2928k9949P0763O2512O2941O2870l0373
2158A144971J57386N1826P0656k0326P836k651M3195M9571Q793K0022j9501J37464
$$ plain form
2146 1649242 1692407 1724315 1775339 1798118 1743383 1791174 1999927 2082838 2010356 2098388 2137551
2135 2137551 2195482 2245944 2256101 2480463 2593065 2690615 2721160 2879492 2980677 3206353
2125 3206353 3336755 3459844 3632694 3756464 4028605 4185481 4349704 4578319 4740109 5137673
2115 5137673 5446726 5743157 6155543 6557641 7237392 7888717 8474415 9193640 9822623 10598335
2105 10598335 11424068 12593132 13891306 15558441 17485011 20041834 23332995 27715162
2097 27715162 33178163 39614719 45653601 50706881 51244379 45341617 38332392 31872503
2089 31872503 26143076 21499047 18131326 15531688 13695047 12297212 11111539 10057867
2081 10057867 9370520 8815876 8274687 7836759 7239682 6667500 6187822 5741664 5378065
$$ packed form
2146A649242M3165L1908N1024K2779n4735M7791K08753Q2911p2482Q8032L9163
2135B137551N7931N0462J0157K24362J12602R7550L0545J58332J01185K25676
2125C206353J30402J23089J72850J23770K72141J56876J64223K28615J61790L97564
2115E137673L09053K96431M12386M02098O79751O51325N85698P19225O28983P75712
2105A0598335Q25733J169064J298174J667135J926570K556823L291161M382167
2097B7715162N463001O436556O038882N053280N37498n902762p009225o459889
2089C1872503n729427m644029l367721k599638j836641j397835j185673j053672
2081A0057867o87347n54644n41189m37928n97077n72182m79678m46158l63599
$$ plain form
2072 5378065 5045044 4717521 4452453 4194565 3992718 3743890 3420655 3206591 3046646 2943054
2062 2943054 2892310 2742646 2616232 2527632 2381038 2349942 2213749 2121563 2027003 1859592
2052 1859592 1854853 1808977 1725584 1707934 1682069 1548812 1507420 1437498 1309299 1304752 1297928 1175010
2040 1175010 1160579 1265910 1227514 1212357 1121705 1171035 1163215 1035440 956278 988525 970177
2029 970177 889325 928311 942556 989611 942501 847687 802858 710413 642448 612628 584932 602082
2017 602082 693492 687819 658796 640391 609953 623357 567189 639429 547426 462804 529045 548906
2005 548906 568958 611952 512939 471930 499199 531111 514459 527421 486924 504757 477850 380260
1993 380260 447869 354504 334206 444705 439358 344322 373926 280240 200202 308058 342295
$$ packed form
2072E378065l33021l27523k65068k57888k01847k48828l23235k14064j59945j03592
2062B943054n0744j49664j26414q8600j46594l1096j36193r2186r4560j67411
2052A859592m739m5876q3393j7650k5865j33257m1392o9922j28199m547o824j22918
2040A175010j4431J05331l8396j5157r0652M9330p820j27775p9162L2247j8348
2029I70177q0852L8986J4245M7055m7110r4814m4829r2445o7965k9820k7696J7150
2017F02082R1410n673k9023j8405l0438J3404n6168P2240r2003q4622O6241J9861
2005E48906K0052M2994r9013m1009K7269L1912j6652J2962m0497J7833k6907r7590
1993C80260O7609r3365k0298J10499n347r5036K9604r3686q0038J07856L4237
$$ plain form
1982 342295 308532 291518 291642 287690 347367 325556 294653 353908 318741 293189 302560 305235 243667
1969 243667 269870 366377 362546 261644 156429 180078 262171 186311 179075 259634 228483 298362
1957 298362 262665 223553 274862 212168 326469 390562 397717 365701 212288 193192 182047
1946 182047 142975 78607 78811 179536 162619 132315 191448 137601 82419 213596 124151 91570
1934 91570 50043 26063 125020 112043 109498 121407 103225 106537 182890 35464 52348 113458
1922 113458 165762 166997 191285 74499 74907 97769 65976 40563 139907 167364 88097 172229
1910 172229 135075 108422 152343 84933 174152 180681 194474 127106 58575 85829 25546 -37443
1898 -37443 -11346 117849 115366 121488 70093 125388 71005 10920 -90506 -47852 1587 104897
$$ packed form
1982C42295l3763j7014J24l952N9677k1811l0903N9255l5167k5552R371K675o1568
1969B43667K6203R6507l831j00902j05215K3649Q2093p5860p236Q0559l1151O9879
1957B98362l5697l9112N1309o2694J14301O4093P155l2016j53413j9096j1145
1946A82047l9072o4368K04J00725j6917l0304N9133n3847n5182J31177q9445l2581
1934I1570m1527k3980R8957j2977k545J1909j8182L312P6353j47426J6884O1110
1922A13458N2304J235K4288j16786M08K2862l1793k5413R9344K7457p9267Q4132
1910A72229l7154k6653M3921o7410Q9219O529J3793o7368o8531K7254o0283o2989
1898c7443K6097J29195k483O122n1395N5295n4383o0085j01426M2654M9439J03310
$$ plain form
1886 104897 142446 102031 34199 46781 8175 21464 7088 -27312 12066 33810 72495 62799
1874 62799 93429 96192 85234 41322 96857 157317 63148 9449 6838 152409 238773 175426
1862 175426 10107 -64940 -5733 -4459 118907 90803 96072 130008 132649 86093 -9599 43885
1850 43885 54193 -20415 -141844 -150378 11801 -31793 -61941 21734 188558 218626 179380
1839 179380 163888 235790 224050 233797 290418 249729 249043 129003 183674 142286 93420 243515
1827 243515 249214 284060 351424 320548 284759 283193 270421 216749 160014 58050 24214 87613
1815 87613 164260 251588 226984 178581 172494 122318 80088 9499 -23965 101635 172106 242387
1803 242387 284652 206918 117390 135223 131418 97428 33911 13274 112125 67321 -126897 -55685
$$ packed form
1886A04897L7549m0415o7832J2582l8606J3289j4376l4400L9378K1744L8685r696
1874F2799L0630K763j0958m3912N5535O0460r4169n3699k611J45571Q6364o3347
1862A75426j65319p5047N9207J274J23366k8104N269L3936K641m6556r5692N3484
1850D3885J0308p4608j21429q534J62179m3594l0148Q3675J66824L0068l9246
1839A79380j5492P1902j1740R747N6621m0689o86j20040N4671m1388m8866J50095
1827B43515N699L4846O7364l0876l5789j566j2772n3672n6735j01964l3836O3399
1815H7613P6647Q7328k4604m8403o087n0176m2230p0589l3464J25600P0471P0281
1803B42387M2265p7734q9528J7833l805l3990o3517k0637R8851m4804j94218P1212
$$ plain form
1791 -55685 32350 -86483 -52514 -14829 55917 67562 66368 -23755 -37332 28266 -47837 4239
1779 4239 60208 -6188 -70611 -46309 -16906 51638 8704 -65167 17020 32878 610 8132
1767 8132 38104 260 -24642 15652 29553 39689 63768 73305 196282 193722 57010 65101
1755 65101 59741 -88347 -69238 148746 82517 64334 118027 44079 54238 -42054 -8353 69912
1743 69912 102107 74744 -29100 -43775 43636 76523 19283 -27712 -47743 28783 74970 17076
1731 17076 9464 70108 46647 34715 67457 13257 -40128 -12531 40184 75157 67963 -24649
1719 -24649 -49667 -9916 -32914 -87130 -17324 64459 10629 56135 62633 -4625 27448 61808
1707 61808 50190 -48115 38622 116799 52352 7373 -50332 -116662 -164109 -77724 92047 124216
$$ packed form
1791e5685Q8035j18833L3969L7685P0746J1645j194r0123j3577O5598p6103N2076
1779D239N5969o6396o4423K4302K9403O8544m2934p3871Q2187J5858l2268P522
1767H132K9972l7844k4902M0294J3901J0136K4079R537J22977k560j36712Q091
1755F5101n360j48088J9109K17984o6229j8183N3693p3948J0159r6292L3701P8265
1743F9912L2195k7363j03844j4675Q7411L2887n7240m6995k0031P6526M6187n7894
1731A7076p612O0644k3461j1932L2742n4200n3385K7597N2715L4973p194r2612
1719b4649k5018L9751k2998n4216O9806Q1783n3830M5506O498o7258L2073L4360
1707F1808j1618r8305Q6737P8177o4447m4979n7705o6330m7447Q6385J69771L2169
$$ plain form
1695 124216 90325 61166 71792 -3692 -49611 -13597 46681 55834 45707 37896 -19893 -9372
1683 -9372 -6546 132217 115414 138536 84972 -2992 -63060 -49449 -44474 34960 10085 -81358
1671 -81358 14627 109635 167655 173419 59017 88322 134046 89426 68358 68945 132728 136355
1659 136355 41466 80896 101042 -53860 -70910 -13612 20138 -18729 40913 -5404 -49290
1648 -49290 -25485 -33916 -23960 20490 3952 11491 65580 91525 53209 10264 -91367 18638
1636 18638 39656 -66327 -81424 -91515 1948 78472 48954 35378 31113 36627 -11347 -68301
1624 -68301 -23725 15528 15920 -95975 5693 69152 30416 59165 114424 61965 73342 92486
1612 92486 -943 22120 28742 -87566 -165977 -41401 33196 54482 45958 86000 95863 -6543
$$ packed form
1695A24216l3891k9159J0626p5484m5919L6014O0278R153j0127p811n7789J0521
1683i372K826J38763j6803K3122n3564q7964o0068J3611M975P9434k4875r1443
1671h1358R5985R5008N8020N764j14402K9305M5724m4620k1068N87O3783L627
1659A36355r4889L9430K0146j54902j7050N7298L3750l8867N9642m6317m3886
1648d9290K3805q431R956M4450j6538P539N4089K5945l8316m2945j01631J10005
1636A8638K1018j05983j5097j0091R3463P6524k9518j3576m265N514m7974n6954
1624f8301M4576L9253L92j11895J01668O3459l8736K8749N5259n2459J1377J9144
1612I2486r3429K3063O622j16308p8411J24576P4597K1286q524M0042R863j02406
$$ plain form
1600 -6543 44968 39656 32258 6999 42908 26844 68840 23214 5447 217550 249400 95151
1588 95151 90954 105325 110531 102429 33394 -61315 -93524 10288 64296 -43152 -99500 -60378
1576 -60378 14409 15903 35339 108873 22638 32892 64134 81374 60799 88085 16999 -52947
1564 -52947 2660 52125 -38 -14300 9897 -26153 -115083 -104236 -80016 7929 -47574 10707
1552 10707 -19742 -65320 -49830 -25262 142779 167476 165494 122644 47915 100133 65935 113927
1540 113927 66342 65240 156667 181138 101577 -39345 21686 1977 132626 98080 28323
1529 28323 70774 43441 -16734 -65528 -78265 39741 62405 69456 -14163 -108662 36092 10346
1517 10346 -76452 -118265 -190148 31399 89848 1359 -10975 -24669 61000 84539 42067 -4488
$$ packed form
1600f543N1511n312p398k5259L5909j6064M1996m5626j7767K12103L1850j54249
1588I5151m197J4371N206q102o9035r4709l2209J03812N4008j07448n6348L9122
1576f0378P4787J494J9436P3534q6235J0254L1242J7240k0575K7286p1086o9946
1564e2947N5607M9465n2163j4262K4197l6050q8930J0847K4220Q7945n5503N8281
1552A0707l0449m5578J5490K4568J68041K4697j982m2850p4729N2218l4198M7992
1540A13927m7585j102R1427K4471p9561j40922O1031j9709J30649l4546o9757
1529B8323M2451k7333o0175m8794j2737J18006K2664P051q3619r4499J44754k5746
1517A0346q6798m1813p1883K21547N8449q8489j2334j3694Q5669K3539m2472m6555
$$ plain form
1505 -4488 1265 46981 8113 75172 17328 59099 3454 12857 25328 -46044 54417 62034
1493 62034 34985 77463 134719 -38138 63302 77837 65387 9672 -20848 -10764 -20568 -42569
1481 -42569 -71136 -50239 -102814 -64608 -46526 -75899 -57463 -123411 -110153 -47292 -12265 98794
1469 98794 18215 -33060 15284 -47954 -53407 -132175 -88972 -89932 -7242 -50537 -27862 103474
1457 103474 3947 1842 -37753 -39568 -63089 4730 -31441 -29979 -468 -6236 31784 15130
1445 15130 757 66586 69124 -5090 -6661 47464 94851 -13995 -87473 10970 35978 55712
1433 55712 119564 7503 -38646 -11083 18593 -28640 61165 2905 -10527 -61552 -137350 40010
1421 40010 65589 -735 29666 -1375 -110581 -85413 -54663 -58358 -9447 16834 -40619 -30358
$$ packed form
1505d488N753M5716l8868O7059n7844M1771n5645R403J2471p1372J00461P617
1493F2034k7049M2478N7256j72857J01440J4535j2450n5715l0520J0084r804k2001
1481d2569k8567K0897n2575L8206J8082k9373J8436o5948J3258O2861L5027J11059
1469I8794q0579n1275M8344o3238n453p8768M3203r60Q2690m3295K2675J31336
1457A03474r9527k105l9595j815k3521O7819l6171J462K9511n768L8020j6654
1445A5130j4373O5829K538p4214j571N4125M7387j08846p3478R8443K5008J9734
1433E5712O3852j12061m6149K7563K9676m7233Q9805n8260j3432n1025p5798J77360
1421D0010K5579o6324L0401l1041j09206K5168L0750l695M8911K6281n7453J0261
$$ plain form
1409 -30358 -170729 -107436 -49495 -99992 -147831 -51779 279 -5327 -18613 -55179 -130191 36359
1397 36359 122702 33536 -28549 -23764 6738 -105022 -164435 -62252 -43246 -62370 -76037 -39257
1385 -39257 35608 36864 91790 90330 17629 -46227 -18475 -9251 4790 -27773 -40514 -11110
1373 -11110 -38478 6990 12126 6204 46255 -85555 -24787 -66346 -116899 -93334 -8407 -22963
1361 -22963 -823 -6338 -37017 5048 -11980 71207 54339 -68831 -88484 -17831 -85542 60265
1349 60265 91387 38285 -13098 -38782 -50047 -46233 69428 133838 44251 -30122 55167 61361
1337 61361 66619 16575 -29729 28180 11610 13294 10336 53975 -44146 -14462 3824 -37806
1325 -37806 81125 95332 109548 2682 -95162 -41482 46296 -11529 -28957 21200 64111
$$ packed form
1409c0358j40371O3293N7941n0497m7839R6052N2058n606j3286l6566p5012J66550
1397C6359Q6343q9166o2085M785L0502j11760n9413J02183J9006j9124j3667L6780
1385c9257P4865J256N4926j460p2701o3856K7752R224J4041l2563j2741K9404
1373a1110k7368M5468N136n922M0051j31810O0768m1559n0553K3565Q4927j4556
1361b2963K2140n515l0679M2065j7028Q3187j6868j23170j9653P0653o7711J45807
1349F0265L1122n3102n1383k5684j1265L814J15661O4410q9587p4373Q5289O194
1337F1361N258n0044m6304N7909j6570J684k958M3639r8121K9684J8286m1630
1325c7806J18931J4207J4216j06866r7844N3680Q7778n7825j7428N0157M2911
$$ plain form
1314 64111 18269 -7601 2369 20495 -6621 37636 45860 9400 82819 92033 56322 63140 -5989
1301 -5989 -93890 -30147 135538 -5499 1982 76191 5534 -95699 -40529 -52106 -102993 -15835
1289 -15835 -73887 -114224 -125989 70790 94643 8082 137764 152381 1092 -101856 -94814
1278 -94814 -16398 55264 99554 170667 96532 -6750 23357 44444 -14364 -75352 -119291 9630
1266 9630 59672 57567 -2808 -84692 -76512 -47880 -8898 5155 7619 12363 91861 118835 139354
1253 139354 20153 -3356 44494 -63367 -7943 54037 129258 8681 -87189 -27609 -64142
1242 -64142 -24666 -29299 27670 124936 74953 -46542 7976 -40124 -778 -69794 -182275 -164105
1230 -164105 -158432 -53062 -1853 -6652 -65007 -35423 -48065 -156936 -77931 3260 -8459 -30396
$$ packed form
1314F4111m5842k5870R970J8126k7116M4257Q224l6460P3419R214l5711O818o9129
1301e989q7901O3743J65685j41037P481P4209p0657j01233N5170j1577n0887Q7158
1289a5835n8052m0337j1765J96779K3853q6561J29682J4617j51289j02948P042
1278i4814P8416P1662M4290P1113p4135j03282L0107K1087n8808o0988m3939J28921
1266I630N0042k105o0375q1884Q180K8632L8982J4053K464M744P9498K6974K0519
1253A39354j19201k3509M7850j07861N5424O1980P5221j20577r5870N9580l6533
1242f4142L9476m633N6969R7266m9983j21495N4518m8100L9346o9016j12481J8170
1230a64105N673J05370N1209m799n8355K9584j2642j08871P9005Q1191j1719k1937
$$ plain form
1218 -30396 -56315 91944 91184 42613 -60478 63496 109242 27245 78906 52535 454 56630
1206 56630 137747 48721 107684 110250 92723 -19600 -69017 41187 113098 -7315 -71597
1195 -71597 -55123 -41204 -68304 59219 38887 12543 26376 106626 82360 54777 20809 -91406
1183 -91406 -132216 -64767 66794 35017 -25328 -75720 -61891 -40266 -12910 38365 -17665 16832
1171 16832 -53005 -107545 -4408 -12842 -20797 77542 34240 -6186 -2497 -17839 -43428 -35810
1159 -35810 -57753 -27114 3613 -8355 34006 -63683 -22139 16200 1164 -10515 26244 183249
1147 183249 8661 -81371 -32235 -124799 -66614 -19332 59801 76026 42044 -28461 47687
1136 47687 93911 58972 63866 84173 -15961 -31631 -18531 1991 18808 15923 85405 51600
$$ packed form
1218c0396k5919J48259p60m8571j03091J23974M5746q1997N1661k6371n2081N6176
1206E6630Q1117q9026N8963K566j7527j12323m9417J10204P1911j20413o4282
1195g1597J6474J3919k7100J27523k0332k6344J3833Q0250k4266k7583l3968j12215
1183i1406m0810O7449J31561l1777o0345n0392J3829K1625K7356N1275n6030L4497
1171A6832o9837n4540J03137q434p955R8339m3302m0426L689j5342k5589P618
1159c5810k1943L0639L0727j1968M2361r7689M1544L8339j5036j1679L6759J57005
1147A83249j74588r0032M9136r2564N8185M7282P9133J6225l3982p0505P6148
1136D7687M6224l4939M894K0307j00134j5670J3100K0522J6817k885O9482l3805
$$ plain form
1124 51600 17668 -20057 -20849 -26343 91030 80191 -15118 -7590 31610 127488 103901 101424 -30338
1111 -30338 -92997 -29078 50957 -33082 -11116 -82841 -95725 -77614 -18217 61402 21628 -69472
1099 -69472 25707 2743 -5048 31302 -119214 -75653 -52219 -82292 -78294 -98678 -85232 -83211
1087 -83211 -37524 -46806 2037 10782 43379 -38512 -83982 -148954 -113470 -149538 -80041 58522
1075 58522 18007 73620 -17767 102836 95262 20050 26494 -24692 -101796 -3022 -78256 -9672
1063 -9672 4007 -33217 -37311 -43920 -113084 -241119 -192285 -96167 -12512 77028 44039 -21981
1051 -21981 -91661 -51350 -10592 -103968 -121571 -29347 -38838 -13499 36279 50138 48296 -62342
1039 -62342 -14840 -84076 -37508 26999 11186 -31113 -81673 -75705 1417 37002 114784 146888
$$ packed form
1124E1600l3932l7725p92n494J17373j0839r5309P528L9200R5878k3587k477j31762
1111c0338o2659O3919Q0035q4039K1966p1725j2884J8111N9397P9619l9774r1100
1099f9472R5179k2964p791L6350j50516M3561K3434l0073L998k0384J3446K021
1087h3211M5687r282M8843Q745L2597q1891m5470o4972L5484l6068O9497J38563
1075E8522m0515N5613r1387J20603p574p5212O444n1186p7104R8774p5234O8584
1063i672J3679l7224m094o609o9164j28035M8834R6118Q3655Q9540l2989o6020
1051b1981o9680M0311M0758r3376j7603R2224r491K5339M9778J3859j842j10638
1039f2342M7502o9236M6568O4507j5813m2299n0560N968P7122L5585P7782L2104
$$ plain form
1027 146888 21621 62913 72548 81903 42242 -55465 -120693 -44946 24931 7502 29206 39426
1015 39426 -84717 -101209 16297 26050 3666 -56657 -902 59123 15080 21379 76232 116776
1003 116776 100476 64315 -84254 -108869 -85924 2483 -107588 -99070 -43819 -41322 -34993 -101243
991 -101243 -87202 -78941 -71575 -89589 -70549 -95204 -139562 -22338 66543 -89084 -104034 5045
979 5045 38033 28358 -52712 -138828 -127787 -1077 -23590 -19380 109 -87335 -4397 -111841
967 -111841 -35906 -1482 -66634 92357 118573 -24604 50005 52797 -44472 -21640 -65368 -110422
955 -110422 -82435 -2958 13691 -48505 -40029 -59960 -78816 -103211 -143496 -64860 -68263 -51061
943 -51061 -96729 -137175 -36880 52706 -53679 -127825 -187941 -151802 -112268 -20338 -27499 -6349
$$ packed form
1027A46888j25267M1292R635R355l9661r7707o5228P5747O9877j7429K1704J0220
1015C9426j24143j6492J17506R753k2384o0323N5755O0025m4043O299N4853M0544
1003A16776j6300l6161j48569k4615K2945Q8407j10071Q518N5251K497O329o6250
991a01243J4041Q261P366j8014J9040k4655m4358J17224Q8881j55627j4950J09079
979E045L2988r675q1070q6116J1041J26710k2513M210J9489q7444Q2938j07444
967a11841P5935L4424o5152J58991K6216j43177P4609K792r7269K2832m3728m5054
955a10422K7987P9477J6649o2196Q476j9931j8856k4395m0285P8636l403J7202
943e1061m5668m0446J00295Q9586j06385p4146o0116L6139L9534R1930p161K1150
$$ plain form
931 -6349 84906 103514 79624 -3606 75 8863 -120692 -164267 -63360 -20802 25156 -35039
919 -35039 13295 71502 32510 -39016 -56774 -50081 44147 59512 -26473 -74010 -46689 -28015
907 -28015 -60983 -107172 -136299 -7843 70372 19630 70014 136435 -18551 -11428 55991 87420
895 87420 69031 8426 -2635 -37510 -22559 -45604 -21635 -39677 -59019 -43140 -49711 -71488
883 -71488 -2013 5648 28724 16909 -36490 66498 171868 49635 21999 -5549 69342 68372
871 68372 -57370 -23609 39775 20116 -23900 -63761 26339 49263 44390 -8555 -8203 30427
859 30427 52615 84838 76386 8440 -21421 52666 94609 -80255 -17593 47040 -74857 -110499
847 -110499 -127579 -89008 -82278 2598 -29286 88174 18651 10866 -25288 -50592 17846 -18249
$$ packed form
931f349R1255J8608k3890q3230L681Q788j29555m3575J00907M2558M5958o0195
919c5039M8334N8207l8992p1526j7758O693R4228J5365q5985m7537K7321J8674
907b8015l2968m6189k9127J28456P8215n0742N0384O6421j54986P123O7419L1429
895H7420j8389o0605j1061l4875J4951k3045K3969j8042j9342J5879o571k1777
883g1488O9475P661K3076j1815n3399J02988J05370j22233k7636k7548P4891r70
871F8372j25742L3761O3384j9659m4016l9861R0100K2924m873n2945L52L8630
859C0427K2188L2223q452o7946k9861P4087M1943j74864O2662O4633j21897l5642
847a10499j7080L8571O730Q4876l1884J17460o9523p785l6154k5304O8438l6095
$$ plain form
835 -18249 -53257 -146327 -71762 15645 -47127 -7726 64154 69502 19442 60844 63543 -31596
823 -31596 -139488 -109736 13297 53691 38139 8832 -43936 3573 20162 68863 18676 -69891
811 -69891 10783 -30446 -27096 -37242 20237 -19405 3004 -1596 35094 167998 139044 6300
799 6300 43103 59034 -91560 -78900 -68620 95784 63671 41511 65963 20247 -51914 -57881
787 -57881 13581 79279 180695 64656 -50595 -23183 -99075 -104415 -143086 -147097 -169281 -144898
775 -144898 -63018 -34657 -74794 -54680 4348 88814 150349 19238 -86848 -14660 -23040 64698
763 64698 49019 -30863 20980 9629 6174 -11491 -20512 13048 19659 24159 93708 117100 67981
750 67981 14688 -25114 43709 153722 -58562 9870 114866 26381 -56882 2377 -29323
$$ packed form
835a8249l5008r3070P4565Q7407o2772L9401P1880N348n0060M1402K699r5139
823c1596j07892K9752J23033M0394j5552k9307n2768M7509J6589M8701n0187q8567
811f9891Q0674m1229L350j0146N7479l9642K2409m600L6690J32904k8954j32744
799F300L6803J5931j50594J2660J0280J64404l2113k2160K4452m5716p2161n967
787e7881P1462O5698J01416j16039j15251K7412p5892n340l8671m011k2184K4383
775a44898Q1880K8361m0137K0114N9028Q4466O1535j31111j06086P2188q380Q7738
763F4698j5679p9882N1843j1351l455j7665r021L3560O611M500O9549K3392m9119
750F7981n3293l9802O8823J10013k12284O8432J04996q8485q3263N9259l1700
$$ plain form
739 -29323 10309 3737 -98105 -104922 35757 101912 -17336 -139528 -183557 -44399 -129734
728 -129734 -81285 20906 -68025 -50991 -34752 -1957 8564 -55931 -58092 12756 43543 62959
716 62959 197946 121101 61807 65879 58185 90306 14101 89902 111688 14353 -153244 -29218
704 -29218 90964 14268 -41376 -15863 -30897 -58232 -68022 -4991 -51895 -96540 678 24263
692 24263 -11066 -62670 -45391 -42111 -15622 3380 68982 -12148 -60927 -51110 -156507 -105367
680 -105367 -60948 49161 95900 95761 50550 123788 122521 19125 7788 -107317 53325 60814
668 60814 73121 -9716 -36987 2548 30523 86522 144128 129102 1558 12665 21339 25153
656 25153 65795 106005 -15499 -120632 -15535 7100 21952 17098 23832 -7532 -77745 -95410
$$ packed form
739b9323L9632o572j01842o817J40679O6155j19248j22192m4029J39158q5335
728a29734M8449J02191q8931J7034J6239L2795J0521o4495k161P0848L0787J9416
716F2959J34987p6845n9294M072p694L2121p6205P5801K1786r7335j67597J24026
704b9218J20182p6696n5644K5513j5034k7335r790O3031m6904m4645R7218K3585
692B4263l5329n1604J7279L280K6489J9002O5602q1130m8779R817j05397N1140
680a05367M4419J10109M6739j39m5211P3238j267j03396j1337j15105J60642P489
668F0814J2307q2837k7271L9535K7975N5999N7606j5026j27544J1107Q674L814
656B5153M0642M0210j21504j05133J05097K2635J4852m854O734l1364p0213j7665
$$ plain form
644 -95410 13780 62327 45260 -85335 -116210 -43829 -80907 -33630 -13093 -14395 18975 79045
632 79045 -78732 -129896 -65216 -144031 -50737 -8476 -26397 -6876 -1921 1135 -85363 -57558
620 -57558 -108504 -49037 -65601 -58149 -77965 -24570 60582 27057 38351 65368 -155 -90810
608 -90810 -54034 -6392 31914 39323 57592 8524 -33527 59411 -36869 -33425 -41060 -81943 -8523
595 -8523 51629 97269 -37541 -7513 -16634 -1130 4881 29280 -5987 -136846 -107437 -84022
583 -84022 32760 28414 -69353 26714 -4646 24310 -114620 -122243 -14334 68968 55005 32728
571 32728 36891 21674 24697 -97494 -97475 102643 35135 -55323 -129648 -158766 -83336 -64797 -34442
558 -34442 -13088 -40616 -196588 -89797 -104834 -26120 -66810 -35614 -145236 -83463 -63185
$$ packed form
644i5410J09190M8547j7067j30595l0875P2381l7078M7277K0537j302L3370O0070
632G9045j57777n1164O4680p8815R3294M2261j7921J9521M955L056q6498K7805
620e7558n0946N9467j6564P452j9816N3395Q5152l3525J1294K7017o5523r0655
608i0810L6776M7642L8306P409J8269m9068m2051R2938r6280L444p635m0883P3420
595h523O0152M5640j34810L0028r121J5504O011K4399l5267j30859K9409K3415
583h4022J16782m346r7767R6067l1360K8956j38930p623J07909Q3302j3963k2277
571C2728M163j5217L023j22191J9K00118o7508r0458p4325k9118P5430J8539L0355
558c4442K1354k7528j55972J06791j5037P8714m0690L1196j09622O1773K0278
$$ plain form
547 -63185 -64229 -92189 21022 72487 -4500 48750 100400 86423 -49072 -64748 -37252 -1396
535 -1396 6262 62127 53932 -58667 -93694 42002 49032 119416 -17084 -37948 7692 61730
523 61730 -37946 -135342 -77291 -51231 -51531 -39060 18400 51072 -41404 8963 -54070 -854
511 -854 -22920 -59856 -3746 -62428 64070 44868 50582 158186 68483 -6609 -40545 19854
499 19854 66698 101080 29013 -66314 17527 30468 -9787 -37935 -81326 -14244 42142 -24165
487 -24165 24648 28312 -35058 -101210 -85793 -163965 -92305 -12057 -5220 3147 -5939 -68789 67536
474 67536 66396 32636 -21993 -11730 99528 93774 85171 117510 170360 87242 30068 5180
462 5180 11071 58142 -25065 -47199 -110691 -154487 -133462 -188676 -119472 -73824 -71828 -31731 32876
$$ packed form
547f3185j044k7960J13211N1465p6987N3250N1650j3977j35495j5676K7496L5856
535a396P658N5865q195j12599l5027J35696P030P0384j36500k0864M5640N4038
523F1730r9676r7396N8051K6060l00J2471N7460L2672r2476N0367o3033N3216
511h54k2066l6936N6110n8682J26498j9202N714J07604q9703p5092l3936O0399
499A9854M6844L4382p2067r5327Q3841J2941m0255k8148m3391O7082N6386o6307
487b4165M8813L664o3370o6152J5417p8172P1660Q0248O837Q367r086o2850J36325
474F7536j140l3760n4629J0263J11258n754q603L2339N2850q3118n7174k4888
462E180N891M7071q3207k2134o3492m3796K1025n5214O9204M5648J996M0097O4607
$$ plain form
449 32876 17695 -46896 12053 83670 -22713 8535 -23961 39224 -2511 -77706 -35113 40508
437 40508 71097 59916 106663 63701 32095 93124 91316 -19122 -25523 -51319 -62861 -92171
425 -92171 -38335 -60906 -90230 12884 -86043 -32441 -24073 -59504 5027 41817 45806 62111
413 62111 21864 49254 70053 61609 -26852 -59467 -152585 -185318 -86976 -37916 -29152 56263
401 56263 -5545 -47153 37297 -10481 33967 -11253 5881 31642 53557 25144 -24145 -29528
389 -29528 7461 -44160 9193 1950 -17402 85955 118104 57141 155458 148473 63355 41804
377 41804 64405 43804 -38418 -83734 -12243 14197 -7999 -19958 63549 76578 12357 26844
365 26844 -36440 -130475 -124817 -97457 -44517 -21732 -79782 -117227 -89289 -153258 -19897 -9645
$$ packed form
449C2876j5181o4591N8949P1617j06383L1248l2496O3185m1735p5195M2593P5621
437D0508L0589j1181M6747m2962l1606O1029j808j10438o401k5796j1542k9310
425i2171N3836k2571k9324J03114r8927N3602Q368l5431O4531L6790L989J6305
413F2111m0247K7390K0799q444q8461l2615r3118l2733R8342M9060Q764Q5415
401E6263o1808m1608Q4450m7778M4448m5220J7134K5761K1915k8413m9289n383
389b9528L6989n1621N3353p243j9352J03357L2149o0963R8317o985q5118k1551
377D1804K2601k0601q2222m5316P1491K6440k2196j1959Q3507J3029o4221J4487
365B6844o3284r4035N658K7360N2940K2785n8050l7445K7938o3969J33361J0252
$$ plain form
353 -9645 -37487 2870 93125 125457 82051 163725 -47241 -118141 -91456 -67037 -31239 -10741
341 -10741 -34713 -15196 -99707 -107787 -147449 -199176 -167687 -93791 -70134 12701 -17891 -14537
329 -14537 37444 45698 31174 -33792 -134910 -162468 -128606 -35575 88699 80502 5963 -16082
317 -16082 14841 -9142 27130 48879 113673 146003 26673 19231 146216 48990 9466 -6877
305 -6877 -79044 -64254 -1625 23038 92496 27268 33874 18683 -48903 -84982 -30127 -9013
293 -9013 20240 100254 45474 33516 107452 -2499 -73170 -96118 -29067 31999 21157 7120
281 7120 41597 23128 78340 81571 -31228 -34333 -54673 35419 -64127 -178043 -240797 -153272
269 -153272 -77029 5043 28974 -10331 -27042 32867 -48599 -103349 -102795 -984 -53205 -29070
$$ packed form
353i645k7842M0357R0255L2332m3406Q1674k10966p0900K6685K4419L5798K0498
341a0741k3972J9517q4511q080l9662n1727L1489P3896K3657Q2835l0592L354
329a4537N1981Q254j4524o4966j01118k7558L3862R3031J24274q197p4539k2045
317a6082L0923k3983L6272K1749O4794L2330j19330p442J26985r7226l9524j6343
305f877p2167J4790O2629K4663O9458o5228O606j5191o7586l6079N4855K1114
293i013K9253Q0014n4780j1958P3936j09951p0671k2948O7051O1066j0842j4037
281G120L4477j8469N5212L231j12799l105k0340R0092r9546j13916o2754Q7525
269a53272P6243Q2072K3931l9305j6711N9909q1466n4750N54J01811n2221K4135
$$ plain form
257 -29070 39369 43133 -98772 -53997 -79389 -42743 -2397 12268 -28711 83727 70848 45477
245 45477 60791 -30526 -45073 -52617 -39240 -66988 -15963 -107516 -11659 -34505 -9894 -19716
233 -19716 -54892 -83261 -22781 -20558 25002 11600 -2583 2754 20949 49193 100966 -17703
221 -17703 10557 70367 27511 -89284 -9701 -17405 -130536 -548 96017 52909 -10927 -26274
209 -26274 -13191 -29591 6930 78514 23030 -58458 6777 45885 -38986 67341 21332 -5068
197 -5068 15901 37842 -5828 -33150 -38302 12491 1391 -39097 -38572 -76117 -76025 -24452 -15088 -41636
183 -41636 -3711 -39384 -3135 33596 43392 -32164 -3289 -45037 -76458 -39808 -30578 20629
171 20629 3986 -65270 -2130 -11674 92579 113130 -300 -39937 -64678 -45571 -75737 -54673
$$ packed form
257b9070O8439L764j41905M4775k5392L6646M0346J4665m0979J12438j2879k5371
245D5477J5314r1317j4547p544J3377k7748N1025r1553R5857k2846K4611r822
233a9716l5176k8369O0480K223M5560j3402j4183N337J8195K8244N1773j18669
221a7703K8260N9810m2856j16795P9583p704j13131J29988R6565m3108o3836j5347
209b6274J3083j6400L6521P1584n5484q1488O5235L9108q4871J06327m6009k6400
197e068K0969K1941m3670k7322n152N0793j1100m0488N25l7545R2N1573R364k6548
183d1636L7925l5673L6249L6731R796p5556K8875m1748l1421L6650R230N1207
171B0629j6643o9256O3140r544J04253K0551j13430l9637k4741J9107l0166K1064
$$ plain form
159 -54673 -99681 -58475 -57638 -8149 -43088 -41056 16656 23318 -15923 10209 77169 43105 -37371
146 -37371 37403 64857 78041 58515 16730 16667 -35507 12194 50702 58075 69746 -15060 -25091
133 -25091 -5667 -27880 -78982 -139178 -93589 -77710 -32657 -65052 -21943 30405 51405 5673
121 5673 29480 -2419 -118186 -124645 -105826 -23775 -82214 -128216 -23171 -64766 -84339 20206
109 20206 -5382 -18381 4957 -36830 -34910 8885 109655 35233 -48876 27201 58296 58651
97 58651 93940 50740 20914 -10786 41708 8681 -21376 24465 -61135 -8756 18545 23705
85 23705 21359 -41963 -31550 10453 -14686 49341 51020 -80530 -89252 -2251 5418 -17783 -70357
72 -70357 35072 53677 -9835 19926 -33113 27039 12189 -58835 -45188 5934 -15851 -9935
$$ packed form
159e4673m5008M1206Q37M9489l4939K032N7712O662l9241K6132O6960l4064q0476
146c7371P4774K7454J3184j9526m1785o3n2174M7701L8508P373J1671q4806j0031
133b5091J9424k2213n1102o0196M5589J5879M5053l2395M3109N2348K1000m5732
121E673K3807l1899j15767o459J8819Q2051n8439m6002J05045m1595j9573J04545
109B0206k5588j2999K3338m1787J920M3795J00770p4422q4109P6077L1095L55
97E8651L5289m3200k9826l1700N2494l3027l0057M5841q5600N2379K7301N160
85B3705k346o3322J0413M2003k5139O4027J679j31550q722Q7001P669k3201n2574
72g0357J05429J8605o3512K9761n3039O0152j4850p1024J3647N1122k1785N916
$$ plain form
60 -9935 -20128 -40623 -77183 -26587 55013 72097 85259 44877 64510 -17315 -68896 -66384 -67540
47 -67540 -33904 -7826 -50790 -33651 -36943 -62136 -69125 -31045 -39497 -50784 -19961 -23164 -19438
34 -19438 -8131 -52349 -70933 -52192 -1349 30899 5328 -21795 -8110 1977 19963 51327
22 51327 29543 10096 -31177 38663 -14503 -68120 -71796 -12117 56326 47381 59841 -37779 -13830
9 -13830 64184 103871 41014 -32556 -64465 -66068 -65298 -30751 -34684
0 -34684
$$ packed form
60i935j0193k0495l6560N0596Q1600J7084J3162m0382J9633q1825n1581K512j156
47f7540L3636K6078m2964J7139l292k5193o989L8080q452j1287L0823l203L726
34a9438J1307m4218j8584J8741N0843L2248k5571k7123J3685J0087J7986L1364
22E1327k1784j9447m1273O9840n3166n3617l676N9679O8443q945J2460r7620K3949
9a3830P8014L9687o2857p3570l1909j603P70L4547l933
0c4684
$$ Imaginary data points
##PAGE= N=2
##DATA TABLE= (X++(I..I)), XYDATA
$$ plain form
16383 -1455776 -1443820 -1386001 -1283301 -1300985 -1322938 -1369207 -1362374 -1278567 -1231626 -1248588 -1176990
16372 -1176990 -1159471 -1188204 -1211977 -1162333 -1094550 -1079262 -1085329 -1102782 -1052879 -992348 -983518 -1013000
16360 -1013000 -1001812 -1045226 -987711 -946362 -881185 -881831 -833404 -894640 -958651 -969601 -940378 -894285
16348 -894285 -857817 -796349 -816810 -830292 -742060 -755909 -783637 -784113 -741247 -633272 -637530 -613737
16336 -613737 -644780 -555354 -534322 -543654 -525362 -499039 -480027 -417421 -491915 -523002 -467735 -487003
16324 -487003 -467426 -373796 -445881 -423537 -421853 -366551 -242924 -291743 -314161 -315882 -296239 -323578
16312 -323578 -177571 -226594 -196521 -245006 -192256 -181283 -220308 -182792 -220693 -194138 -135791
16301 -135791 -121086 -68823 -119283 -102170 -54052 25502 -44936 -59265 -57202 -24468 -65551 -20963
$$ packed form
16383a455776J1956N7819J02700j7684k1953m6269O833Q3807M6941j6962P1598
16372a176990J7519k8733k3773M9644O7783J5288o067j7453M9903O0531Q830k9482
16360a013000J1188m3414N7515M1349O5177o46M8427o1236o4011j0950K9223M6093
16348h94285L6468O1468k0461j3482Q8232j3849k7728m76M2866J07975m258K3793
16336f13737l1043Q9426K1032r332J8292K6323J9012O2606p4494l1087N5267j9268
16324d87003J9577R3630p2085K2344J684N5302J23627m8819k2418j721J9643k7339
16312c23578J46007m9023L0073m8485N2750J0973l9025L7516l7901K6555N8347
16301a35791J4705N2263n0460J7113M8118P9554p0438j4329K063L2734m1083M4588
$$ plain form
16289 -20963 72708 24232 88598 200415 132919 92976 95233 66436 70230 95648 96103 81171
16277 81171 143858 129442 234367 284265 309038 301496 213727 304537 282428 265682 280508 270452
16265 270452 311210 197921 331169 353875 415410 371178 456172 437661 454654 395065 442171
16254 442171 434563 427686 504321 480008 452858 524791 526594 527239 433476 366281 467359 546176
16242 546176 517841 507713 570697 573029 603368 601587 614144 583432 657513 687796 665768 678627
16230 678627 641243 651681 655026 713041 762541 809408 806278 826635 791552 708305 762179 822947
16218 822947 755152 772691 801519 755156 798894 801257 803322 804351 788433 836511 845816 838916
16206 838916 815744 800253 823645 872476 935931 949877 1029470 936604 1025793 980847 967429
$$ packed form
16289b0963R3671m8476O4366J11817o7496l9943K257k8797L794K5418M55j4932
16277H1171O2687j4416J04925M9898K4773p542q7769R0810k2109j6746J4826j0056
16265B70452M0758j13289J33248K2706O1535m4232Q4994j8511J6993n9589M7106
16254D42171p608o877P6635k4313k7150P1933J803O45r3763o7195J01078P8817
16242E46176k8335j0128O2984K332L0339j781J2557l0712P4081L0283k2028J2859
16230F78627l7384J0438L345N8015M9500M6867l130K0357l5083q3247N3874O0768
16218H22947o7795J7539K8828m6363M3738K363K065J029j5918M8078R305o900
16206H38916k3172j5491K3392M8831O3455J3946P9593r2866Q9189m4946j3418
$$ plain form
16195 967429 990582 970269 1003593 1028447 998965 977569 1033553 1004227 936434 926739 961834 948573
16183 948573 968805 1011140 1026693 938120 1022236 972987 990208 956813 974529 1004673 1056466
16172 1056466 988285 951061 997550 981602 907687 994477 1036313 1056263 1074629 984195 1065647
16161 1065647 1094575 1176689 1091288 1048552 1063252 1164588 1082368 1093756 1140308 1056638 1047526
16150 1047526 1201106 1143050 1178336 1137041 1128719 1089210 984222 1103813 1108054 1159515 1189311
16139 1189311 1258803 1278389 1208067 1216108 1202868 1192115 1127943 1135424 1163352 1268068 1298386
16128 1298386 1298907 1231597 1242922 1177150 1136963 1143091 1126448 1139923 1184657 1142772 1184154 1193844
16116 1193844 1258328 1317064 1384115 1349406 1312562 1251214 1200948 1197291 1239586 1282067 1219071
$$ packed form
16195I67429K3153k0313L3324K4854k9482k1396N5984k9326o7793r695L5095j3261
16183I48573K0232M2335J5553q8573Q4116m9249J7221l3395J7716L0144N1793
16172A056466o8181l7224M6489j5948p3915Q6790M1836J9950J8366r0434Q1452
16161A065647K8928Q2114q5401m2736J4700J01336q2220J1388M6552q3670r112
16150A047526J53580n8056L5286m1295q322l9509j04988J19591M241N1461K9796
16139A189311O9492J9586p0322Q041j3240j0753o4172P481K7928J04716L0318
16128A298386N21o7310J1325o5772m0187O128j6643J3475M4734m1885M1382R690
16116A193844O4484N8736O7051l4709l6844o1348n0266l657M2295M2481o2996
$$ plain form
16105 1219071 1207635 1253493 1185913 1210135 1254881 1301531 1356595 1317197 1384385 1341638 1233862
16094 1233862 1119788 1302267 1351507 1322701 1328017 1275564 1256647 1303514 1344147 1308562 1302060
16083 1302060 1338405 1355894 1404337 1261263 1181506 1166483 1179873 1259527 1316993 1276914 1306575
16072 1306575 1239720 1214327 1271050 1285466 1300917 1244767 1265990 1262675 1292201 1323447 1209046
16061 1209046 1260619 1241718 1259704 1327116 1288011 1241752 1299682 1354640 1291092 1238043 1281184
16050 1281184 1413994 1463992 1395085 1338685 1288564 1264594 1292694 1172621 1261912 1305960 1316934
16039 1316934 1404332 1442445 1470339 1307669 1319999 1240126 1200893 1107941 1195728 1167087 1195216
16028 1195216 1298699 1343022 1320544 1302642 1319519 1337512 1288002 1324743 1285541 1239190 1285191
$$ packed form
16105A219071j1436M5858o7580K4222M4746M6650N5064l9398O7188m2747j07776
16094A233862j14074J82479M9240k8806N316n2453j8917M6867M0633l5585o502
16083A302060L6345J7489M8443j43074p9757j5023J3390P9654N7466m0079K9661
16072A306575o6855k5393N6723J4416J5451n6150K1223l315K9526L1246j14401
16061A209046N1573j8901J7986O7412l9105m6259N7930N4958o3548n3049M3141
16050A281184J32810M9998o8907n6400n0121k3970K8100j20073Q9291M4048J0974
16039A316934Q7398L8113K7894j62670J2330p9873l9233r2952Q7787k8641K8129
16028A195216J03483M4323k2478j7902J6877J7993m9510L6741l9202m6351M6001
$$ plain form
16017 1285191 1399189 1403109 1379030 1423773 1465448 1365118 1303056 1270984 1383417 1348816 1292636
16006 1292636 1250079 1212566 1203683 1233568 1295266 1313686 1333469 1269886 1324193 1380760 1405427
15995 1405427 1318535 1353594 1357191 1339256 1290004 1361409 1366841 1305293 1304940 1335979 1348887 1442791
15983 1442791 1441372 1483327 1332575 1276231 1245190 1248122 1200820 1219750 1306786 1336210 1323583
15972 1323583 1305425 1285804 1220311 1178399 1218939 1189630 1258376 1323070 1314434 1265743 1246369
15961 1246369 1342890 1382486 1297222 1307817 1240369 1295109 1376564 1347209 1305928 1316821 1256265
$$ packed form
16017A285191J13998L920k4079M4743M1675j00330o2062l2072J12433l4601n6180
16006A292636m2557l7513q883K9885O1698J8420J9783o3583N4307N6567K4667
15995A405427q6892L5059L597j7935m9252P1405N432o1548l53L1039J2908R3904
15983A442791j419M1955j50752n6344l1041K932m7302J8930Q7036K9424j2627
15972A323583j8158j9621o5493m1912M0540k9309O8746O4694q636m8691j9374
15961A246369R6521L9596q5264J0595o7448N4740Q1455k9355m1281J0893o0556
$$ [...]
##END NTUPLES=NMR SPECTRUM
##END=
