##TITLE=1H_EC-3289(II)
 CDCl3
 8 sc, 
 27.1.2023
##JCAMPDX= 6.0         $$ Bruker NMR JCAMP-DX V2.0
##DATA TYPE= NMR SPECTRUM
##DATA CLASS= NTUPLES
##ORIGIN= UXNMR, Bruker Analytische Messtechnik GmbH
##OWNER= root
$$ XWIN-NMR		Version 3.5
$$ Fri Jan 27 14:04:00 2023 Russian Standard Time (UT+4h)  she@DPX200
##.OBSERVE FREQUENCY= 200.13135
##.OBSERVE NUCLEUS= ^1H
##.ACQUISITION MODE= SIMULTANEOUS
##.ACQUISITION SCHEME= undefined
##.AVERAGES= 8
##.DIGITISER RES= 18
##SPECTROMETER/DATA SYSTEM= spect
##.PULSE SEQUENCE= zg30
##.SOLVENT NAME= CDCl3
##.SHIFT REFERENCE= (INTERNAL, CDCl3, 0, 15.7337)
##AUDIT TRAIL= $$ (NUMBER, WHEN, WHO, WHERE, WHAT)
$$ ##TITLE= Audit trail, XWIN-NMR		Version 3.5
$$ ##JCAMPDX= 5.01
$$ ##ORIGIN= Bruker BioSpin GmbH
$$ ##OWNER= she
$$ F:/spectra/data/she/nmr/H-F/1/pdata/1/auditp.txt
$$ ##AUDIT TRAIL=  $$ (NUMBER, WHEN, WHO, WHERE, WHAT)
(   1,<2023-01-27 14:03:02.62 +0400>,<she>,<DPX200>,
      <created by zg, POWCHK disabled, PULCHK disabled
       configuration hash MD5:
       00 E9 B6 7A A2 85 ED C7 34 08 36 98 17 FE 4E 26
       data hash MD5: 16K
       1C 02 C5 08 4C 26 07 12 B1 89 F2 74 2E CB F1 E0>)
(   2,<2023-01-27 14:03:05.00 +0400>,<she>,<DPX200>,
      <Start of raw data processing
       efp BC_mod = 2 LB = 0.24 FT_mod = 6 PKNL = 1 PHC0 = -19106.28 PHC1 = 4.200789 SI = 16K 
       data hash MD5: 16K
       E4 B5 79 4E B3 E9 25 1A 25 88 8D BB 57 D7 33 C9>)
(   3,<2023-01-27 14:03:21.93 +0400>,<she>,<DPX200>,
      <pk PHC0 = 2.205979 PHC1 = 0 
       data hash MD5: 16K
       48 03 19 6D 3D 08 FF 32 59 30 36 4D 27 81 21 79>)
(   4,<2023-01-27 14:03:25.07 +0400>,<she>,<DPX200>,
      <abs ABSG = 5 
       data hash MD5: 16K
       7A EF 0F A6 E9 40 11 CE 95 C0 7A 78 DF E0 E1 F9>)
$$ ##END=
$$ 
$$ hash MD5
$$ CF 45 0C E7 3B 6C 7A F4 F9 FA FA 5E 77 8D DF 30
##$RELAX= 
##$RELAX= 
##$RELAX= 
##$RELAX= 
##$RELAX= 
##$RELAX= 
$$ Bruker specific parameters
$$ --------------------------
##$DU= <F:/spectra>
##$EXPNO= 1
##$NAME= <H-F>
##$PROCNO= 1
##$TYPE= <nmr>
##$USER= <she>
##$AMP= (0..31)
100 100 100 100 100 100 100 100 100 100 100 100 100 100 100 100 100 100 
100 100 100 100 100 100 100 100 100 100 100 100 100 100 
##$AQSEQ= 0
##$AQ_mod= 1
##$AUNM= <au_zg>
##$AUTOPOS= <>
##$BF1= 200.13
##$BF2= 200.13
##$BF3= 200.13
##$BF4= 200.13
##$BF5= 200.13
##$BF6= 200.13
##$BF7= 200.13
##$BF8= 200.13
##$BYTORDA= 1
##$CFDGTYP= 0
##$CFRGTYP= 5
##$CHEMSTR= <none>
##$CNST= (0..31)
1 1 145 1 1 1 1 1 1 1 1 1 1 1 1 1 1 1 1 1 1 1 1 1 1 1 1 1 1 1 1 1 
##$CPDPRG= <>
##$CPDPRG1= <>
##$CPDPRG2= <>
##$CPDPRG3= <>
##$CPDPRG4= <mlev>
##$CPDPRG5= <mlev>
##$CPDPRG6= <mlev>
##$CPDPRG7= <mlev>
##$CPDPRG8= <mlev>
##$CPDPRGB= <>
##$CPDPRGT= <>
##$D= (0..31)
0 1.2 0 0 0 0 0 0 0 0.06 0 0.03 0 0 0 0 0.0002 0 0 0 0 0 0 0 0 0 0 0 0 
0 0 0 
##$DATE= 1674813781
##$DBL= (0..7)
120 120 120 120 120 120 120 120 
##$DBP= (0..7)
150 150 150 150 150 150 150 150 
##$DBP07= 0
##$DBPNAM0= <>
##$DBPNAM1= <>
##$DBPNAM2= <>
##$DBPNAM3= <>
##$DBPNAM4= <>
$$ [...]
##$SUBNAM3= <"">
##$SUBNAM4= <"">
##$SUBNAM5= <"">
##$SUBNAM6= <"">
##$SUBNAM7= <"">
##$SUBNAM8= <"">
##$SUBNAM9= <"">
##$SW= 18.05172834244
##$SWIBOX= (0..15)
0 0 2 0 0 0 0 0 0 0 0 0 0 0 0 0 
##$SW_h= 3612.71676300578
##$TD= 16384
##$TD0= 1
##$TE= 0
##$TE2= 300
##$TE3= 300
##$TEG= 300
##$TL= (0..7)
0 120 120 120 120 120 120 120 
##$TP= (0..7)
150 150 150 150 150 150 150 150 
##$TP07= 0
##$TPNAME0= <>
##$TPNAME1= <>
##$TPNAME2= <>
##$TPNAME3= <>
##$TPNAME4= <>
##$TPNAME5= <>
##$TPNAME6= <>
##$TPNAME7= <>
##$TPOAL= (0..7)
0.5 0.5 0.5 0.5 0.5 0.5 0.5 0.5 
##$TPOFFS= (0..7)
0 0 0 0 0 0 0 0 
##$TUNHIN= 0
##$TUNHOUT= 0
##$TUNXOUT= 0
##$USERA1= <user>
##$USERA2= <user>
##$USERA3= <user>
##$USERA4= <user>
##$USERA5= <user>
##$V9= 5
##$VALIST= <valist>
##$VCLIST= <CCCCCCCCCCCCCCC>
##$VD= 0
##$VDLIST= <DDDDDDDDDDDDDDD>
##$VPLIST= <PPPPPPPPPPPPPPP>
##$VTLIST= <TTTTTTTTTTTTTTT>
##$WBST= 1024
##$WBSW= 4
##$XGAIN= (0..3)
0 0 0 0 
##$XL= 0
##$YL= 0
##$YMAX_a= 370956
##$YMIN_a= -602200
##$ZGOPTNS= <>
##$ZL1= 120
##$ZL2= 120
##$ZL3= 120
##$ZL4= 120
##$ABSF1= 15.73366
##$ABSF2= -2.31819
##$ABSG= 5
##$ABSL= 3
##$ALPHA= 0
##$AQORDER= 0
##$ASSFAC= 0
##$ASSFACI= 0
##$ASSFACX= 0
##$ASSWID= 0
##$AUNMP= <proc_1d>
##$AZFE= 0.1
##$AZFW= 0.1
##$BCFW= 0
##$BC_mod= 2
##$BYTORDP= 0
##$COROFFS= 0
##$CY= -3
##$DATMOD= 1
##$DC= 0
##$DFILT= <>
##$DTYPP= 0
##$F1P= 0
##$F2P= 0
##$FCOR= 1
##$FTSIZE= 16384
##$FT_mod= 6
##$GAMMA= 0
##$GB= 0
##$INTBC= 1
##$INTSCL= 3.70164e-10
##$ISEN= 128
##$LB= 0.24
##$LEV0= 0
##$LPBIN= 0
##$MAXI= 10000
##$MC2= 0
##$MEAN= 0
##$ME_mod= 0
##$MI= 1.114404
##$NCOEF= 0
##$NC_proc= -5
##$NLEV= 6
##$NOISF1= 3.799351
##$NOISF2= 2.8
##$NSP= 0
##$NTH_PI= 0
##$NZP= 0
##$OFFSET= 15.73366
##$PC= 1
##$PHC0= -19104.07
##$PHC1= 4.200789
##$PH_mod= 1
##$PKNL= yes
##$PPARMOD= 0
##$PSCAL= 0
##$PSIGN= 0
##$REVERSE= no
##$SF= 200.130007579999
##$SI= 16384
##$SIGF1= 3
##$SIGF2= 2
##$SINO= 5.538805
##$SIOLD= 16384
##$SREGLST= <1H.CDCl3>
##$SSB= 0
##$STSI= 16384
##$STSR= 0
##$SW_p= 3612.71676300578
##$SYMM= 0
##$S_DEV= 0
##$TDeff= 16384
##$TDoff= 0
##$TI= <>
##$TILT= no
##$TM1= 0
##$TM2= 0
##$TOPLEV= 0
##$USERP1= <user>
##$USERP2= <user>
##$USERP3= <user>
##$USERP4= <user>
##$USERP5= <user>
##$WDW= 1
##$XDIM= 16384
##$YMAX_p= 289433578
##$YMIN_p= -188955
$$ End of Bruker specific parameters
$$ ---------------------------------
##NTUPLES= NMR SPECTRUM
##VAR_NAME=  FREQUENCY,     SPECTRUM/REAL,   SPECTRUM/IMAG
##SYMBOL=    X,             R,               I
##VAR_TYPE=  INDEPENDENT,   DEPENDENT,       DEPENDENT
##VAR_FORM=  AFFN,          ASDF,            ASDF
##VAR_DIM=   16384,         16384,           16384
##UNITS=     HZ,            ARBITRARY UNITS, ARBITRARY UNITS
##FACTOR=    0.220516191357247, 1,           1
##FIRST=     3148.77744388042, 0,            0
##LAST=      -463.939319125362, 0,           0
##MIN=       -463.939319125362, -188955,     0
##MAX=       3148.77744388042, 289433578,    0
$$ Real data points
##PAGE= N=1
##DATA TABLE= (X++(R..R)), XYDATA
$$ [...]
5813D39632K5776Q753J5658M3984p840k1597M6566j9901m1443N0183j5688j8738
5801E05345K1633K7837j686l1j4828K1138o164M3584l0523K5487K18k6656K620
5788E67974o825K2666J5908m3391J2959k4825k8652M2061J8163J8861J5969P251
5776F18119q1O002O585l5554K3970q272l2732J1950L9833l7224j4189p722R917
5763E80602J4202j0683L6574l962j2253r668L36J5403p245P317j7883K5230N5754
5750F73724k348J4866j4034M9602K3607J3644L424K9796J3624J2857J2755K0803
5738H52320J4696l8240m0272N418O8268M4671K24J3818Q257j0980L4151L6975
5726I89306N663J1605O4798l8889n0013K8504J968l7875R17j0200J2504n961J2953
$$ y = [439632, 465408, 474161, 489819, 533803, 525963, 504366, 550932, 531031, 489588, 539771, 524083, 505345, 526978, 554815, 553129, 553098, 538270, 559408, 553244, 596828, 566305, 591792, 592010, 565354, 567974, 561149, 583815, 599723, 556332, 569291, 544466, 515814, 557875, 576038, 594899, 610868, 618119, 618038, 624040, 630625, 595071, 619041, 610769, 578037, 589987, 629820, 592596, 578407, 570685, 580602, 594804, 584121, 620695, 616733, 604480, 594812, 595148, 610551, 603306, 610623, 592740, 617970, 673724, 671376, 686242, 672208, 721810, 745417, 759061, 762485, 792281, 805905, 818762, 831517, 852320, 867016, 828776, 788504, 793922, 862190, 906861, 907085, 920903, 929160, 918180, 952331, 989306, 994969, 1006574, 1071372, 1032483, 982470, 1010974, 1012942, 975067, 975984, 965784, 978288, 972327, 985280]
5713I85280J2229K0424j6823m034J9081K2852R003p077J6295j9546L7051K3802
5701A098537J3474L197K9159K8712L2031L9393K0770N1013J12250Q1745M7061
5690A557342O8614O8564K6190M113K1540J6363m3402k1549O330N8807N1578N7547
5678A872037P2141L4762O2981R1265N983J9198L3531m0998r9019m8450k7946q0429
5666A895056l2058o1712o9790j7834P9771J4361m116j7814M2167N698m4177o830
5654A782722j6381q6238j5505l298l9524J0772O8312K5524k6384O3457N2104N1281
5642A866842n423J8708Q2122Q8447R1080Q3724J55786J33628R5208O5550J711
5631B677383l2831p2166M3088k6176k7505P0095J00670R5406K3011R9188J17462
$$ y = [985280, 997509, 1017933, 1001110, 997076, 1016157, 1039009, 1048012, 1040935, 1057230, 1037684, 1074735, 1098537, 1112011, 1115208, 1144367, 1173079, 1205110, 1244503, 1265273, 1316286, 1428536, 1510281, 1557342, 1625956, 1694520, 1720710, 1724823, 1746363, 1762726, 1719324, 1697775, 1704105, 1762912, 1814490, 1872037, 1944178, 1978940, 2041921, 2133186, 2139169, 2158367, 2191898, 2150900, 2051881, 2003431, 1975485, 1895056, 1862998, 1801286, 1731496, 1713662, 1793433, 1807794, 1803678, 1785864, 1828031, 1833729, 1789552, 1782722, 1766341, 1680103, 1664598, 1661300, 1621776, 1632548, 1700860, 1726384, 1700000, 1763457, 1815561, 1866842, 1861419, 1880127, 1962249, 2050696, 2141776, 2225500, 2381286, 2514914, 2610122, 2675672, 2677383, 2644552, 2572386, 2615474, 2589298, 2561793, 2631888, 2732558, 2827964, 2850975, 2950163, 3067625]
5620C067625N9690L4064n7824j02825n7183q0440j63505j09304o3705n4322r734
5609B462537k0759N1090N2260P40R1219L2753L8945j4217o352n3571q3635k7950
5597B523060k2779J1902J745O0281L7904L4763J13180P7935N4146Q4715K13733
5586C190585J91238K28757K30194K26521J12742N819j54724k19496l00194k25780
5576C285662j05839r6648j20597j6103m2041j8084M4831j1094R904M6476J24730
5565C101197J05487J44672K39150J94715J07502J97245J90620J76670Q726r5914
5555D370070j32078j69549j43703p6701k0794K3818o9833m134O9258Q9298L6380
5544C972032L2926N3978O6616N2168O6687J1523n804J941n2377j43117p6066j22009
$$ y = [3067625, 3127315, 3161379, 3103555, 3000730, 2943547, 2863107, 2699602, 2590298, 2526593, 2472271, 2462537, 2441778, 2492868, 2545128, 2545868, 2637087, 2669840, 2708785, 2694568, 2688216, 2634645, 2551010, 2523060, 2500281, 2512183, 2513928, 2574209, 2612113, 2646876, 2760056, 2837991, 2892137, 2976852, 3190585, 3381823, 3610580, 3840774, 4067295, 4180037, 4185856, 4031132, 3811636, 3511442, 3285662, 3179823, 3083175, 2962578, 2946475, 2904434, 2886350, 2931181, 2920087, 2929991, 2976467, 3101197, 3206684, 3351356, 3590506, 3785221, 3892723, 4089968, 4280588, 4457258, 4465984, 4370070, 4237992, 4068443, 3924740, 3848039, 3827245, 3851063, 3781230, 3777096, 3846354, 3935652, 3972032, 4004958, 4058936, 4125552, 4177720, 4244407, 4255930, 4250126, 4252067, 4199690, 4056573, 3980507, 3858498]
5532C858498p7909j03082j21472j12690p1567m1236q1732l3238n757K8217j1146
5521C226886k039J3249p055O6954L7530P546Q2313J8160N3996R8792P5500J02403
5509C774235P0532O6227J0489O9689P1041N1719L0895K7124J0568k2805K3674
5498D183388J6375l4419o5633j12976j10970l4747J4998J2057n4262j1251K7651
5487C830211K0116J03686M8909n4355O4273K6720K7225M9833J8960Q0814P7469
5476D293861J03826J30008J48581J91282O0052j1314q1066p5472j51383k05959
5466D402416j22409o8474p6777j10491r9168r0654m6515j9953n1467J3989K4477
5455C754974o9889m550K5557K3777P2103R3670P6551J32391J32717J18365J19567
$$ y = [3858498, 3780589, 3677507, 3556035, 3443345, 3371778, 3330542, 3248810, 3215572, 3209815, 3238032, 3226886, 3224847, 3238096, 3231041, 3297995, 3335525, 3343071, 3425384, 3443544, 3497540, 3596332, 3671832, 3774235, 3844767, 3910994, 3921483, 3991172, 4062213, 4113932, 4144827, 4171951, 4182519, 4159714, 4183388, 4199763, 4165344, 4099711, 3986735, 3875765, 3841018, 3856016, 3868073, 3813811, 3802560, 3830211, 3850327, 3954013, 4002922, 3948567, 4012840, 4039560, 4066785, 4116618, 4135578, 4216392, 4293861, 4397687, 4527695, 4676276, 4867558, 4927610, 4916296, 4835230, 4759758, 4608375, 4402416, 4280007, 4211533, 4134756, 4024265, 3925097, 3834443, 3787928, 3767975, 3716508, 3730497, 3754974, 3685085, 3680535, 3706092, 3729869, 3801972, 3895642, 3972193, 4104584, 4237301, 4355666, 4475233]
5444D475233R3805m7027n7894p5983j10452n9305l8109n4337p9080l7417M7463
5433D056897P4944K8917N2435N8248J07896N8217R2827J64148J62961J18461J54147
5422E130098R9416J7811k2369J0908K6706j5228j4442p7684j61003j26477j28619
5411D739117j60360j72151p9450n1048n0953l4896J8242M4204q75N3558O7798
5400D373186J17415Q3586J59438K40393J86886L02332K70762K92024J89370J10535
5390F325927k643n0014J8407j5307m5537l4358n1198j53769k29530k28934k84955
5379E248089j66432j27480j12818m8631l6965k957r358k2451N9187M4338P1639
5368D896161J21455J31680R5219J04014J74266J83085J07435O8202R1693Q8011
$$ y = [4475233, 4569038, 4522011, 4464117, 4388134, 4277682, 4218377, 4180268, 4125931, 4046851, 4009434, 4056897, 4131841, 4160758, 4213193, 4271441, 4379337, 4437554, 4530381, 4694529, 4857490, 4975951, 5130098, 5229514, 5247325, 5224956, 5235864, 5262570, 5247342, 5232900, 5155216, 4994213, 4867736, 4739117, 4578757, 4406606, 4327156, 4276108, 4225155, 4190259, 4208501, 4252705, 4251830, 4305388, 4373186, 4490601, 4574187, 4733625, 4974018, 5160904, 5463236, 5733998, 6026022, 6215392, 6325927, 6323284, 6273270, 6291677, 6276370, 6230833, 6196475, 6145277, 5991508, 5761978, 5533044, 5248089, 5081657, 4954177, 4841359, 4792728, 4755763, 4752806, 4743448, 4720997, 4780184, 4824522, 4896161, 5017616, 5149296, 5244515, 5348529, 5522795, 5705880, 5813315, 5881517, 5973210, 6061221]
5358F061221J01026J38989J11627J59310J38989j6164J9135o2806m4310N4107
5348F661124P4909R6043J32861J74195K47342K17718L26347L11559L52717L96800
5338H991615M70478N97634O93098Q14026J086930J206948J162251R74045O78767
5329A6675792J52676k71851n45231l87519l13301j85662n2076j06323j18363k77435
5319A4570707k96486l77179m03178l24155j99477l4089J43150K42465L85056O87628
5309A4394442P23961R63935J244529J494667J795066J920770J898011J755124
5301B6190505J359090Q29789M01981K11195J37010J69034M12494P73732Q98025
5292C1382855O54922L4357q78465j859575k597857k614097k288224j899164j499391
$$ y = [6061221, 6162247, 6301236, 6412863, 6572173, 6711162, 6694998, 6714133, 6651327, 6607017, 6661124, 6736033, 6832076, 6964937, 7139132, 7386474, 7604192, 7930539, 8242098, 8594815, 8991615, 9462093, 10059727, 10752825, 11566851, 12653781, 13860729, 15022980, 15997025, 16675792, 16828468, 16556617, 16011386, 15623867, 15310566, 15124904, 15072828, 14966505, 14848142, 14570707, 14274221, 13897042, 13493864, 13169709, 12970232, 12936143, 13079293, 13321758, 13706814, 14394442, 15118403, 16082338, 17326867, 18821534, 20616600, 22537370, 24435381, 26190505, 27549595, 28379384, 28781365, 28992560, 29129570, 29298604, 29711098, 30484830, 31382855, 32037777, 32072134, 31193669, 29334094, 26736237, 24122140, 21833916, 19934752, 18435361]
5283A8435361j089658p70774m81554k77559q1135R6060K77014N13930P53320Q48318
5273A8223323J011083R93359R92032P31596M84737M18306O89864R53214R39605
5264B5437119P90364K40028n06696j407004j930646k112516j976249j685212j385870
5255A5463318j086369r26473p12878n51071m05343l45481k78943k08646j83847
5246A0764267j06972j04161j0525m597K8181K0510K6804O6414R0087K10174J38386
5235A1118568J87759K10379K88856L70811M64762N73278O17993P65686J044995
5226A5643087J306131J531623J863220K103294K095842J770221J224046M39685
5218B7977149l71804j058348j180106r17013n51766l94735l27167l18331o12691
$$ y = [18435361, 17345703, 16574929, 16093375, 15815816, 15734681, 15830741, 16107755, 16621685, 17375005, 18223323, 19234406, 20227765, 21219797, 21951393, 22436130, 22854436, 23544300, 24497514, 25437119, 26227483, 26467511, 25960815, 24553811, 22623165, 20510649, 18534400, 16849188, 15463318, 14376949, 13450476, 12737598, 12186527, 11781184, 11435703, 11156760, 10948114, 10764267, 10657295, 10553134, 10542609, 10538012, 10566193, 10586703, 10613507, 10679921, 10770008, 10980182, 11118568, 11306327, 11516706, 11805562, 12176373, 12641135, 13214413, 13832406, 14598092, 15643087, 16949218, 18480841, 20344061, 22447355, 24543197, 26313418, 27537464, 27977149, 27605345, 26546997, 25366891, 24449878, 23898112, 23503377, 23176210, 22857879, 22245188]
5209B2245188p83981q62532o86743m91669k91941o1375K35944N20798Q61654J174751
5199B1860094J478274J798574J914320J842627J481269J012340K65398m92053
5191C1160843p33879p39056o15496m89793m49599m61182o35200p62297o10709
5182B5663632m92845n51970o64036j029129j456905j632080j498577j247603j036674
5173A6053813p16644n17035l76196k49399r9826j20111J6138J11847P9291J12108
5163A4293986R4685J8811P0353K09318L10618M00991L91208K34409k9442m16121
5153A5578816r12259j179512j205909j022257q05665o56906n00258m01145l09016
5144H585889j87153j32939j46976p9052r3826j45062j11012k8047J10113J66557
$$ y = [22245188, 21461207, 20598675, 19911932, 19420263, 19128322, 19066947, 19302891, 19823689, 20685343, 21860094, 23338368, 25136942, 27051262, 28893889, 30375158, 31387498, 31652896, 31160843, 30426964, 29687908, 29072412, 28582619, 28133020, 27671838, 27036638, 26274341, 25663632, 25170787, 24618817, 23954781, 22925652, 21468747, 19836667, 18338090, 17090487, 16053813, 15337169, 14820134, 14443938, 14194539, 14094713, 13974602, 13990740, 14102587, 14181878, 14293986, 14388671, 14407482, 14477835, 14687153, 14997771, 15398762, 15789970, 16024379, 15994937, 15578816, 14666557, 13487045, 12281136, 11258879, 10453214, 9796308, 9296050, 8894905, 8585889, 8398736, 8265797, 8118821, 8039769, 7945943, 7800881, 7689869, 7661822, 7771935, 7938492]
5134G938492J94429K48898K52960J10983N3030j35297l24682n37983n39699l92809
5124F868322l34312k96945k08730j43722j00428j8986k7472K5856P6097Q5495
5114E925175J77290J78472M25413M89055O17107P20313O83944N06776J60519k02941
5104I681123p37894r11036q71304p32314n73093m74609l64768k80646k28713j89024
5094D317722j35678j35727j01268m4277n9416n0044m1361p9325J1166l976n3357
5083C624459m5879o0570r0387p3740p0237j5402k1220m0578k7901m6913p7582
5072C054050q3943j6260m2693j03707m0871J8911q5740p239k303k1168j0734m498
5060B653805m2302j3976K276K6038P6290l437l526m8210k2674o5701l1300K0926
$$ y = [7938492, 8132921, 8381819, 8634779, 8745762, 8798792, 8663495, 8338813, 7800830, 7261131, 6868322, 6534010, 6237065, 6028335, 5884613, 5784185, 5765199, 5737727, 5763583, 5839680, 5925175, 6102465, 6280937, 6706350, 7195405, 7812512, 8532825, 9216769, 9723545, 9884064, 9681123, 8943229, 8032193, 7160889, 6428575, 5855482, 5380873, 5016105, 4735459, 4506746, 4317722, 4182044, 4046317, 3945049, 3900772, 3841356, 3791312, 3749951, 3670626, 3681792, 3677816, 3624459, 3578580, 3518010, 3427623, 3353883, 3283646, 3268244, 3247024, 3206446, 3178545, 3131632, 3054050, 2970107, 2953847, 2911154, 2807447, 2766576, 2785487, 2699747, 2692508, 2690205, 2669037, 2658303, 2653805, 2611503, 2597527, 2599803, 2625841, 2702131, 2698694, 2695168, 2646958, 2624284, 2558583, 2527283, 2548209]
5048B548209J0804Q088l1466j8576L5356L2062o787O810l1770j7719J5791p6460
5036B474342l7127O941N832L7464J3967J5403K3647L0430M298M4269P6247P8419
5024B774132j852L3026J11804N5764O0459J08524K9689O7079P2771O8508L6416
5013C416320N8174L9447N5791M7036M6046Q285p945M1537J16026P5613M9460O0903
5001D006693R344n874k5830n085m1232j3104J3286Q8522J20754J54967J84732
4990D487173K71727K91613K76231L12593J57858L9482r3865k92801l07600k04670
4980D937741j80010j46915j16844j04092K491j5588j6123N893Q5784N7774J01640
4969D611751Q4308N5303R7259R3681J68486J15672J33087J41858J20591J83570
$$ y = [2548209, 2559013, 2567101, 2535635, 2517059, 2552415, 2584477, 2577690, 2584500, 2552730, 2535011, 2550802, 2474342, 2437215, 2444156, 2449988, 2487452, 2501419, 2516822, 2540469, 2570899, 2575197, 2619466, 2695713, 2774132, 2772280, 2805306, 2917110, 2972874, 3033333, 3141857, 3171546, 3238625, 3311396, 3379904, 3416320, 3474494, 3513941, 3569732, 3616768, 3662814, 3671099, 3663154, 3704691, 3820717, 3896330, 3945790, 4006693, 4016037, 4010163, 3984333, 3979248, 3938016, 3924912, 3938198, 4026720, 4147474, 4302441, 4487173, 4758900, 5050513, 5326744, 5639337, 5797195, 5836677, 5742812, 5450011, 5142411, 4937741, 4757731, 4610816, 4493972, 4389880, 4392371, 4376783, 4360660, 4366553, 4452337, 4510111, 4611751, 4696059, 4751362, 4848621, 4942302, 5110788, 5226460, 5359547, 5501405, 5621996, 5805566]
4959E805566K05413K28270J75380K75444L81985M14222N01523O12714O88261P36309
4949A0025087P30369O86540N60063L56708M91462Q74409J244928J297414J228685
4940A7495665J153246P24670J86175J28126L08208K24615j36171l80802q29353
4931A8874379j537060j756528j324263r15033m90730k38373r1558r7927j95723
4922A2227184l78414o68851p78004o00599m62602l34376l03968k98685l05189
4913H096496l54692l05105k60253k09929k48344k22666j06292j34230r5459p9640
4903F079886o6094L2778m0826k8216J96m8027j0561k4559k0417o028l429p453
4891E857250l3736O773N2602N317L1627P4576L82M5710M2243P5212P0968J48633
$$ y = [5805566, 6010979, 6239249, 6414629, 6690073, 7072058, 7486280, 7987803, 8600517, 9288778, 10025087, 10755456, 11441996, 12002059, 12358767, 12850229, 13724638, 14969566, 16266980, 17495665, 18648911, 19373581, 19559756, 19687882, 19996090, 20220705, 20084534, 19703732, 18874379, 17337319, 15580791, 14256528, 13341495, 12850765, 12612392, 12520834, 12422907, 12227184, 11848770, 11179919, 10401915, 9801316, 9338714, 9004338, 8700370, 8401685, 8096496, 7741804, 7436699, 7176446, 6966517, 6718173, 6495507, 6389215, 6254985, 6159526, 6079886, 6013792, 6046570, 6005744, 5977528, 5977724, 5929697, 5919136, 5894577, 5874160, 5868132, 5864703, 5857250, 5823514, 5830287, 5882889, 5888206, 5919833, 5994409, 5994791, 6040501, 6082744, 6157956, 6228924, 6377557]
4879F377557J08743N3484P6251J31167J09627J25917J38130J21012R9915O4920
4869G406723P9613P6836M9841J60094J74299J80143J93804K69495J99141K18362
4859I008351K33545K76462K76679L01419L31810L24719M54917M94745M55895N61573
4849A2720115N32723N83388N34515O32015O95854P68487R02529R91797J087199
4840A9448622J258778J399921J720925K074562K507447K944820L404800L385189
4832C8145064L247157L208705K587846J897808K677121M208113O455691R137873
4824G1565378J2757975J5687842J6321278J2184811P295122n44557j6435477k2062322
4816I6770050j8225344j3846233j0237485p784006n993590m742082l746312l053311
$$ y = [6377557, 6486300, 6539784, 6616035, 6747202, 6856829, 6982746, 7120876, 7241888, 7341803, 7406723, 7486336, 7563172, 7613013, 7773107, 7947406, 8127549, 8321353, 8590848, 8789989, 9008351, 9241896, 9518358, 9795037, 10096456, 10428266, 10752985, 11207902, 11702647, 12158542, 12720115, 13252838, 13836226, 14370741, 15002756, 15698610, 16467097, 17369626, 18361423, 19448622, 20707400, 22107321, 23828246, 25902808, 28410255, 31355075, 34759875, 38145064, 41392221, 44600926, 47188772, 49086580, 51763701, 55971814, 62427505, 71565378, 84323353, 100011195, 116332473, 128517284, 135812406, 135267849, 118832372, 96770050, 78544706, 64698473, 54460988, 46676982, 40683392, 35941310, 32194998, 29141687]
4808B9141687k386454j881139j643221j487334j308758j166810j125858j023568
4800A7118545q78467p38372o82552o77637o47731n60458m95281n05645m18690
4791A1513712l96974m30076m10067k78176k77107k37082k66222k01623j78046
4782H838339k04379j33036p4372j35588o9221j04596j14065j53699j64368j95798
4772G489217j52109j69676k09871k15681j66605j71655k11128j31338j27144j11321
4762E822689j92486j75422n2359p7504j06058l9031k3527k8914N190l8729l4080
4751E059769r1845j02561j21176n2355p9347q7361q7906o0046q034l6956J2055
4740D344237l1739L4521o0853p2200o2816q1223j05981j13364j20382j31555j31355
$$ y = [29141687, 26755233, 24874094, 23230873, 21743539, 20434781, 19267971, 18142113, 17118545, 16240078, 15501706, 14819154, 14141517, 13493786, 12933328, 12438047, 11932402, 11513712, 11116738, 10686662, 10276595, 9998419, 9721312, 9484230, 9218008, 9016385, 8838339, 8633960, 8500924, 8426552, 8290964, 8221743, 8117147, 8003082, 7849383, 7685015, 7489217, 7337108, 7167432, 6957561, 6741880, 6575275, 6403620, 6192492, 6061154, 5934010, 5822689, 5630203, 5454781, 5402422, 5324918, 5218860, 5179829, 5156302, 5127388, 5132578, 5093849, 5059769, 4967924, 4865363, 4744187, 4691832, 4612485, 4525124, 4437218, 4377172, 4369138, 4332182, 4344237, 4312498, 4347019, 4286166, 4213966, 4151150, 4069927, 3963946, 3850582, 3730200, 3598645, 3467290]
4729C467290p8976j3691o3195n7431k2614K3704j35143o9575N0019j2348n2159
4718C035881j06294o6597j01855n8525k9953j4975J3696n5092P038L5750j7784
4707B641290n2496J0261M6824l1094j6943k2492o5477j2372m7253J2061K5134
4696B487443l4669j6634l5033j9274m3018p982n0393l5485J9900n2402m6428k2800
4684B143225J0649K2407K2537K0288J2767J1252l7401K7790M4663l3488n598Q0706
4672B319797M2567m1332N2563K1057m3905j765Q145m5488r127k5970K6005J5193
4660B317740M8099K1199L7417J7670L6535R4540P6618J34022P5703L6829M8281
4649B944653n2770p1121q5450m5169r2077q1799j34913j6096J2771l4608r643
$$ y = [3467290, 3388314, 3374623, 3311428, 3253997, 3231383, 3255087, 3119944, 3050369, 3100388, 3088040, 3035881, 2929587, 2862990, 2761135, 2702610, 2672657, 2657682, 2671378, 2616286, 2623324, 2659074, 2641290, 2588794, 2599055, 2645879, 2614785, 2597842, 2575350, 2509873, 2497501, 2450248, 2462309, 2487443, 2452774, 2436140, 2401107, 2381833, 2338815, 2330833, 2280440, 2244955, 2264855, 2212453, 2166025, 2143225, 2153874, 2176281, 2198818, 2219106, 2231873, 2243125, 2205724, 2233514, 2278177, 2244689, 2239091, 2319797, 2362364, 2321032, 2373595, 2394652, 2350747, 2348982, 2357127, 2311639, 2302512, 2276542, 2302547, 2317740, 2365839, 2387038, 2424455, 2442125, 2478660, 2573200, 2649818, 2783840, 2859543, 2896372, 2944653, 2891883, 2820762, 2735312, 2690143, 2598066, 2516267, 2381354, 2365258, 2378029, 2343421, 2333778]
4638B333778J6582L7836J1167Q4948K7072K0247N697M9755Q807L8890M4966P2678
4626B752423J00109P5604N1825R6706J07949P3445Q8795J02777N4424P7736J44676
4615C726469J63172O0201J50391J94539J82401K25647J99388K25175K98427L97254
4605E823064M35606M44032N79891P06084Q64456J096575J397934J775484K073123
4596A5196249K277982K111573J515797N85912q53771k295496k659040k367930
4588A3511276j938963j565435j223836r73132q21681o19650n37685l98065l79793
4579E053036k86549k50593k55079j85873j16520j53069r9112j26585j37699j02384
4569C339573q7655p1154m8943j06298q8444l7420n7370j20902q1822k6798q5859
$$ y = [2333778, 2350360, 2388196, 2399363, 2484311, 2511383, 2531630, 2537327, 2587082, 2595889, 2634779, 2679745, 2752423, 2852532, 2928136, 2979961, 3076667, 3184616, 3258061, 3346856, 3449633, 3504057, 3581793, 3726469, 3889641, 3949842, 4100233, 4294772, 4477173, 4702820, 4902208, 5127383, 5425810, 5823064, 6258670, 6702702, 7282593, 7988677, 8853133, 9949708, 11347642, 13123126, 15196249, 17474231, 19585804, 21101601, 21687513, 20833742, 18538246, 15879206, 13511276, 11572313, 10006878, 8783042, 7809910, 6988229, 6368579, 5830894, 5432829, 5053036, 4766487, 4515894, 4260815, 4074942, 3958422, 3805353, 3706241, 3579656, 3441957, 3339573, 3251918, 3180764, 3131821, 3025523, 2937079, 2899659, 2842289, 2721387, 2639565, 2612767, 2526908]
4558B526908q3904J172n5363m9937P5622p9410k4102N3853l4165m9655j0003k0885
4546B250131n8835m3055l0521k8700k8379J9403j0494j6362k3045l1423K0768
4535B019488n011j9933J6744J9701K3342j9171J6009K4064n1195N0260j5455M786
4523B063629N119o3805p1285j2428k3355k0902M6369J9162m0919k6532N283O4010
4511A944346L2523l3354O0822L1497K6565Q3870O4771P7543M1480K9234n2223
4500B307074j34364j12010m4647m9194n0623n3817l1742ql3957o6061p4069o9178
4488A587404l9923l9387pk7616p0677J6569N8403j573r397K5394M6776m747j2641
4475A528578r079k1575j3610j092O486l0216l5931n6463K5404K0471j7115L7253
$$ y = [2526908, 2443004, 2444176, 2388813, 2338876, 2414498, 2335088, 2310986, 2364839, 2330674, 2281019, 2271016, 2250131, 2191296, 2148241, 2117720, 2089020, 2060641, 2080044, 2069550, 2053188, 2030143, 1998720, 2019488, 2014477, 1994544, 2011288, 2030989, 2054331, 2035160, 2051169, 2075233, 2024038, 2074298, 2058843, 2063629, 2068748, 2004943, 1933658, 1921230, 1897875, 1876973, 1923342, 1942504, 1901585, 1875053, 1880336, 1944346, 1976869, 1943515, 2004337, 2035834, 2062399, 2146269, 2211040, 2288583, 2330063, 2359297, 2307074, 2172710, 2060700, 2016053, 1966859, 1916236, 1862419, 1830677, 1830669, 1796712, 1730651, 1656582, 1587404, 1547481, 1508094, 1508087, 1480471, 1409794, 1426363, 1484766, 1483193, 1473796, 1499190, 1545966, 1541219, 1528578, 1519499, 1497924, 1484314, 1483222, 1489708, 1459492, 1423561, 1367098, 1392502, 1412973, 1395858, 1433111]
4463A433111k6679M938N2294j1480N3718M34M1079q2126o8816k482j2643o0809
4451A320539k9376k8415o9038N556n7295j1834N1908L4130n0315M56j2623K3666
4439A177359j288j9839N0433K1640L4675K5992J8879O8603N442p471N782J1741
4427A391948m117M6368O813l9219m5328k8942N145n009n569M656k0172m8096n196
4414A253282l3188m9591l7047l0974J8863n4010n3341R013P1181l3063m2334N7302
4402A076093L088m3699m65J2195l2923m477l4819j011L1064K3109q101J9150p383
4389A031821J7707K4823l0274o6972O1025k2428l9098k6788J6534P5469j2832
4378A028987n1375J8570K257n7068J5736J6926J8122p825j6727O865k013r176
$$ y = [1433111, 1406432, 1411370, 1463664, 1452184, 1505902, 1506336, 1547415, 1465289, 1396473, 1393991, 1381348, 1320539, 1291163, 1262748, 1193710, 1199266, 1141971, 1130137, 1182045, 1216175, 1165860, 1166316, 1153693, 1177359, 1176071, 1156232, 1206665, 1228305, 1262980, 1288972, 1307851, 1376454, 1381896, 1374425, 1380207, 1391948, 1387831, 1434199, 1441012, 1401793, 1356465, 1327523, 1332668, 1327659, 1322090, 1326746, 1306574, 1258478, 1253282, 1220094, 1170503, 1133456, 1102482, 1121345, 1067335, 1013994, 1023007, 1094188, 1061125, 1018791, 1076093, 1079181, 1035482, 1035017, 1047212, 1014289, 1009812, 974993, 973982, 1005046, 1028155, 1020054, 1039204, 1031821, 1049528, 1074351, 1044077, 977105, 1038130, 1015702, 976604, 949816, 966350, 1041819, 1028987, 977612, 996182, 998439, 941371, 957107, 974033, 992155, 984330, 967603, 974468, 972455, 963279]
4366I63279l5911l1601j3579J16183K4800r016L1579p704M5675K1585j280o0445
4354A043565p917L9753n4843k568J9835n594l304J3390L9697J9371J4748L4998
4342A151131J8108L9575n360K4952M1058m2833j7047k7100l6960J0261n4399j9116
4330A082270Q7078L2632L2593L32N6288M6736K6322k4348l9102K8919O7003L4599
4318A431322L6763K4666R571m2292J7613J9653K4738P530O5188j5928N6328M3200
4306A678352K909L845l3461M3712M8673L6623J0797J9372J4213M73K0960K9656
4294A876124M1945N1054M8368j7638m490L1404L0096p3942k2134L236o9122o7056
4282A827845n6516K1432l8506O117Q971m3186j4265O320m5425j4068p2361J69
$$ y = [963279, 927368, 895767, 882188, 998371, 1023171, 1014155, 1045734, 1038030, 1083705, 1105290, 1104010, 1043565, 1035648, 1075401, 1020558, 1017990, 1037825, 1032231, 1028927, 1042317, 1082014, 1101385, 1116133, 1151131, 1169239, 1208814, 1203454, 1228406, 1269464, 1226631, 1209584, 1182484, 1145524, 1155785, 1101386, 1082270, 1169348, 1201980, 1234573, 1234905, 1291193, 1337929, 1364251, 1339903, 1300801, 1329720, 1396723, 1431322, 1468085, 1492751, 1502322, 1460030, 1477643, 1497296, 1522034, 1529564, 1594752, 1578824, 1635152, 1678352, 1681261, 1685106, 1651645, 1695357, 1744030, 1780653, 1791450, 1810822, 1825035, 1825508, 1846468, 1876124, 1918069, 1969123, 2017491, 1999853, 1995363, 2026767, 2056863, 1982921, 1960787, 1964023, 1894901, 1827845, 1771329, 1792761, 1754255, 1760372, 1769343, 1726157, 1711892, 1718212, 1672787, 1658719, 1586358, 1586527]
4270A586527j362q6020p9112k8967l0297j1372m4101l1198l3493J819m4806m3799
4258A153819k7184m0457m5573l6834R004k7883l9802n4606J3835M7974o32k1930
4246I29731j1701k896p2767J1248R21N0083l6310q4657j0692N9967m3669K0684
4234H09942L5521l6875L9857N175j5389l0429l4593p032N7747j9789M9245n035
4222H48345n9558r712K4444k8607r203J0129O1181J457j3811m582K1853k9134
4210H12802J8343j4675J8839O3475m81p5002m1532M5996k2354M8494J626N9765
4198I15296m666j7848J4831j7311k9854N4195K8465K2430r837Q031K8645k7219
4186I65158K7296M9556K475M1899l2492j2314L5863m0065L3438J7098O6208k64
$$ y = [1586527, 1585165, 1499145, 1420033, 1391066, 1360769, 1349397, 1305296, 1274098, 1240605, 1242424, 1197618, 1153819, 1126635, 1086178, 1040605, 1003771, 1012775, 984892, 945090, 890484, 904319, 952293, 951661, 929731, 918030, 915134, 842367, 853615, 854536, 904619, 868309, 783652, 772960, 832927, 789258, 809942, 845463, 808588, 848445, 853620, 838231, 807802, 773209, 766177, 823924, 804135, 853380, 848345, 788787, 779075, 803519, 774912, 765709, 775838, 837019, 838476, 824665, 820083, 841936, 812802, 831145, 816470, 835309, 898784, 898303, 823301, 781769, 827765, 805411, 853905, 855531, 915296, 910630, 892782, 907613, 890302, 860448, 914643, 943108, 965538, 955701, 963732, 992377, 965158, 992454, 1042010, 1044485, 1086384, 1053892, 1041578, 1077441, 1037376, 1070814, 1087912, 1154120, 1153856]
4174A153856O589K8441J0333J0098K2793P8749K9659k6451M7491n498L8072J9723
4162A413855P706L5534k911N778N6386L3359o250N2330O8307K4090P3987K4526
4150A786697K1744J05361K1717Q6899M9815M2096M4759Q7215J16384L4380J12530
4139B509597K30064J94218K04222J50854Q4094J12515k5649j31805j63436j27652
4129C037022q8443m9912l1845k4050k1404O6462p876L7499M0373L8949J1819j3314
4117B995280L6763R4786R2202K0653J9113N8844L8730P4696J10789P2958P8804
4106C693618M4816L5557N3506L6354J47026J44821J11257J19379Q9241Q8556J31710
4095D695841J54568J34793J25764J82920J68095K01294K78733K25857K69775K88398
$$ y = [1153856, 1160445, 1188886, 1199219, 1209317, 1232110, 1310859, 1340518, 1314067, 1361558, 1356060, 1394132, 1413855, 1421561, 1457095, 1454184, 1459962, 1516348, 1549707, 1543457, 1595787, 1664094, 1688184, 1762171, 1786697, 1808441, 1913802, 1935519, 2022418, 2072233, 2114329, 2159088, 2246303, 2362687, 2397067, 2509597, 2739661, 2933879, 3138101, 3288955, 3373049, 3485564, 3459915, 3328110, 3164674, 3037022, 2948579, 2898667, 2866822, 2842772, 2821368, 2887830, 2879954, 2917453, 2957826, 2996775, 3008594, 2995280, 3032043, 3126829, 3219031, 3239684, 3258797, 3317641, 3356371, 3431067, 3541856, 3614814, 3693618, 3738434, 3773991, 3827497, 3863851, 4010877, 4155698, 4266955, 4386334, 4475575, 4564131, 4695841, 4850409, 4985202, 5110966, 5293886, 5461981, 5663275, 5942008, 6167865, 6437640, 6726038]
4085F726038K51653L30716L18366L62223L32212K93369L29069K92083M13230M34319
4075A0083278M91477O03715O77578P04347P31155P99378P72128P24440O53108
4066A6240604N86574O44709P52339Q97735J056558J346586J790290K295008K939726
4057B8550129L682898M045744L426155J950951J080643k641792m825486l795494
4049C1473748k804836j907745j299457p53172l13217j054J78046L14017J86002
4040B5072332O4024k76408o60819q86975r50093j014684q24036n77806l83429
4031A9562106k15349l7861L4131J08946M9633j37097l67652n72948q40860r15652
4021A6667397r10208q65169p36595n91206m82165l68290l43251k46131k78430
$$ y = [6726038, 6977691, 7308407, 7626773, 7988996, 8321208, 8614577, 8943646, 9235729, 9648959, 10083278, 10574755, 11178470, 11856048, 12560395, 13291550, 14090928, 14863056, 15587496, 16240604, 16827178, 17471887, 18224226, 19121961, 20178519, 21525105, 23315395, 25610403, 28550129, 32233027, 36278771, 39704926, 41655877, 42736520, 40094728, 35269242, 31473748, 28668912, 26761167, 25461710, 24708538, 24395321, 24394267, 24572313, 24886330, 25072332, 25136356, 24859948, 24199129, 23312154, 22362061, 21347377, 20523341, 19945535, 19562106, 19346757, 19308896, 19343027, 19451973, 19501606, 19364509, 18996857, 18423909, 17583049, 16667397, 15757189, 14892020, 14155425, 13564219, 13082054, 12713764, 12370513, 12124382, 11845952]
4012A1845952k73024l02280m34117m88150n01981n51492n40913m76572m82096
4003G795327l66776l15601k98583k59913k27695k46097k26208k26910k41791j90163
3993E195590k52489k05501k27492k13712j97952j97383j51465j27164j30245p4216
3983C417971j09408r8098p9495j17175j69522m2021r2169r3750m878n5723q3404
3972B472328j11686p7531j599k9456n4512j9651o0508m4087n8391q0279n5896
3961A878732n8724J0306j4795l8971j16748k0864J8217m2163j8552m3624n7591
3950A495223q8812J3070J4851l8423j7856l6086O987j132L151k0079Q514k0976
3938A318432j969n4318k7265p3049l0473o752j9385J5123k6969J1630o314m156
$$ y = [11845952, 11572928, 11270648, 10836531, 10348381, 9846400, 9294908, 8753995, 8277423, 7795327, 7428551, 7112950, 6814367, 6554454, 6326759, 6080662, 5854454, 5627544, 5385753, 5195590, 4943101, 4737600, 4510108, 4296396, 4098444, 3901061, 3749596, 3622432, 3492187, 3417971, 3308563, 3210465, 3130970, 3013795, 2844273, 2802252, 2710083, 2616333, 2611455, 2555732, 2472328, 2360642, 2283111, 2281512, 2252056, 2197544, 2177893, 2117385, 2073298, 2014907, 1934628, 1878732, 1820008, 1830314, 1815519, 1776548, 1659800, 1638936, 1657153, 1614990, 1596438, 1552814, 1495223, 1406411, 1419481, 1434332, 1395909, 1378053, 1341967, 1348954, 1347822, 1350973, 1330894, 1339408, 1318432, 1316463, 1262145, 1234880, 1161831, 1131358, 1124606, 1105221, 1120344, 1093375, 1105005, 1098691, 1094535]
3926A094535l6841j9227N537M6897K1360J7355p6648l5046K7121J8636l6614r153
3914A017912j5335j2071j0136P0699l1688K7583o458K0461j8252j21390J9499
3903I40824m796l1008k3603p513M3800K555k6874m0326J0940N3639l3419J4160
3891H98379J4690k520J605j4218L1482p52M730M6105m6343m32K7588n1039M4184
3878I53459k5575L596J9478l4469K1499k7018K376j4558j5898N1025P739L1090
3866I72744K3721j6348J2543m5374k8160J1695k2082J0473M7403L1583o253q135
3854I83810k8122J1768N6240K0804k5773p679j0583k8816l896Q691l7299L7629
3842I76774N7109k2565K0899P698L6534j7499k6365K5607L3768Q737J8680K993
$$ y = [1094535, 1057694, 1038467, 1044004, 1090901, 1112261, 1129616, 1052968, 1017922, 1045043, 1063679, 1027065, 1017912, 1002577, 990506, 980370, 1051069, 1019381, 1046964, 1040506, 1060967, 1042715, 921325, 940824, 936028, 905020, 881417, 873904, 917704, 920259, 893385, 853059, 863999, 917638, 884219, 898379, 913069, 910549, 912154, 897936, 929418, 928666, 933396, 979501, 933158, 932726, 960314, 909275, 953459, 927884, 931480, 950958, 916489, 937988, 910970, 913346, 898788, 882890, 933915, 941654, 972744, 996465, 980117, 992660, 947286, 919126, 930821, 908739, 919212, 966615, 998198, 991945, 983810, 955688, 967456, 1023696, 1044500, 1018727, 1011048, 1000465, 971649, 967753, 976444, 939145, 976774, 1033883, 1011318, 1032217, 1039915, 1076449, 1058950, 1032585, 1058192, 1091960, 1100697, 1119377, 1122370]
3830A122370O9413l1479o8284J9381N1359P2856n169K2378L1944N5388Q1240O5382
3818A486779O693Q1793k8542M7563Q2396J2213J0178N7283P5477N3332O072O4436
3806A955673N3734L6615p725m766M4295J6971k0626N3648M1215j4571K2087k5694
3794B150856J1855K0713J147k9311J736o8308J3709J6556K594j6744j3224j3085
3782B078494O997m688L3741j6144p125k1576M7233K4614Q889l105K9092Q7990
3770B264412M4708Q1926N5620J04678N0434O1426N4303P2116J12588R7102P5289
3759C074602N6647J45402J37195Q4078P9993N6042K2090j073K7203j1612l1016
3748C639551M6125J6182K8244l1707J9891Q9708M9073M0566M6486N464R5493P1021
$$ y = [1122370, 1191783, 1160304, 1092020, 1111401, 1162760, 1235616, 1230447, 1252825, 1284769, 1340157, 1421397, 1486779, 1493472, 1575265, 1546723, 1594286, 1676682, 1688895, 1699073, 1756356, 1831833, 1885165, 1891237, 1955673, 2009407, 2046022, 2038297, 2033531, 2077826, 2094797, 2074171, 2127819, 2169034, 2154463, 2176550, 2150856, 2162711, 2183424, 2184571, 2155260, 2156996, 2088688, 2102397, 2118953, 2121547, 2104803, 2091579, 2078494, 2085491, 2080803, 2114544, 2098400, 2091275, 2069699, 2116932, 2141546, 2150435, 2147330, 2176422, 2264412, 2309120, 2391046, 2446666, 2551344, 2601778, 2663204, 2717507, 2789623, 2902211, 2999313, 3074602, 3131249, 3276651, 3413846, 3497924, 3577917, 3633959, 3656049, 3654976, 3682179, 3670567, 3639551, 3685676, 3701858, 3730102, 3698395, 3718286, 3807994, 3857067, 3897633, 3944119, 3949583, 4045076, 4116097]
3736D116097Q6210N6374P1819R3598R6776J45395K27560K73416J77030J90502
3726E534777J63791J11666J06471O8957l7674r2435p2152q3390j00057p1914o0514
3715E467526n5988K7547M8923j922p6182J3055j9606j35108l8525o8529j87124
3704D974067k01345j86143k49173k44165k64200j92233j66905j69142k01500j75134
3694B924127l8667r3097j19532k6118l8154n5237m8045l442n5749O86m7879j7044
3682B381849k1751m2093q525L2219K0626m7010K4610J0733j3105L2875K6125l2446
3670B364107o0792p5961L596k0957l1010m0525M76K4805J7215j8025k153K4097
3658B184873L1568K1207L3889K9664J5411M1241N4450P837l6036O866j0023j5383
$$ y = [4116097, 4202307, 4258681, 4330500, 4424098, 4520874, 4666269, 4893829, 5167245, 5344275, 5534777, 5698568, 5810234, 5916705, 5985662, 5947988, 5855553, 5783401, 5700011, 5599954, 5528040, 5467526, 5411538, 5439085, 5488008, 5486086, 5409904, 5422959, 5403353, 5268245, 5229720, 5161191, 4974067, 4772722, 4586579, 4337406, 4093241, 3829041, 3636808, 3469903, 3300761, 3099261, 2924127, 2885460, 2792363, 2672831, 2646713, 2608559, 2553322, 2505277, 2501835, 2446086, 2446772, 2398893, 2381849, 2360098, 2318005, 2309480, 2341699, 2362325, 2315315, 2339925, 2350658, 2337553, 2370428, 2396553, 2364107, 2303315, 2227354, 2230950, 2209993, 2178983, 2138458, 2138934, 2163739, 2180954, 2162929, 2160776, 2184873, 2216441, 2237648, 2271537, 2301201, 2316612, 2357853, 2412303, 2420140, 2384104, 2390970, 2380947, 2365564]
3646B365564m6308J068J1083J264l7080k8170O588L1052p2011N1196N5368l6719
3634B302895l8067N4013j992K0160R035M5079M5376R1288L2141l3545P6616n391
3622B597608m696J06003N9652Q471J1735J3318K9709O3431L3364m930N9424N6413
3610C029502L2208O0325Q0199J8799O6265M3891N3226L298k0281M7612P4383P4377
3598C563804L2605M6666Q6394J8299m598Q3149P6295J9415R5435M9784k0753j4726
3586D031769K0816q822n520m9029J4772j8736M882j3406j5125M9497R871N0436
3574D071405N5568P9576N0981R6000K4934P5668J01484J23996J04928J09174J59485
3563E053199J50357J23959J01705P5031P7558J50830P1204J35339J31365J16812
$$ y = [2365564, 2319256, 2320324, 2331407, 2332671, 2295591, 2267421, 2274009, 2305061, 2233050, 2284246, 2339614, 2302895, 2264828, 2318841, 2316849, 2337009, 2346044, 2391123, 2436499, 2527787, 2559928, 2526383, 2602999, 2597608, 2592912, 2698915, 2758567, 2767038, 2778773, 2792091, 2821800, 2885231, 2918595, 2913665, 2973089, 3029502, 3061710, 3122035, 3202234, 3221033, 3287298, 3331189, 3384415, 3387713, 3367432, 3415044, 3489427, 3563804, 3596409, 3643075, 3729469, 3747768, 3743170, 3826319, 3902614, 3922029, 4017464, 4067248, 4046495, 4031769, 4052585, 4043763, 4038243, 3989214, 4003986, 3985250, 3990132, 3976726, 3961601, 4011098, 4020969, 4071405, 4126973, 4206549, 4257530, 4353530, 4378464, 4454132, 4555616, 4679612, 4784540, 4893714, 5053199, 5203556, 5327515, 5429220, 5504251, 5581809, 5732639, 5803843, 5939182, 6070547, 6187359]
3553F187359J91589J57058J35908K40490K28346K60359L00436M10183L97792M35015
3543H944535M77241N12879N16481N22949L94444L91805L39485K47600K00311J57476
3533A2705206O4168M0550q0806j10286p4234r7184l6132o1588n1852k6537m1880
3522A2229425j09232o4090j10902j85804j43685k65007k47848k77961l01675k90435
3512A0232786l23742k95443k85293l02233k67558k70422k33472j78237j57001
3503G919385k5802j36211m6874q5302l9275j6964k4599J2227j4527M4369N2969
3492G639396K2275M9774J5761O215R860k9491m3997M403J27l6536k0626P2590
3480G689751J6645P505k8012N41N9427M3058R9428J12390O225J03739J03628R4186
$$ y = [6187359, 6378948, 6536006, 6671914, 6912404, 7140750, 7401109, 7701545, 8111728, 8509520, 8944535, 9421776, 9934655, 10451136, 10974085, 11368529, 11760334, 12099819, 12347419, 12547730, 12705206, 12769374, 12809924, 12729118, 12618832, 12544598, 12447414, 12411282, 12349694, 12297842, 12271305, 12229425, 12120193, 12056103, 11945201, 11759397, 11615712, 11350705, 11102857, 10824896, 10523221, 10232786, 9909044, 9613601, 9328308, 9026075, 8758517, 8488095, 8254623, 8076386, 7919385, 7893583, 7757372, 7710498, 7625196, 7585921, 7568957, 7544358, 7556585, 7542058, 7586427, 7639396, 7661671, 7711445, 7727206, 7733421, 7743281, 7713790, 7669793, 7674196, 7674323, 7637787, 7617161, 7689751, 7706396, 7713901, 7685889, 7686430, 7745857, 7788915, 7888343, 8000733, 8006958, 8110697, 8214325, 8308511]
3468H308511N1734P8323R8879R1907L6626M4315K6805K5632J1943K8483L3549
3457H836707l4426k8128O114N4967P638K5356K1361P1952J8232Q9827N0545O4054
3445I184199P1327O3717O2294P3893Q4033L049P319L6741P978J5182J7389M27
3433I627548l5794N2551m1411m5332L9938m0240p4382o7897o8068o9179n8929
3422I218805m5808l7760o4322r5432j3239p8572o4210J3411K7844R143o374P059
3410H870545M7771P5538K1186L9553j773M0403P5635P1352M3436O4260M7246L6577
3398I431729J15207J25402J18554P8639P4880J31447J36595J86657J76282J76612
3388A0752004J37750J29295J00218J41084Q4963J48438R5735J83099K18126K27971
$$ y = [8308511, 8360245, 8438568, 8537447, 8629354, 8665980, 8710295, 8737100, 8762732, 8774675, 8803158, 8836707, 8802281, 8774153, 8780267, 8835234, 8842872, 8868228, 8889589, 8961541, 8979773, 9069600, 9120145, 9184199, 9255526, 9319243, 9381537, 9455430, 9539463, 9542512, 9549831, 9586572, 9594550, 9609732, 9627121, 9627548, 9591754, 9644305, 9602894, 9557562, 9597500, 9557260, 9482878, 9414981, 9346913, 9277734, 9218805, 9172997, 9135237, 9070915, 8975483, 8962244, 8883672, 8819462, 8832873, 8860717, 8869860, 8863486, 8870545, 8918316, 8993854, 9015040, 9054593, 9052820, 9093223, 9168858, 9240210, 9283646, 9347906, 9395152, 9431729, 9546936, 9672338, 9790892, 9869531, 9944411, 10075858, 10212453, 10399110, 10575392, 10752004, 10889754, 11019049, 11119267, 11260351, 11345314, 11493752, 11589487, 11772586, 11990712, 12218683]
3378A2218683K52423K38082K77876K74417K60588K19550K13081J12987J07195
3369A4174882J75690K63829K38465K64170K53385L25760L77213L62027L47079
3360A6782500M11409L84693L60054L67516L80907L77179M31049M56750L74431
3351B0326488M57026M68063N72312N46598N65099O06053O67768O61969O11624
3342B5483000O16671O43889O45669O37430O70781P46479O96153Q06655R50926
3333C1897653R56738J109054J173678J380750J524051J674196J775527J953329
3325D3444976K178695K249221K227909K208212K015126J852079J529568J145080
3317E8850866P60402M23515J51215o483j25077r1525N8229K49692M41889N13766
$$ y = [12218683, 12471106, 12709188, 12987064, 13261481, 13522069, 13741619, 13954700, 14067687, 14174882, 14350572, 14614401, 14852866, 15117036, 15370421, 15696181, 16073394, 16435421, 16782500, 17193909, 17578602, 17938656, 18306172, 18687079, 19064258, 19495307, 19952057, 20326488, 20783514, 21251577, 21823889, 22370487, 22935586, 23541639, 24209407, 24871376, 25483000, 26099671, 26743560, 27389229, 28026659, 28697440, 29443919, 30140072, 30946727, 31897653, 32854391, 33963445, 35137123, 36517873, 38041924, 39716120, 41491647, 43444976, 45623671, 47872892, 50100801, 52309013, 54324139, 56176218, 57705786, 58850866, 59611268, 60034783, 60185998, 60179515, 60054438, 59962913, 60021142, 60270834, 60712723, 61226489]
3307F1226489N38671M42713K62671j25746n01434q13744j265000j536834j808893
3298E6418893k024205k071519j964248j841887j693000j453533j190971j051453
3290D3128077q68944p89442o77633m71944l92977l20934k36786k28921j76377
3281C8964119n1252L755j5157J09662K18460L16346M48631N83999O45293Q32131
3271D2055987J021217J024494J127530J328019J484502J635962J757378J987629
3263E3422718K192200K448218K826315L148774L598960M000824M499330M953034
3255H1090373N285416N503344N509620N221187M640706L914057L064547K126152
3247A16355402J293456N39865N7395l59877m71445n47676k56664r6587J42282
$$ y = [61226489, 61765160, 62207873, 62470544, 62344798, 61843364, 61029620, 59764620, 58227786, 56418893, 54394688, 52323169, 50358921, 48517034, 46824034, 45370501, 44179530, 43128077, 42259133, 41469691, 40792058, 40320114, 39927137, 39606203, 39369417, 39140496, 38964119, 38912867, 38916622, 38901465, 39011127, 39229587, 39545933, 39994564, 40578563, 41223856, 42055987, 43077204, 44101698, 45229228, 46557247, 48041749, 49677711, 51435089, 53422718, 55614918, 58063136, 60889451, 64038225, 67637185, 71638009, 76137339, 81090373, 86375789, 91879133, 97388753, 102609940, 107250646, 111164703, 114229250, 116355402, 117648858, 118188723, 118246118, 117886241, 117414796, 116867120, 116610456, 116513869, 116656151]
3238A16656151J80984j31703n92399j219325j982407k733493l380324m015480
3230A02782004m472650m814253m992869n048672m879355m503609m051591l525980
3222F6493025l161758k798121k596010k433362k293908k268409k164983k154748
3214D6621726k009156j940698j799660j664701j571777j390060j206876j139127
3206C3899671j024209q62333q03044p33460o80199n88807n03011n28572m72305
3197B7703731l80378l26513k81039k80697j95417j96126j45797j44584j62350
3188B5590830r4505q057k219J00N9575J36815J99363K64304K24080J98955K81760
3177B6851001L22486L42237K88598K83423J94604J62472J64306J46998R7109N8849
$$ y = [116656151, 116837135, 116705432, 116113033, 114893708, 112911301, 110177808, 106797484, 102782004, 98309354, 93495101, 88502232, 83453560, 78574205, 74070596, 70019005, 66493025, 63331267, 60533146, 57937136, 55503774, 53209866, 50941457, 48776474, 46621726, 44612570, 42671872, 40872212, 39207511, 37635734, 36245674, 35038798, 33899671, 32875462, 32013129, 31210085, 30476625, 29796426, 29207619, 28704608, 28176036, 27703731, 27323353, 26996840, 26715801, 26435104, 26239687, 26043561, 25897764, 25753180, 25590830, 25496325, 25488268, 25486049, 25486149, 25545724, 25682539, 25881902, 26146206, 26370286, 26569241, 26851001, 27173487, 27515724, 27804322, 28087745, 28282349, 28444821, 28609127, 28756125, 28853234, 28912083]
3167B8912083J6358K7516m7053o8341n8892j2119M1919J45982K20925L46224M22009
3156B9946611M04928M79325N48302O65889O89767P43530O62470O09007O96890
3147C5446719O35981N57837N21061N63213N44713N51903O36247P55099P90273
3138D1003046R54494J121564J229253J370355J623719J813277K151025K438024
3130E3704757K754224L179813L537637L826190M016760M206881M131953L927563
3122H3285778L742020L483640L223149K952279K682136K337933J790466J259579
3114A04756980O33691L1334m42065p93693j138353j395880j634921j812182j958865
3105I6246046k020239k074002k140162k189545k197688k288317k488281k587980
$$ y = [28912083, 28928441, 28955957, 28908904, 28840563, 28781671, 28769552, 28811471, 28957453, 29178378, 29524602, 29946611, 30351539, 30830864, 31379166, 32045055, 32734822, 33478352, 34140822, 34749829, 35446719, 36082700, 36640537, 37161598, 37724811, 38269524, 38821427, 39457674, 40212773, 41003046, 41957540, 43079104, 44308357, 45678712, 47302431, 49115708, 51266733, 53704757, 56458981, 59638794, 63176431, 67002621, 71019381, 75226262, 79358215, 83285778, 87027798, 90511438, 93734587, 96686866, 99369002, 101706935, 103497401, 104756980, 105390671, 105422005, 104979940, 104186247, 103047894, 101652014, 100017093, 98204911, 96246046, 94225807, 92151805, 90011643, 87822098, 85624410, 83336093, 80847812, 78259832]
3097G8259832k611792k595323k457242k125181j909674j810403j735889j827376
3089F1186952j912999k027091k059067k003812j923263j796382j705317j537550
3081D6221471j375066j184698q65640o58208m23756k17251J5299K58485L81109
3072D2151745N12375O24029O34581N68299M73154K84739R1717j75617m07827p33534
3062D4023661r76712j077112j289244j383781j424160j507141j466328j465951
3054C3433232j398150j395707j355526j258509j253482j196099j132765j093455
3046B3349539r54478r76721r53957q40079p09262p32940o79923n67079n14604
3037A6420496n08770m19020l96536l41984l54599k87769k24827k34977k12082
$$ y = [78259832, 75648040, 73052717, 70595475, 68470294, 66560620, 64750217, 63014328, 61186952, 59273953, 57246862, 55187795, 53183983, 51260720, 49464338, 47759021, 46221471, 44846405, 43661707, 42796067, 42137859, 41714103, 41496852, 41512151, 41770636, 42151745, 42664120, 43288149, 43922730, 44491029, 44964183, 45248922, 45340639, 45165022, 44757195, 44023661, 43046949, 41969837, 40680593, 39296812, 37872652, 36365511, 34899183, 33433232, 32035082, 30639375, 29283849, 28025340, 26771858, 25575759, 24442994, 23349539, 22395061, 21418340, 20464383, 19624304, 18915042, 18182102, 17502179, 16935100, 16420496, 15911726, 15492706, 15096170, 14754186, 14399587, 14111818, 13886991, 13652014, 13439932]
3028A3439932k17387j30218j41050r5065l2442j9773K5938J11628M9889R6187
3018A3087639R2992J16613J94885K04917J71641J97823J68376K03763J74056J70569
3008A4783274K8093m0456m0893m4051q0400j57866j74997j94781j94036j29251
2998A3754636q0444q6521k6078l4507J9582J13915J51191K27069L49425L57349
2988A4745617L65929M57889M19397K52191J04329R9001m1315l9251p9796m0203
2978A6243788J08371J76976K26583L33613M42396M36994N13336M27672K14622
2969A9124351l2513k81920n06799n97858p88350p86218o20138n91085n22825m50262
2959A3946383l67501k98585k68191k25240q3079j53953j53130q1760m4644j5749
$$ y = [13439932, 13222545, 13092327, 12951277, 12856212, 12823770, 12803997, 12829935, 12941563, 12991452, 13087639, 13180631, 13297244, 13492129, 13697046, 13868687, 14066510, 14234886, 14438649, 14612705, 14783274, 14811367, 14770911, 14730018, 14685967, 14605567, 14447701, 14272704, 14077923, 13883887, 13754636, 13674192, 13587671, 13561593, 13527086, 13546668, 13660583, 13811774, 14038843, 14388268, 14745617, 15111546, 15569435, 15988832, 16241023, 16345352, 16444353, 16403038, 16363787, 16283991, 16243788, 16352159, 16529135, 16755718, 17089331, 17531727, 17968721, 18482057, 18909729, 19124351, 19091838, 18809918, 18303119, 17705261, 16916911, 16130693, 15510555, 14919470, 14396645, 13946383, 13578882, 13280297, 13012106, 12786866, 12703787, 12549834, 12396704, 12314944, 12270300, 12254551]
2949A2254551N9478m1861P9695N4681L1260N1618P8475J00713M0136J11070O9652
2938A2889468J29195J03415R9504J65149J47783J83227K01544J93282K17455L10082
2928A4640104L21868K91215K63400K75140K57237K30712L57466K99146M38522
2919A7374810M55858M44052M32588N15411M98496N21679N56185N97745O31207
2910B2028031O33159O47728P21074O96483O46383O47920N78404M76917L87664
2901B7463763M39904M62480M00194M49863M52540M71683N25540N72458P22365
2892C1960790P96432R02987J031375J138051J273137J351176J482548J599641
2884D1536137J648224J689937J906485K084552K270694K514003K799089L152760
$$ y = [12254551, 12314029, 12272168, 12351863, 12406544, 12437804, 12489422, 12567897, 12668610, 12708746, 12819816, 12889468, 13018663, 13122078, 13221582, 13386731, 13534514, 13717741, 13919285, 14112567, 14330022, 14640104, 14961972, 15253187, 15516587, 15791727, 16048964, 16279676, 16637142, 16936288, 17374810, 17830668, 18274720, 18707308, 19222719, 19721215, 20242894, 20799079, 21396824, 22028031, 22661190, 23308918, 24029992, 24726475, 25372858, 26020778, 26599182, 27076099, 27463763, 27903667, 28366147, 28766341, 29216204, 29668744, 30140427, 30665967, 31238425, 31960790, 32757222, 33660209, 34691584, 35829635, 37102772, 38453948, 39936496, 41536137, 43184361, 44874298, 46780783, 48865335, 51136029, 53650032, 56449121, 59601881]
2876E9601881L574332M043445M725441N497876O500932P564967Q433072R173892
2868A09115838R529427R554579R192182Q975606R922794J2524637J6370191K0650120
2860B05835374K3994309K4537140K0859616J2926043J281096j3148953k4948522
2853B51336103k9407998k7587828k3083801j8508632j4600141j1512951r373195
2846A17261557q006506p013708o466860o026967n722003n365378m952494m807365
2838F8900276m529281m191299l805447l444359l335127l046605k799739k606367
2830D1142052k360957k141120j965483j826657j692954j529856j431384j246649
2822B6946992j195831j133036j056655j015958r73358q27991q46437p84555o58167
$$ y = [59601881, 63176213, 67219658, 71945099, 77442975, 83943907, 91508874, 99941946, 109115838, 118645265, 128199844, 137392026, 146367632, 156290426, 168815063, 185185254, 205835374, 229829683, 254366823, 275226439, 288152482, 289433578, 276284625, 251336103, 221928105, 194340277, 171256476, 152747844, 138147703, 126634752, 117261557, 109255051, 102241343, 95774483, 89747516, 84025513, 78660135, 73707641, 68900276, 64370995, 60179696, 56374249, 52929890, 49594763, 46548158, 43748419, 41142052, 38781095, 36639975, 34674492, 32847835, 31154881, 29625025, 28193641, 26946992, 25751161, 24618125, 23561470, 22545512, 21572154, 20744163, 19897726, 19113171, 18455004]
2813A8455004o30510o24159n70186n67686n49175n33437n10924m70466m55656
2804A3542805m32553l53014l62083l34113k56487l48588k79864l07436k55209
2795A0613458k29882l08335k60513j43693k14378j98580k77840k79886j62191
2786H538160k18416j91353j28856j29168k31669j71751j71351j48053j91542j16850
2776F839151j91250j99178j44189j87866j60600k21850j93568j18275j12249j48668
2766E161458j24404j04111j09258j32389j44447r9914o1365r8479o5644r4935
2756D126512k2142p4532q1443n2460p7777j45352p6201o0188o7703q3574o2256
2745C322884j6437p7038m2588n3478k1139n9596q7042j00266l9448n5776r1114
$$ y = [18455004, 17824494, 17200335, 16630149, 16062463, 15513288, 14979851, 14468927, 13998461, 13542805, 13110252, 12757238, 12395155, 12061042, 11804555, 11455967, 11176103, 10868667, 10613458, 10383576, 10075241, 9814728, 9671035, 9456657, 9258077, 8980237, 8700351, 8538160, 8319744, 8128391, 7999535, 7870367, 7638698, 7466947, 7295596, 7147543, 6956001, 6839151, 6647901, 6448723, 6304534, 6116668, 5956068, 5734218, 5540650, 5422375, 5310126, 5161458, 5037054, 4932943, 4823685, 4691296, 4546849, 4446935, 4385570, 4287091, 4221447, 4126512, 4104370, 4029838, 3948395, 3895935, 3818158, 3672806, 3596605, 3536417, 3468714, 3385140, 3322884, 3306447, 3229409, 3186821, 3133343, 3112204, 3052608, 2965566, 2865300, 2825852, 2770076, 2678962]
2734B678962r4516p5149l2245q55j825m6914m5417j5493Q08o1246m3271j355o5816
2721B195668p9764p834p8938o3146k0636j7974K7144J978q251P485l1729j6251
2709A907752m4088m5360J1996l5656o8295k0426n738m2207n1886L9359k2004n6819
2697A566628k793R458K2341j1775j6837N9319K0224k7111p561k9272N025K6361
2685A614007j02285m8418K7935o8230n2306k6585j597k3338j283n5491m5648N2310
2673A269071k8822n8049k1446K565l0957n1987J1336n7156L3099j8022j3472M3696
2661A079856p554l3742m4976P074P536k3094o7788k9119k5883j6669j2186K3827
2649H57282n6302k263K8734j8659l6520j8757L5547j4630j7791M3630q869L064
$$ y = [2678962, 2584446, 2509297, 2477052, 2476197, 2474372, 2427458, 2382041, 2366548, 2367356, 2306110, 2262839, 2261484, 2195668, 2115904, 2108070, 2029132, 1965986, 1945350, 1927376, 1954520, 1956498, 1948247, 1955732, 1924003, 1907752, 1863664, 1818304, 1830300, 1794644, 1726349, 1705923, 1700185, 1657978, 1606092, 1645451, 1623447, 1566628, 1563835, 1573293, 1595634, 1583859, 1567022, 1626341, 1646565, 1619454, 1611893, 1582621, 1587646, 1614007, 1511722, 1463304, 1491239, 1423009, 1370703, 1344118, 1342521, 1319183, 1317900, 1262409, 1216761, 1269071, 1240249, 1182200, 1160754, 1163319, 1132362, 1080375, 1091711, 1034555, 1067654, 1049632, 1036160, 1079856, 1072302, 1038560, 993584, 1000658, 1008194, 985100, 917312, 888193, 862310, 845641, 833455, 857282, 800980, 798717, 827451, 808792, 772272, 753515, 789062, 774432, 756641, 800271, 791402, 794466]
2637G94466l0058l58j9136j4057J1300o0090L4060q351J5550j7341O226L4293
2625G46504o619j7312M5986k1739J6555k7145k2206o110k6622J0176J2487l8050
2613F65905K5874L4049j1056k4966o824M1488j3282J9947R83J0734m3832J0604
2601G09624N6181p427j2804q918R074M6890R821J1609m5735M6721J4651j170L7517
2588H66034P0430K1843J07615L5991o270R3759Q2892K7372K6364P7176J30250
2577A533456Q6711Q4442J12533P4094K5079q6618j05130j16022j05378j03103
2567A400064p9612p0886o8328r7983m2573l1686l1783n9718l1341m2241j791l5758
2555H06364Q655k6628l8440l7412Q008r379n7124o7587j3774J4273k347j2787
$$ y = [794466, 764408, 764050, 744914, 730857, 742157, 682067, 716127, 707776, 723326, 705985, 712211, 746504, 739885, 722573, 768559, 746820, 763375, 736230, 714024, 707914, 681292, 691468, 703955, 665905, 691779, 725828, 714772, 689806, 682982, 724470, 711188, 731135, 732118, 742852, 699020, 709624, 765805, 758378, 745574, 736656, 745730, 792620, 802441, 814050, 768315, 815036, 829687, 828517, 866034, 936464, 958307, 1065922, 1101913, 1095643, 1189402, 1272294, 1299666, 1326030, 1403206, 1533456, 1620167, 1704609, 1817142, 1891236, 1916315, 1829697, 1724567, 1608545, 1503167, 1400064, 1320452, 1249566, 1181238, 1083255, 1040682, 1008996, 977213, 917495, 886154, 843913, 842122, 806364, 815019, 788391, 749951, 712539, 720547, 711168, 654044, 586457, 572683, 586956, 584609, 571822]
2543E71822M534l435m9852k9180J6118k1729j966m1378j406l0757R449L8948l8805
2530D22363n7523m1381M9559j6566L8270J464K4673Q955k6206l5182k09n1958
2518C16259K0470j6264J5206J123l3640m5173L7270J9221m9773L3530l4151o766
2506B57312J8701l6939j4891L2783l5915K3870j7854k4423j1856K9397k1542l3113
2494A65530L6925k6387R247j304M6935K9680l9957o1551r22q550J9050K4998J3340
2481B07034k6529m7357k4034K062J5635j516M3859K4684o6877n9034K2947j6534
2469G4340L8616k8001k0140o456J4112K8596r387k728K5131j2565o3633o475L443
2456C4853L2374J1573m7305J4366K6833j1684K5528r328m2924M2726Q605l1645
$$ y = [571822, 576356, 572921, 523069, 493889, 510007, 488278, 486312, 444934, 443528, 412771, 422220, 461168, 422363, 364840, 323459, 373018, 356452, 394722, 396186, 420859, 429814, 403608, 368426, 368217, 316259, 336729, 320465, 335671, 336794, 303154, 257981, 295251, 314472, 264699, 298229, 264078, 257312, 276013, 239074, 224183, 256966, 221051, 244921, 227067, 202644, 190788, 220185, 198643, 165530, 202455, 176068, 185315, 184011, 230946, 260626, 220669, 159118, 158196, 149646, 168696, 193694, 207034, 180505, 133148, 109114, 111176, 126811, 125295, 169154, 193838, 126961, 67927, 90874, 74340, 112956, 84955, 64815, 58359, 72471, 101067, 91680, 88952, 114083, 101518, 37885, 31410, 34853, 67227, 78800, 31495, 45861, 72694, 61010, 86538, 77210, 34286, 77012, 85617, 53972]
2444E3972n62J4027k873M4595j5716m9442O897l3534m2999K3903N2221r525k8029
2431A2935R750K9028m9449j3003M2321L2161K6396j9639O99r092N152n455Q473
2418G0277m943m9041M3583m0551K1934J4936N4711o855k1319K5187k1898m1340
2406D4681j0023L099m2900K4665L9950j5693K118m4062j3401J9835J3831j2755
2394I345k3352O304J8358K9017k9964r730j702L3916K2363J4370k5018J6158L6237
2381I6302j9960m4833l6177j9175l771J8169N4187L0224r802r5385J1798O1951
2369D3528K2736m790l5936L160l4196j1733k8053q157O2983k5982k9063K3102
2357b2401j4662K3877K0042P852K6177J1509k3034R271J1583M03J6517M2398j8787
$$ y = [53972, 53410, 67437, 64564, 109159, 93443, 44001, 50898, 17364, -25635, -1732, 50489, 40964, 12935, 22685, 51713, 2264, -10739, 31582, 63743, 90139, 70500, 71199, 62107, 67259, 61804, 70277, 65334, 16293, 59876, 19325, 41259, 56195, 110906, 104051, 82732, 107919, 86021, 44681, 34658, 37757, -5143, 19522, 59472, 43779, 45897, 1835, -11566, 8269, 22100, 9345, -14007, -7703, 10655, 39672, 9708, -22, -1724, 32192, 54555, 68925, 43907, 60065, 96302, 76342, 31509, -4668, -23843, -27614, -9445, 44742, 74966, 65164, -30221, -18423, 43528, 66264, 61474, 25538, 28698, -5498, -17231, -45284, -53441, 9542, -16440, -45503, -22401, -37063, -13186, 6856, 14708, 40885, 52394, 29360, 38631, 50214, 50617, 67134, 109532, 90745]
2344I0745l1165Q320j9490Q110N179l5055k9739K5500m3375J4236J4543n8365
2332e0556K2025p309l568K3153L5188J0177n8900j2972m896j434L4533k6591N3002
2319A1852k9395l2979M8398M2699l0486o7219p671K7067K1639l1278K7244j9054
2307c9183R522M0709j4695l7523J9942M4889j7506m1485K8851N0095N961k1412
2295B8165q167m122J9428p254l1062o14j251K6823O984j2362P261J9877K5162
2282F8868l2731m094J975m1550K9402L781p0539j5029K0834M0878m854Q609K3671
2269B9221K8002j0718P29J2163j1121m2438l3693q219P8754R389l3992K0224K5627
2256F3928j02k0505L3831m9222j6032l3575P161M0151P70k0276J475N289j1976
$$ y = [90745, 59580, 67900, 48410, 56520, 61699, 26644, -3095, 22405, -20970, -6734, 7809, -50556, -28531, -35840, -39408, -16255, 18933, 29110, -29790, -42762, -47658, -49092, -14559, -41150, 11852, -17543, -50522, -2124, 40575, 10089, -57130, -64801, -37734, -16095, -47373, -20129, -39183, -29661, 11048, -3647, -41170, -21228, 23661, 6155, -35330, -6479, 43616, 49577, 28165, 19998, 15876, 35304, 28050, -3012, -3626, -4877, 21946, 28930, 16568, 23829, 43706, 68868, 36137, 32043, 34018, -7532, 21870, 25651, -44888, -59917, -39083, 1795, -3059, 5550, 29221, 57223, 46505, 47234, 59397, 48276, 5838, -27855, -36074, 42680, 52069, 18077, 38301, 63928, 63826, 43321, 77152, 27930, 11898, -21677, -14516, 25635, 26405, 6129, 7604, 12893, 917]
2243I17L1836j3632K0610J4208l8269L8197K4960j072m0103k4341M0244m992l4892
2230A3671k426K5981L5893J7352m0834j5188J9646M4856j1860k1141m254l5452
2218B6244n703K8517R7751m7022k6580L0986j2q532j2577l6126M3599k787l4402
2205E3356L5874M953R799K5108K2525J799m1807o2532M3128M1883o720p7867R539
2192E9038M3102n0008J2142L2170l8917K1631P823m408M0812N4598r198j6406
2180A52379L3007k4493M2974m486J6681j4131J2794P303Q05J4548L6455j4243
2168B59593k4382j1881M5106J593q575q854j1450m120Q0394M0500n53J5588K8302
2155D01261m5900J7815O1399K5756L526j6212L1439J5028Q482L4777J16638l5468
$$ y = [917, 32753, 19121, 39731, 53939, 15670, 53867, 78827, 77755, 37652, 13311, 53555, 48563, 13671, 11245, 37226, 73119, 90471, 49637, 34449, 54095, 98951, 87091, 65950, 61696, 26244, 20541, 49058, 146809, 99787, 73207, 104193, 104181, 95649, 83072, 46946, 90545, 87758, 53356, 89230, 94183, 103982, 129090, 151615, 153414, 111607, 49075, 92203, 134086, 127366, 49499, 59038, 102140, 52132, 64274, 96444, 57527, 79158, 86981, 82573, 123385, 177983, 168785, 152379, 185386, 160893, 203867, 199381, 216062, 201931, 214725, 222028, 222833, 237381, 273836, 259593, 235211, 223330, 268436, 270029, 261454, 252600, 241150, 237030, 317424, 357924, 357371, 372959, 401261, 355361, 373176, 434575, 460331, 463857, 447645, 479084, 494112, 502594, 537371, 654009, 618541]
2143F18541j7136k3850j237K9981M410k2111N0814L6610K5341l215M3362K554
2131G44064K9413j585j1329N2163J7195N7954L0312K6100m4278l21P2363N1821
2119A023872N6075L4130P7452K4151M1948K1692M0772N9879O1842J08313J62215
2108A712341R1743M5969Q1243J40034J41207J07783O8428J49923J69394K04976
2098B913041K21208K80015L21768L07963K90215K98607K49164L52229M17006N67793
2088F219009O99282Q76531J203131J582519K043075K845241L279001L152399J947094
2079B3847282J401020j160466m660547m240074l048607k142786j620708j143710
2071G231404r91039q04502n68100l52998l30463k36882k17699k21554k32550l19215
$$ y = [618541, 601405, 577555, 576318, 606299, 610709, 588598, 639412, 676022, 701363, 698148, 741510, 744064, 773477, 771892, 760563, 812726, 829921, 887875, 918187, 944287, 900009, 899688, 972051, 1023872, 1079947, 1114077, 1191529, 1215680, 1257628, 1279320, 1320092, 1379971, 1441813, 1550126, 1712341, 1804084, 1850053, 1931296, 2071330, 2212537, 2320320, 2388748, 2538671, 2708065, 2913041, 3134249, 3414264, 3736032, 4043995, 4334210, 4632817, 4881981, 5234210, 5651216, 6219009, 6918291, 7794822, 8997953, 10580472, 12623547, 15468788, 18747789, 21900188, 23847282, 25248302, 24087836, 19427289, 15187215, 12138608, 9995822, 8375114, 7231404, 6240365, 5435863, 4867763, 4514765, 4184302, 3947420, 3729721, 3508167, 3275617, 2956402]
2061B956402k96852j87615j19866j22833j52817j19428j27241j46533j11107n7069
2051A515041o2006p2040j07483r4471K285k0052o8333o0363o2562n4386o5065
2040H50565l7819l3684k3312k714J3696p0909j5490p267m4010p6052j7963J9598
2028E54639m4053n5565k7971j9178R1088l4507k2721J7039k6288m5924P32Q903
2016C96194n0094L2582M443K5174n5395j3458J3032m3640k5407j7432j5374n872
2004B44753j7238J3181J6599k418Q399j2510p226j0767m13K66J619m1795o132
1991A86318p972K888m362k9663L8006j4462m2998j3890K6704k1676j5268k838
1979A00787J5644l4827k8043j5971M3084j2949L3910J9138k7557n0882K1073l6905
$$ y = [2956402, 2659550, 2471935, 2352069, 2229236, 2076419, 1956991, 1829750, 1683217, 1572110, 1515041, 1453035, 1380995, 1273512, 1179041, 1181326, 1161274, 1092941, 1032578, 970016, 915630, 850565, 812746, 779062, 755750, 753036, 766732, 695823, 680333, 673066, 629056, 553004, 535041, 554639, 510586, 455021, 427050, 407872, 498960, 464453, 441732, 458771, 432483, 386559, 387291, 396194, 346100, 378682, 383125, 408299, 352904, 339446, 352478, 308838, 283431, 265999, 250625, 244753, 227515, 240696, 257295, 254877, 263276, 250766, 243540, 232773, 232360, 232626, 234245, 192450, 186318, 178346, 181234, 176872, 147209, 185215, 170753, 127755, 113865, 140569, 118893, 103625, 100787, 116431, 81604, 53561, 37590, 80674, 67725, 101635, 120773, 93216, 42334, 63407, 26502]
1967B6502L1698j2170j2320J1018m4359L62J3886p65M3048j2738n6592k8119Q555
1954c1994N5834K5777m3055k0724M6937o914k1549L1925n500l487m760J7314n4175
1941a4371J0075J6787j0651J7504j7644J2472m2608k3773N2762K5980n1924p228
1929c2619L0705M9846m523k2338k9496K4648q610L1413j2652o5756K9603m0985
1917e0764M1690L9383l3374j3895J1350J3285o4012J3531O2573J8760r8520J8512
1905d1481K3503K6492k2930j7871P398K8115l4138m834k9938j3644L2793K7531
1893a9004m2629J4189J8035l4041m842L0019R2564k1627k7196j0613O890k3473
1881b1728l570M886j671j2750K1113r847k1707K4395O910L351J9806l7213r20
$$ y = [26502, 58200, 46030, 33710, 44728, 369, 731, 14617, 13852, 56900, 44162, -12430, -40549, -31994, 23840, 49617, 6562, -14162, 32775, 25861, 4312, 36237, 30737, 27250, 22490, 39804, -14371, -4296, 12491, 1840, 19344, 1700, 14172, -28436, -52209, 553, 26533, -25391, -32619, -1914, 47932, 43409, 21071, -8425, 16223, 7613, 39026, 26374, -39382, -9779, -50764, -9074, 30309, -3065, -16960, -5610, 7675, -56337, -42806, 19767, 38527, -59993, -41481, -17978, 8514, -14416, -32287, -24889, 3226, -30912, -35746, -65684, -79328, -46535, -19004, -61633, -47444, -29409, -63450, -68292, -38273, 54291, 32664, 5468, -5145, 1745, -21728, -25298, -20412, -22083, -34833, -13720, -23567, -45274, -20879, -13969, -10618, 9188, -28025, -28945]
1868b8945o676k8300k7103J3882K5992R721K747n6521R361O883K4906j7033J2296
1855e8790K3874L1411J4178l1684J1274o04j1915N3214n3278n7615m1871N875
1843a15931N8023J0831j5902o84J3194m7396m6357k4670P2922K453l893L1618
1831f5792O931j0144L5998R53j3593m5120L697R8647K9064m1996k9368k6834N728
1818e1829J956l6227M1460M7568P132L2254P118K9729J1846J3008l9771k93m6926
1805A7025K3302n1994l8091J6508J0873k8902l7037K4687k114M7054m4463N0601
1793a2551K6525n9991q6883L8797R021L2306J396K2406k4167m4155q265M6107
1781e9454L8040k2174J0251N99l1481k6068L8291j2620J5310K8521k7340j9650
$$ y = [-28945, -35621, -63921, -91024, -77142, -51150, -41429, -38682, -95203, -85842, -78959, -54053, -71086, -58790, -34916, -3505, 10673, -21011, -9737, -10341, -22256, 30958, -22320, -79935, -121806, -115931, -57908, -47077, -62979, -63663, -50469, -97865, -144222, -168892, -95970, -93517, -97410, -65792, -58861, -69005, -33007, -32054, -45647, -90767, -87070, 11577, 40641, -1355, -30723, -57557, -51829, -49873, -86100, -44640, 2928, 10060, 42314, 49432, 79161, 91007, 104015, 64244, 63951, 17025, 40327, -11667, -49758, -33250, -22377, -51279, -88316, -63629, -65743, -18689, -63152, -12551, 13974, -46017, -132900, -94103, -85082, -52776, -51380, -28974, -53141, -97296, -105561, -59454, -21414, -43588, -33337, -32738, -64219, -90287, -51996, -64616, -49306, -20785, -48125, -67775]
1769f7775K340k6188K0528K9698K6270l3289J1066k1310P652P708j8101o78k7189
1756h9268K2483K4236K017J496J8618l8402R722M1732j191K9264k4755m2914n6931
1743a03893k3874L148Q666k2719O5598q725J242J3306l1345K4791k0030n3192
1731a47027J1458M2824r401L4774L1070n462J2585r623O951L456k956o748o7986
1718a06085N0531J7555l8469M2709K3093o1367j0092J526J0315R418J8111Q767
1706c3988p804o5981J3162p568m9361N6346L7001l3451K2793L7934M7255l6155
1694a9817q4068O663M5760K9804j1919l0141j4804l0909K5040L9983P85j6427
1682f0050r803p029k3002L51J5843p615l3737O3255m396o3674M7339K4000l0196
$$ y = [-67775, -65435, -91623, -71095, -41397, -15127, -48416, -37350, -58660, -51008, -43300, -61401, -62079, -89268, -66785, -42549, -40532, -39036, -20418, -58820, -49098, -7366, -8557, 20707, -4048, -46962, -103893, -127767, -124619, -115953, -138672, -73074, -81799, -80557, -67251, -98596, -73805, -93835, -147027, -135569, -92745, -102146, -67372, -36302, -41764, -29179, -38802, -31851, -28395, -31351, -38099, -106085, -55554, -37999, -76468, -33759, -10666, -72033, -82125, -80599, -70284, -60866, -42755, -33988, -41792, -107773, -94611, -102179, -151540, -95194, -58193, -91644, -68851, -30917, 16338, -19817, -103885, -97222, -51462, -21658, -33577, -63718, -78522, -109431, -84391, -44408, -43623, -60050, -69853, -76882, -99884, -99533, -83690, -91305, -125042, -61787, -66183, -129857, -82518, -58518, -88714]
1669h8714k5805K5315L8027k7782j0882L6851M703O120J5672J3066K5323r125
1657B769m5568L4645L4987o2197l569l9403j4230M1079p549L2080l2003q220R270
1644e7909O795l6445K3994J3738J308l561m2145K6978L242K4576j9806J3411o0453
1631a06277j7119Q5065L4407k0011j7574j6601j3695K8623K0494j6317j5795n4750
1619a09550o100j8084N391J3202L6723L1445J9013j3557l484n731K574J751K1587
1606b4820j4009r305n6096J8178J9125j2185M8100m4179K7633O118O615j8888
1594e3713j3211M4457J9435l628J9059l4884m5298K2562P49j0137k0629L6914
1582c8324j3627j2390J6568o621J0996Q406j4127J6381M109m5208J5381M1256
$$ y = [-88714, -114519, -89204, -51177, -78959, -89841, -52990, -48287, -42167, -26495, -13429, 11894, 2769, -42799, -8154, 26833, -35364, -38933, -78336, -92566, -51487, -59036, -26956, -58959, -67179, -57909, -51114, -87559, -63565, -49827, -48519, -52080, -94225, -67247, -64005, -39429, -59235, -45824, -106277, -123396, -38331, -3924, -23935, -41509, -58110, -71805, -43182, -22688, -39005, -54800, -109550, -115650, -133734, -128343, -115141, -78418, -46973, -27960, -41517, -45001, -50732, -48158, -46407, -24820, -38829, -48134, -104230, -86052, -66927, -79112, -31012, -75191, -47558, -41440, -34825, -53713, -66924, -22467, -3032, -6660, 12399, -22485, -67783, -45221, -44472, -54609, -75238, -38324, -51951, -64341, -47773, -54394, -43398, -34992, -49119, -32738, -28629, -73837, -58456, -17200]
1570a7200j2833o422j346k6602m9236N0903K3462j4398q98m3347L1976l3699J3761
1557h5879J955J7265k3416J8008L0523j0801Q214K5111m7135J9503k0443J1245
1545e5850J4758m371j0508K3229M639n1496L0459J6314k6981l8456M335Q2316
1533a1612l4376m2137J4773J9981M3058k1097n9972q888L7437J0824p991J4616
1521d5384N5013p519o9436k0905L8587P291K0555l4995l7197K5533L1985O918
1509b9554n975k5834j7694l515j4553K8076M4496K5543l5943p6796M6011K1022
1497d4716k8171m6148K1181K8776K6810l3406K283j5600L1483L3852J4502m6524
1485e5678j1467q014K6574J672l357l0547l8693J4755L0169L7697l468J5946K7922
$$ y = [-17200, -30033, -36455, -37801, -64403, -113639, -62736, -39274, -53672, -54570, -97917, -65941, -99640, -85879, -83924, -66659, -90075, -72067, -41544, -52345, -44131, -19020, -66155, -46652, -67095, -55850, -41092, -45463, -55971, -32742, -28103, -79599, -49140, -32826, -59807, -98263, -93928, -11612, -45988, -88125, -73352, -53371, -10313, -31410, -91382, -100270, -62833, -52009, -60000, -45384, 9629, 2110, -67326, -88231, -49644, -42353, -21798, -56793, -93990, -68457, -36472, -29554, -35529, -61363, -79057, -82572, -97125, -69049, -24553, 990, -34953, -111749, -65738, -44716, -72887, -119035, -97854, -69078, -42268, -75674, -73391, -88991, -57508, -23656, -9154, -55678, -67145, -75159, -48585, -46913, -50270, -80817, -119510, -104755, -74586, -36889, -40357, -24411, 3511]
1472C511j9137k2190j8773l4230N8971k3133l9868j3495L8289J7885J509j6766
1460f7427L5997L2789l7869J2120k5189k2570K963N60L7018j7941N1528m0808
1448c8829k7395L1132L8427Q224n4661j0049J3913J2314O03p042k5207p312L1161
1435c4721k594J0041l6774J0348j7308J37j7838j8700J4965K3162L6707J9156
1423a3419l3614L965K0302j5152j647J8159j9521j9338N235M5944j3178l5051
1411e7315J6835J8848J8662j7756j7905n9070O0327j4231K2907l1164m0366l1785
1399a32013J8623O0514L0390r302k8056n903L6432M124l7634O8744n2953l5238
1387h2272K4325K1062k2318j7992J9103j3023k0653O778L639J9206k8932J0537
$$ y = [3511, -15626, -37816, -56589, -90819, -31848, -54981, -94849, -108344, -70055, -52170, -50661, -67427, -31430, 1359, -36510, -24390, -49579, -72149, -69186, -68626, -31608, -49549, 1979, -38829, -66224, -35092, 3335, 11559, -43102, -53151, -39238, -26924, -26321, -33363, -58570, -65882, -34721, -37315, -27274, -64048, -53700, -71008, -70871, -88709, -107409, -92444, -69282, -32575, -13419, -47033, -43068, -22766, -37918, -39565, -21406, -40927, -60265, -55030, -9086, -22264, -57315, -40480, -21632, -2970, -20726, -38631, -97701, -37374, -51605, -28698, -59862, -100228, -132013, -113390, -52876, -22486, -31788, -59844, -65747, -29315, -25191, -62825, 5919, -47034, -82272, -57947, -36885, -59203, -77195, -58092, -71115, -91768, -84990, -81351, -62145, -91077, -80540]
1375h0540L3936q436j007l9914K9141j7916l1685K2455M6194l9033Q4464k3465
1363b5806j9127R568K19R960n6740K7712J6484k2963K8784J6517n4129P731M586
1350e7204j9396L1595J4757j0801J0306K9792L9390k7851o1515Q151J7597J640
1338b3539n0442K4218N1850k4605o790J9138J4254L1847k0847p0458j9043M2354
1326c2063N0370m1657L518l7868l1378j423L4718J4842k8835K2934O408m4760
1314h5194O5871J4465j8977l338L1656o3544l9218N5963l873J3283K3965J6358
1302G417k4599K2298j2503k7372K9855k4076J3306Q818k3420l3878q644L5311
1290c7487p001n6187l3710M5976J5822o006j1971J8199J1600K8936K6325j09k9653
$$ y = [-80540, -46604, -55040, -56047, -95961, -66820, -84736, -116421, -93966, -47772, -86805, -2341, -25806, -44933, -35365, -35146, -25186, -81926, -54214, -37730, -60693, -31909, -15392, -69521, -61790, -57204, -76600, -45005, -30248, -41049, -30743, -951, 38439, 10588, -50927, -42776, -25179, -23539, -73981, -49763, 2087, -22518, -29308, -10170, 4084, 35931, 15084, -55374, -74417, -32063, 18307, -23350, -19832, -57700, -89078, -90501, -55783, -40941, -69776, -46842, -40434, -85194, -19323, -4858, -23835, -27173, 4483, -59061, -98279, -42316, -46189, -32906, -8941, 7417, -17182, 5116, -7387, -34759, -4904, -28980, -15674, -6856, -30276, -64154, -72798, -37487, -44488, -100675, -134385, -88409, -72587, -78593, -90564, -72365, -60765, -31829, -5504, -5613, -35266]
1277c5266Q059L3745N803l0318K5487J8558l3241m0252K3660O190j2828J7461
1265a2942p0480J3005N882K5030P038n622m2639K2675j53m91k6578L061K6048
1252e6166P01O978J0432l3284o439L1311k7126L1154K5712K7034j7632N583n8913
1239f0655J0778K606j4171J4095K0495j5397J4672N039l3697k4452J7941K692
1227f0054m5894j679K6773J0628J5848N2280K3148n1974j8836o51K1581L070k5316
1214e1076J7190j9392j6925J5899r274N905k9285j046L6222p909K3098m0970N9023
1201a8540k998n932l0502o536J9636k9851l152O0612o880k1077K068J2362l6753
1188f7543m0214M8549L6154k589n3564K4520J0713K2381j3542P545j7501J3754
$$ y = [-35266, -27207, 6538, 12341, -17977, 7510, 26068, -7173, -47425, -23765, -17575, -30403, -12942, -83422, -70417, -64535, -39505, -32467, -38089, -80728, -58053, -58206, -58697, -85275, -82214, -56166, -55465, -48487, -38055, -71339, -77778, -46467, -73593, -42439, -16727, 10307, -7325, -1742, -60655, -49877, -47271, -61442, -47347, -26852, -42249, -27577, -22538, -56235, -80687, -62746, -60054, -105948, -107627, -80854, -70226, -54378, -2098, 21050, -30924, -49760, -50411, -28830, -25760, -51076, -33886, -53278, -70203, -54304, -63578, -57673, -86958, -88004, -51782, -59691, -36593, -77563, -18540, -21538, -27470, -57972, -64508, -44872, -74723, -77875, -17263, -24143, -45220, -43152, -30790, -67543, -107757, -59208, -23054, -25643, -79207, -54687, -43974, -21593, -35135, -27590, -45091, -31337]
1176c1337l783j9738J4518J1547k201k0771q315K727R330j0795N492J6628k2547
1163e9245J1009J593l0708M5743j8153J1783M5100j6654k4051J8408M7701l7422
1151d896K4685J9154n8300l3956L0525l0318K5488L2637l0753k5025m1875J7422
1139g5212M3893j8390R006k087K3012L3353j6962J413K5311j9186l2344j7182
1127d5375k1165m263K4448N3998m1132K3733k9369m1608K4887N4510J9587m6601
1115b8350k2943j0902L0393J4168J1006j1024l7561l1448J2968M1067J5690p428
1103b4364L467m4542l6662L1417M4512O751K650k5985m440l854L7077K0490l7302
1090c0785j8041j8342L1264k8228L234Q016L1132J9161K2922n5338m4577M9022
$$ y = [-31337, -35120, -54858, -40340, -28793, -30994, -51765, -60080, -57353, -48023, -58818, -53326, -36698, -59245, -48236, -46643, -77351, -31608, -49761, -37978, 7122, -9532, -33583, -15175, 32526, -4896, 19789, 38943, -19357, -53313, -22788, -53106, -27618, 5019, -25734, -50759, -92634, -75212, -31319, -49709, -40703, -42790, -19778, 13575, -3387, -1974, 23337, 4151, -28193, -45375, -66540, -70803, -46355, 7643, -33489, -9756, -39125, -80733, -55846, -1336, 18251, -28350, -51293, -62195, -31802, -17634, -6628, -17652, -55213, -86661, -73693, -32626, -16936, -24364, -20897, -65439, -102101, -70684, -26172, -19421, -16771, -42756, -47196, -51050, -13973, 6517, -30785, -48826, -67168, -35904, -64132, -60898, -52882, -21750, -2589, 20333, -35005, -79582, -30560]
1078c0560j5067n190N3219j4989p655p135Q616j305m337q668J0208J7711K6790
1065B1638o5388k860J1698j3454k1727K7334M9496k7460l4775l81R1480o437m6268
1052a7104K1570L297m6498j1472J5989O3835J5496l1989j8123l3597j3217O382
1040d5431N377L1373j3878p139K7693J1962n5735K8892J2880o2638l2999O1983
1028c7660K918j333K4915P582k3499k9338J7091L72L5350j6868k250q630J1618
1015a9732M4229m4407J2350J3652j1811r551J9457L0273n3070k5930J4730m996
1003c4806L5990L2693q417j5150m5063N150O759r311J6980J9079O590k6150J3489
990b167N2949k8614n165R452n1465j5969j2074L8269J5567n460k2230N881J1645
$$ y = [-30560, -45627, -50817, 2402, -12587, -20242, -27377, -18761, -20066, -24403, -33071, -22863, -5152, 21638, -43750, -46610, -34912, -48366, -70093, -42759, 6737, -20723, -55498, -55879, 35601, 29164, -17104, 4466, 7763, -38735, -50207, -34218, 29617, 45113, 13124, -4999, -38596, -51813, -45431, -40054, -8681, -22559, -29698, -2005, 9957, -45778, -16886, -4006, -66644, -99643, -37660, -34742, -36075, -11160, -3578, -27077, -56415, -39324, -38952, -3602, -20470, -22720, -31350, -19732, 24497, -19910, -7560, 6092, -5719, -15270, 4187, 34460, -18610, -44540, -29810, -34806, 1184, 33877, 25460, 10310, -34753, -29603, -22844, -32155, -15175, 3904, 10494, -15656, -2167, 50782, 22168, 17003, 26455, -25010, -40979, -53053, -14784, 783, -4677, -26907, -21026, -9381]
977i381k9178r731K087J2886M3996N488n7369r885L3890j8669K426O5172O768
964C8500j7148m6914J3936l300j8310p120J2200j3566O295M002L505L1263l3014
951b9671p307L6905k9882l8553O095K4147L4731R749m2526j255J2771k7914J9764
938c2946j703K5095J9594K478j7677O597k7841k8285N3903M1140l4577p7364N761
925f5825L7294n0846M4258L4727n19N104j7949j7943l5170r495J4836k570J650
912f2448N3529l881j1125K974l322K7993q569m3075J7833m1787Q215K5784N9857
899B1978J9083p7980L1859N549J3341J2067L3173R988n581K430l6792k1877J648
886H886J2242M987j3595l7095j5247M090Q358N8104j8580o0571k8241j8480N5519
$$ y = [-9381, -38559, -48290, -46203, -33317, 10679, 16167, -41202, -51087, -17197, -35866, -33440, 31732, 38500, 21352, -25562, -11626, -14926, -33236, -40356, -28156, -41722, -35427, -31425, -27920, 3343, -29671, -36978, -73, -29955, -68508, -62413, -38266, -3535, 6214, -36312, -37567, -24796, -52710, -32946, -34649, -9554, 10040, 12518, -5159, 1438, -26403, -54688, -785, 40355, 5778, -71586, -65825, -28531, -79377, -35119, -392, -911, 4193, -13756, -31699, -66869, -76364, -61528, -64098, -62448, -8919, -12800, -23925, -20951, -24273, 3720, -4849, -47924, -30091, -71878, -63663, -37879, 21978, 41061, -36919, -5060, 489, 13830, 25897, 59070, 69058, 63477, 65907, 29115, 7238, 8886, 21128, 26115, 12520, -24575, -39822, -35732, -27374, 30730, 12150, -48421, -76662, -95142, -39623]
873c9623o500k4730N6919L5701n1007j2083J7490J906M2498k8571n7267N0957
861a4310l6325J1614O6226m657K8785R028p6118m0448q36j4156L4167M4288j9571
848a2313l9090j3063J0245K34L4136K4045j0696n337Q676l4172K4555M788o1158
835f9150k0571p207L6086M6088J5649J6565k7257J9565j2195n1669L0875M8256
823B5035q900p744p894K8435j800j7461J9466R975k38k3228m0611O724M6458m0482
809a2265J1213J0454L0734j1363q0190j3732O8033q597j9370p12L1620K8761k2849
796A1737K3074J4370j2579l4927N213L1683p20k8131l6959l783l6229M4630j1439
783c4060K0555K0449m968k6873K3939m8645j0670R627L2033J5587J616L4312k2520
$$ y = [-39623, -46123, -70853, -13934, 21767, -29240, -41323, -23833, -21927, 20571, -8000, -65267, -14310, -50635, -39021, 27205, 22548, 51333, 60361, -15757, -56205, -57041, -71197, -37030, 7258, -12313, -51403, -64466, -54221, -53987, -19851, 4194, -6502, -11839, -3163, -37335, -12780, -7992, -69150, -89721, -96928, -60842, -14754, 895, 17460, -9797, 9768, -2427, -54096, -23221, 25035, 16135, 8391, 497, 28932, 27132, 9671, 29137, 39112, 38874, 15646, -24965, -18241, 28217, -12265, -1052, 9402, 40136, 28773, -51417, -65149, 2884, -5713, -25083, -25795, 5825, 34586, 11737, 34811, 49181, 36602, 1675, 6888, 38571, 37851, 9720, -27239, -31022, -67251, -22621, -34060, -13505, 6944, 1976, -24897, -958, -49603, -60273, -50646, -18613, -3026, -1410, 32902, 10382]
770A0382K2230o6378k00J6073k8495k014M0410J1227K7628K9304q232l5497l0181
757a3743J8736j2955M253K7922L6323m2180J3346L93j0634K7327l369k4369m1396
744b0346L5422Q428q743r694J945O0186J077n1606n673p693M5419Q748k582l0316
730B4572L4645l5050k3898m759J8761L9274j7266m5534O594M2959q418k2049q954
717H77O7686m445l1916L4641K5557l6997n3840M3128L8221r965n358j4292m4859
704H438J0792O98j3987j5633o915j8083K0343K7302l9807J7426N7819K1147m2113
691B7427j8794j1825n745L5586j0093K2724J7460L130o7876K5702j6930n0319
679d9553J8212N2179J4136j2335l65k1080R716l626J3066l3627K1586k1099O7706
$$ y = [10382, 32612, -33766, -33966, -17893, -46388, -48402, -7992, 3235, 30863, 60167, 51935, 16438, -13743, 4993, -7962, -3709, 24213, 60536, 18356, 31702, 32095, 21461, 48788, 45419, 21050, -20346, 15076, 23504, 14761, 5067, 7012, 67198, 68275, 16669, 10996, 3303, 48722, 57470, 54888, 24572, 59217, 24167, 269, -4490, 14271, 53545, 36279, -9255, -2661, 40298, 31880, 9831, 877, 68563, 64118, 32202, 66843, 92400, 55403, 1563, 44691, 82912, 72947, 67589, 53297, 8438, 19230, 19928, 5941, -9692, -16607, -34690, -14347, 12955, -26852, -9426, 48393, 69540, 27427, 8633, -3192, -8937, 26649, 16556, 39280, 56740, 59870, -8006, 17696, 766, -49553, -31341, 20838, 34974, 22639, 22274, 1194, 10910, 7284, 20350, -13277, 8309, -12790, 54916]
666E4916K3147n4010n6516L1715N778j6557K0063Q186j7099J5078P197l3469k030
653a3601M3349K6236l0941r297l839m940J700j1741M3812k7157o78j1521k2125
640b0743K6866j1978k7356J1870L2542j3170r897L2692R204k7131J5130l5790
628a7761k3278L5241J1173n9832K8225N4016j4712R8r784J4900J4689q462n2249
615b7736L173k7411j4491N6390L669K8221P902m543n3511k3711l812M2148j6907
602c0619L25K0532r09M4505K7129m7847J8659o72P976m611j7651o860J0164J691
588B1812j1602j8707K7699L8875j6873q033n5302Q187j7450L1669Q267m2219Q355
575b5322L9093q896k8777L1445K2566j3756k2436o812P982K3941k2314J3781l2401
$$ y = [54916, 78063, 24053, -32463, -748, 5030, -11527, 8536, 16722, -377, 14701, 21898, -11571, -13601, 29748, 55984, 25043, 15746, 11907, 6967, 8667, -3074, 40738, 13581, 12903, 1382, -20743, 6123, -5855, -33211, -21341, 11201, -1969, -11866, 20826, 30030, 2899, 18029, -17761, -41039, -5798, 5375, -54457, -26232, 27784, 13072, 13170, 3386, 18286, 32975, 24513, -27736, -24563, -51974, -66465, -10075, -6406, 21815, 29717, 25174, -28337, -52048, -55860, -13712, -30619, -30294, -9762, -10671, 33834, 60963, 13116, 31775, 31103, 39079, 34468, 16817, 9957, 20121, 21812, 10210, -8497, 19202, 58077, 41204, 33171, -22131, -13944, -31394, 275, 8542, -33677, -25322, 13771, 4875, -23902, 7543, 30109, 16353, -6083, -12895, -4913, 19028, -3286, 10495, -21906]
562b1906M963L6255L2517o0356l5825L5829k0332J4575J902J03593n2641l2642
550E932J027L6037j7791k7115L8149K2583p2772K7703O98k3591J3385K4781L2332
537F1358k4675m7460N9117L8549q047n4964l8020O8606N193Q106k2822o0001J842
524a3218L7812p859L0465k703K0851l4663k4212O538J8306n024L531j75j8979
511A0670j2753J6466J7793K3035r7137m72O865J057k2273J1733N9914M2185n8084
498a001k4777J9821J7143m25n7138N6087j2676o73O762L2950m2775N52j7799J0294
484a3655L0185j8301l113M0817j4994n97J7614q0668K910M5105L4057k5804l3524
471a9968J9778O6062m061J8638o0029J8343K7646o1523R979L1506J6156n329r306
$$ y = [-21906, -16943, 19312, 51829, -8527, -44352, -8523, -28855, -14280, -12378, 91215, 38574, 5932, 6959, 42996, 25205, -1910, 36239, 58822, -13950, 13753, 14451, -9140, 4245, 29026, 61358, 36683, -10777, 48340, 86889, 78842, 23878, -14142, 54464, 59657, 67763, 44941, -15060, -13218, 24594, 16735, 47200, 44497, 65348, 30685, 6473, 13011, 31317, 26293, 29824, 29649, 10670, -2083, 14383, 32176, 55211, -41926, -42398, -35533, -34476, -56749, -45016, 14898, 57083, -1001, -25778, -5957, 11186, 10761, -46377, 9710, -2966, -3639, 3123, 36073, -6702, -6150, -23949, -13655, 16530, -1771, -4884, 35933, 20939, 20342, 37956, -42712, -39802, 5303, 39360, 13556, -19968, -190, 65872, 61811, 80449, 20420, 38763, 66409, 4886, 14865, 46371, 62527, 57198, 47892]
458D7892P334K873m7100K6762j1916J4138k2568L2718mo905j9200J28K5645l3634
444A6163K092r662q132K3883J3992k7934L7836K2860k8225l7188M4548n4479n972
431a0218N7980L5086l0842m6778R919q733m6337M3760l7650M4640P630L9631m1630
418A6458m1964N1216L0816l2125r026P3919n0392O48N109j0779K241M8111m1004
405D3228o4042J4277Q3263r130j7577n1639M8270L0430J7900k4390k5755m2100
393B735N7798L4540l3589m6816l7941L3321L879K4294K0727j7081R424j6991l4635
380c35l6777j1191k159N2544r870l960J4883M6538M5967n4488k9528K5144k9577
367G191q160M1988l1252r886j1631J1856Q547j4036K4786m564K3695j746j3262
$$ y = [47892, 55226, 58099, 10999, 37761, 25845, 39983, 17415, 50133, 50129, 43224, 24024, 24152, 49797, 16163, 18255, 8593, 461, 24344, 38336, 10402, 48238, 71098, 42873, 5685, 50233, -4246, -10218, 47762, 82848, 52006, 5228, 15147, 6414, -39923, 3837, -33813, 10827, 18457, 58088, 16458, -25506, 25710, 56526, 24401, 15375, 89294, 38902, 39550, 44659, 33880, 36121, 84232, 43228, -20814, -6537, 76726, 67596, 50019, -1620, 46650, 77080, 94980, 70590, 44835, 2735, 60533, 95073, 61484, 14668, -23273, 10048, 13927, 38221, 58948, 41867, 51291, 34300, -335, -37112, -48303, -50462, 2082, -7788, -11748, 3135, 49673, 95640, 41152, 11624, 36768, 7191, -969, 41019, 9767, -119, -11750, 106, 8653, -5383, 19403, 14839, 38534, 36788, 23526]
354B3526J161J4546k4789L5683L5137n3581M441p246J167p831J3860N40J0835
341D7449l1515J3177K5586M981J5595o0791m3129L4875o615J9516k9714n931K2744
328F228R02J3798K0815K479M000k9896J1529j607L0746o529k1952J9039j7785
315C1767n621N6563K0317n5103q726N7146r033m368p651l2794k6018j6199K357
302B637M753L4971L537l3667N359M159K0942k2770k0625K5256j662J0554L3628
289F7072N408n6979N7575k8088M641L0928j4187n975k2667k4314m8795K0525K9180
276A4324q138J3334J4519K068M9319q214l8392k2407k0694O309R0491r116m3569
263C9834L0174J8669j1624j4190J9263l5057j0218k6548J3534K7245k3823k3204
$$ y = [23526, 24687, 39233, 14444, 50127, 85264, 31683, 36124, 28878, 30045, 22214, 36074, 36614, 47449, 15934, 29111, 54697, 59678, 75273, 14482, -28647, 6228, -387, 19129, -10585, -16516, 6228, 7130, 20928, 41743, 44222, 48222, 18326, 29855, 28248, 58994, 52465, 30513, 49552, 31767, 26146, 82709, 103026, 47923, 39197, 96343, 87310, 82942, 75291, 42497, 16479, 280, 2637, 7390, 42361, 45898, 12231, 17590, 21749, 42691, 19921, -704, 24552, 22890, 33444, 67072, 72480, 15501, 73076, 44988, 49629, 80557, 66370, 60395, 37728, 13414, -35381, -14856, 14324, 6186, 19520, 34039, 36107, 85426, 77212, 38820, 16413, -4281, 2028, 92519, 83403, 39834, 70008, 88677, 77053, 62863, 82126, 47069, 36851, 10303, 23837, 51082, 27259, 4055]
251D055q570Q264J4770m716J1245L6562q522k6610m864J4252K6023K0344j5880
238F6353j1841n1529K983l653N355L870J5094k4945o405J7313N1562K7659Q975
225A00791l8868r207J6338J7184M6048l2847l1776j6616J8809j1155N314r452
213E4563O630k6885j0893k2374m090J6746M7002K3481j107o1438J3046K380j7714
200A9347o468L0323Q557O6272m5153m2039O7693n675k8491L1723q3172k8331p472
187b2886J6987M8385k0517j9852K5579l5774M247O1321r024N3345l1185n3278
175A7348J6303L3113l6727k5348K8051J7179m5268j5250m5507J5458O1753k1439
163c34K3977J8494L9167p3560n3584O8431J6775J4675j4163k3320n3577K8828
$$ y = [4055, -4515, 3749, 18519, 13803, 25048, 61610, 53088, 26478, 21614, 35866, 61889, 82233, 66353, 54512, 2983, 5966, 2313, 7668, 11538, 26632, 1687, -4718, 12595, 64157, 91816, 100791, 61923, 52716, 69054, 86238, 132286, 99439, 67663, 51047, 69856, 58701, 64015, 54563, 61193, 34308, 23415, 1041, -3049, 13697, 60699, 84180, 83073, 21635, 34681, 37061, 19347, 12879, 43202, 51759, 118031, 72878, 30839, 98532, 92857, 64366, 96089, 12917, -15414, -22886, -5899, 42486, 21969, 2117, 27696, -8078, -3831, 57490, 48466, 101811, 70626, 17348, 33651, 66764, 30037, 4689, 32740, 49919, 4651, -10599, -56106, -40648, 21105, -334, 23643, 42137, 81304, 7744, -45840, 22591, 39366, 54041, 39878, 16558, -37019, -8191]
151h191p776L942J1103n226K8147K9524k1495L824J4859o33k1544l6811l5820
138d6097L2015J9690J8759J3048k067K7837j647l0947J2362m5008J3L5137N758
125C8853Q408K5591L181k7069m472m617J2520J2422j5724k0853k0270M019L896
112A5885J7702L3788J2801p1050P594Q011j8424j6549K2519L5721K2433j1801
100E8630k5032p524m3144J6636J3990N304q672k3048K6164L8427K148r322k8263
87A6294j1217J5630j978K4085p833k8124J3323k14L5560J5834m072j3620k8712
74B4956M185K0316j6047r644l0944P85O637j8269K2072J4691o762L0241k1593
61B0624j0722M425J1833m8229L9743k840k1477J0585K254K3664M600k642j2150
$$ y = [-8191, -15967, -12025, -922, -6148, 21999, 51523, 30028, 33852, 48711, 48078, 26534, -10277, -46097, -14082, 5608, 24367, 37415, 35348, 63185, 61538, 30591, 42953, -2055, -2042, 33095, 38853, 47261, 72852, 76033, 48964, 44492, 39875, 52395, 64817, 49093, 28240, 7970, 11989, 15885, 33587, 67375, 80176, 9126, 16720, 24731, 6307, -10242, 12277, 47998, 70431, 58630, 33598, 26074, -17070, -434, 13556, 18860, 10188, -12860, 13304, 51731, 53879, 44557, 16294, 5077, 20707, 18729, 42814, 34981, 6857, 20180, 19966, 55526, 71360, 67288, 53668, 24956, 29141, 49457, 33410, 23766, -7178, -6393, 244, -18025, 4047, 18738, 11976, 42217, 20624, 9902, 14327, 26160, -22069, 17674, 14834, -6643, 3942, 6196, 29860, 34460, 31818, 19668]
48A9668K63R076O260k0327j2412l9417j7971J9526Q964L1138K053j9123k347R083
34e566K006r359M147k4241j1406J227J6811O0350k9387o660m555K2692l0163j9561
20c3665J8250K756m072j1944l393J5972J4997j5991J2071q103j3001q132R740
7b4515j0467j7183J573L3141k225k5865K7716
0a7825
$$ y = [19668, 19931, 29007, 35267, 14940, 2528, -36889, -54860, -35334, -26370, 4768, 6821, -12302, -14649, -5566, -3560, -12919, -8772, -33013, -44419, -43192, -26381, 33969, 4582, -2078, -6633, 16059, -14104, -33665, -15415, -12659, -16731, -28675, -32068, -16096, -1099, -17090, -5019, -13122, -26123, -34255, -24515, -34982, -52165, -50592, -17451, -19676, -45541, -17825]
$$ Imaginary data points
##PAGE= N=2
##DATA TABLE= (X++(I..I)), XYDATA
16383a454834J1379K8845L2539J9083l4499J2041O4864J598k9021K4784J2088
16372a311133L2173O0790m659j6338N4757J3627K6016K7601J7275l634L323l672
16360a103874J5477M7922K6120L1335L4905K8192J5030L0013K6742l0177L2366
16349h45949L2774K0315j8876L7719j0782J1177K9440Q284j940K8537k8144K9331
16337g08114O6580J3179O326J0547J3656K873R043K3304J9239J0793J1259L2439
16325d88876M3107r463o085L8665L4112j4236m663R0027Q374R274k9106m344N2211
16312b81003O213M7299j2498O024j9326K4365K6949L7026N867n979M0334J6659
16300a08070p048K1078K7259J7869j9922L7893j0626J965L5190J8606P129J6737
$$ y = [-1454834, -1443455, -1414610, -1382071, -1362988, -1397487, -1385446, -1320582, -1318984, -1348005, -1323221, -1311133, -1278960, -1218170, -1222829, -1239167, -1184410, -1170783, -1144767, -1117166, -1099891, -1103525, -1100202, -1103874, -1088397, -1040475, -1014355, -983020, -948115, -919923, -904893, -874880, -848138, -878315, -845949, -813175, -792860, -811736, -774017, -784799, -773622, -744182, -735898, -737838, -709301, -737445, -708114, -641534, -628355, -622029, -611482, -597826, -594953, -585910, -562606, -543367, -532574, -521315, -488876, -445769, -455232, -461317, -422652, -388540, -402776, -407439, -317412, -309038, -299764, -328870, -333214, -281003, -274790, -227491, -239989, -233965, -253291, -228926, -201977, -164951, -159084, -165063, -124729, -108070, -115118, -94040, -66781, -48912, -68834, -30941, -41567, -39602, -4412, 14194, 21323, 38060]
16288C8060l2291O4382l4625K6442k3603J1559M0090K5914N1281Q416l3734l948
16276A37943J1016J3123K1439K7925O9941j1744Q081k3461j8487J8474L2892M916
16264B92058J6048l972K5398J1786L2726N884K0662J5287J6272L5765l780k414
16252D61720m417j2058J1769Q35p441N8860M1729j0359p110N0975j1286l2443
16240E40774O3781P146l8154L1846L3287m8043J9904N1329Q36r129J5714q677
16228F60614j3709K1919L2275j1721K586k3399O4496o284r554L6987m966R883
16216G59127L2264l5144k323M9032L2973o8569J0731K8014q11J1814K1934N9299
16204H98341N67m7537K4312j8085j3530J0524M4051R559j5968k7283K4239K4178
$$ y = [38060, 5769, 70151, 35526, 61968, 38365, 49924, 90014, 115928, 167209, 175625, 141891, 137943, 148959, 162082, 183521, 211446, 281387, 269643, 277724, 254263, 235776, 254250, 287142, 292058, 308106, 304134, 329532, 341318, 374044, 379928, 400590, 415877, 432149, 467914, 464134, 461720, 457303, 445245, 457014, 457849, 450408, 509268, 550997, 540638, 533528, 584503, 573217, 540774, 604555, 611701, 573547, 605393, 638680, 590637, 610541, 661870, 662706, 653577, 669291, 660614, 646905, 668824, 701099, 689378, 691964, 668565, 733061, 726777, 717223, 754210, 749244, 759127, 791391, 756247, 753924, 802956, 835929, 767360, 778091, 806105, 805294, 817108, 839042, 898341, 898908, 851371, 875683, 857598, 844068, 854592, 898643, 908202, 892234, 864951, 889190, 913368]
16192I13368j0673j2309k0905P9690j8288j1656K0864Q848k0594J4992L4042K9221
16180A006600j3425r3800J1682P0328O281J7796R25l3449k6783K1124p510J0239
16168I70008O6628L0233m9188m596J3721J4286M3600J7320k5406O999k3637L216
16156A063184q488j7630K4473L5478M7392n0208p152N118l1934L4457K3363J337
16144A119390j0936m253m9476J1419J862M9266J7993l979j8910L3172p918L2773
16132A170403j4019k1321k3377k3021M5029L4899j7832q251J6486M1307M3296
16121A243599K526m3425K5994k3830k3873j3361j380K1048Q156k5254l0849O8348
16109A207699K9802j7969n1448K1427k6647j3517j0985M9654k868K4723m773o683
$$ y = [913368, 902695, 890386, 869481, 949171, 930883, 919227, 940091, 948939, 928345, 943337, 977379, 1006600, 993175, 899375, 911057, 981385, 987666, 1005462, 1006387, 972938, 946155, 967279, 959769, 970008, 1036636, 1066869, 1017681, 1013085, 1026806, 1041092, 1084692, 1102012, 1076606, 1083605, 1059968, 1063184, 1054696, 1037066, 1061539, 1097017, 1144409, 1094201, 1087049, 1092167, 1060233, 1094690, 1118053, 1119390, 1108454, 1104201, 1054725, 1066144, 1068006, 1117272, 1135265, 1131286, 1112376, 1145548, 1137630, 1170403, 1156384, 1135063, 1111686, 1088665, 1133694, 1168593, 1150761, 1142510, 1158996, 1200303, 1243599, 1246125, 1202700, 1228694, 1204864, 1180991, 1167630, 1166250, 1187298, 1195454, 1170200, 1139351, 1207699, 1237501, 1219532, 1168084, 1189511, 1162864, 1149347, 1138362, 1188016, 1185148, 1209871, 1205098, 1198415]
16097A198415k7050M385L1674k0233m163j9835J3678j6626r858N0119L9952l249
16085A237209K1734q070Q739m5296m7501K2052J0091j6868n171L2129m258j5037
16073A189753K6447L3778j1263K179l1025l090k7515J8695j7688J7263M9762m1488
16061A205808k7787N4114J1969k0120l4454K8477l498J3252r579J5947M1709k8628
16049A247210K0176k670j9498M736j7218J0466M9315p860j9134k1037l77M843
16037A248952m1658M775J6426J7062k0842q930R712L1513K4587m2072j4277j854
16025A223394l3475N3845J9873j7705M839o69J5624n620j6655m5532l8431K8846
16013A188334P6592K260l7213l0596K3071K7237J4823k6551k8959J0774O5656
$$ y = [1198415, 1171365, 1175750, 1207424, 1187191, 1183028, 1163193, 1176871, 1160245, 1150387, 1200506, 1240458, 1237209, 1258943, 1250873, 1259612, 1214316, 1166815, 1188867, 1198958, 1182090, 1176919, 1209048, 1204790, 1189753, 1216200, 1249978, 1238715, 1240894, 1209869, 1206779, 1179264, 1197959, 1180271, 1197534, 1247296, 1205808, 1178021, 1232135, 1244104, 1223984, 1189530, 1218007, 1214509, 1227761, 1218182, 1234129, 1275838, 1247210, 1267386, 1264716, 1245218, 1249954, 1232736, 1243202, 1292517, 1284657, 1265523, 1244486, 1244109, 1248952, 1207294, 1212069, 1228495, 1245557, 1224715, 1215785, 1225497, 1257010, 1281597, 1239525, 1225248, 1223394, 1189919, 1243764, 1263637, 1245932, 1250771, 1250102, 1265726, 1260106, 1243451, 1197919, 1159488, 1188334, 1264926, 1267186, 1229973, 1199377, 1222448, 1249685, 1264508, 1237957, 1208998, 1219772, 1285428]
16002A285428j7395m090q759p831o5610L0825m516Q940L1698j2898K5966p935
15990A253823J6244K9218q760n0135P811N403j5009J2187r251n2873L0763p003
15978A212418P071p203K7119N2757n5842l330M8528j2323J5463R47l671J5339
15966A297273k9169k3782j2873P611k336M5706O439J7691o1534m9288P1751N203
15954A272692q410k7840k8157L6144Q808N315j302j624q754n1097N42L6456J1994
15941A244767m2096L2641J3027p5055Q199q773p621L1876M443j6519J3909J4497
15929A213295L2443O2075P401j6376m2433k7235K447K6716L519j0089K0252m6754
15917A225261K6793k5089k5232P7665k7577k1500j7692M783N7544l3506k8190
$$ y = [1285428, 1268033, 1263943, 1255184, 1247353, 1181743, 1212568, 1208052, 1216992, 1248690, 1235792, 1261758, 1253823, 1270067, 1299285, 1290525, 1240390, 1248201, 1253604, 1238595, 1250782, 1241531, 1188658, 1219421, 1212418, 1219489, 1212286, 1239405, 1292162, 1236320, 1232990, 1281518, 1269195, 1284658, 1285605, 1281934, 1297273, 1268104, 1244322, 1231449, 1239060, 1236724, 1282430, 1288869, 1306560, 1245026, 1195738, 1267489, 1272692, 1264282, 1236442, 1208285, 1244429, 1253237, 1258552, 1257250, 1255626, 1246872, 1195775, 1196317, 1232773, 1244767, 1202671, 1235312, 1248339, 1173284, 1181483, 1172710, 1165089, 1196965, 1201408, 1184889, 1198798, 1213295, 1245738, 1307813, 1315214, 1298838, 1256405, 1229170, 1231617, 1258333, 1261852, 1251763, 1272015, 1225261, 1252054, 1226965, 1201733, 1279398, 1251821, 1230321, 1212629, 1217412, 1274956, 1241450, 1213260]
15906A213260J1500O189N863j9963J9534O5195l155p1269j0387K2697K3468J183
15894A264115J3287l4078K2354J600m925n051n523j2896j9742O0623l0449m2444
15882A206871j4038M2298M07J1388K9494J1210m4592l746M9554l3116j9068j8577
15870A218085N5649L9001l0038m1692L1282K3570K9335l022m4958J057R243k2381
15858A265131n651k5226j3653K1157K2312L0223n2415J7618K9418m2484j5434
15847A230996M0184M7545n7960j3341L4864l1874L1131k7108J9741P997n5457
15836A226718j4261N1084J16k9294K5508r782n7879J8161N3797j1210L6029J3697
15824A302684o066J8165l7885J303O4386m9969k3535L449M56l5442J1729J5419
$$ y = [1213260, 1224760, 1230949, 1236812, 1216849, 1236383, 1301578, 1298423, 1227154, 1216767, 1239464, 1262932, 1264115, 1277402, 1243324, 1265678, 1267278, 1262353, 1257302, 1251779, 1238883, 1219141, 1279764, 1249315, 1206871, 1192833, 1235131, 1235538, 1246926, 1276420, 1287630, 1243038, 1239292, 1288846, 1255730, 1236662, 1218085, 1273734, 1312735, 1282697, 1241005, 1272287, 1295857, 1325192, 1322170, 1277212, 1278269, 1287512, 1265131, 1259480, 1234254, 1220601, 1241758, 1264070, 1294293, 1241878, 1259496, 1288914, 1246430, 1230996, 1271180, 1318725, 1260765, 1247424, 1282288, 1250414, 1281545, 1254437, 1274178, 1282175, 1226718, 1212457, 1263541, 1263657, 1234363, 1259871, 1250089, 1192210, 1210371, 1264168, 1252958, 1288987, 1302684, 1296618, 1314783, 1276898, 1278201, 1342587, 1292618, 1269083, 1272532, 1272988, 1237546, 1249275, 1264694]
$$ [...]
##END NTUPLES=NMR SPECTRUM
##END=
