##TITLE=1H_EC-3289(2)
 CDCl3
 8 sc, 
 20.1.2023
##JCAMPDX= 6.0         $$ Bruker NMR JCAMP-DX V2.0
##DATA TYPE= NMR SPECTRUM
##DATA CLASS= NTUPLES
##ORIGIN= UXNMR, Bruker Analytische Messtechnik GmbH
##OWNER= root
$$ XWIN-NMR		Version 3.5
$$ Fri Jan 20 14:11:42 2023 Russian Standard Time (UT+4h)  she@DPX200
##.OBSERVE FREQUENCY= 200.13135
##.OBSERVE NUCLEUS= ^1H
##.ACQUISITION MODE= SIMULTANEOUS
##.ACQUISITION SCHEME= undefined
##.AVERAGES= 8
##.DIGITISER RES= 18
##SPECTROMETER/DATA SYSTEM= spect
##.PULSE SEQUENCE= zg30
##.SOLVENT NAME= CDCl3
##.SHIFT REFERENCE= (INTERNAL, CDCl3, 0, 15.7513)
##AUDIT TRAIL= $$ (NUMBER, WHEN, WHO, WHERE, WHAT)
$$ ##TITLE= Audit trail, XWIN-NMR		Version 3.5
$$ ##JCAMPDX= 5.01
$$ ##ORIGIN= Bruker BioSpin GmbH
$$ ##OWNER= she
$$ F:/spectra/data/she/nmr/H-F/1/pdata/1/auditp.txt
$$ ##AUDIT TRAIL=  $$ (NUMBER, WHEN, WHO, WHERE, WHAT)
(   1,<2023-01-20 14:10:40.34 +0400>,<she>,<DPX200>,
      <created by zg, POWCHK disabled, PULCHK disabled
       configuration hash MD5:
       00 E9 B6 7A A2 85 ED C7 34 08 36 98 17 FE 4E 26
       data hash MD5: 16K
       41 57 D8 0A 9D 28 D2 30 62 0D C2 52 BA BB F8 FF>)
(   2,<2023-01-20 14:10:42.53 +0400>,<she>,<DPX200>,
      <Start of raw data processing
       efp BC_mod = 2 LB = 0.24 FT_mod = 6 PKNL = 1 PHC0 = -19110.59 PHC1 = 9.800791 SI = 16K 
       data hash MD5: 16K
       34 D4 6A 19 07 9F 8F D1 15 10 8A CF B9 00 1C 9A>)
(   3,<2023-01-20 14:10:59.98 +0400>,<she>,<DPX200>,
      <pk PHC0 = -0.282482 PHC1 = -1.490116e-08 
       data hash MD5: 16K
       6C 62 4A EE EA 5E BB A2 43 32 23 F9 95 FE 97 C8>)
(   4,<2023-01-20 14:11:02.96 +0400>,<she>,<DPX200>,
      <abs ABSG = 5 
       data hash MD5: 16K
       06 A3 A8 96 41 BE DB 5D 2F BF 10 28 D5 1A CA FA>)
$$ ##END=
$$ 
$$ hash MD5
$$ C9 13 35 07 75 E6 73 AC 5F CE DA 2B E9 19 0E E1
##$RELAX= 
##$RELAX= 
##$RELAX= 
##$RELAX= 
##$RELAX= 
##$RELAX= 
$$ Bruker specific parameters
$$ --------------------------
##$DU= <F:/spectra>
##$EXPNO= 1
##$NAME= <H-F>
##$PROCNO= 1
##$TYPE= <nmr>
##$USER= <she>
##$AMP= (0..31)
100 100 100 100 100 100 100 100 100 100 100 100 100 100 100 100 100 100 
100 100 100 100 100 100 100 100 100 100 100 100 100 100 
##$AQSEQ= 0
##$AQ_mod= 1
##$AUNM= <au_zg>
##$AUTOPOS= <>
##$BF1= 200.13
##$BF2= 200.13
##$BF3= 200.13
##$BF4= 200.13
##$BF5= 200.13
##$BF6= 200.13
##$BF7= 200.13
##$BF8= 200.13
##$BYTORDA= 1
##$CFDGTYP= 0
##$CFRGTYP= 5
##$CHEMSTR= <none>
##$CNST= (0..31)
1 1 145 1 1 1 1 1 1 1 1 1 1 1 1 1 1 1 1 1 1 1 1 1 1 1 1 1 1 1 1 1 
##$CPDPRG= <>
##$CPDPRG1= <>
##$CPDPRG2= <>
##$CPDPRG3= <>
##$CPDPRG4= <mlev>
##$CPDPRG5= <mlev>
##$CPDPRG6= <mlev>
##$CPDPRG7= <mlev>
##$CPDPRG8= <mlev>
##$CPDPRGB= <>
##$CPDPRGT= <>
##$D= (0..31)
0 1.2 0 0 0 0 0 0 0 0.06 0 0.03 0 0 0 0 0.0002 0 0 0 0 0 0 0 0 0 0 0 0 
0 0 0 
##$DATE= 1674209439
##$DBL= (0..7)
120 120 120 120 120 120 120 120 
##$DBP= (0..7)
150 150 150 150 150 150 150 150 
##$DBP07= 0
##$DBPNAM0= <>
##$DBPNAM1= <>
##$DBPNAM2= <>
##$DBPNAM3= <>
##$DBPNAM4= <>
$$ [...]
##$SUBNAM3= <"">
##$SUBNAM4= <"">
##$SUBNAM5= <"">
##$SUBNAM6= <"">
##$SUBNAM7= <"">
##$SUBNAM8= <"">
##$SUBNAM9= <"">
##$SW= 18.05172834244
##$SWIBOX= (0..15)
0 0 2 0 0 0 0 0 0 0 0 0 0 0 0 0 
##$SW_h= 3612.71676300578
##$TD= 16384
##$TD0= 1
##$TE= 0
##$TE2= 300
##$TE3= 300
##$TEG= 300
##$TL= (0..7)
0 120 120 120 120 120 120 120 
##$TP= (0..7)
150 150 150 150 150 150 150 150 
##$TP07= 0
##$TPNAME0= <>
##$TPNAME1= <>
##$TPNAME2= <>
##$TPNAME3= <>
##$TPNAME4= <>
##$TPNAME5= <>
##$TPNAME6= <>
##$TPNAME7= <>
##$TPOAL= (0..7)
0.5 0.5 0.5 0.5 0.5 0.5 0.5 0.5 
##$TPOFFS= (0..7)
0 0 0 0 0 0 0 0 
##$TUNHIN= 0
##$TUNHOUT= 0
##$TUNXOUT= 0
##$USERA1= <user>
##$USERA2= <user>
##$USERA3= <user>
##$USERA4= <user>
##$USERA5= <user>
##$V9= 5
##$VALIST= <valist>
##$VCLIST= <CCCCCCCCCCCCCCC>
##$VD= 0
##$VDLIST= <DDDDDDDDDDDDDDD>
##$VPLIST= <PPPPPPPPPPPPPPP>
##$VTLIST= <TTTTTTTTTTTTTTT>
##$WBST= 1024
##$WBSW= 4
##$XGAIN= (0..3)
0 0 0 0 
##$XL= 0
##$YL= 0
##$YMAX_a= 261711
##$YMIN_a= -402552
##$ZGOPTNS= <>
##$ZL1= 120
##$ZL2= 120
##$ZL3= 120
##$ZL4= 120
##$ABSF1= 15.75681
##$ABSF2= -2.295039
##$ABSG= 5
##$ABSL= 3
##$ALPHA= 0
##$AQORDER= 0
##$ASSFAC= 0
##$ASSFACI= 0
##$ASSFACX= 0
##$ASSWID= 0
##$AUNMP= <proc_1d>
##$AZFE= 0.1
##$AZFW= 0.1
##$BCFW= 0
##$BC_mod= 2
##$BYTORDP= 0
##$COROFFS= 0
##$CY= -3
##$DATMOD= 1
##$DC= 0
##$DFILT= <>
##$DTYPP= 0
##$F1P= 0
##$F2P= 0
##$FCOR= 1
##$FTSIZE= 16384
##$FT_mod= 6
##$GAMMA= 0
##$GB= 0
##$INTBC= 1
##$INTSCL= 3.70164e-10
##$ISEN= 128
##$LB= 0.24
##$LEV0= 0
##$LPBIN= 0
##$MAXI= 10000
##$MC2= 0
##$MEAN= 0
##$ME_mod= 0
##$MI= 1.114404
##$NCOEF= 0
##$NC_proc= -6
##$NLEV= 6
##$NOISF1= 3.799351
##$NOISF2= 2.8
##$NSP= 0
##$NTH_PI= 0
##$NZP= 0
##$OFFSET= 15.7513
##$PC= 1
##$PHC0= -19110.87
##$PHC1= 9.800791
##$PH_mod= 1
##$PKNL= yes
##$PPARMOD= 0
##$PSCAL= 0
##$PSIGN= 0
##$REVERSE= no
##$SF= 200.13000405231
##$SI= 16384
##$SIGF1= 3
##$SIGF2= 2
##$SINO= 5.538805
##$SIOLD= 16384
##$SREGLST= <1H.CDCl3>
##$SSB= 0
##$STSI= 16384
##$STSR= 0
##$SW_p= 3612.71676300578
##$SYMM= 0
##$S_DEV= 0
##$TDeff= 16384
##$TDoff= 0
##$TI= <>
##$TILT= no
##$TM1= 0
##$TM2= 0
##$TOPLEV= 0
##$USERP1= <user>
##$USERP2= <user>
##$USERP3= <user>
##$USERP4= <user>
##$USERP5= <user>
##$WDW= 1
##$XDIM= 16384
##$YMAX_p= 348507890
##$YMIN_p= -260874
$$ End of Bruker specific parameters
$$ ---------------------------------
##NTUPLES= NMR SPECTRUM
##VAR_NAME=  FREQUENCY,     SPECTRUM/REAL,   SPECTRUM/IMAG
##SYMBOL=    X,             R,               I
##VAR_TYPE=  INDEPENDENT,   DEPENDENT,       DEPENDENT
##VAR_FORM=  AFFN,          ASDF,            ASDF
##VAR_DIM=   16384,         16384,           16384
##UNITS=     HZ,            ARBITRARY UNITS, ARBITRARY UNITS
##FACTOR=    0.220516191357247, 1,           1
##FIRST=     3152.30770442935, 0,            0
##LAST=      -460.409058576426, 0,           0
##MIN=       -460.409058576426, -260874,     0
##MAX=       3152.30770442935, 348507890,    0
$$ Real data points
##PAGE= N=1
##DATA TABLE= (X++(R..R)), XYDATA
$$ [...]
5754A711544Q4920Q1579j42182j733O8451j3841R4736O2701l8890j8562p5634
5743A813089R3246J04776k1649m5040j0520J12178L7357k5421J08608Q1663L7718
5732B286005q1302n1554j911N7786N490m1201l1925J2345N0152M556q6831J2124
5720B133734P5930r7603J7562M3963j05326p4449R0324m6653j6963l1610J69817
5709B158726o8732j56691p1980L293n1181j5897Q2956k3238o9231J47665J01151
5698B036841j40297r222P7385r696m620o350L4715n45j1383N6757m9704O4931
5686B038812l8808j3187R2875j1168p7757o483k5584J3377m9308r9895Q3731O4151
5674A970756j0917n3251j26305J1304J00641P851r484j0168M1761J10894N6853
$$ plain form
5754 1711544 1796464 1878043 1735861 1734128 1802579 1788738 1883474 1946175 1907285 1888723 1813089
5743 1813089 1906335 2011111 1989462 1944422 1933902 2046080 2083437 2058016 2166624 2248287 2286005
5732 2286005 2204703 2153149 2151238 2209024 2214514 2173313 2141388 2153733 2203885 2208441 2121610 2133734
5720 2133734 2209664 2112061 2129623 2173586 2068260 1993811 2084135 2037482 2020519 1988909 2158726
5709 2158726 2089994 1933303 1861323 1864616 1813435 1797538 1880494 1857256 1788025 1935690 2036841
5698 2036841 1896544 1887322 1964707 1955011 1950391 1944041 1978756 1978211 1966828 2023585 1973881 2038812
5686 2038812 2000004 1986817 2079692 2068524 1990767 1984284 1958700 1972077 1922769 1822874 1906605 1970756
5674 1970756 1959839 1906588 1780283 1791587 1892228 1900079 1890595 1880427 1922188 2033082 2089935
5663B089935k3166j02443l086M3334k8997J04764m4797k4071q3969r9J39287J01726
5651B168418K1883n8194O27j4141J8986l4023J00309j6278O0420L0774P7194P4852
5639B430827J666Q1397M6490R630l1529m7183R0259l5912j22594J03593P1856
5628B598500l2190q4115L3240N0692r4742P4877K8560L1403o2185R3545J57141
5617B794726J4829L6849m8791O1185J10874K6530j5993m0662O4904J16716J02110
5606C223277M8129L7382Q2918N5901k3923J17188K02840L5884Q3949J81006J45297
5595D189848Q7304L9155N2540J14293j8738q3427L2987N6851o2417k07646K5536
5584D226286J7534J26352M0740o8821K0972J3559o3587L3334J40890k4673J30907
$$ plain form
5663 2089935 2066769 1964326 1961240 2004574 1975577 2080341 2035544 2011473 1927504 1927405 2066692 2168418
5651 2168418 2190301 2132107 2132734 2118593 2137579 2103556 2203865 2187587 2248007 2278781 2355975 2430827
5639 2430827 2432493 2513890 2560380 2570010 2538481 2491298 2581557 2545645 2423051 2526644 2598500
5628 2598500 2566310 2482195 2515435 2566127 2471385 2546262 2574822 2606225 2544040 2637585 2794726
5617 2794726 2809555 2846404 2797613 2858798 2969672 2996202 2980209 2939547 3004451 3121167 3223277
5606 3223277 3271406 3308788 3391706 3447607 3423684 3540872 3743712 3779596 3863545 4044551 4189848
5595 4189848 4277152 4316307 4368847 4483140 4464402 4380975 4413962 4470813 4408396 4200750 4226286
5584 4226286 4243820 4370172 4410912 4342091 4363063 4376622 4313035 4346369 4487259 4462586 4593493
5573D593493J03646J84786J44205o4645N26J35424J88327K54106Q545J10017J91390
5562E849820K86259J55762N2163J90980J71277R2732Q9238J85615K25532J60259
5552G459637J19579L54638J46072L11259L28757K56160N6434j34288l03777n18846
5542H075625n69250l89416l60662k96162k00559j89442q8451j65521j43777j22852
5532E549533k3845j58572m5760q4068o923n2519l245R1146Q2061j002O8007J00864
5520E515677J07198K06279R4663P0854J13603L6682l1444K1034l9345k58201k34911
5509E602089l2529J1355j89600k6958n7271j35163r2440j29169p6265j96679q1903
5498D595467n8805j07236l4562j19784P0379j2304l4225p3065N7143j8519M9854
$$ plain form
5573 4593493 4697139 4881925 5026130 4961485 4962011 5097435 5285762 5539868 5548413 5658430 5849820
5562 5849820 6136079 6291841 6344004 6534984 6706261 6798993 6888231 7073846 7299378 7459637
5552 7459637 7579216 7933854 8079926 8391185 8719942 8976102 9032536 8898248 8594471 8075625
5542 8075625 7506375 7116959 6756297 6460135 6259576 6070134 5981683 5816162 5672385 5549533
5532 5549533 5525688 5367116 5321356 5237288 5230365 5177846 5174601 5265747 5347808 5346806 5414813 5515677
5520 5515677 5622875 5829154 5923817 5994671 6108274 6144956 6113512 6134546 6095201 5837000 5602089
5509 5602089 5569560 5580915 5391315 5364357 5307086 5171923 5079483 4950314 4874049 4677370 4595467
5498 4595467 4536662 4429426 4394864 4275080 4345459 4333155 4298930 4225865 4283008 4264489 4314343
5487D314343O4090k0417N5264j04398J03477J72736O0689R4889J26489R0541N8825
5476E016528M1600n6552j11949k7137p3354J3013q0587j59346K3394j8293j10551
5465D456766j4913j35019O751J22804o1741o8016N5988m0249P5235N2708J51885
5454D602199Q2810J0919J49521N7071J5040K02239J16249P0366J71853J25126
5444E603393k4982O215l6040m8553p5234j34216m5148M7307O3934K0870K9555
5433E407101M2170K09M5532j02014p5217p562N28J48896M6665Q7643J74059R4996
5421E863006J69908L00070J0164O9927J11451l2110n980p5800j073M1515L1359
5410F482437K4757q1855q2918M7162O1068k18894N0232L8146k0035J42895J88510
$$ plain form
5487 4314343 4378433 4358016 4413280 4308882 4412359 4585095 4645784 4740673 4867162 4957703 5016528
5476 5016528 5058128 5001576 4889627 4862490 4789136 4802149 4721562 4562216 4585610 4567317 4456766
5465 4456766 4441853 4306834 4313585 4436389 4374648 4306632 4362620 4322371 4397606 4450314 4602199
5454 4602199 4685009 4695928 4845449 4902520 4917560 5119799 5236048 5306414 5478267 5603393
5444 5603393 5578411 5584626 5548586 5500033 5424799 5290583 5245435 5292742 5356676 5377546 5407101
5433 5407101 5449271 5449480 5495012 5392998 5317781 5310219 5310747 5459643 5506308 5593951 5768010 5863006
5421 5863006 6032914 6332984 6343148 6413075 6524526 6492416 6486436 6410636 6409563 6451078 6482437
5410 6482437 6507194 6425339 6342421 6389583 6450651 6231757 6281989 6320135 6300100 6442995 6631505
5399F631505k5664P0794Q8995J06633J43647K15288K77520K01419K89278J11263
5389H110678J66359K8144p0870M4839J40026J08935Q6309P5933L4724n1756j0938
5378H662383j13276j47401j12729n6077o0666q5412J55343N4495l5649J26711
5368H387722O7844J33449R0031Q0578K22698K50225K22114K02815J93626J35010
5358I986112J43600J52655J33098L36518K23841K09988K98348J43795J32934J13471
5348A1874360J41290J78582J09416L08743M80432M03118O37960Q05025J086227
5339A6025153J416947J529104J520804J255565J002628J68325k32068m27002n88824
5330B1670632n96688l63381j63678k25309k05881k05872m79645n40958l37458
$$ plain form
5399 6631505 6605841 6676635 6765630 6872263 7015910 7231198 7508718 7710137 7999415 8110678
5389 8110678 8277037 8305181 8234311 8279150 8419176 8528111 8614420 8690353 8725077 8673321 8662383
5378 8662383 8549107 8401706 8288977 8232900 8172234 8086822 8242165 8296660 8261011 8387722
5368 8387722 8455566 8589015 8679046 8759624 8982322 9232547 9454661 9657476 9851102 9986112
5358 9986112 10129712 10282367 10415465 10751983 10975824 11185812 11484160 11627955 11760889 11874360
5348 11874360 12015650 12194232 12303648 12612391 13092823 13495941 14133901 14938926 16025153
5339 16025153 17442100 18971204 20492008 21747573 22750201 22918526 22686458 22259456 21670632
5330 21670632 21073944 20710563 20546885 20321576 20115695 19909823 19430178 18889220 18551762
5321A8551762l66235k10686q6525P1604K74284M39125P24162R25839J050178J401605
5311B2775113J703090K115835K362516K397571K256504J820826J278560O17032
5303C7327047K11290J00271K39282N60618J006757J442986J054485L26502q92633
5294D1376605k052565k889515l135765k850565k400945j800589j348860j102732
5286B3795069o60871l41089k66339J3616L40761M76479Q83066J225793J451060
5277B6917545J268796J058698R07725N99368P06291Q37201J050552J257354J100174
5268C5703704L85535o91274j555261k085453k574479k506836k008206j721588
5260B2946142j410401j133448q13243n32145n53474m49366l43703j97271j76233
$$ plain form
5321 18551762 18185527 17974841 17888316 17959920 18234204 18673329 19397491 20323330 21373508 22775113
5311 22775113 24478203 26594038 28956554 31354125 33610629 35431455 36710015 37327047
5303 37327047 37538337 37638608 37877890 38438508 39445265 40888251 41942736 42269238 41376605
5294 41376605 39324040 36434525 33298760 30448195 28047250 26246661 24897801 23795069
5286 23795069 23134198 22793109 22526770 22540386 22881147 23357626 24240692 25466485 26917545
5277 26917545 28186341 29245039 30152764 30752132 31458423 32295624 33346176 34603530 35703704
5268 35703704 36089239 35397965 33842704 31757251 29182772 26675936 24667730 22946142
5260 22946142 21535741 20402293 19589050 19056905 18503431 18054065 17710362 17513091 17336858
5251A7336858k31405p7018j70685m2298j21468r0853K0876J57810K177N3866J75567
5240A7013427K61343K91248L36803N10644P27100R09707J091674J299375J607250
5231B4048571K105278K331474K716854K640011K301507J381173L14847p04648
5223C7135067j475094j538300j127776q24034n20734m33468o75181q96712j124828
5214B8518940j092424p15390l72364j3998J91556L49476N31193Q23996J359309
5205B9580294J785615K162416K390113K212856J693609Q67025j54576o78896r56401
5196C8902055j072842q05093n95943n97776o31994p73257j038621p97891o56159
5187C1932479q08832j124480j410381j559417j676839j531215j501428j288481
$$ plain form
5251 17336858 17105453 17028435 16857750 16815452 16693984 16603131 16624007 16781817 16783994 16837860 17013427
5240 17013427 17274770 17566018 17902821 18413465 19140565 20050272 21141946 22441321 24048571
5231 24048571 26153849 28485323 31202177 33842188 36143695 37524868 37839715 37135067
5223 37135067 35659973 34121673 32993897 32169863 31649129 31215661 30540480 29643768 28518940
5214 28518940 27426516 26711126 26338762 26324764 26516320 26865796 27396989 28220985 29580294
5205 29580294 31365909 33528325 35918438 38131294 39824903 40691928 40537352 39858456 38902055
5196 38902055 37829213 37024120 36428177 35830401 35198407 34425150 33386529 32588638 31932479
5187 31932479 31123647 29999167 28588786 27029369 25352530 23821315 22319887 21031406
5179B1031406q64191p15259n47421j58341p6172N0057K49279J79836N9066M9834
5169A9258094n1597j48499J6756J46420L63756L37950M33668K41794r4704o99844
5159A9803794j169118j361035j420907j200639r40334o99053m73979l62775k60041
5150A1915913j95099k15799k4904J55512K14901L10471J95297K36865L7573j30877
5140A2499853l71416o18843n15408m89488m15657l20072j29621j5942n4796k3284
5130I545326K11254K03314L78907M18277O27716O65936P56302J189459J642454
5121A5638945J955564J917480J280079L94158p08832j641335k106702k012999
5113A4716358j778199j454432j124288r13690n80349n73960m83548n09258m38258
$$ plain form
5179 21031406 20167215 19451956 18904535 18746194 18670022 18720079 18969358 19149194 19208260 19258094
5169 19258094 19206497 19057998 19074754 19221174 19584930 19922880 20356548 20598342 20503638 19803794
5159 19803794 18634676 17273641 15852734 14652095 13711761 13012708 12538729 12175954 11915913
5150 11915913 11720814 11505015 11480111 11635623 11850524 12160995 12356292 12593157 12630730 12499853
5140 12499853 12128437 11509594 10994186 10504698 10089041 9768969 9639348 9623406 9568610 9545326
5130 9545326 9756580 9959894 10338801 10757078 11384794 12050730 12807032 13996491 15638945
5121 15638945 17594509 19511989 20792068 21186226 20477394 18836059 16729357 14716358
5113 14716358 12938159 11483727 10359439 9445749 8865400 8291440 7807892 7298634 6860376
5104F860376l43368l20037j97483k03149k56881p5707j78981j77727j55757j27513
5094D823773j69197j08067j16395m685j32616p4916R0478k867j52855n7348q291
5083D087014k2708j3608K6614M7658p4015o4683j85796l6931K1166J6565k5606
5072C775670N865o5481M0597n4897j04376r8070M6210j26455q437j4878n1079
5061C344669o4959j07986J9939k1251j14349J6610M7618J06465Q6215N559p4441
5050C244089M2266M4901J9352J02098p2529j44951m3008o4r059M4541N5721l6061
5038C247296j53968N9801J62211l6602M3582K4834K1335J18686N0309p592j4317
5027C515575K02036J5883O9441J19314O6945J28790R9161K96793K05839J26239
$$ plain form
5104 6860376 6517008 6196971 5999488 5796339 5539458 5463751 5284770 5107043 4951286 4823773
5094 4823773 4654576 4546509 4430114 4425429 4292813 4217897 4308375 4305508 4152653 4095305 4087014
5083 4087014 4064306 4050698 4077312 4124970 4050955 3986272 3800476 3763545 3784711 3801276 3775670
5072 3775670 3781535 3716054 3756651 3701754 3597378 3499308 3545518 3419063 3410626 3395748 3344669
5061 3344669 3279710 3171724 3191663 3170412 3056063 3072673 3120291 3226756 3312971 3318530 3244089
5050 3244089 3286355 3331256 3350608 3452706 3380177 3235226 3192218 3192154 3183095 3227636 3283357 3247296
5038 3247296 3093328 3153129 3315340 3278738 3322320 3347154 3368489 3487175 3537484 3529892 3515575
5027 3515575 3717611 3733494 3802935 3922249 3989194 4117984 4217145 4513938 4719777 4846016
5017D846016L10370L38583R0748q2152j01339j94650k44401j88885P5663l3076
5007D816877L1888N0256L3607J98243K29017O6502O4165l4044j80681j09938n8978
4996E106914n3410j02119K6120K790J9223J41339Q4964K34529M03818J56642J89838
4985F210648J05472K32830M330k84097k41103l05718p9799j89576m1763o8213
4975E343011q6185q1527M929K4832j45740O4179N6956j25332o7329R1411N86R3433
4963E173224N7554j8239J06843M0998M3084Q5269L5105R8422J39177J56892M5373
4952E963702M0756P8302K30973K17176K58883L39347K30775K57494L14572N08326
4942H440306M90062O36921P72257Q53696R30409R04480P52260M94295J06845m5533
$$ plain form
5017 4846016 5156386 5494969 5585717 5503565 5402226 5207576 4963175 4774290 4849953 4816877
5007 4816877 4848765 4899021 4932628 5130871 5359888 5426390 5490555 5456511 5275830 5165892 5106914
4996 5106914 5053504 4951385 4977505 4980295 4999518 5140857 5225821 5460350 5864168 6020810 6210648
4985 6210648 6316120 6548950 6553280 6269183 6028080 5722362 5642563 5452987 5411224 5343011
4975 5343011 5256826 5175299 5180228 5205060 5059320 5123499 5180455 5055123 4987794 5079205 5079791 5173224
4963 5173224 5230778 5212539 5319382 5360380 5403464 5488733 5523838 5622260 5761437 5918329 5963702
4952 5963702 6004458 6082760 6313733 6530909 6789792 7129139 7359914 7617408 7931980 8440306
4942 8440306 8930368 9567289 10339546 11193242 12123651 13028131 13780391 14274686 14381531 14335998
4932A4335998N6648M07913O46590R28905J088234P59629M01160o7952n61431q72720
4922A7122974n63076k21431R6778L60905O28087P33346L76627j19557o77276j043468
4912A6693909j227835j105811j149256q24304p42723o61462o23381n53952n02899
4903I302286k57730k45311k80613j63103j97660j52376j08206J9972p269k760
4893G907230l5226L3244O8811k0672r0293M5747O7906J05895L0995O158J57665
4882H277460L8353M3547K3846J15406R9210J02620O554K22869J83876J6895J63231
4871I293867K27452L08581L95940M00402M20614L99758L57002N20456M54915O01220
4861A3380207O41317N10876N53050N01022M98852L67937L80559L80939M88466
$$ plain form
4932 14335998 14392646 14800559 15447149 16376054 17464288 18223917 18625077 18557125 17995694 17122974
4922 17122974 16559898 16338467 16435245 16796150 17424237 18157583 18534210 18414653 17737377 16693909
4912 16693909 15466074 14360263 13211007 12386703 11643980 10982518 10359137 9805185 9302286
4903 9302286 9044556 8799245 8518632 8355529 8157869 8005493 7897287 7917259 7909990 7907230
4893 7907230 7872004 7905248 7974059 7953387 7863094 7908841 7976747 8082642 8113637 8119795 8277460
4882 8277460 8315813 8359360 8383206 8498612 8597822 8700442 8706996 8929865 9113741 9130636 9293867
4871 9293867 9521319 9829900 10225840 10626242 11046856 11446614 11803616 12324072 12778987 13380207
4861 13380207 14021524 14532400 15085450 15586472 16085324 16453261 16833820 17214759 17703225
4852A7703225N76003O17505P81289P03445P24190R50597J025662J303913J691567
4843B6077396K032424K326321K803314L274410L857014M515111N238789O267041
4835E6391820Q327624J0963647J5438463K0222766K2241955J9268104R650445
4828A62504824j356774j5492256k3490125k2688058j8051194j3420582r689611
4821E8316224p116927n628805m583381m000192l431735k787938k347932k158132
4813B6261182j958033j841469j551535j493302j295574j135041j039920r70502
4805A4975806o97183p24734o70278p30343m98514m31659l67950l75834l02893
4796A0176418k02314j55824l34452k12547k51933k64387L4026q7809k50921j00756
$$ plain form
4852 17703225 18279228 18896733 19678022 20381467 21105657 22056254 23081916 24385829 26077396
4843 26077396 28109820 30436141 33239455 36513865 40370879 44885990 50124779 56391820
4835 56391820 64719444 75683091 91121554 111344320 133586275 152854379 162504824
4828 162504824 161148050 145655794 122165669 99477611 81426417 68005835 58316224
4821 58316224 51199297 45570492 40987111 36986919 33555184 30767246 28419314 26261182
4813 26261182 24303149 22461680 20910145 19416843 18121269 16986228 15946308 14975806
4805 14975806 14278623 13553889 12883611 12153268 11654754 11223095 10855145 10479311 10176418
4796 10176418 9974104 9818280 9483828 9271281 9019348 8754961 8788987 8701178 8450257 8349501
4786H349501j65158j48005k23828j45381j42470k76999j54465j05478r5988j68615
4776F723114j67735Q4218j90795j63832j42428k53594j49373o8408p4435j34239
4766E462493q4067r6085j05991j37652j41993j1672p2695j10851j1403m2131r7125
4755D550828l8472r1873N089j56389j9575j46167j46889m7503n0112q8408Q91
4744C771420L307p7405q4348r0186j31243K5712J2836k0624k7561M1434Q7592
4733C510934J05145k8724k36140j02671K3182j13797j76304o5070n7307n0582
4723B808666l4214J8869N0972O888Q96J4053o6879l4051m6356P9969P2045M6678
4711B917536o5308j24097k1703R6350m5652j01867O4858j9909k3171n8505M0704
$$ plain form
4786 8349501 8184343 8036338 7812510 7667129 7524659 7247660 7093195 6987717 6891729 6723114
4776 6723114 6555379 6639597 6448802 6284970 6142542 5888948 5739575 5671167 5596732 5462493
4766 5462493 5378426 5282341 5176350 5038698 4896705 4885033 4812338 4701487 4690084 4647953 4550828
4755 4550828 4512356 4420483 4425572 4269183 4249608 4103441 3956552 3909049 3858937 3770529 3771420
4744 3771420 3774727 3697322 3612974 3522788 3391545 3417257 3430093 3409469 3381908 3423342 3510934
4733 3510934 3616079 3587355 3351215 3248544 3271726 3157929 2981625 2916555 2859248 2808666
4723 2808666 2774452 2793321 2844293 2851181 2852077 2866130 2799251 2765200 2718844 2798813 2870858 2917536
4711 2917536 2852228 2728131 2706428 2802778 2757126 2655259 2720117 2700208 2677037 2618532 2659236
4700B659236K2822O6203l4719K6280L5671l0865k938k7612N2622m6024P1595O8479
4688B860750K1847n6993J18738n0455p8927M3369N4891j1108N0027L2052K3145
4677C007336q7289J8427Q1252O9576O7643j4654Q0225M3653L4910K5030j7628
4666C308481m1543P3495J689k9710R4759L4550N5331K8067l5534l958Q9572K2099
4654C597298J8833R8249J46051l3630p512J33941J78078J25522M6330J85736K38489
4643D727385J98891J72317Q9907K42681K44976J47912K09718K39539K23688J89462
4633F686476J27465J99594J26615K26079K83675L11442L26664K14560L40440L77181
4623I220191M65366M73238O98114Q32141R38983J242925J378648J624323J801472
$$ plain form
4700 2659236 2682058 2748261 2713542 2739822 2775493 2744628 2741690 2714078 2766700 2720676 2792271 2860750
4688 2860750 2882597 2825604 2944342 2893887 2814960 2858329 2913220 2902112 2952139 2984191 3007336
4677 3007336 2920047 2938474 3019726 3089302 3156945 3142291 3222516 3266169 3301079 3326109 3308481
4666 3308481 3266938 3340433 3342122 3312412 3407171 3441721 3497052 3525119 3489585 3485627 3575199 3597298
4654 3597298 3616131 3714380 3860431 3826801 3819289 3953230 4131308 4256830 4303160 4488896 4727385
4643 4727385 4926276 5098593 5188500 5431181 5676157 5824069 6033787 6273326 6497014 6686476
4633 6686476 6813941 7013535 7140150 7366229 7649904 7961346 8288010 8502570 8843010 9220191
4623 9220191 9685557 10158795 10856909 11689050 12628033 13870958 15249606 16873929 18675401
4614A8675401K247460K891383L563373M552661O051722O902660P059557N573773
4606E7517990J962295k283252n968281p739980p356769n848878m598039l389294
4598B2295792k650147k075499j685251j513738j405955j133463q74398q27402
4590A0129939p28725n93086o53414o78475n16537m84463l33707m09858m29319
4581E302355k29805k71846k12797k43178k49546k60371o7112l6524k0470r3562
4571C617144j50113j74178r6490J42569j28932p6340j3645q3465j14548j62390
4561B759612o2454J0151R979q5678o9456m8505j14355o5561L1042j02141l9183
4550B223451M1283j32528m7272N0769n0161r6554k2965l8584j03216p0433o0033
$$ plain form
4614 18675401 20922861 23814244 27377617 31930278 37982000 44884660 51944217 57517990
4606 57517990 59480285 57197033 51228752 43488772 36132003 30283125 25685086 22295792
4598 22295792 19645645 17570146 15884895 14371157 12965202 11831739 10957341 10129939
4590 10129939 9401214 8808128 8154714 7476239 6959702 6475239 6141532 5731674 5302355
4581 5302355 5072550 4800704 4587907 4344729 4095183 3834812 3767700 3731176 3710706 3617144
4571 3617144 3467031 3292853 3196363 3338932 3210000 3133660 3120015 3036550 2922002 2759612
4561 2759612 2697158 2707309 2717288 2631610 2562154 2513649 2399294 2333733 2364775 2262634 2223451
4550 2223451 2264734 2132206 2084934 2135703 2085542 1988988 1966023 1927439 1824223 1753790 1693757
4539A693757P8329O3771j4140r6920q2857N1981o8934O51q2050L9224O8774j16309
4527A535277Q5177J6706r8668l4414J01463J2085j16407Q2079J20170j6731k1464
4516A665273R4576J64702N4610P329l8559O9509j16916j88935j02582l2460Q3318
4505A659865j05220n6728j22313o4172n7052m5661j30242m266L8898n829N3509
4494A160789n4177P2500L9057J7020j28949l0430o3059K2643K4938m3356O9872
4483A086848J38184j0839l4796R893R366l1509Q1900l1257j06264l1632Q5388
4472A165282M2410m0005N2918K9187Q1190j49011J731j3415q0448n8084J3840
4461A045595j20539r0120O3033l232P3854q0440Q8040K3292m6126J9701J08051
$$ plain form
4539 1693757 1772086 1835857 1821717 1724797 1641940 1693921 1624987 1625638 1543588 1582812 1651586 1535277
4527 1535277 1620454 1637160 1538492 1504078 1605541 1617626 1501219 1583298 1703468 1686737 1665273
4516 1665273 1759849 1924551 1979161 1986490 1947931 2017440 1900524 1711589 1609007 1576547 1659865
4505 1659865 1554645 1497917 1375604 1311432 1254380 1208719 1078477 1074211 1113109 1107280 1160789
4494 1160789 1106612 1179112 1218169 1235189 1106240 1075810 1012751 1035394 1060332 1016976 1086848
4483 1086848 1225032 1214193 1179397 1189290 1198656 1167147 1249047 1217790 1111526 1079894 1165282
4472 1165282 1207692 1167687 1220605 1249792 1330982 1181971 1183702 1170287 1089839 1031755 1045595
4461 1045595 925056 834936 897969 894737 968591 888151 976191 999483 953357 973058 1081109
4450A081109R2034p1527j14745n7152N8519n8289J1315m5831n163K9539K9511
4439I49320J078K4761R972o5250n7086Q5418L7795q7259O263J10601N1493l8788
4427A028318j31007k1066m4243K1511O4679N8339n9587M0803J03855M913m6420
4416A020095J8133l5389j01998q250j5807n5981K3227L9042J03458Q1293J1743
4405A079566o2925j02649O1302R619L0618l0386J04081j0386n3082M2016K1470
4394A089244j5951K0275j0968K9928n3506n9651P570O1346J0268L6234L6412O0072
4382A211273M2169M3721j3712j74228R6153N9475J7661o8676l7148p1763J04572
4371A209497P2262k2684o1339P5342J81397k1340m9246J6365N576m6990Q552N5848
$$ plain form
4450 1081109 1173143 1101616 986871 929719 988238 929949 941264 895433 890270 919809 949320
4439 949320 950398 975159 985131 919881 862795 948213 986008 898749 905012 1015613 1067106 1028318
4427 1028318 897311 876245 832002 853513 918192 976531 916944 957747 1061602 1066515 1020095
4416 1020095 1038228 1002839 900841 892591 876784 820803 844030 883072 986530 1067823 1079566
4405 1079566 1016641 913992 975294 984913 1015531 985145 1089226 1078840 1025758 1067774 1089244
4394 1089244 1073293 1093568 1082600 1112528 1059022 999371 1006941 1068287 1078555 1114789 1151201 1211273
4382 1211273 1253442 1297163 1283451 1109223 1205376 1264851 1282512 1213836 1176688 1104925 1209497
4371 1209497 1281759 1259075 1197736 1273078 1454475 1433135 1383889 1400254 1405830 1358840 1367392 1423240
4359A423240L5659O8073p3787m2056J57009M8753k2838q292J34322R954M8111
4348A778148j00009q5814Q0868M0541N2713K0355P6900m9969J168J64907L3559
4337B013367K0497J32211N5927r0158P3489O7324J51278Q2445K3624m4570N1071
4326B536505Q2480R8486L6369K7971Q9184J21529N4199J60585R4760p746P277
4315C301599j07030R9511J15393L8415N9963P9958J73567J66522m4938p3451J44104
4304C953613k716O3972R5694k014J4796r2204R4442o0249n0715j12097k251o118
4292C894153j04633m4911j17247j076K070n8119k2918j02943q2271j46747j8169
4281C197189j17465k0320r2150p3688k4321j09863p2007l7321j34966o3152Q717
$$ plain form
4359 1423240 1458899 1526972 1453185 1411129 1568138 1616891 1594053 1585761 1720083 1730037 1778148
4348 1778148 1678139 1592325 1673193 1713734 1766447 1786802 1863702 1813733 1814901 1979808 2013367
4337 2013367 2033864 2166075 2222002 2131844 2205333 2272657 2423935 2506380 2530004 2485434 2536505
4326 2536505 2618985 2717471 2753840 2781811 2870995 2992524 3046723 3207308 3302068 3294322 3301599
4315 3301599 3194569 3294080 3409473 3447888 3507851 3587809 3761376 3927898 3882960 3809509 3953613
4304 3953613 3950897 4014869 4110563 4108549 4123345 4031141 4125583 4065334 4014619 3902522 3900271 3894153
4292 3894153 3789520 3744609 3627362 3626286 3628356 3570237 3547319 3444376 3362105 3215358 3197189
4281 3197189 3079724 3059404 2967254 2893566 2869245 2759382 2687375 2650054 2515088 2451936 2460653
4270B460653p5088K5304j45847K3265j08905L0372j6666j5542l6049j51409P0922
4259B061010j42367j37581n5553O9860M532k5667O401j19993j35162O1695k1874
4248A565301q57J06147r9964j37158J04638n7683o8168m3700p0841L4835k3158
4237A309392Q1254J0146p7062j6401n3286n4224J1177M891j1393o2488J07782
4226A249788J2865J4207j9987p8901P9362L8743r2301n9313k5164O1497j2867
4215A167929q1898J77012p831j5839j6041j6271q5616K617K6117M4107L0366M5672
4203A270324L6388r4794M5227k6957J4423K5560R9750N5642J7832q3622r09K9936
4191A388800J29078o2626q3546m9620J18043P0426j3842R713O697M9765M083M3829
$$ plain form
4270 2460653 2385565 2410869 2265022 2288287 2179382 2209754 2193088 2177546 2141497 1990088 2061010
4259 2061010 1918643 1781062 1725509 1795369 1799901 1774234 1780635 1660642 1525480 1587175 1565301
4248 1565301 1564444 1670591 1570627 1433469 1538107 1480424 1412256 1368556 1297715 1332550 1309392
4237 1309392 1390646 1400792 1323730 1307329 1254043 1199819 1210996 1215887 1204494 1142006 1249788
4226 1249788 1262653 1276860 1256873 1177972 1257334 1296077 1203776 1144463 1119299 1180796 1167929
4215 1167929 1086031 1263043 1255212 1239373 1223332 1207061 1121445 1124062 1150179 1194286 1224652 1270324
4203 1270324 1306712 1211918 1257145 1230188 1244611 1270171 1369921 1425563 1443395 1359773 1358864 1388800
4191 1388800 1517878 1455252 1371706 1322086 1440129 1510555 1496713 1506426 1513123 1562888 1566971 1610800
4179A610800j1630J28604J40579j02850O2976K16315J8564n7515j5484M4705J09998
4168B145062J801Q4918P4981J6021P1997J03043K9608O6515l9041K3980J33229
4157B712114J46546l745J15995J18842O5013P4033N0270J19675L0790K4588J19603
4146C573724K51284Q7739j1409m0392Q1008k794P3981J65277J10192l7886N5398
4135D306122Q8526j345J35203J74755J0619j4108N5838Q7080Q8136L6595N6696
4124E024117J58488l2644K4487J43982R1565R072J41572M6779J13817M9062J02212
4113E872509p6921J28383J08536L9146K14977J11964K9289L2539M5501J08510
4103F614433K13593J92983J69095N0110J11745J20947K35131K50219J86688R1799
$$ plain form
4179 1610800 1599170 1727774 1868353 1765503 1828479 2044794 2063358 2005843 1990359 2035064 2145062
4168 2145062 2146863 2231781 2306762 2322783 2394780 2497823 2527431 2593946 2554905 2578885 2712114
4157 2712114 2858660 2854915 2970910 3089752 3154765 3228798 3279068 3398743 3429533 3454121 3573724
4146 3573724 3825008 3912747 3901338 3860946 3941954 3939160 4013141 4178418 4288610 4250724 4306122
4135 4306122 4394648 4393303 4528506 4703261 4713880 4699772 4755610 4842690 4930826 4967421 5024117
4124 5024117 5182605 5149961 5174448 5318430 5409995 5419067 5560639 5607418 5721235 5770297 5872509
4113 5872509 5795588 5923971 6032507 6071653 6286630 6398594 6427883 6460422 6505923 6614433
4103 6614433 6828026 7021009 7190104 7240214 7351959 7472906 7708037 7958256 8144944 8236743
4093H236743K38267M13386J39771K11319K34345L06465J36076K92290L69692M36305
4083A1014659N64305M11391M93080N40818M58031M64868N19435M34045L21851
4074A5222483K10817K93619L14718L71539M10753O05567O18588Q15013Q01304
4065A9664401Q54642Q83510P05553N48174J35805r8825j71909j30022j22247q0751
4055B2188331P5026L15721N71582P47578R23710P34299M69396K44856l1267n13680
4045B5725552p82554q01815q00342p52201n97036m03859r9649J65187J32917J00775
4035B1886975o7410j40285m05326o20566r43775r83625j035831j007923p66272
4026A5915962p25033n13456n13976m00513k65317j68217l51074l90577n84444
$$ plain form
4093 8236743 8475010 8888396 9028167 9239486 9473831 9780296 9916372 10208662 10578354 11014659
4083 11014659 11578964 11990355 12483435 13024253 13482284 13947152 14466587 14900632 15222483
4074 15222483 15433300 15726919 16041637 16413176 16823929 17429496 18048084 18863097 19664401
4065 19664401 20519043 21402553 22108106 22656280 22792085 22693260 22521351 22391329 22269082 22188331
4055 22188331 22263357 22579078 23150660 23898238 24821948 25556247 26025643 26270499 26239232 25725552
4045 25725552 24942998 24141183 23340841 22588640 21991604 21587745 21488096 21653283 21786200 21886975
4035 21886975 21819565 21679280 21273954 20653388 19709613 18725988 17690157 16682234 15915962
4026 15915962 15190929 14677473 14163497 13762984 13497667 13329450 12978376 12587799 12003355
4017A2003355n45286p11191o65349n99003o28153o12265l43441l51242k65503
4008G281922k94371l20995l21866j79927k65967k78261l52256k57602j57039l04213
3998D549425k07616j20448j53077l09890k05757j71662r2604n9267j52678J1747
3988C088173l1330j10674j11273o1450j13519j45317M428p852L4707n3859j28387
3977B363647j12597J2057q8784L390r4876q1077k7719k0969j27551k335N5965
3966A879151j8172n5618J9055n3529r3596K803j25598J0343O8543l9654n5334
3955A538394J09185J4832J8423l748l2638q16j6668K8223r8451O00p3105p3861
3943A410370q1828r2963N1475O6069j2511n9323K0066Q9499j11844K3368L9613
$$ plain form
4017 12003355 11458069 10746878 10081529 9482526 8854373 8242108 7898667 7547425 7281922
4008 7281922 6987551 6666556 6344690 6164763 5898796 5620535 5268279 5010677 4853638 4549425
3998 4549425 4341809 4221361 4068284 3758394 3552637 3380975 3288371 3229104 3076426 3088173
3988 3088173 3056843 2946169 2834896 2773446 2659927 2514610 2519038 2511186 2545893 2492034 2363647
3977 2363647 2251050 2263107 2174323 2177713 2082837 2001760 1974041 1953072 1825521 1823186 1879151
3966 1879151 1860979 1805361 1824416 1770887 1677291 1680094 1554496 1564839 1633382 1593728 1538394
3955 1538394 1647579 1662411 1680834 1677086 1644448 1643632 1626964 1655187 1556736 1557336 1484231 1410370
3943 1410370 1328542 1235579 1287054 1353123 1340612 1281289 1301355 1390854 1279010 1302378 1341991
3932A341991L4157p1818m0111J27297p2942j24796p176P3920l754N9369j4777
3921A301360j29683J31103L4804Q527o9351k961j1609k3340q9177P3557n5176
3910A168054k0019J40R4956l9755k7016J76123q2574j18644r774p876M4301K8681
3898A206597o4578Q9512q4432r5043R2948K7571K5055J8445O732J1669j8509N6711
3886A272678q3781J5555M7823q1882r111L5607o031p6573P4669P3949j4283M1046
3874A289666R5146J06826m0708n0499L1301j8198M6309M9981o7514N7843k5252
3863A474901n9729q865O9456j3236L5738K625M1265O3163j37983j5015O6226r245
3851A509301O6541N8137o3629J07938M6116M1317K6787j4899J5750m9724L847
$$ plain form
3932 1341991 1376148 1304330 1264219 1391516 1318574 1193778 1186602 1260522 1256768 1316137 1301360
3921 1301360 1171677 1302780 1337584 1346111 1276760 1273799 1262190 1238850 1149673 1223230 1168054
3910 1168054 1148035 1148175 1243131 1203376 1176360 1352483 1269909 1151265 1141491 1133615 1177916 1206597
3898 1206597 1142019 1231531 1147099 1052056 1145004 1172575 1197630 1216075 1222807 1234476 1215967 1272678
3886 1272678 1188897 1204452 1252275 1170393 1161282 1196889 1190858 1114285 1188954 1262903 1248620 1289666
3874 1289666 1384812 1491638 1450930 1400431 1431732 1413534 1459843 1509824 1442310 1500153 1474901
3863 1474901 1415172 1406307 1475763 1462527 1498265 1500890 1542155 1605318 1467335 1452320 1518546 1509301
3851 1509301 1575842 1633979 1570350 1678288 1724404 1765721 1792508 1777609 1793359 1743635 1747482
3840A747482M5045K3423K0409P1898O9801N8388N0159L2498l9695J67750K0128
3829B267286N1285R5384K16618k347k528R2262L4175R0999J20789M1820J25266
3818C131009N292J5425J30002N4189J566l7133P5476M2986Q8816R7292J12168
3807C717088K349L0602P5820l0846r8520j7634R2188k72Q643k4595M7916j8101
3795C784638K3147L1165m1619k2458O5735m371P6544J8092L4205J25234J758J8589
3783D110659Q6202k5343L5979J06528K36546J550P4226K12609L5525N3298Q4159
3772E011938K15193K15180K18037J33699J12894K06407J87609J30129P4493M7412
3762F552991J72636O7287l3863n1597L5310N5670m1075j33522q3237j55471l6477
$$ plain form
3840 1747482 1792527 1815950 1836359 1908257 1978058 2036446 2086605 2119103 2079408 2247158 2267286
3829 2267286 2318571 2413955 2630573 2628226 2625698 2717960 2752135 2843134 2963923 3005743 3131009
3818 3131009 3136301 3151726 3281728 3335917 3337483 3300350 3375826 3418812 3507628 3604920 3717088
3807 3717088 3719437 3750039 3825859 3795013 3696493 3678859 3771047 3770775 3779418 3754823 3802739 3784638
3795 3784638 3807785 3838950 3797331 3774873 3840608 3836237 3912781 3930873 3965078 4090312 4092070 4110659
3783 4110659 4196861 4171518 4207497 4314025 4550571 4552121 4626347 4838956 4874481 4927779 5011938
3772 5011938 5227131 5442311 5660348 5794047 5906941 6113348 6300957 6431086 6505579 6552991
3762 6552991 6725627 6792914 6759051 6707454 6742764 6798434 6757359 6623837 6540600 6385129 6348652
3751F348652L8429j4181j80667p2220l1396l3522j70223j46691j21106k36134
3741E380941k18553j51752j89968k43393k28480j73106k25344k35741m2137j24680
3731C547787p6664O5559j70774k49317q4466n2201k09438n5m3738P191n2815m7095
3719B633974l6509m1228p9400Q286k2635j1132p1196j7462l4185m5K1595k3341
3707B326722n2158n5421q7059J7616n0180j6606Q7932J24934j5780j31510j8434
3696B130056P5928O868K0171K6493p6950j3250k5236R8999p011k8736k2275K1381
3684B206438K8701L6234m51k904q0195N154k9855J04334p491p7855Q651L9608
3672B230369J5282J2380l9061N1559r3512K3592K004K1285L3684P0863m4243O0136
$$ plain form
3751 6348652 6387081 6372900 6192233 6120013 6088617 6055095 5884872 5738181 5617075 5380941
3741 5380941 5162388 5010636 4820668 4577275 4348795 4175689 3950345 3714604 3672467 3547787
3731 3547787 3471123 3536682 3365908 3116591 3032125 2979924 2770486 2770431 2726693 2733884 2681069 2633974
3719 2633974 2597465 2556237 2476837 2485123 2462488 2451356 2380160 2362698 2328513 2328468 2350063 2326722
3707 2326722 2274564 2219143 2132084 2149700 2099520 2082914 2170846 2295780 2280000 2148490 2130056
3696 2130056 2205984 2212852 2233023 2259516 2182566 2169316 2144080 2243079 2236068 2207332 2185057 2206438
3684 2206438 2235139 2271373 2270922 2268018 2187823 2192977 2163122 2267456 2259965 2182110 2190761 2230369
3672 2230369 2245651 2258031 2218970 2270529 2177017 2200609 2202613 2223898 2257582 2328445 2284202 2344338
3660B344338J42592j59348m6987M9322J13288K4381q5069P0520J93482l2909o1175
3649B552435j35032M6856J03065k7354K9706R8097M9247j8202J55959N6299L5238
3638B946314p2876k0827J16462K6206Q4617p8549J0746L9456P049J85298O5256
3627C309152L1176J22321M8302m8847o6305N2711J74678J41757N077N8240J44357
3616C972619N6681P7228l7945J6625R2951J88406j5465N8701Q5546m3363p1678
3605D380306J19862R7738p599l9450O2965J59032J3592K9166N0318P3698k4649
3594D914979k5630P4898J58523J4481O5542J32225O7810n1857J278J20913O3460
3583E536622J79304J31024O8188J72435J41647M0543J47951Q5607J20326J53399
$$ plain form
3660 2344338 2486930 2327582 2280595 2329917 2443205 2467586 2382517 2453037 2646519 2613610 2552435
3649 2552435 2417403 2464259 2567324 2539970 2569676 2667773 2717020 2698818 2854777 2911076 2946314
3638 2946314 2873438 2852611 2969073 2995279 3079896 3001347 3012093 3051549 3058598 3243896 3309152
3627 3309152 3340328 3462649 3510951 3462104 3395799 3448510 3623188 3764945 3770022 3828262 3972619
3616 3972619 4029300 4106528 4068583 4085208 4178159 4366565 4351100 4409801 4495347 4451984 4380306
3605 4380306 4500168 4597906 4590307 4550857 4613822 4772854 4786446 4815612 4865930 4939628 4914979
3594 4914979 4889349 4964247 5122770 5137251 5202793 5335018 5402828 5350971 5352249 5473162 5536622
3583 5536622 5715926 5846950 5915138 6087573 6229220 6269763 6417714 6503321 6623647 6777046
3573F777046R9309J84512R6871M2776J23767J97587P8170J35166K5573J88614
3563G949391J35590Q0258L01195J70631J97594J24463J26107R5580J79127J44727
3553I504663O4286K88815L01070K11027J50354J70060Q1915J67213J67182J71481
3543A1278066K239K6419J96230K01353N7593O8078M2037P9945N1564J09581J19467
3532A2232572P7414J54238J5708J4489K8443J8484J24213k2266m2489Q147n3006
3521A2555947m3836O112M5730L631m7630N493J16570M6762L0100P2524J24803
3510A2916206M1588J09206K64305J50573K92612L56694J93922L16568L96111L33299
3500A5371084K70081K38252K57687L40899K00909J39937Q8166P9825J81338J45143
$$ plain form
3573 6777046 6876355 7060867 7157738 7200514 7324281 7521868 7600038 7735204 7760777 7949391
3563 7949391 8084981 8165239 8466434 8637065 8834659 8959122 9085229 9180809 9359936 9504663
3553 9504663 9568949 9857764 10158834 10369861 10520215 10690275 10772190 10939403 11106585 11278066
3543 11278066 11280305 11306724 11502954 11704307 11761900 11829978 11872015 11951960 12003524 12113105 12232572
3532 12232572 12309986 12464224 12479932 12494421 12522864 12541348 12665561 12643295 12600806 12608953 12555947
3521 12555947 12512111 12518223 12563953 12567584 12519954 12525447 12642017 12688779 12718879 12791403 12916206
3510 12916206 12957794 13067000 13331305 13481878 13774490 14131184 14325106 14641674 15037785 15371084
3500 15371084 15641165 15879417 16137104 16478003 16678912 16818849 16907015 16986840 17168178 17313321
3490A7313321O5418l2430K5301j7147l7889k6252r5422N948k9364r516M8029L7965
3478A7247962o0480O2881J13024N4014q9167o5094Q6974j3333o4199j03012p1109
3467A7098461j52441j62788j70378j99331k77534k21599l28583l30204k46346
3458A5009257l04990j67755j53594k78956l33828j71007k48564k56959k3147j39923
3448A2930534k03319m2062l949r956k3158j89673J6478j856p9325K6841N5119
3437A2475674J26974p8943p2236J47206J72387L4281J33404O6338J17899K7730
3427A3150714J6510P9438J80371K16360J45163J23955J62520J75665K09563J66246
3417A4626505O2216J91969O9414J54320J65453K11488L9602O3329J51795L5053
$$ plain form
3490 17313321 17378739 17346309 17371610 17354463 17316574 17290322 17194900 17200848 17171484 17161968 17209997 17247962
3478 17247962 17187482 17250363 17363387 17417401 17328234 17263140 17350114 17336781 17272582 17169570 17098461
3467 17098461 16946020 16783232 16612854 16413523 16135989 15914390 15585807 15255603 15009257
3458 15009257 14704267 14536512 14382918 14103962 13770134 13599127 13350563 13093604 13070457 12930534
3448 12930534 12727215 12685153 12681204 12671248 12648090 12458417 12474895 12473039 12393714 12420555 12475674
3437 12475674 12602648 12523705 12451469 12598675 12771062 12805343 12938747 13005085 13122984 13150714
3427 13150714 13167224 13246662 13427033 13643393 13788556 13912511 14075031 14250696 14460259 14626505
3417 14626505 14688721 14880690 14950104 15104424 15269877 15481365 15520967 15584296 15736091 15771144
3407A5771144K5887J50711Q6896J33125L85858R3756J35001K49888J73185J34860
3397A7340311K14432J81676K46889K07584K60660K75707K86388K99861K77386
3388A9590894K88794K80466L87581L89757L31569L23059K46773L99155M19609
3379B2657657L64478M72384M49369L98177N04576O42104M04315O01229O77717
3370B7172006N21401O00163P45287P97189Q78709P80551Q97765J070959J035982
3361C4500012R46007Q77722R90092Q76581J028350J003151R17220R75956P78796
3352D2893887Q28920P60944Q41446Q66690Q23775P78615Q53197Q93978P94201
3343E0335653Q49403R19430R39067R05037J149356J229667J306805J509891J727790
$$ plain form
3407 15771144 15797031 15947742 16034638 16167763 16553621 16647377 16782378 17032266 17205451 17340311
3397 17340311 17554743 17736419 17983308 18190892 18451552 18727259 19013647 19313508 19590894
3388 19590894 19879688 20160154 20547735 20937492 21269061 21592120 21838893 22238048 22657657
3379 22657657 23022135 23494519 23943888 24342065 24846641 25488745 25893060 26494289 27172006
3370 27172006 27693407 28293570 29038857 29836046 30714755 31495306 32393071 33464030 34500012
3361 34500012 35446019 36323741 37313833 38190414 39218764 40221915 41139135 42115091 42893887
3352 42893887 43722807 44483751 45325197 46191887 47015662 47794277 48647474 49541452 50335653
3343 50335653 51185056 52104486 53043553 53948590 55097946 56327613 57634418 59144309 60872099
3334F0872099J896931K104268K390253K499368K528948K516937K392256K161109
3326G9362169J791260J275828Q63618O30086K82395n8181j23680J1173J65564
3317H4200232K90828N10352O31046Q02341N32720M42665l2447l04927o50098j162505
3307H5260207j588289j855223j890320k062928k084089j913866j684102j636656
3299G0544734j412904j320790r11966r87093p57300n58953m96306l12198p5427
3290F3711797K9042J7229J20698K29866K69791M04879L78659L56112N54774P83117
3280F6855964P89898Q58655R68074J200721J326860J587583J779051J771507K244626
3271G9382939K603255K842416L123279L495351M032536M476157M923367N571850
$$ plain form
3334 60872099 62769030 64873298 67263551 69762919 72291867 74808804 77201060 79362169
3326 79362169 81153429 82429257 83292875 83922961 84205356 84147175 84023495 84034668 84200232
3317 84200232 84491060 85001412 85632458 86434799 86967519 87410184 87377737 87072810 86422712 85260207
3307 85260207 83671918 81816695 79926375 77863447 75779358 73865492 72181390 70544734
3299 70544734 69131830 67811040 66899074 65911981 65154681 64595728 64099422 63787224 63711797
3290 63711797 63740839 63758068 63878766 64108632 64378423 64783302 65161961 65518073 66072847 66855964
3280 66855964 67645862 68504517 69472591 70673312 72000172 73587755 75366806 77138313 79382939
3271 79382939 81986194 84828610 87951889 91447240 95479776 99955933 104879300 110451150
3263A10451150N817011N989418O057095N566461M830998M015358K935467K051354
3255A47714312J177007M20702P7448k99935m76775m08041p1741L4872K4610j58976
3245A48033483p60234j421275k328426l268075m029905m591989n282450n720603
3237A20630526o095097o224577o032275n904185n372942m873933m491411l934604
3229G7701502l479322l320667l164996k751531k472112k376766k212782k094297
3221E5829029j987846j587880j417766j221881j110311r96728j003370j023592
3213D5479655j025468j167199j019114q42684p47176o17652n52319n30950m09554
3204C8567539l33915l51280l35108k77580j37912j32041j64087p9379k11179o4116
$$ plain form
3263 110451150 116268161 122257579 128314674 133881135 138712133 142727491 145662958 147714312
3255 147714312 148891319 149312021 149389469 149089534 148612759 148204718 148132977 148167849 148192459 148033483
3245 148033483 147273249 145851974 143523548 140255473 136225568 131633579 126351129 120630526
3237 120630526 114535429 108310852 102278577 96374392 91001450 86127517 81636106 77701502
3229 77701502 74222180 70901513 67736517 64984986 62512874 60136108 57923326 55829029
3221 55829029 53841183 52253303 50835537 49613656 48503345 47506617 46503247 45479655
3213 45479655 44454187 43286988 42267874 41425190 40678014 40060362 39508043 38977093 38567539
3204 38567539 38233624 37882344 37547236 37269656 37131744 36999703 36835616 36756237 36545058 36480942
3194C6480942q1653j48499J23591K53805K76542L92519M19093N22864P10106N64732
3184C9514042O79913P92049N27359M43714K27969J93541K32687J87080J80554
3175D2978908J10899J30419M8903k0522N5179J42647L9665L92998L60768L32502
3165D4572366L57487N68968N78315O20428Q19974Q10122Q72296R56589Q40569
3156E0997114R10236Q54984P51017Q45605Q37056P40019Q27774P66573Q42790
3147E8373168Q62662R65478R58057J033616J040174J130776J470175J688433K158169
3138F9680708K456356K860816L475874L770811M216490M658780M773001M920034
3130A00812870M803429M859222M417097M357650M126356L741787L200165K771407
$$ plain form
3194 36480942 36399289 36250790 36374381 36628186 36904728 37297247 37716340 38239204 38949310 39514042
3184 39514042 40193955 40986004 41513363 41957077 42185046 42378587 42611274 42798354 42978908
3175 42978908 43089807 43220226 43269129 43248607 43303786 43446433 43486098 43879096 44239864 44572366
3165 44572366 44929853 45498821 46077136 46697564 47517538 48327660 49199956 50156545 50997114
3156 50997114 51907350 52762334 53513351 54358956 55196012 55936031 56763805 57530378 58373168
3147 58373168 59235830 60201308 61159365 62192981 63233155 64363931 65834106 67522539 69680708
3138 69680708 72137064 74997880 78473754 82244565 86461055 91119835 95892836 100812870
3130 100812870 105616299 110475521 114892618 119250268 123376624 127118411 130318576 133089983
3122A33089983J889437R18198K85333j42249q87167j285251j598683j870601j986267
3113A28412733k155470k378874k306533k489830k720904k935546l284683l666268
3105A06474625l709311l797850l514025l247323l106739k838342k800676k821432
3097H0638927k912331k800606k831774k778085k616575k417642k310269j975935
3089E9995710j909049j555717j116435r22998p59418l40481j81738o274K36602
3080E3440202L37593M87259N04873O39644M05136J68456J02977k2667m09261p01989
3070E4952223r49229j122851j337624j383236j358368j562935j518536j406279
3062D4313165j636074j615657j469361j467834j485519j490068j302390j315580
$$ plain form
3122 133089983 134979420 135897618 136182951 136040702 135153535 133868284 132269601 130399000 128412733
3113 128412733 126257263 123878389 121571856 119082026 116361122 113425576 110140893 106474625
3105 106474625 102765314 98967464 95453439 92206116 89099377 86261035 83460359 80638927
3097 80638927 77726596 74925990 72094216 69316131 66699556 64281914 61971645 59995710
3089 59995710 58086661 56530944 55414509 54491511 53732093 53391612 53209874 53203600 53440202
3080 53440202 53777795 54265054 54769927 55409571 55814707 55983163 56086140 56063473 55654212 54952223
3070 54952223 54002994 52880143 51542519 50159283 48800915 47237980 45719444 44313165
3062 44313165 42677091 41061434 39592073 38124239 36638720 35148652 33846262 32530682
3054C2530682j212094j334141j193320j210557j121519r49283r10919r09739o42664
3045B3046446o38299o54333m91028m81210l75726l08082l72560k96903l43870
3036A9084435j22907j06672j02668j14436j24629j07278J21444J3359N7938J39757
3026A8738343J66101L20243K87509J93193K52755M21383L63436L91005L64635
3017B1498603M43195J79998J21033K3768J23036O8454P3765K7080m554N1576m9118
3006B2556836o8583J50105J69336J19937L23789L74834N27651O81241O49835O92650
2996B6177631P73606Q38433R54651P25644Q17034R38643R42151R33078R59439
2987C4060310J084399J161123J398009J443519J551097J687120J447659P70730
$$ plain form
3054 32530682 31318588 29984447 28791127 27580570 26459051 25509768 24598849 23689110 23046446
3045 23046446 22408147 21753814 21262786 20781576 20405850 20097768 19725208 19428305 19084435
3036 19084435 18961528 18854856 18752188 18637752 18513123 18405845 18527289 18540648 18598586 18738343
3026 18738343 18904444 19224687 19512196 19705389 19958144 20379527 20742963 21133968 21498603
3017 21498603 21941798 22121796 22242829 22266597 22389633 22458087 22531852 22558932 22554378 22605954 22556836
3006 22556836 22488253 22638358 22807694 22927631 23251420 23626254 24153905 24835146 25484981 26177631
2996 26177631 26951237 27789670 28744321 29469965 30286999 31225642 32167793 33100871 34060310
2987 34060310 35144709 36305832 37703841 39147360 40698457 42385577 43833236 44603966
2979D4603966J72666n93985j200321j646043j818412j684765j702537j628367
2971C4502202j612386j476108j382982j190421j142200j126781j005320r70189
2963B4595815p28754p32175p70196n25775m57512l45689l95876l96892l17761
2954A9925185k00080k09439P0521r9927j7097J04828J70902J57417J1412N1337
2944A9965059J34975J83271J69973K83908K26512M11661L50311L97982M41194
2935B2564846N12009M50525N15590O49927O05938P59213N77077P05114R27732
2926B8267971Q60991R93526R96210J094606J121755J322574J418728J601930J615689
2917C9293980J839701J856303J682344J509412J358210J124014J057733J190103
$$ plain form
2979 44603966 44776632 44182647 42982326 41336283 39517871 37833106 36130569 34502202
2971 34502202 32889816 31413708 30030726 28840305 27698105 26571324 25566004 24595815
2963 24595815 23867061 23134886 22364690 21838915 21381403 21035714 20639838 20242946 19925185
2954 19925185 19725105 19515666 19586187 19486260 19469163 19573991 19744893 19902310 19913722 19965059
2944 19965059 20100034 20283305 20453278 20737186 20963698 21375359 21725670 22123652 22564846
2935 22564846 23076855 23527380 24042970 24692897 25298835 26058048 26635125 27340239 28267971
2926 28267971 29128962 30122488 31118698 32213304 33335059 34657633 36076361 37678291 39293980
2917 39293980 41133681 42989984 44672328 46181740 47539950 48663964 49721697 50911800
2909E0911800J283162J453902J682365J636330J549650J518025J276483J134558
2901F2446275J018420Q60876Q64611Q22567R79990Q72369R77366R62242R57026
2892G0761742J055314J194768J239077J447842J830409J966954K202853K587517
2884H4286476K977610L228551L814615M404568N285525N809880O599396P359561
2876A23766182Q231882Q913451R978262J1646791J3868871J7335641K2216456
2869B15957536K7693360L1895271L2331128K6373333J4257262k069767j8211816
2862C28226307k9565344l3473435l0877044k5616544k0158724j5491734j1843796
2855A61199686r647151q608423q008439p788148p636818p675232p593922p498099
$$ plain form
2909 50911800 52194962 53648864 55331229 56967559 58517209 60035234 61311717 62446275
2901 62446275 63464695 64325571 65190182 66012749 66992739 67865108 68842474 69804716 70761742
2892 70761742 71817056 73011824 74250901 75698743 77529152 79496106 81698959 84286476
2884 84286476 87264086 90492637 94307252 98711820 103997345 109807225 116406621 123766182
2876 123766182 131998064 140911515 150889777 162536568 176405439 193741080 215957536
2869 215957536 243650896 275546167 307877295 334250628 348507890 346438123 328226307
2862 328226307 298660963 265187528 234310484 208693940 188535216 173043482 161199686
2855 161199686 151552535 142944112 134935673 127147525 119510707 111835475 104241553 96743454
2847I6743454o996636o475638o041095n429039m910922m469896m160690l658235
2839E4601303l397159l286720k871569k637592k280033k218958j960152j751973
2831C4197147j634423j500228j519850j232183j200293j063948j040787q92580
2823B4112855q66573q83826q15040p75848p72101p68816p25123o08878n88437
2814A7308213m32262n53324n80267n25209m69539n19809m75246m00114m26263
2805A2926180l90548l73560m56416l39877l94018l08662l69489k55389j45293
2796I892928k70794l15878k02844j78823k05211j17380k59137k10017l34442k18277
2786G580125j54673k16266k47689j60125r7447r3201j75300k15022j31287j78855
$$ plain form
2847 96743454 89746818 83271180 77230085 71801046 66890124 62420228 58259538 54601303
2839 54601303 51204144 47917424 45045855 42408263 40128230 37909272 35949120 34197147
2831 34197147 32562724 31062496 29542646 28310463 27110170 26046222 25005435 24112855
2823 24112855 23246282 22362456 21547416 20771568 19999467 19230651 18505528 17896650 17308213
2814 17308213 16875951 16322627 15742360 15217151 14747612 14227803 13752557 13352443 12926180
2805 12926180 12535632 12162072 11705656 11365779 10971761 10663099 10293610 10038221 9892928
2796 9892928 9622134 9306256 9103412 8924589 8719378 8601998 8342861 8132844 7798402 7580125
2786 7580125 7425452 7209186 6961497 6801372 6703925 6610724 6435424 6220402 6089115 5910260
2776E910260j02888n4300j00338j12410j24545n5482r0033m7190j29799q3791
2766E009484k03115j66780j71183j90316k16171k10924l5060n2871j5980O863
2756C753947q7239j06382m7910k515J7475j06380K9002r3345o6172m874j3287
2745C272320L7838J4824j69799p7325o269j15735m3200j02960K6224K5185L1938
2734B893041n4292j15009R473N1260j03368k8010j25128o783J1847k8905j3981
2723B490145q5051m5292j03261k4329m876M4007j03001m4184Q2092n6675j06042
2712B043533l6543L5090O548J9353j9198j13950K6780n6755K0752o7896o3803
2701A793911l3513q0080j4745j1764r5839n6530k5059P6251J05860n9781m9577
$$ plain form
2776 5910260 5807372 5753072 5652734 5540324 5415779 5360297 5270264 5223074 5093275 5009484
2766 5009484 4806369 4639589 4468406 4278090 4061919 3850995 3815935 3763064 3747084 3753947
2756 3753947 3666708 3560326 3512416 3509901 3527376 3420996 3449998 3356653 3290481 3285607 3272320
2745 3272320 3310158 3324982 3155183 3077858 3071589 2955854 2912654 2809694 2835918 2861103 2893041
2734 2893041 2838749 2723740 2733213 2784473 2681105 2653095 2527967 2521184 2533031 2504126 2490145
2723 2490145 2405094 2359802 2256541 2232212 2227336 2271343 2168342 2124158 2206250 2149575 2043533
2712 2043533 2006990 2042080 2048628 2067981 2048783 1934833 1961613 1904858 1925610 1857714 1793911
2701 1793911 1760398 1680318 1665573 1653809 1557970 1501440 1476381 1552632 1658492 1598711 1549134
2690A549134j09127q5774L8476L2694r8153m9382j07535j9237O6829L9835P511
2679A265271m6315j9922K9084l8580K1894p9059m7480J252r7634K7941Q1071j0863
2667A086660l3723J8879o187M9894p2527J6492J32083n0857n0227n9118m3720
2656I87649k8591O5450r2477O912K4703M8555N4634n7119o1595O0371m7824j46202
2644H14466J25935N5022l6877k0248n550k5695k8446O2114M3067J3563n984j13557
2632H77810L2948J85455o7574k8405Q3386q5353l1938j5711P9993M412k8665K7674
2620A034032j8355J3289n9501j1098l8924o7460K8594J9182p7532m3423j9741
2609G59063J18456O6086k375J9607n9793j7938O6781L3107o42k7155r6949L8434
$$ plain form
2690 1549134 1440007 1354233 1392709 1425403 1327250 1277868 1170333 1151096 1217925 1257760 1265271
2679 1265271 1218956 1199034 1228118 1189538 1211432 1132373 1084893 1086145 988511 1016452 1097523 1086660
2667 1086660 1052937 1071816 1065629 1115523 1042996 1059488 1191571 1140714 1090487 1031369 987649
2656 987649 959058 1024508 932031 938943 963646 1012201 1066835 1009716 948121 1008492 960668 814466
2644 814466 940401 995423 958546 938298 932748 907053 878607 940721 983788 997351 991367 877810
2632 877810 910758 1096213 1028639 1000234 1083620 998267 966329 950618 1030611 1035023 1006358 1034032
2620 1034032 1015677 1028966 969465 958367 919443 851983 880577 899759 822227 778804 759063
2609 759063 877519 943605 941230 960837 901044 883106 949887 982994 982352 955197 858248 896682
2597H96682J10432k1893o5144O8566J19635Q1983q4390L6203J01793J30090J77916
2586A551873J58213P4883P9163J64108O9080j1695p9286j15601j28262r3309p9358
2575A589809j64409k31833q0962o947r6757L9058M323j01221j17132j13729M22
2564G20622j2665j8865L3429n6635j61639N3715P1236L5867P2365j36216n6188
2553E45026N1805R4728j14826j03846l909J18527m8532j21529p282q5008L979
2542C29133m252J6850M4103Q237l798n1679M6528p0205N1704O6632j37668o6457
2530B29128m7979J30175k748m7241J8200P8052O2021j59967L8353J291n2656j8946
2518B27683l3769R3841J09126o1830m9354p411l1921l2657J001o2061Q0102M4740
$$ plain form
2597 896682 1007114 985221 920077 988643 1108278 1190261 1105871 1142074 1243867 1373957 1551873
2586 1551873 1710086 1784969 1864132 2028240 2097320 2085625 2006339 1890738 1762476 1669167 1589809
2575 1589809 1425400 1193567 1112605 1105658 1008901 1047959 1052282 951061 833929 720200 720622
2564 720622 707957 689092 722521 665886 504247 557962 629198 665065 737430 601214 545026
2553 545026 596831 691559 576733 472887 468978 587505 538973 417444 410162 325154 329133
2542 329133 324881 341731 385834 394071 390273 338594 385122 314917 366621 433253 295585 229128
2530 229128 181149 311324 308576 261335 279535 357587 419608 259641 297994 299285 246629 227683
2518 227683 193914 287755 396881 335051 285697 278286 246365 213708 214709 152648 232750 277490
2506B77490j8512m2924L0689j5490P7875L1403q1380o1130j4742K3906q3817N3125
2494A76493J4481N2811n4921j9520k0838Q5032r712m1136R1125J2255m7198J4099
2482B52971N8049J0234q5989K9970l7772K0862J48444j05647q8562K6799p9752
2471A49607r629J14444r8808j5756J6908P6570j9314L7766O247q5531J52911j6272
2459C09143n343m9741N1150j19898M0665M6091J5096m3764n4523J0460j07378
2448I1958O4337n5236N5028J17343j5472K2853m5135o8066k0080K9146J3350J2949
2436B02975j2049N8042m8154m6794M1747K1694j44057J23148K8923M986m943k1976
2424B03542K6070k3158K6714K6459o5184K4490O3310n3074j05451q3312j8072
$$ plain form
2506 277490 258978 216054 246743 231253 309128 340531 259151 198021 183279 207185 123368 176493
2494 176493 190974 243785 188864 169344 148506 233538 223826 182690 273815 286070 238872 252971
2482 252971 311020 321254 235265 265235 227463 248325 396769 291122 202560 229359 149607
2471 149607 139978 254422 155614 139858 156766 233336 214022 251788 258035 172504 325415 309143
2459 309143 303800 254059 305209 185311 225976 272067 287163 243399 188876 199336 91958
2448 91958 156295 101059 156087 273430 257958 280811 235676 167610 147530 176676 190026 202975
2436 202975 190926 248968 200814 154020 195767 217461 73404 196552 225475 230461 225518 203542
2424 203542 229612 206454 233168 259627 194443 218933 282243 229169 123718 40406 22334
2413B2334M0264M4553k5877j1675N7706k9363P3404o9260j6540k0236o2712J30600
2401A33198k9350O480m4732k0881n7155J5765o991J8875N4306P0070M9433l9959
2389A49059p8712R9371r229M0458L0856j7753k1608M3702L3547m4345l6089k4570
2377A64687m4249J8730K0780L3475n7884P2907o080o4428r3207l6377k4598N3378
2365C7134M1605j9944N988M2220P2852N6078l0884O8368o4238J1973O6840o3910
2353B24082M0767l6360J2018j6007o0351j05666J50362n2212n6016J14476J7543
2342B32636j0315m251j05984N5055N9064j12292Q3535l3905Q4685J2258q7307
2331A73179k1372o9337N1279J107j24678q410J04350j1111J8765Q0299O3534o0499
$$ plain form
2413 22334 62598 107151 81274 69599 127305 97942 171346 102086 85546 65310 2598 133198
2401 133198 103848 110328 65596 44715 -12440 3325 -3666 15209 69515 139585 189018 149059
2389 149059 70347 169718 160489 200947 231803 214050 192442 236144 269691 225346 189257 164687
2377 164687 120438 139168 159948 193423 135539 208446 202366 137938 44731 8354 -16244 37134
2365 37134 78739 58795 64783 107003 179855 235933 205049 273417 209179 221152 287992 224082
2353 224082 264849 228489 240507 224500 164149 58483 208845 156633 100617 215093 232636
2342 232636 222321 218070 112086 167141 226205 113913 197448 163543 248228 260486 173179
2331 173179 151807 82470 133749 134856 10178 1768 106118 95007 113772 194071 257605 197106
2319A97106j22882l8316N039Q9356Q8606O0985j03404m3217K3382n9563K287N717
2307A05096j05074J52980Q547l9763P7709p9863N7705M1032P828n537l2348R8592
2295B86904o6473j05189l7645R8462J6354L3743Q861j06492j09208K8243K5008
2284G2568J5186J22801L1218J1210j6916M6505q8029k3204j70331o234J04948
2273I9722R7877m2176P7462q5514j23890N1894Q8146L0822n4931J11646K2326
2262B73384j2915n0185K672M4428N926m9565n4423R0092l6623m7215p2007N4556
2250A48125j5744L7196M1144j3755k0517M682N5447L8146J6950J5405q7971K1066
2238B40174N5834n0333L4768J5504J7453O1100L9276j10343O047J4578n0983j2975
$$ plain form
2319 197106 74224 35908 40947 130303 218909 279894 176490 133273 156655 97092 99379 105096
2307 105096 22 153002 161549 121786 199495 119632 177337 218369 226197 220660 188312 286904
2295 286904 220431 115242 77597 176059 192413 226156 235017 128525 19317 47560 72568
2284 72568 87754 210555 241773 252983 236067 282572 194543 171339 1008 -5226 99722
2273 99722 197599 155423 232885 147371 23481 75375 163521 194343 139412 251058 273384
2262 273384 260469 210284 212956 257384 263310 213745 159322 249414 212791 165576 93569 148125
2250 148125 132381 169577 210721 196966 176449 181131 236578 274724 291674 307079 219108 240174
2238 240174 296008 245675 280443 295947 313400 374500 413776 303433 309480 324058 273075 260100
2226B60100m8074P8411P8503n9063k828k5855L796n7753o0706j2383O9714L8387
2214B62249Q2724n25j0711O2134p6610J09638L7849l2895j51091R8302J12281
2203D93345l0698J3269R0641L1675j37249m4290J14965j7833M0311n1832n0705
2192D51599m1854L255M2704l5368Q7816r482J7864m157J8317P5006R9549p2536
2180F32713O4326P9614q5863j403M0901K9069p379J6097L6211J1816R9019L6367
2168I51488O846m7275n620P9769P8556J6123Q7908J1737p771R0181O0339n1825
2156A270456J1185J4899N8067M6306J40745O1678O9727o0197N8005J4641o494
2145A679018J99488k9447J2331J7228m3301J23407M5352O1845O4430O8815Q0159
$$ plain form
2226 260100 212026 290437 368940 309877 307049 281194 284990 227237 166531 154148 223862 262249
2214 262249 344973 344448 333737 395871 319261 428899 466748 433853 282762 381064 493345
2203 493345 462647 475916 566557 598232 460983 416693 531658 513825 554136 502304 451599
2192 451599 409745 413000 455704 420336 508152 498670 516534 512377 530694 605700 705249 632713
2180 632713 697039 776653 690790 689387 730288 759357 751978 768075 804286 816102 915121 951488
2168 951488 958334 911059 905439 985208 1063764 1079887 1167795 1179532 1171761 1261942 1322281 1270456
2156 1270456 1281641 1296540 1354607 1400913 1541658 1603336 1673063 1612866 1670871 1685512 1679018
2145 1679018 1878506 1849059 1861390 1878618 1835317 1958724 2004076 2065921 2130351 2199166 2279325
2134B279325p0246N8949J50519Q8888l5726Q4498P5799J37038J80445J35009L07067
2123C391565J33356J93366K24437K01446J55710L30275J75367J42566K24095J17104
2113E289287J86920J74071K12445L59743L20445L41202L74444L77618O49621P54402
2103I040198O44400P32289O73271P63719R66162J217934J464915J976585K265697
2094A9745170L050391M076781O066443P545234Q410428O811910K540194j707008
2086E6539543p310454r264606p961891n700930m177360l061754k352003j873814
2078A4836731j458663j176283r17109o90809p43047n49138n80734q75028q01348
2069G044572o51164o29008m50807l65847l13551m77080l25983j93342j45429k14829
$$ plain form
2134 2279325 2209079 2268028 2418547 2507435 2471709 2556207 2632006 2769044 2949489 3084498 3391565
2123 3391565 3524921 3718287 3942724 4144170 4299880 4630155 4805522 4948088 5172183 5289287
2113 5289287 5476207 5650278 5862723 6222466 6542911 6884113 7258557 7636175 8285796 9040198
2103 9040198 9684598 10416887 11090158 11853877 12820039 14037973 15502888 17479473 19745170
2094 19745170 22795561 26872342 32938785 40484019 48894447 55706357 58246551 56539543
2086 56539543 49229089 39964483 32002592 26301662 22124302 19062548 16710545 14836731
2078 14836731 13378068 12201785 11284676 10593867 9850820 9301682 8720948 7845920 7044572
2069 7044572 6393408 5764400 5313593 4947746 4634195 4157115 3831132 3637790 3492361 3277532
2059C277532k66866j58732j46721j792j24534j59579r9734p5386o6323p5065j22778
2048A980022l5068k8645K8739N086k27972j00855K0996p7137k0916p0701r5495
2037A378054R836l6724o8881j09946m3906q792n8402M9403N800q6090j73476J88
2025H57064p4566Q8783m1705k0296O2500j0145J9007n8877m3360p2773l8673l661
2013F63298J01021j8675j06136M6305j0477Q6170q3709j24654j0139J0773l7271
2002E16506J3248q9295o0451J02828o2825N9807m426O053O6841l3953n3967l2866
1990D27500r832p6316o0595l795P6571j4990n1486Q5874l9029n9876j06776k413
1978A64837J14237J17523n9156o5383p649q5448o5594O4443J4868N9840O8801
$$ plain form
2059 3277532 3010666 2851934 2705213 2703421 2578887 2419308 2319574 2244188 2177865 2102800 1980022
2048 1980022 1944954 1916309 1945048 1950134 1722162 1621307 1642303 1565166 1544250 1473549 1378054
2037 1378054 1387890 1351166 1282285 1172339 1128433 1119641 1061239 1110642 1116442 1030352 856876 857064
2025 857064 782498 871281 829576 809280 871780 861635 880642 821765 778405 705632 666959 663298
2013 663298 764319 745644 639508 685813 675336 761506 677797 553143 543004 553777 516506
2002 516506 529754 440459 380008 482836 420011 479818 475392 481445 548286 514333 460366 427500
1990 427500 417668 341352 280757 276962 353533 338543 287057 372931 333902 274026 167250 164837
1978 164837 279074 396597 337441 272058 264409 178961 113367 177810 192678 252518 321319
1967C21319l2495p1704j19021K5749R8645Qn4777L6075R923r7515k0387R5142
1955A90962P6458L9997k2585m0839j11879q651N3736N4677p2353J824q253M2067
1943A95161k1045m7788P9009m3881p269m0987J3556j1722n8896L1562J01438J1953
1931B01091n2470j3315O2611n300o7219o0012m9144M9055l0090j3336K0164O1976
1919A04011j04762o1829l5709N3865P0483L39l5000n305k5546J14312o1415O847
1907B0291Q2901J4806L5782n9701p360J2833n4437j60636O7290R3020K6397J6166
1895H7352q4618m7892M6569M442l0244K8492k3335J7787J28025K887j17620N7753
1883F9598M2034j27493l7088O2278P6960q7024O5783J8470N8780k9905q0073K8944
$$ plain form
1967 321319 288824 217120 98099 123848 222493 222501 167724 203799 213722 116207 95820 190962
1955 190962 267420 307417 284832 243993 132114 123463 177199 231876 159523 161347 153094 195161
1943 195161 174116 126328 205337 161456 154187 113200 126756 115034 56138 87700 189138 201091
1931 201091 148621 135306 197917 192617 125398 65386 16242 65297 35207 21871 42035 104011
1919 104011 -751 -62580 -98289 -44424 26059 26398 -8602 -13907 -39453 74859 13444 20291
1907 20291 103192 117998 153780 94079 86719 99552 45115 -115521 -48231 44789 71186 87352
1895 87352 2734 -45158 1411 5853 -24391 4101 -19234 -1447 126578 129465 11845 69598
1883 69598 111632 -15861 -52949 9329 86289 -735 65048 83518 142298 112393 32320 61264
1871F1264o4859n7563J05319l5705M5199P662L6025k0617j2j0436l873J4392o371
1858G0425N4050m1689j46717P7206R0505j22726m3104j5132J0627P4120Q6538
1847I4103k714m3549K6621j4490q0318P6227k2284k9987j574l4581L0974M0221
1835C8649Q9485l9710L0127L2691j12972p692J54488q4692n8579N2854o490j4355
1823G3804j0666J23243l6007J15123L725j21049K2650K7017p1983K05j44973M4918
1811B6007n6767J5077n657p198o714M4213M8997j22760J00705k4659K7662O5560
1799A04466L4461r8276o0564j4219l5405J8544P7178l5166k6484m6808m1783O8858
1787e5198l6088l191Q8160O0870k3263n5370j14129N3517N7710L3278K4654J546
$$ plain form
1871 61264 -3595 -61158 44161 8456 53655 61317 97342 76725 76713 66277 62404 76796 70425
1858 70425 124475 82786 -63931 13275 103780 -18946 -62050 -77182 -66555 7565 94103
1847 94103 91389 47840 74461 59971 -20347 55880 33596 3609 2035 -32546 -1572 38649
1835 38649 128134 88424 118551 151242 38270 30578 185066 100374 41795 94649 88159 73804
1823 73804 63138 186381 150374 265497 269222 148173 170823 197840 125857 126062 -18911 26007
1811 26007 -30760 -15683 -21340 -28538 -35252 8961 57958 -64802 35903 11244 38906 104466
1799 104466 138927 40651 -19913 -34132 -69537 -50993 26185 -8981 -35465 -82273 -124056 -55198
1787 -55198 -91286 -94477 -6317 54553 31290 -24080 -138209 -84692 -26982 6296 30950 32496
1775C2496p3205R9595p8614k8K7364q5353Q6853p3298R1123p8550L132M111k0981
1762f5355R5412N081M559o0013K6738j3824J3822K6025p363r5445o6631R9597
1750c7397k8142P1882k8840k7593m7097J3698R622j0292j078L1948J16524l3700
1738B9535P3540m8618o5331O4994j38352n330m035k394k3700j7128R2139n2411
1726i7091p642M7316P6483N8961j01137K2194l5433q191o9930L1415j0808j0186
1714a04049P1526J7070j1648m7952l2718k211J20893J3141p322q3206m924O6673
1702d727M4119k8878m36n070l2666r0007p3420N0673J56402R2361m7195q746K2682
1689G5092j01148o834K413O6795J25347n3426q6584k8288N821n4134N283M5260
$$ plain form
1775 32496 -40709 58886 -19728 -19756 7608 -77745 9108 -64190 26933 -51617 -48485 -44374 -65355
1762 -65355 30057 35138 39697 -20316 6422 -7402 6420 32445 25082 -70363 -136994 -37397
1750 -37397 -65539 6343 -22497 -50090 -97187 -83489 -73867 -84159 -85237 -53289 63235 29535
1738 29535 103075 54457 -10874 54120 -84232 -89562 -93597 -95991 -119691 -136819 -44680 -97091
1726 -97091 -104733 -57417 19066 78027 -23110 -916 -36349 -44540 -114470 -83055 -93863 -104049
1714 -104049 -32523 -15453 -27101 -75053 -107771 -109982 10911 24052 16730 -66476 -71400 -4727
1702 -4727 39392 10514 10078 5008 -27658 -117665 -191085 -140412 15990 108351 61156 52410 75092
1689 75092 -26056 -32890 -30477 36318 161665 108239 21655 -6633 -812 -54946 -49663 -4403
1677d403k2058P8914n508j9621m1491n6281L3841J0327J0450Q821k0050J31610
1665A04551m7549j6286k8809n8602L4531M938k4298L0749L488l1057Q725m0789
1653f0408J102N9866K5191L5036l4462p2942N3126k7783J23816j16504j02065
1642a16027J9864P1321J47239j94012J6955Q6790o5187n439p1817j2202J26602
1631D087Q994l2452j2551M3771m3344r381M199j316J0599J9473J40663l8937j15696
1618b1891j03620N1074R0462J3058r1817q3150J3618M0312J9521k2648M1435l7829
1606i1475j04616Q4438L9680L6757K4954m1432K1188Q4950p2125p037N358o1202
1594h0562l4083m2800J01190N0941l9332Q4269q5989k5631N7249o0672J2738K1855
$$ plain form
1677 -4403 -26461 52453 46945 27324 -14167 -70448 -36607 -26280 -15830 -7009 -27059 104551
1665 104551 57002 40716 11907 -46695 -12164 -7226 -31524 -775 2713 -28344 -19619 -60408
1653 -60408 -59306 560 25751 60787 26325 -46617 6509 -21274 102542 -13962 -116027
1642 -116027 -96163 -24842 122397 -71615 -54660 32130 -33057 -38496 -110313 -122515 4087
1631 4087 13081 -19371 -31922 11849 -31495 -40876 -36677 -37993 -27394 -7921 132742 93805 -21891
1618 -21891 -125511 -74437 16025 29083 -62734 -145884 -132266 -91954 -72433 -95081 -53646 -91475
1606 -91475 -196091 -111653 -71973 -35216 -10262 -51694 -30506 54444 -17681 -24718 -19360 -80562
1594 -80562 -114645 -157445 -56255 -5314 -44646 39623 -46366 -71997 -14748 -75420 -62682 -40827
1582d0827j13826L8870L0408M3956K0183O4732Q8243j04190l3118J7162k859M0870
1570D9604n0933j7953K3602j07052O198K8268Q3358L8424m0746k005Q1555j22405
1558c0085l4933J26780k7178j7898o6685n7509O1158N3105q4383o0299M4587M7251
1546d6089m0520Q757n2894J7268L6496j117j570P0184R2420j26247m930j4963
1534f3205K489J8047p410M4427Q0444n6018k3570l433k5128N1703J06037r9779
1522B4604L6983J5863m7549j9003m8066j0889L549L3145q390l2260j6721j5341
1510h4075j709k7949l6645J1000J08768P1684l1934o500K7844l1768p0441N8402
1498a3323p6311R7596J8754M0657j01259j03280J48520k2538K1445k4301j0467
$$ plain form
1582 -40827 -154653 -115783 -85375 -41419 -21236 43496 131739 27549 -5569 11593 8734 49604
1570 49604 -1329 -19282 4320 -102732 -96534 -68266 15092 53516 12770 10765 92320 -30085
1558 -30085 -65018 61762 34584 16686 -49999 -107508 -46350 6755 -77628 -137927 -93340 -46089
1546 -46089 -86609 -77852 -130746 -113478 -76982 -78099 -79669 -9485 82935 -43312 -48242 -63205
1534 -63205 -60716 -42669 -50079 -5652 74792 18774 -4796 -8229 -33357 18346 124383 24604
1522 24604 61587 77450 29901 10898 -37168 -48057 -44508 -11363 -19753 -52013 -68734 -84075
1510 -84075 -85784 -113733 -150378 -139378 -30610 41074 9140 2640 30484 -1284 -71725 -13323
1498 -13323 -89634 7962 26716 67373 -33886 -137166 11354 -11184 10261 -14040 -24507
1487b4507m3773n3734j17j8306O1048J0637K9080J81953q2058j10220J10219n6932
1475C290k9312l8743k2635%q3284K9481J08324M7067K963l1208J64033l3962j14410
1462A604Q159o5881N5945j12129J1282R053p8118J39952P4810J3572q5246l6947
1450f3944Q3579k06312n2528M1334Q2504K9958K321R490m2704J9662N4347L5196
1438g097p4640l5059m2533J19718M7227Q130m8048m4271l1345M5617L5017J6992
1426a0292q710j911j6913j5879J00000L9345J5641o2338p2375N338M3101q332
1414F675P6378l8511j33107q367J4736N3529J3578m7887j920q6852L5679N4087
1402f1982J945L2915L959m0315K9439P6312J3495o0938l2993J30780O2087j12127
$$ plain form
1487 -24507 -68280 -122014 -122131 -140437 -79389 -68752 -39672 142281 60223 -49997 60222 3290
1475 3290 -26022 -64765 -87400 -87400 -170684 -141203 -32879 14188 17151 -14057 149976 116014 1604
1462 1604 9763 -56118 -173 -112302 -101020 -91967 -170085 -30133 44677 58249 -26997 -63944
1450 -63944 19635 -186677 -239205 -197871 -115367 -85409 -83088 -73598 -116302 -96640 -42293 -7097
1438 -7097 -81737 -116796 -159329 -39611 7616 15746 -32302 -76573 -107918 -62301 -27284 -10292
1426 -10292 -19002 -20913 -37826 -53705 46295 85640 101281 38943 -33432 -28094 15007 6675
1414 6675 83053 44542 -88565 -96932 -82196 -28667 -15089 -62976 -64896 -151748 -116069 -61982
1402 -61982 -60037 -27122 -23163 -63478 -34039 42273 55768 -5170 -38163 92617 154704 42577
1390D2577j3075P4952o3870p3873L3987N947n8203M7142o2818J9417j1369O6833
1378G647R6569j07880j27883M9687N5673l0793k8883Q4518n5456k2659O4103r9345
1366a14702N6723O7649j3945r2312J4260J07650j9015q5144k0448k1062K9428
1355i0918M5471r4706J2183R4997J20104K4829j68698K5224j17767J27324J19218
1344I7261j67821k6368Q5330K4597j1108N438k1077P5453O4055j8086n8794r8200
1332d9320q508J09482l3236o0861J01591M6301p4373K4707l9920L9191j4909j29637
1320h9492N5801j9045p5219l699P3177N3506K5326j32350k52J5028o6243K4993
1308a38469M0741J54103n9013m9480Q5068m3329K5370J6379j35091Q7724o3159
$$ plain form
1390 42577 29502 104454 40584 -33289 698 6645 -51558 -4416 -67234 -47817 -59186 7647
1378 7647 104216 -3664 -131547 -81860 -26187 -56980 -85863 -1345 -56801 -79460 -15357 -114702
1366 -114702 -57979 9670 -4275 -96587 -82327 25323 6308 -78836 -99284 -120346 -90918
1355 -90918 -45447 -140153 -127970 -32973 87131 111960 -56738 -31514 -149281 -21957 97261
1344 97261 -70560 -96928 -11598 12999 1891 7329 -13748 61705 125760 107674 48880 -49320
1332 -49320 -57828 51654 18418 -42443 59148 105449 31076 55783 15863 55054 40145 -89492
1320 -89492 -33691 -52736 -127955 -131654 -58477 -4971 20355 -111995 -112247 -97219 -163462 -138469
1308 -138469 -97728 56375 -2638 -52118 32950 -10379 14991 31370 -103721 -15997 -79156
1297g9156J4122K7516J3545p9029P836J3231J0344R0837O6288l8589j18455m491
1285g6001l2569L2655P0661R4443o693j56982l9827L0063o811R8592r6206k4496
1273a13171P8557j4013j0152M3094j56863M5749k5474J01010p9052r3028J17786
1262a05557L3927k3028k326J6661J4348J91988j0569j09382l7814J1508M28L6464
1250A6648j07511N486M4617P1438k0282m2494N7385m8223p4699J06694N1413j20410
1238e9938k0481m2957J16910O4046M4663m7514r9939o683J004Q53J4930J0114
1226b4992M4728q0106R879J753J19745l17k3680j36893n5662j463K2312J58309
1214C3613r4647n7394m2087N3422O7940J38612k3669q2391k1900J489r0748N8258
$$ plain form
1297 -79156 -65034 -37518 -23973 -103002 -95166 -81935 -71591 19246 85534 46945 -71510 -76001
1285 -76001 -108570 -75915 -5254 89189 82496 -74486 -114313 -84250 -91061 7531 -88675 -113171
1273 -113171 -34614 -48627 -58779 -15685 -172548 -126799 -152273 -51263 -130315 -223343 -105557
1262 -105557 -71630 -94658 -96984 -80323 -65975 126013 115444 6062 -31752 -20244 -19816 16648
1250 16648 -90863 -85377 -40760 30678 10396 -32098 25287 -22936 -97635 9059 60472 -59938
1238 -59938 -80419 -123376 -6466 57580 102243 54729 -45210 -51893 -50889 -50036 -35106 -24992
1226 -24992 19736 -60370 -50491 -48738 71007 70690 47010 -89883 -145545 -147008 -124696 33613
1214 33613 -61034 -118428 -160515 -107093 -39153 99459 75790 -6601 -28501 -27012 -117760 -59502
1202e9502r7846O4810R0087M758j1128O1236k3831l2700m2838m3657O4679O5015
1190C9083o5314P3668l2229m7427N7044j3801p6314j02424O1263N4034q4957N7736
1178g9638P9039R613j6371m6230j9406M3071j6476k7240K414R427N8150M3607
1166C9960J25801l8059n4840n1537o358J6042Q2828o3049j33854j3617Q9068k643
1154a0258r963k5845Q8210o0966K0170L7484J562k7786l0794Q7432l8455r9431
1142f8640k4214J80191q88n78Q879L2399L320j32408l2219J9977N2591n5062j457
1129a8109j361k3339L8070L3484O1035L893k2740k0777p7193J15221J4855m6195
1117E6844r9372r4270J4778k5003J08116P3725n1480L9947m4920Q7193p3205n2306
$$ plain form
1202 -59502 -157348 -92538 -2451 2307 -8821 52415 28584 -4116 -46954 -90611 -25932 39083
1190 39083 -26231 47437 15208 -32219 24825 11024 -65290 -167714 -106451 -52417 -137374 -79638
1178 -79638 -599 9014 -7357 -53587 -72993 -29922 -46398 -73638 -71224 -61797 -3647 39960
1166 39960 165761 127702 72862 21325 14967 31009 113837 50788 -83066 -96683 -7615 -10258
1154 -10258 -20221 -46066 42144 -18822 1348 38832 40394 12608 -18186 69246 30791 -68640
1142 -68640 -92854 87337 86449 85871 94750 127149 130469 -1939 -34158 -14181 38410 -16652 -18109
1129 -18109 -19470 -42809 -4739 28745 89780 93673 70933 50156 -27037 88184 103039 56844
1117 56844 -42528 -136798 -122020 -147023 -38907 34818 -16662 23285 -21635 65558 -7647 -59953
1105e9953J9297N6474r112r1954P7464k0121J9373K1084O021M1768l5338M3739
1093F8742L3694p5524J30579r234l534n6456j00226j4877j7535M3943m4159R725
1081c4862L3473L0587M3656j29461m4171N1797K1008K6767J1582j5010L0701m667
1069B1400K1517n1036N002j06776K2913J36970J2136K2404m3127j39998j8449
1058a17044k2991O6588L7148p3709J08044L3171o4802n8132R1223j03152J4847
1047h8809L0392R746l668l6147K4536J24937q7015l8410N6267j87290O9035O627
1035a19799J5925N3536L9807k8987o4233l7082K7889k0408j0187J19147j4343
1024c8735k061m2297O4070N7941n5424K6229n3671k4235j7116O2001n7183o188
$$ plain form
1105 -59953 -40656 15818 6706 -85248 -7784 -27905 -8532 12552 18573 60341 25003 68742
1093 68742 102436 26912 157491 148257 144723 88267 -11959 -26836 -44371 -428 -44587 -34862
1081 -34862 -1389 29198 72854 -56607 -100778 -48981 -27973 -1206 10376 -4634 26067 21400
1069 21400 42917 -8119 -3117 -109893 -86980 49990 62126 84530 41403 -98595 -117044
1058 -117044 -140035 -73447 -36299 -110008 -1964 31207 -33595 -91727 -504 -103656 -88809
1047 -88809 -58417 -48671 -52339 -88486 -63950 60987 -26028 -64438 -8171 -195461 -126426 -119799
1035 -119799 -103874 -50338 -10531 -39518 -103751 -140833 -112944 -133352 -143539 -24392 -38735
1024 -38735 -40796 -83093 -19023 38918 -16506 9723 -43948 -68183 -85299 -23298 -80481 -86669
1012h6669O6764L7646o7047r8307M096n4178J15461Q0579r3132M7757N8600m7913
1000c6343l8159J06714n0621K2133L2718k2357m0853r4542j8032R6270J7139r5294
988a21227p34L6846k0662J9743N8232q156K7529l8323l7190l8691J04784n7018
976g4867M7965L7079m1263J34342k6147j26061r2746J15896K3108K1707K9012
965D8025l0197Q895K78M8143L8606o8680j0059k1801n9889O3755M0528J73652
953B31256r5972n7708j20994R664L7739l5985K140J5109M7489j3342K0658k6396
941A3658m9128n9643P2178m015O275P5302K5679K851j15095l7855Q0898n2747
929d1642q2806R7172k0419j561L3795J285R1504J63o1528p0311J1613J827p699
$$ plain form
1012 -86669 -19905 17741 -49306 -147613 -143517 -197695 -82234 -1655 -94787 -47030 11570 -36343
1000 -36343 -74502 32212 -18409 3724 36442 14085 -26768 -121310 -139342 -43072 -25933 -121227
988 -121227 -121961 -85115 -105777 -86034 -27802 -35958 -8429 -46752 -83942 -122633 -17849 -74867
976 -74867 -26902 10177 -31086 103256 77109 -48952 -141698 -25802 -2694 19013 48025
965 48025 17828 26723 27001 75144 113750 45070 35011 13210 -46679 17076 57604 231256
953 231256 135284 77576 -43418 -33754 3985 -32000 -29860 -14751 32738 19396 40054 13658
941 13658 -35470 -95113 -22935 -26950 -20675 54627 80306 83157 -31938 -69793 11105 -41642
929 -41642 -124448 -27276 -47695 -49256 -15461 -14176 77328 77491 15963 -54348 -42735 -40908 -48607
916d8607O1619N3562j10148n1027J36534P4976p5276l2350L0029k4362P5793O2864
904A53607L2064p2389l7127m2750j2078K7699P5553O7791m6749q5279p8031L9615
892B1926k1904K0639L1426L3402r2152m4265l7278K0238p318j8800o985P3545
880b7526M3798j26067l6120J47442j2111o1346p2032L3658Q0909k458j7210l3330
868h2393J73520j4880q3410J6040j89907J9723K9095O7308J16626o9001J0623
857f656O9251m8817o8221N1524m6804Q590J4850n296j10872Q0627O6641n1935
845d7118O6626R683j0671J05007l9708j9279L8482j2358l0849N9361k7075L5382
833A27483o8788n6822L718m8956P784J09K3245N4490o6645m4021K6397J11948
$$ plain form
916 -48607 13012 66574 -43574 -94601 41933 116909 41633 9283 39312 14950 90743 153607
904 153607 185671 113282 76155 33405 21327 49026 124579 192370 145621 60342 -17689 21926
892 21926 22 20661 52087 85489 -6663 -50928 -88206 -67968 -75286 -94086 -101071 -27526
880 -27526 16272 -109795 -145915 1527 -10584 -71930 -143962 -110304 -29395 -31853 -49063 -82393
868 -82393 91127 76247 -7163 8877 -181030 -161307 -132212 -64904 51722 -17279 -6656
857 -6656 62595 13778 -54443 -2919 -49723 -41133 -26283 -31579 -142451 -61824 4817 -47118
845 -47118 19508 29191 18520 123527 83819 64540 103022 90664 59815 119176 92101 127483
833 127483 58695 1873 5591 -43365 -35581 -35472 -12227 42263 -24382 -68403 -42006 69942
821F9942M815j2493o7442J0403Q1934k8729p2857L5376j9608o1488N4533M269
809a345J2323k361R7343l5266R6122j62069n978R6145M0240r8726m1864n1228
797e6664J02560L7801k727m5751j82989J00224P2274k6429J282J1389o1516j08278
785a58824Q455J3952P4980J4457j9722j7059L8905J23499J04528n9156n5415q0138
773a1538k3714j1761O506K365o8459Q5124l8718o8594J4767k1585L7259R2881
761e467K0460R427K7164K070L0984j8555r6900M6310q9925k0176j009O1216N5067
748B0666O8072J9637r5623j17701M8963K2862j463k0648j8657L6680k785j773
736d1770M1258Q2101l4647m3977l9297q3011M6849l0976M0082L6803N8911M9450
$$ plain form
821 69942 74757 62264 -5178 5225 87159 58430 -14427 20949 1341 -60147 -5614 -1345
809 -1345 10978 8617 105960 70694 166816 4747 -1231 94914 135154 36428 -5436 -56664
797 -56664 45896 83697 80970 35219 -147770 -47546 24728 -1701 -419 10970 -50546 -158824
785 -158824 -150369 -136417 -61437 -46980 -66702 -83761 -44856 78643 183171 124015 68600 -11538
773 -11538 -35252 -47013 -40507 -38142 -106601 -21477 -60195 -128789 -114022 -135607 -98348 -5467
761 -5467 14993 24420 51584 53654 84638 66083 -30817 15493 -74432 -94608 -95617 -34401 20666
748 20666 88738 108375 12752 -104949 -55986 -33124 -34587 -55235 -73892 -37212 -39997 -41770
736 -41770 -512 81589 46942 2965 -36332 -119343 -72494 -103470 -63388 -26585 32326 81776
724H1776n8895M0851L2650j0280o2540j26269J54853Q7026j90703O6636O517O4798
712H6420J8773j06318j9057m863M3033k1406p1102J21327J9214p7402K1087k457
700G249j30526P6199m9266j7734Q3683N3370K5081l6275O1116p7961k701P5037
688F7272J01184j15797L3310P099J02565n5921j52938M0312N9388M3618q6561
677D3531j7800j5102O7028o6695r279O9666j3832K9374o9170k3371J2141k3164
665a6673q673L0824m9674M8928j4961j45912J05587R2902n6036J184J34343l2079
653H9760K7856K0028P335l5635j49186K5673M625K2462N4172o6500q4107J10014
641B6497J0814K5914J7700J378K6813K1645j02202l7664N6663k5490J43320n4902
$$ plain form
724 81776 22881 63732 96382 86102 23562 -102707 52146 139172 -51531 15105 21622 86420
712 86420 105193 -1125 -20182 -25045 17988 -3418 -74520 46807 66021 -11381 9706 7249
700 7249 -123277 -47078 -96344 -114078 -30395 22975 48056 11781 72897 -5064 -7765 67272
688 67272 168456 52659 85969 93068 195633 139712 -13226 27086 86474 130092 43531
677 43531 25731 10629 77657 10962 1683 71349 57517 86891 17721 -5650 6491 -16673
665 -16673 -25346 5478 -44196 4732 -10229 -156141 -50554 42348 -13688 -12504 121839 89760
653 89760 117616 137644 144979 109344 -39842 -14169 -9544 12918 67090 590 -83517 26497
641 26497 37311 63225 80925 82303 109116 130761 28559 -9105 47558 22068 165388 110486
629A10486R517n2376J0343P5856k8452q4089j1929N3048o1927O1720J287r9689
617a6205O0181p6241J3947m0359k3218P1469K5034L8157p1546n2473r9012R9721
605g0545J03643q0270O2367K3509m8922j5506P481K7583l881M6656M3053L1062
593A26230j0923l7510r4041O1764j13210l0393J51473l1059j43739J61035m4878
582e251o3461P8224j997M3089l5057m6461O0367L0386q4413Q4910K980J1629J5337
569I0282n1979k12J4702L9227k4028m4031N8292j00349j19490P4804M6675k104
557a8211R699l0218L1102L415K5107K4274K5445j4024L0252l7026n8820m8724
545e7729j2709K9045N0319o3977q2341R1080M5565p4198M8243k5902O7254M9190
$$ plain form
629 110486 120003 67627 77970 153826 125374 41285 29356 82404 20477 82197 83484 -16205
617 -16205 43976 -32265 -18318 -58677 -81895 -10426 14608 52765 -18781 -71254 -170266 -70545
605 -70545 33098 -47172 15195 38704 -10218 -25724 -18243 9340 5459 52115 95168 126230
593 126230 115307 77797 -16244 45520 -67690 -98083 53390 22331 -121408 39627 -5251
582 -5251 -68712 9512 7515 50604 15547 -30914 29453 59839 -24574 60336 63316 74945 90282
569 90282 38303 38091 52793 92020 67992 23961 82253 -18096 -137586 -62782 -16107 -18211
557 -18211 -8512 -38730 -7628 -4213 20894 45168 70613 56589 86841 49815 -9005 -57729
545 -57729 -70438 -41393 8926 -55051 -137392 -46312 -747 -74945 -26702 -52604 14650 63840
533F3840m273q8933k2435K2286j163J4710Q1172J2322M7279M3437r5134q8760
521a5652n0227K7759J02844o5780j08199m2052N137O7311K3133P3239m9253p2336
509a04076P8234O3614l2391K0961N9374l636n7655J03766o4228n9535Q3749L970
497I2147l6557k8694J03658o7110r0246J37570m9493L5231O356m2708m9097m1740
485c0683m7659L8261Q562M4171Q571P0942L4839o9106J0075P7676m1412m9895
473E4342k4609L4012J15555p727p4696p4005K5848N4882j28072k4231J21543o2750
461A0092m9091J1168k9872j5218n854Q3878J9402j1575j3906k7041r042J01749
449F4690O3628j17213j6446Q203l45q0j9031q7314n2517M5882L8530J01919N1203
$$ plain form
533 63840 59567 -29366 -51801 -29515 -30678 -15968 65204 77526 124805 168242 73108 -15652
521 -15652 -65879 -38120 64724 -1056 -109255 -151307 -146170 -78859 -55726 17513 -31740 -104076
509 -104076 -25842 37772 5381 26342 85716 82080 24425 128191 63963 4428 88177 92147
497 92147 55590 26896 130554 63444 -26802 110768 61275 96506 102862 60154 11057 -30683
485 -30683 -78342 -40081 -31519 12652 21223 92165 127004 57898 67973 145649 104237 54342
473 54342 29733 63745 179300 171573 96877 22872 48720 103602 -24470 -48701 72842 10092
461 10092 -38999 -27831 -57703 -72921 -78775 5103 24505 12930 -976 -28017 -37059 64690
449 64690 128318 11105 -5341 2862 2517 2437 -16594 -103908 -156425 -110543 -72013 29906 81109
436H1109k3468k9632J38129l3512L6759o1806j00081J28633O6258j07705J3629
425A08313J8112p6567m2288L4127N8383k9319n5933o227m7379K8741k9646k4246
413f3929P1725n1377R078k374O0355L283J02613R129o2128O7728q0253n2966n5374
400d4490J30051J28434n9495l7405o1267p1417j11543J08135J44280n4080j17519
389d6316P8258K9521R531n4947M0682k6224M8252o4605j8698M1387k2392k3974
377i525O5045k0095L4307O3229m1608j1228j894J2560M849M7705M5774j83366
365E753J05406k1787j18843J383k3100J3595K3084L1034P6098r303Q691o0366
353C1645q5958J3598J18841P7395q3098n5337R9736P508j00187J4739P7183J7858
$$ plain form
436 81109 57641 28009 166138 132626 169385 107579 7498 136131 202389 94684 108313
425 108313 126425 49858 7570 41697 100080 70761 14828 8601 -38778 -10037 -39683 -63929
413 -63929 7796 -43581 -34503 -36877 23478 26761 129374 138503 76375 144103 63850 10884 -44490
400 -44490 85561 213995 154500 117095 55828 -15589 -127132 -18997 125283 71203 -46316
389 -46316 31942 61463 70994 16047 56729 30505 78757 14152 -4546 36841 14449 -9525
377 -9525 55520 35425 69732 132961 91353 80125 78231 90791 95640 143345 189119 5753
365 5753 111159 89372 -29471 -28088 -51188 -37593 -14509 16525 92623 83320 92011 31645
353 31645 -54313 -40715 78126 155521 72423 17086 116822 124330 24143 38882 116065 133923
341A33923p0579m3374L8415k3980Q1523o6009K6472J63703n8997Q800j05509k4327
329F0061m0906O3191q5351K6507L0111J355k3621J30089m5742p4024M3061N5387
317A40118n822L2596j30187j21144R6459Q9964N2654j11932k030J47645m4923
306A43398l4073L8569l6400j6555p0069n8005K01P140K0559K2261L2037j3294
294C5769M023j601m1010K9451l1615L658K4296M6374J4290q0019r3218L8235P4738
281B3371l1449Q55O3741J0090l9133M7060l0257N7387O7895m4085J0422o4259
269G1638k2100J3080m0280J07387n8694n9481P3270M7681r4896k214Q3023j05735
257A2679L4725J01876l7115M0006k9249O6096j55564o0309M8857L5227K7449j8985
$$ plain form
341 133923 63344 19970 58385 34405 115928 49919 76391 240094 181097 189897 84388 60061
329 60061 19155 82346 -3005 23502 53613 54968 31347 161436 115694 41670 84731 140118
317 140118 134296 166892 36705 -84439 12020 101984 154638 42706 40676 188321 143398
306 143398 109325 147894 111494 94939 24870 -33135 -32934 -25794 -5235 17026 49063 35769
294 35769 39792 38191 -2819 26632 -4983 -1325 22971 69345 83635 3616 -89602 -51367 23371
281 23371 -8078 -7223 56518 66608 27475 74535 44278 101665 169560 125475 135897 71638
269 71638 49538 62618 22338 129725 71031 11550 84820 132501 37605 35391 118414 12679
257 12679 47404 149280 112165 152171 122922 189018 33454 -26855 22002 57229 84678 65693
245F5693l4317L1263j2889o9979Q5865P4456K2817j16631J01720m2629k4985K2412
233A02796M307j30889L5713O1518l4693M1958P327O5177j08172k8284j7265k804
221c311K3337R2157N4652j5505m9744o2987J3250M2261M1770o7740L4252M1190
209A43582k0989J306j6286r7813k2326Q1430J4369n7063N1397k9125j15981R4335
197B6836l8789J6200K2844m577M9137M6727m4992n6608N5264N5793J0994k9521
185A09308m012n8195M7518q7954Q0058N8848o2573m4601j6990K99J22961n0099
173I4568m7483j599J1241M514O4115k8603K5812n0714j7336L4620m8876k0172
161B0087m7687j4450N3624l4794N6174M099j6486P4336l1426l7057m2889M486
$$ plain form
245 65693 31376 62639 49750 -20229 65636 140092 162909 46278 147998 105369 80384 102796
233 102796 107103 -23786 11927 73445 38752 80710 88037 153214 45042 16758 -507 -3311
221 -3311 20026 112183 166835 151330 101586 38599 51849 94110 135880 68140 102392 143582
209 143582 122593 123899 107613 9800 -12526 68904 83273 26210 77607 48482 -67499 26836
197 26836 -11953 4247 27091 22514 71651 118378 73386 16778 72042 127835 138829 109308
185 109308 105296 47101 94619 6665 86723 145571 82998 38397 21407 21706 144667 94568
173 94568 47085 45486 56727 61241 125356 96753 122565 71851 54515 89135 40259 20087
161 20087 -27600 -42050 11574 -23220 32954 37053 20567 94903 63477 26420 -16469 -11983
149a1983P6139k8574j0599Q5711j2169J3127j2103l2869j1309j778J8874K5435
137I7902r5057l7847R4595K7278l8445J1542N7272l7491Q826l3190k4973M8909
125G9321L118j5853L246l336L4920P7184J3644m0433q2441K6746J0434n6347p4200
112b3997P6575L5432P7281q6430K0989p4493M0767L1385J362M1038J723k3922
100A17710l1362M9142L8133q5120m6208L5441J4507n1814j3387k8415l600M3421
88C8448j6392q251J7356L2289k4688J4136J8700M0052J2865o7950O0845Q0980
76A98390j2910j20552J5659R169m5927J9611N2623k0076J7501m8102J2225j203
64G6408J73n7229J3843L4496m371Q6466n3473M8824l7543J799l1913N1847o1802
$$ plain form
149 -11983 64156 35582 24983 110694 98525 111652 99549 66680 55371 53593 72467 97902
137 97902 2845 -35002 59593 86871 48426 59968 117240 79749 88575 55385 30412 79321
125 79321 82439 66586 69832 66496 101416 178600 192244 151811 69370 96116 106550 50203 -23997
112 -23997 52578 88010 165291 78861 99850 25357 66124 97509 98871 139909 141632 117710
100 117710 86348 135490 173623 88503 42295 77736 92243 40429 27042 -1373 -4973 38448
88 38448 22056 13805 31161 63450 38762 52898 71598 111650 124515 56565 117410 198390
76 198390 185480 64928 80587 89756 43829 63440 116063 95987 113488 65386 77611 76408
64 76408 76581 19352 33195 67691 63320 149786 96313 145137 107594 109393 77480 129327 67525
51F7525J0624K6225K21n6725j801O6321m8915j25218R1742k705k8714m3949k6652
38g2021L1812Q4993N6559o5112m3991J01414Q3184j00723J5094m2171j666K963
26E0335M2974j0615P725o1389L5637K1160n158r088n550R6743l9809r0569L090
13C5486M800k8580Q8463J2080l9632j7204L0237J9579K0785p069P628k8428m5120
0E3025
$$ plain form
51 67525 78149 104374 104595 47870 46069 112390 63475 -61743 29999 27294 -1420 -45369 -72021
38 -72021 -40209 44784 101343 36231 -7760 93654 176838 76115 91209 49038 47372 50335
26 50335 93309 82694 90419 29030 64667 85827 80669 71581 66031 162774 122965 32396 35486
13 35486 40286 11706 100169 112249 72617 55413 85650 105229 126014 118945 126573 98145 53025
0 53025
$$ Imaginary data points
##PAGE= N=2
##DATA TABLE= (X++(I..I)), XYDATA
16383a892448o9468K6731N9135K2859l2922J07263M8949J06696L0300l0986l6227
16372a660118o0112J21502L3116k8571O8698j1041l0893K5480M4706q679J03917
16361a401995K706K4643O834J9648J1998M0923M2497K2032j7347Q1076L2139k2389
16349a157235O1010k102o539P2263L8062j10601O6252L4893R4315L0181M14R00
16337h78187J7334J9061J0832k6168R9827N6934L4871k754o3361M0790Q1818m7422
16325f56425k6335P4762J08425k6162O560J8133n6485K0441M5535M2384N2001
16314c97166Q3058j2114J7137j1997P598p1928K7404J06396R998Q0249L3527o769
16302a34607P609L5215R4356n1699p3412J245K2196Q0517M7259K1687m9668n5295
$$ plain form
16383 -1892448 -1961916 -1935185 -1876050 -1853191 -1886113 -1778850 -1729901 -1623205 -1592905 -1623891 -1660118
16372 -1660118 -1720230 -1598728 -1565612 -1594183 -1525485 -1536526 -1567419 -1541939 -1497233 -1505912 -1401995
16361 -1401995 -1399289 -1374646 -1367812 -1348164 -1336166 -1295243 -1252746 -1230714 -1248061 -1166985 -1134846 -1157235
16349 -1157235 -1096225 -1098327 -1104866 -1032603 -994541 -1105142 -1038890 -1003997 -909682 -879501 -879087 -878187
16337 -878187 -860853 -841792 -830960 -857128 -757301 -700367 -665496 -668250 -731611 -690821 -609003 -656425
16325 -656425 -682760 -607998 -499573 -525735 -519175 -501042 -557527 -537086 -491551 -449167 -397166
16314 -397166 -314108 -326222 -309085 -321082 -313484 -385412 -358008 -251612 -241614 -161365 -127838 -134607
16302 -134607 -126998 -91783 2573 -49126 -122538 -121293 -99097 -18580 28679 50366 698 -54597
16290e4597M2106J33793O4247O1550o0370k5582J16586o355o5151j250j1726j3220
16278A80031L2330J20495m2896J9487l096K4890N4332l8511M9799J20539N8588
16267E75988J9622k0831q1509o6759J10159Q6984j5376m2600O0937R4836k8869
16256F92582O0830p654J01025q708j8959l2465m4420l7475N12L5923O5966n8116
16244G49041l168J10833l7923K8910N2258N5413n5309J2240P1087K6738j7498
16233I92622n4119M3044J525J4573r4258N2567j7402K6372l631o2660O6833q054
16221I57412J08162n7536l1499M2950m9026J87706O9725o0729l7107K0110J15389
16210A265557N0345p1680L2502O2348J960p6592r9008M3822Q4221J600l2100Q0217
$$ plain form
16290 -54597 -12491 121302 185549 247099 186729 161147 277733 271378 206227 204977 193251 180031
16278 180031 212361 332856 289960 309447 306351 331241 385573 347062 396861 517400 575988
16267 575988 595610 574779 493270 426511 536670 623654 608278 565678 626615 721451 692582
16256 692582 753412 745758 846783 838075 819116 786651 742231 704756 705268 741191 807157 749041
16244 749041 745873 856706 818783 847693 899951 955364 900055 912295 983382 1010120 992622
16233 992622 938503 981547 983072 997645 903387 955954 938552 964924 961293 898633 965466 957412
16221 957412 1065574 1008038 976539 1019489 970463 1158169 1227894 1167165 1130058 1150168 1265557
16210 1265557 1315902 1244222 1276724 1339072 1341032 1264440 1165432 1209254 1293475 1295075 1262975 1343192
16198A343192p7580l0911L3661J01864O9950J6280K5444l9913m4175p3493l9591
16187A284728J27933q8507r4926O4248L6422O7234j0914k98l0540k7347M7386
16176A375419L9761J5533J6802L4400p756n2197P6460O8725m7206m2866K389k2515
16164A456949R2162N4184j3950K733P4204j23935p3475J01091M8591j09646n9454
16153A449454l0725M4463j4959R0227N4765p0879L9492K5218M1295m4947k566
16142A580838n4214K3015p9933n5219J20291N1256p8709J8311J32815k2151Q1548
16131A717848n1335o6675O7739J0431r0746O1318m0o4462J29072M9733n1390p4440
16119A637053m8527J3276N3993o7430P9280l3360J26127J05529j11466j33986
$$ plain form
16198 1343192 1265612 1234701 1268362 1370226 1440176 1456456 1481900 1441987 1397812 1324319 1284728
16187 1284728 1412661 1324154 1229228 1293476 1329898 1397132 1386218 1385920 1355380 1328033 1375419
16176 1375419 1415180 1430713 1447515 1481915 1474159 1421962 1498422 1567147 1519941 1477075 1479464 1456949
16164 1456949 1549111 1603295 1589345 1592078 1666282 1542347 1468872 1569963 1618554 1508908 1449454
16153 1449454 1418729 1463192 1448233 1538460 1593225 1522346 1561838 1587056 1628351 1583404 1580838
16142 1580838 1526624 1549639 1469706 1414487 1534778 1586034 1507325 1525636 1658451 1636300 1717848
16131 1717848 1666513 1599838 1667577 1678008 1587262 1648580 1648540 1584078 1713150 1762883 1711493 1637053
16119 1637053 1588526 1601802 1655795 1588365 1667645 1634285 1760412 1865941 1754475 1620489
16109A620489m3045L7719Q5043m2311J42423l7765r9008P8665R6508R066j2622
16098A835162p9775K6058n8659j4211M3301j2908J9861m7690p3748P2655O1329
16087A771375m7367L6276l0492K6577o2056P3039J4658j31120m7834Q4162L8795
16076A726013J533n6723m1581P0770J21161j6466j03258L297j15099r5533J72105
16065A666219K1072Q8713k6621q8951R2974Q722q2055l5560K8704k113P9683k9087
16053A721700j5764k0825J27148j6632j17558m5427l1363J39167j15230L7138
16043A662354J38885p7668k4207J13214l2835k0004l5335M7428O4772j364p6745
16032A758495q4635o2295M0323K3585j783K0097R4578R0691m5979l0125j06943
$$ plain form
16109 1620489 1577444 1615163 1700206 1657895 1800318 1762553 1663545 1742210 1838718 1847784 1835162
16098 1835162 1755387 1781445 1722786 1708575 1751876 1738968 1758829 1711139 1637391 1710046 1771375
16087 1771375 1724008 1760284 1729792 1756369 1694313 1767352 1782010 1650890 1603056 1687218 1726013
16076 1726013 1727546 1670823 1629242 1700012 1821173 1804707 1701449 1704746 1589647 1494114 1666219
16065 1666219 1687291 1776004 1749383 1660432 1753406 1762128 1680073 1644513 1673217 1671104 1750787 1721700
16053 1721700 1705936 1685111 1812259 1795627 1678069 1632642 1601279 1740446 1625216 1662354
16043 1662354 1801239 1723571 1699364 1812578 1779743 1759739 1724404 1771832 1836604 1835240 1758495
16032 1758495 1673860 1611565 1651888 1675473 1673690 1693787 1788365 1879056 1833077 1802952 1696009
16021A696009o168O7784O8623N4766O049m0100l8198J114j2506j73660L6515J95200
16009A855428N534m2519r640J1606q5775N6777K7182o5486R823J4412l1461l0067
15997A715814N509k197j1917l9045P350R6677P8719l224m8408k6583O5040L5283
15985A873018j9003l4089j08024L3688L5841o908m0388J759O0845o188p7506R543
15973A722588o450L5954M5292p01k320O3209r0389j88366R2115R8593m5964N4915
15961A778476K1133K9859Q9448k5860Q752r9160K9210l0937K742m6122R357N6736
$$ plain form
16021 1696009 1689841 1757625 1826248 1881014 1887063 1846963 1808765 1809879 1797373 1623713 1660228 1855428
16009 1855428 1860962 1818443 1808803 1820409 1734634 1791411 1818593 1753107 1762930 1777342 1745881 1715814
15997 1715814 1721323 1719126 1707209 1668164 1675514 1772191 1850910 1847686 1799278 1772695 1837735 1873018
15985 1873018 1854015 1819926 1711902 1745590 1781431 1774523 1734135 1735894 1796739 1790551 1713045 1722588
15973 1722588 1716138 1752092 1797384 1796683 1794363 1857572 1767183 1578817 1670932 1769525 1723561 1778476
15961 1778476 1799609 1829468 1918916 1893056 1901808 1802648 1831858 1800921 1803663 1757541 1766898 1823634
$$ [...]
##END NTUPLES=NMR SPECTRUM
##END=
