##TITLE=1H_EC-3289(12)
 CDCl3
 8 sc, 
 23.1.2023
##JCAMPDX= 6.0         $$ Bruker NMR JCAMP-DX V2.0
##DATA TYPE= NMR SPECTRUM
##DATA CLASS= NTUPLES
##ORIGIN= UXNMR, Bruker Analytische Messtechnik GmbH
##OWNER= root
$$ XWIN-NMR		Version 3.5
$$ Mon Jan 23 14:27:07 2023 Russian Standard Time (UT+4h)  she@DPX200
##.OBSERVE FREQUENCY= 200.13135
##.OBSERVE NUCLEUS= ^1H
##.ACQUISITION MODE= SIMULTANEOUS
##.ACQUISITION SCHEME= undefined
##.AVERAGES= 8
##.DIGITISER RES= 18
##SPECTROMETER/DATA SYSTEM= spect
##.PULSE SEQUENCE= zg30
##.SOLVENT NAME= CDCl3
##.SHIFT REFERENCE= (INTERNAL, CDCl3, 0, 15.7491)
##AUDIT TRAIL= $$ (NUMBER, WHEN, WHO, WHERE, WHAT)
$$ ##TITLE= Audit trail, XWIN-NMR		Version 3.5
$$ ##JCAMPDX= 5.01
$$ ##ORIGIN= Bruker BioSpin GmbH
$$ ##OWNER= she
$$ F:/spectra/data/she/nmr/H-F/1/pdata/1/auditp.txt
$$ ##AUDIT TRAIL=  $$ (NUMBER, WHEN, WHO, WHERE, WHAT)
(   1,<2023-01-23 14:25:42.40 +0400>,<she>,<DPX200>,
      <created by zg, POWCHK disabled, PULCHK disabled
       configuration hash MD5:
       00 E9 B6 7A A2 85 ED C7 34 08 36 98 17 FE 4E 26
       data hash MD5: 16K
       70 CA 43 B2 F9 EB 6A CC 28 57 A4 BE 81 BB 85 9E>)
(   2,<2023-01-23 14:25:47.07 +0400>,<she>,<DPX200>,
      <Start of raw data processing
       efp BC_mod = 2 LB = 0.24 FT_mod = 6 PKNL = 1 PHC0 = -19110.57 PHC1 = 11.20079 SI = 16K 
       data hash MD5: 16K
       41 B0 83 3A 45 58 46 95 60 A0 D8 0D 60 FC C3 48>)
(   3,<2023-01-23 14:26:06.28 +0400>,<she>,<DPX200>,
      <pk PHC0 = -1.379769 PHC1 = 1 
       data hash MD5: 16K
       FA 5A 28 58 41 3A 50 67 3D A5 8C 5D E2 34 30 CC>)
(   4,<2023-01-23 14:26:09.56 +0400>,<she>,<DPX200>,
      <abs ABSG = 5 
       data hash MD5: 16K
       37 BE 3E 73 2F 46 34 1C FA BF 32 30 9A F2 F1 25>)
$$ ##END=
$$ 
$$ hash MD5
$$ 53 92 0C 87 0D 13 1C 97 C1 7F CC 99 46 56 14 26
##$RELAX= 
##$RELAX= 
##$RELAX= 
##$RELAX= 
##$RELAX= 
##$RELAX= 
$$ Bruker specific parameters
$$ --------------------------
##$DU= <F:/spectra>
##$EXPNO= 1
##$NAME= <H-F>
##$PROCNO= 1
##$TYPE= <nmr>
##$USER= <she>
##$AMP= (0..31)
100 100 100 100 100 100 100 100 100 100 100 100 100 100 100 100 100 100 
100 100 100 100 100 100 100 100 100 100 100 100 100 100 
##$AQSEQ= 0
##$AQ_mod= 1
##$AUNM= <au_zg>
##$AUTOPOS= <>
##$BF1= 200.13
##$BF2= 200.13
##$BF3= 200.13
##$BF4= 200.13
##$BF5= 200.13
##$BF6= 200.13
##$BF7= 200.13
##$BF8= 200.13
##$BYTORDA= 1
##$CFDGTYP= 0
##$CFRGTYP= 5
##$CHEMSTR= <none>
##$CNST= (0..31)
1 1 145 1 1 1 1 1 1 1 1 1 1 1 1 1 1 1 1 1 1 1 1 1 1 1 1 1 1 1 1 1 
##$CPDPRG= <>
##$CPDPRG1= <>
##$CPDPRG2= <>
##$CPDPRG3= <>
##$CPDPRG4= <mlev>
##$CPDPRG5= <mlev>
##$CPDPRG6= <mlev>
##$CPDPRG7= <mlev>
##$CPDPRG8= <mlev>
##$CPDPRGB= <>
##$CPDPRGT= <>
##$D= (0..31)
0 1.2 0 0 0 0 0 0 0 0.06 0 0.03 0 0 0 0 0.0002 0 0 0 0 0 0 0 0 0 0 0 0 
0 0 0 
##$DATE= 1674469541
##$DBL= (0..7)
120 120 120 120 120 120 120 120 
##$DBP= (0..7)
150 150 150 150 150 150 150 150 
##$DBP07= 0
##$DBPNAM0= <>
##$DBPNAM1= <>
##$DBPNAM2= <>
##$DBPNAM3= <>
##$DBPNAM4= <>
$$ [...]
##$SUBNAM3= <"">
##$SUBNAM4= <"">
##$SUBNAM5= <"">
##$SUBNAM6= <"">
##$SUBNAM7= <"">
##$SUBNAM8= <"">
##$SUBNAM9= <"">
##$SW= 18.05172834244
##$SWIBOX= (0..15)
0 0 2 0 0 0 0 0 0 0 0 0 0 0 0 0 
##$SW_h= 3612.71676300578
##$TD= 16384
##$TD0= 1
##$TE= 0
##$TE2= 300
##$TE3= 300
##$TEG= 300
##$TL= (0..7)
0 120 120 120 120 120 120 120 
##$TP= (0..7)
150 150 150 150 150 150 150 150 
##$TP07= 0
##$TPNAME0= <>
##$TPNAME1= <>
##$TPNAME2= <>
##$TPNAME3= <>
##$TPNAME4= <>
##$TPNAME5= <>
##$TPNAME6= <>
##$TPNAME7= <>
##$TPOAL= (0..7)
0.5 0.5 0.5 0.5 0.5 0.5 0.5 0.5 
##$TPOFFS= (0..7)
0 0 0 0 0 0 0 0 
##$TUNHIN= 0
##$TUNHOUT= 0
##$TUNXOUT= 0
##$USERA1= <user>
##$USERA2= <user>
##$USERA3= <user>
##$USERA4= <user>
##$USERA5= <user>
##$V9= 5
##$VALIST= <valist>
##$VCLIST= <CCCCCCCCCCCCCCC>
##$VD= 0
##$VDLIST= <DDDDDDDDDDDDDDD>
##$VPLIST= <PPPPPPPPPPPPPPP>
##$VTLIST= <TTTTTTTTTTTTTTT>
##$WBST= 1024
##$WBSW= 4
##$XGAIN= (0..3)
0 0 0 0 
##$XL= 0
##$YL= 0
##$YMAX_a= 262227
##$YMIN_a= -393754
##$ZGOPTNS= <>
##$ZL1= 120
##$ZL2= 120
##$ZL3= 120
##$ZL4= 120
##$ABSF1= 17.47895
##$ABSF2= -0.5729313
##$ABSG= 5
##$ABSL= 3
##$ALPHA= 0
##$AQORDER= 0
##$ASSFAC= 0
##$ASSFACI= 0
##$ASSFACX= 0
##$ASSWID= 0
##$AUNMP= <proc_1d>
##$AZFE= 0.1
##$AZFW= 0.1
##$BCFW= 0
##$BC_mod= 2
##$BYTORDP= 0
##$COROFFS= 0
##$CY= -3
##$DATMOD= 1
##$DC= 0
##$DFILT= <>
##$DTYPP= 0
##$F1P= 0
##$F2P= 0
##$FCOR= 1
##$FTSIZE= 16384
##$FT_mod= 6
##$GAMMA= 0
##$GB= 0
##$INTBC= 1
##$INTSCL= 3.70164e-10
##$ISEN= 128
##$LB= 0.24
##$LEV0= 0
##$LPBIN= 0
##$MAXI= 10000
##$MC2= 0
##$MEAN= 0
##$ME_mod= 0
##$MI= 1.114404
##$NCOEF= 0
##$NC_proc= -6
##$NLEV= 6
##$NOISF1= 3.799351
##$NOISF2= 2.8
##$NSP= 0
##$NTH_PI= 0
##$NZP= 0
##$OFFSET= 15.74909
##$PC= 1
##$PHC0= -19111.95
##$PHC1= 12.20079
##$PH_mod= 1
##$PKNL= yes
##$PPARMOD= 0
##$PSCAL= 0
##$PSIGN= 0
##$REVERSE= no
##$SF= 200.130004493146
##$SI= 16384
##$SIGF1= 3
##$SIGF2= 2
##$SINO= 5.538805
##$SIOLD= 16384
##$SREGLST= <1H.CDCl3>
##$SSB= 0
##$STSI= 16384
##$STSR= 0
##$SW_p= 3612.71676300578
##$SYMM= 0
##$S_DEV= 0
##$TDeff= 16384
##$TDoff= 0
##$TI= <>
##$TILT= no
##$TM1= 0
##$TM2= 0
##$TOPLEV= 0
##$USERP1= <user>
##$USERP2= <user>
##$USERP3= <user>
##$USERP4= <user>
##$USERP5= <user>
##$WDW= 1
##$XDIM= 16384
##$YMAX_p= 354203705
##$YMIN_p= -420256
$$ End of Bruker specific parameters
$$ ---------------------------------
##NTUPLES= NMR SPECTRUM
##VAR_NAME=  FREQUENCY,     SPECTRUM/REAL,   SPECTRUM/IMAG
##SYMBOL=    X,             R,               I
##VAR_TYPE=  INDEPENDENT,   DEPENDENT,       DEPENDENT
##VAR_FORM=  AFFN,          ASDF,            ASDF
##VAR_DIM=   16384,         16384,           16384
##UNITS=     HZ,            ARBITRARY UNITS, ARBITRARY UNITS
##FACTOR=    0.220516191357247, 1,           1
##FIRST=     3151.8654914287, 0,             0
##LAST=      -460.851271577078, 0,           0
##MIN=       -460.851271577078, -420256,     0
##MAX=       3151.8654914287, 354203705,     0
$$ Real data points
##PAGE= N=1
##DATA TABLE= (X++(R..R)), XYDATA
$$ [...]
5771C926559J0485K8654K4874j71573O4876j0991O554L0393n5576J3888n4313
5760C813830K6388N6436o4820n7981j71208p1013K5332J17195P7187m8989j13128
5749C589229j0886J21630m3819j34387J2407M4102r3822P1369k8428P138J6160
5738C550693j3724m4252O2273r5487m4791k3246K6741l2578O9417J9905j77914
5727C297037M4170o0084j79815K6457L9196n7216K4950M6128q0258L1761j08238
5716C024088p6999L2308J24303j638O7264n1819j14744l6918J11117j29436n0090
5705B897436j9787m476P1047M6762P5735j19370p4763J11078L6876r4151q2312
5694B844075q721j30736K0657J8639n9350L1133m8903O9169M9480o4557n6982
$$ y = [3926559, 3937044, 3965698, 3990572, 3818999, 3883875, 3872884, 3879438, 3909831, 3854255, 3868143, 3813830, 3840218, 3896654, 3831834, 3773853, 3602645, 3531632, 3556964, 3674159, 3751346, 3702357, 3589229, 3578343, 3699973, 3656154, 3521767, 3534174, 3578276, 3484454, 3555823, 3527395, 3534533, 3550693, 3536969, 3492717, 3554990, 3459503, 3414712, 3391466, 3418207, 3385629, 3455046, 3474951, 3297037, 3341207, 3281123, 3101308, 3127765, 3166961, 3109745, 3134695, 3180823, 3100565, 3132326, 3024088, 2947089, 2979397, 3103700, 3102062, 3169326, 3117507, 3002763, 2965845, 3076962, 2947526, 2897436, 2877649, 2873173, 2944220, 2990982, 3066717, 2947347, 2872584, 2983662, 3020538, 2926387, 2844075, 2835354, 2704618, 2725275, 2743914, 2684564, 2715697, 2666794, 2735963, 2785443, 2720886, 2663904]
5683B663904k4628j14262n2945R6522O958L4436P308j2729P962p0384l3793J04902
5671B613251J47508o559q0006k1207N8862n7488M5725j03300l3473O6481K02334
5660B832128M6679r876l730m0659j02601Q5930J2295j1657k1127J7708O4475K248
5648B871813j19585Q8857P9413L2377o0645R8539J08820q4139q4240R0158L0485
5637C051853m249L8403l0083J23733k0879Q8381J33609l2018O9615P409m2585
5626C383189q3273l9905q9433p4068o8209o9342j20239L7073k823N7722N4280
5615B984972p7049J8145J74774K3181l5792J06310J01591J58655L5752l5170j43949
5604C311420o7353L6021j6400j09272k6085J123M8901k7773l1852J9956J12520
$$ y = [2663904, 2639276, 2525014, 2472069, 2568591, 2575549, 2609985, 2617293, 2604564, 2612526, 2542142, 2508349, 2613251, 2760759, 2754200, 2674194, 2652987, 2711849, 2654361, 2700086, 2596786, 2563313, 2629794, 2832128, 2878807, 2868931, 2865201, 2824542, 2721941, 2807871, 2820166, 2808509, 2787382, 2805090, 2869565, 2871813, 2752228, 2841085, 2920498, 2952875, 2892230, 2990769, 3099589, 3015450, 2931210, 3021368, 3051853, 3047604, 3086007, 3055924, 3179657, 3158778, 3247159, 3380768, 3348750, 3418365, 3425774, 3383189, 3299916, 3260011, 3170578, 3096510, 3028301, 2958959, 2838720, 2875793, 2872970, 2930692, 2984972, 2907923, 2926068, 3100842, 3124023, 3088231, 3194541, 3296132, 3454787, 3490539, 3455369, 3311420, 3244067, 3280088, 3263688, 3154416, 3128331, 3129454, 3178355, 3150582, 3118730, 3138686, 3251206]
5593C251206n7413k694l6246j6821O2805O5887O4838P1789N0434l05J17686J25000
5581C696166N7399J62227J29849J55663J21845J76281J13983M0656j6309o2012
5571D575748K874j69857r910L529N494L1904K2452J25976P2217J39489J00637
5560D900553J66413K20349J36128K00209J62599K4236J72402J96356K12562K40203
5550F632010K50268J93353m7514l15961l95593n35266n36653l90138k65068k88744
5540D300694j84028j10780j94056j57594n4770j67048L078m8030j04767P0238
5530C352937n3005Q137l8623L1374l1578O5852M0070j578M4355J37072L6888j2046
5518C579855J29862m3952K7924R69o0263m7824m646j01853j31891r8208o0905
$$ y = [3251206, 3193793, 3191099, 3154853, 3138032, 3200837, 3266724, 3331562, 3403351, 3453785, 3453480, 3571166, 3696166, 3753565, 3915792, 4045641, 4201304, 4323149, 4499430, 4613413, 4654069, 4637760, 4575748, 4578622, 4408765, 4398855, 4402384, 4407878, 4439782, 4462234, 4588210, 4660427, 4799916, 4900553, 5066966, 5287315, 5423443, 5623652, 5786251, 5810487, 5982889, 6179245, 6391807, 6632010, 6882278, 7075631, 7028117, 6712156, 6316563, 5781297, 5244644, 4854506, 4589438, 4300694, 4116666, 4005886, 3811830, 3654236, 3599466, 3432418, 3435496, 3387466, 3282699, 3352937, 3299932, 3308069, 3269446, 3300820, 3269242, 3335094, 3375164, 3373586, 3417941, 3555013, 3591901, 3579855, 3709717, 3665765, 3693689, 3694658, 3634395, 3586571, 3581925, 3480072, 3348181, 3249973, 3189068]
5507C189068P7592J8626j0691j07018L4400O6794m2981O9865q5682o4932K4889
5496C169930R8045P7264m664m2210Q645k2336K9853K1493n8858R393O5105m2311
5484C309349J9370j7196q1177M1574J53358J18440N7232J1155l5125Q9293R7273
5473C763546Q7304K8478M7842O5100M4274J30652L5107J09842K6874l6818K1604
5462D323805P7539O179p936L6513l65J7959l9197M7542j66108K9457K2939M2116
5450D390443j2880q815J09921R9183L1865k6464J81670J12066l0186J06345N3651
5439E006799J47143O2791J10856k8523L5663O5544O3870N9409N1047O9146o2604
5428E581141N649J6459K27631M2655Q2282P5053J61286J54547J77046K37475K63482
$$ y = [3189068, 3266660, 3285286, 3274595, 3167577, 3201977, 3268771, 3225790, 3295655, 3209973, 3145041, 3169930, 3267975, 3345239, 3340575, 3298365, 3307010, 3284674, 3314527, 3336020, 3277162, 3286555, 3351660, 3309349, 3328719, 3311523, 3230346, 3271920, 3425278, 3543718, 3600950, 3612105, 3576980, 3666273, 3763546, 3850850, 3879328, 3927170, 3992270, 4036544, 4167196, 4202303, 4312145, 4339019, 4302201, 4323805, 4401344, 4407523, 4399587, 4436100, 4435735, 4453694, 4414497, 4462039, 4295931, 4325388, 4348327, 4390443, 4377563, 4368748, 4478669, 4577852, 4609717, 4583253, 4764923, 4876989, 4846803, 4953148, 5006799, 5153942, 5216733, 5327589, 5299066, 5334729, 5400273, 5464143, 5523552, 5574599, 5643745, 5581141, 5586790, 5603249, 5830880, 5873535, 5955817, 6030870, 6192156, 6346703, 6523749, 6761224, 7024706]
5417G024706N07480N36467O92147L22111K01606J72l17650k45884r6948j17300
5407H506907o7895k5624p3571j48917r6745j90859j42750l53201j79290n092L1685
5396G254648K38927J20511J20658J02410K19608K77303M07884O16116O62091Q29564
5386A0849720R05314Q92358P57266M34867Q6708j54508j74940K3061L32672K75479
5376A4227997J40176j60184m96841p64398r95548r89552q40883o23603m06023
5367I091141j85082r7828l34704j38974q7991J71091J21517J16791J88717L05854
5357I150532L84871M81578L29995L37619L00511J65413J76281K36417M20033M25239
5347A2408489N81708L93855N9088j86567j46576k01034j45250O115L27969O30037
$$ y = [7024706, 7532186, 8068653, 8760800, 9082911, 9284517, 9284689, 8967039, 8721155, 8624207, 8506907, 8439012, 8413388, 8339817, 8190900, 8094155, 7903296, 7760546, 7407345, 7228055, 7222963, 7254648, 7493575, 7614086, 7734744, 7837154, 8056762, 8334065, 8741949, 9358065, 10020156, 10849720, 11755034, 12647392, 13404658, 13839525, 13926233, 13771725, 13596785, 13619846, 13952518, 14227997, 14368173, 14207989, 13711148, 12946750, 11951202, 10961650, 10120767, 9497164, 9091141, 8906059, 8808231, 8473527, 8334553, 8246562, 8417653, 8539170, 8655961, 8844678, 9150532, 9535403, 10016981, 10346976, 10684595, 10985106, 11150519, 11326800, 11563217, 11983250, 12408489, 12990197, 13384052, 13443140, 13256573, 13109997, 12908963, 12763713, 12769828, 13097797, 13727834]
5337A3727834P73950P79132N79760L01001m2768l95150m62567n15053l28443k81105
5327A4136591k16839j89653k91829j87390m55819l53132l42912j58404m1761R1555
5317A1990407J36917L21644K60921N83742O15025P37035J054828J338928J599392
5308A8638839J658725J721268J509333J006121P40834L54289l6206J5955J46099
5299B5755257N05836P72748R19268O10281r2511j018516j685478k161955k153206
5290B1451724j980498j540909j081860r26439o25819l60534k92965p5679J60014
5281A4727035L59999O09202P48427Q53439J037408R68507Q23889M30978K44906
5272B0803790N63016N84631Q49840R89558M43163p6277p65331j357705j741811
$$ y = [13727834, 14501784, 15280916, 15860676, 16161677, 16118909, 15723759, 15261192, 14746139, 14417696, 14136591, 13919752, 13730099, 13438270, 13250880, 12795061, 12441929, 12099017, 11940613, 11898852, 11990407, 12127324, 12448968, 12709889, 13293631, 13908656, 14645691, 15700519, 17039447, 18638839, 20297564, 22018832, 23528165, 24534286, 25275120, 25629409, 25593203, 25609158, 25755257, 26261093, 27033841, 27953109, 28563390, 28470879, 27452363, 25766885, 23604930, 21451724, 19471226, 17930317, 16848457, 15922018, 15296199, 14935665, 14642700, 14567021, 14727035, 15087034, 15696236, 16444663, 17298102, 18335510, 19304017, 20127906, 20558884, 20803790, 21366806, 21951437, 22801277, 23790835, 24233998, 24157721, 23392390, 22034685, 20292874]
5263B0292874j726193j616033j317981j079833q70664p40807m42726m23820k41730
5254A1833087l03124l00668j14311k06525q9549J24744l6374l7113J14974J4230
5244A0999371Q2386K07724K11226K70705K99933L65031M03747M83558M85232O45921
5234A4454834O93712R29277J264768J543536J788737J931312J952747J546256
5226B6105179Q41550L9057o27158j053553q97560n96509l91268l02791o4563l49724
5216B2702660n64686m57799k12487o1249K12658O51834R66908R50845J012501
5207B5201185Q66112Q26221J005228J264500J390819J458413J070113M72024j51334
5198C3403281o36238j031117r56159p09702n76964o42231n95800o14420o97667
$$ y = [20292874, 18566681, 16950648, 15632667, 14552834, 13682170, 12941363, 12498637, 12074817, 11833087, 11529963, 11229295, 11114984, 10908459, 10818910, 10943654, 10907280, 10870167, 10985141, 10999371, 11081757, 11289481, 11500707, 11771412, 12071345, 12436376, 12840123, 13323681, 13808913, 14454834, 15148546, 16077823, 17342591, 18886127, 20674864, 22606176, 24558923, 26105179, 26946729, 26985786, 26358628, 25305075, 24407515, 23811006, 23419738, 23116947, 23052384, 22702660, 22137974, 21680175, 21467688, 21406439, 21619097, 22270931, 23237839, 24188684, 25201185, 26067297, 26893518, 27898746, 29163246, 30554065, 32012478, 33082591, 33554615, 33403281, 32767043, 31735926, 30779767, 30070065, 29493101, 28850870, 28255070, 27640650, 26942983]
5189B6942983m43275l21784m38704o04964o82131p07670n25704k21913q858p8372
5179B2909608J02637j38397l17213m10092l91394j19201K38997L72152J81091
5170B2428188L8627l16387n99979p75990n52375l16985j92413K2688j11168m78581
5160A9145625p57038r56790j102052r00476p70149n08717l34371J9412N7428J27345
5150A4020217L29207K09814J97532R3982j56200j24244o0475r7432j85211k13705
5140A4013485m97981p92826o72388p38071n80902l64309k52894k46610j06826
5131I760678o9412N5342o3230M9123N9700R8298M11907K84880O24355N85170N49034
5120A2345845N55348J30809k85298m86544o68029o15082n60005m15972l08757
$$ y = [26942983, 26499708, 26177924, 25739220, 25134256, 24452125, 23744455, 23218751, 22996838, 22987980, 22909608, 23012245, 22873848, 22556635, 22146543, 21755149, 21635948, 21874945, 22247097, 22428188, 22466815, 22150428, 21550449, 20774459, 20222084, 19905099, 19712686, 19735374, 19624206, 19145625, 18388587, 17431797, 16329745, 15429269, 14659120, 14150403, 13816032, 13835444, 13892872, 14020217, 14349424, 14559238, 14756770, 14850752, 14694552, 14570308, 14509833, 14412401, 14227190, 14013485, 13515504, 12722678, 12050290, 11312219, 10731317, 10367008, 10114114, 9867504, 9760678, 9691266, 9746608, 9683378, 9732501, 9792201, 9890499, 10302406, 10587286, 11211641, 11796811, 12345845, 12901193, 13032002, 12746704, 12260160, 11592131, 10977049, 10417044, 10001072, 9692315]
5111I692315k36187j73583k06955n238o1874j82020j09080L8843L3636j41473
5101H648384J21193r8227M0100J00561j28043Q2945n9512L1423l0478J86M0218
5090H748750Q7822J045Q9066R3891r2352O4278J80371m9915R3722L8044P6347
5079I331069O7510j1743J48153P7216r941R0710J49398j6340J46415J02204k9910
5068A0044741k2521L2086Q1411K8498M7876J06420N382j79J39423J1960P5598
5057A0550695J11779O3829l8742J59930q498J7332J02758M6375J51329N9396Q5126
5046A1301309J55084k4067O7155J29610j0982L5696Q646K4105O0792K6889l8342
5035A1735895P8518P4522n792J5413N6532M9288J3517k9769R1647Q3994J58346
$$ y = [9692315, 9456128, 9282545, 9075590, 9070352, 9008478, 8826458, 8717378, 8756221, 8789857, 8648384, 8769577, 8671350, 8711450, 8812011, 8683968, 8766913, 8707401, 8738824, 8708346, 8708532, 8748750, 8836572, 8837617, 8926683, 9020574, 8928222, 8992500, 9172871, 9122956, 9216678, 9254722, 9331069, 9398579, 9386836, 9534989, 9612205, 9602264, 9692974, 9842372, 9826032, 9972447, 10074651, 10044741, 10022220, 10054306, 10135717, 10164215, 10212091, 10318511, 10323893, 10323714, 10463137, 10475097, 10550695, 10662474, 10726303, 10687561, 10847491, 10838993, 10856325, 10959083, 11005458, 11156787, 11216183, 11301309, 11456393, 11432326, 11499481, 11629091, 11618109, 11653805, 11662451, 11686556, 11747348, 11774237, 11735895, 11814413, 11888935, 11883143, 11898556, 11955088, 12004376, 12017893, 11988124, 12079771, 12163765, 12322111]
5024A2322111L6546J37929J2969J47404K35744N7301L2760m3321p0241q1061j13583
5013A2674558j92811j06253k7613j9258J50753J01846Q0974K39211J40312j24759
5003A2916960j41354k17848k23168k94288k17657k18919k76642j08660m5643K1608
4993A1194389M7141J00993M4232K47884J17301J20283N856j61753j08064k6410
4983A1581852j44248l47097k16916j70185o1091j12870k0071l1399R895P218R3766
4972A0588854j4470j82690m7246P8016N8419J561k4589M9253K16321N1568R9745
4961A0874742J34860K53905K46262K89710M63763M33038N22507O56183P55879
4952A4630849Q48599R77124J245887J636600K010505K548899L128963L198581
$$ y = [12322111, 12358657, 12496586, 12509555, 12656959, 12892703, 12950004, 12982764, 12939443, 12869202, 12788141, 12674558, 12481747, 12375494, 12347881, 12328623, 12479376, 12581222, 12662196, 12901407, 13041719, 12916960, 12775606, 12557758, 12334590, 12040302, 11822645, 11603726, 11327084, 11218424, 11172781, 11194389, 11241530, 11342523, 11386755, 11634639, 11751940, 11872223, 11878079, 11716326, 11608262, 11581852, 11437604, 11090507, 10873591, 10703406, 10642315, 10529445, 10509374, 10477975, 10487870, 10495088, 10588854, 10574384, 10391694, 10344448, 10422464, 10480883, 10482444, 10457855, 10507108, 10723429, 10774997, 10874742, 11009602, 11263507, 11509769, 11799479, 12263242, 12696280, 13218787, 13874970, 14630849, 15479448, 16456572, 17702459, 19339059, 21349564, 23898463, 27027426, 30226007]
4944C0226007K569506J355195j56747j201296j483567j334537m19058K84171L86415
4935C0226089p3538j086407k001541k448705k473849k204022j738622j435552
4927A6763853j132115p90657n86167l54003m22290j76550j46035R4126J71693
4918A3421855M22979M74244M27251O25259O39462Q83292J149841J630286K063267
4909B1737736K789381L291420L006913J778914N3408j886861l200343l541495
4901B4029073l081298k509251k025711j549177j188074q79006o01844o12299m51463
4892A1130950k67808l34105m14300j37779p4723j30727j37001j62714o8355r3888
4882I309550j38390k7013j05794j945j2097L0667L7692k4409P9886N4120J52287
$$ y = [30226007, 32795513, 34150708, 33993961, 32792665, 31309098, 29974561, 29555503, 29839674, 30226089, 30152551, 29066144, 27064603, 24615898, 22142049, 19938027, 18199405, 16763853, 15631738, 14841081, 14254914, 13900911, 13478621, 13302071, 13156036, 13250162, 13421855, 13844834, 14319078, 14746329, 15371588, 16011050, 16894342, 18044183, 19674469, 21737736, 24527117, 27818537, 30825450, 32604364, 32657772, 30770911, 27570568, 24029073, 20947775, 18438524, 16412813, 14863636, 13675562, 12796556, 12194712, 11582413, 11130950, 10863142, 10529037, 10114737, 9976958, 9902235, 9771508, 9634507, 9471793, 9403438, 9309550, 9171160, 9144147, 9038353, 9036408, 9024311, 9054978, 9092670, 9068261, 9148147, 9202267, 9354554]
4871I354554O3874N7136J10044R8986J67640K09872J95724J92288J81546K10017
4861A0841681J85540L48735K16766M16113L68980N07075N29706M44589M11803
4852A4270988M20182N60697P22748P81242P20758Q02528J005261J118303J424565
4843B1827272J491129J928291K267613K440240K735415L332422M058788M896984
4835D4978154O442813Q835894J2374552J5693155J5895345J1306857L600510p212475
4827A11914805j4741037j6409848j4558212j1840603q657513o245759m781201
4820C4680632l703079k945711k471428k153726j406938j405839j232125r12725
4812A8449061r73983o96588o54595o19774n51184n51988m22440m32621l32635
$$ y = [9354554, 9418428, 9475564, 9585608, 9684594, 9852234, 10062106, 10257830, 10450118, 10631664, 10841681, 11027221, 11375956, 11592722, 12008835, 12377815, 12884890, 13414596, 13859185, 14270988, 14691170, 15251867, 15974615, 16755857, 17476615, 18279143, 19284404, 20402707, 21827272, 23318401, 25246692, 27514305, 29954545, 32689960, 36022382, 40081170, 44978154, 51420967, 60256861, 72631413, 88324568, 104219913, 115526770, 119127280, 111914805, 97173768, 80763920, 66205708, 54365105, 45707592, 39461833, 34680632, 30977553, 28031842, 25560414, 23406688, 21999750, 20593911, 19361786, 18449061, 17475078, 16778490, 16123895, 15504121, 14952937, 14400949, 13978509, 13545888, 13213253]
4803A3213253l24474l09771k35308k67587j84000j97279l24241k05592j19912
4794A1045089j63350k87572k45810p9576r2896k70916r9678j24813j06196j61120
4784I413162j25851j02415r5724m137j01280n6192l3615k02740n4058j53317J2665
4773H496498Q01m2981j9056q1422j85559k06382j8387j1474j93545j2357m1464
4762G684672j5944j11374j63770o750j33188j9523q367j46344o265p792r4811
4751F970544j05264r3589n3487j64246k4828j08603k00719k8038r1324k23781
4741E876665j30896q8520j00182o6577m5530o3053j37345j08691m3191n296o3003
4730E024381k0120n4933o1728M6206p369P1296J06602M0019p844J5681J589L087
$$ y = [13213253, 12888779, 12579008, 12343700, 12076113, 11892113, 11694834, 11370593, 11165001, 11045089, 10881739, 10594167, 10348357, 10268781, 10175885, 9904969, 9805291, 9680478, 9574282, 9413162, 9287311, 9184896, 9089172, 9085035, 8983755, 8927563, 8893948, 8691208, 8637150, 8483833, 8496498, 8497299, 8454318, 8435262, 8353840, 8168281, 7961899, 7943512, 7932038, 7738493, 7726136, 7684672, 7668728, 7557354, 7393584, 7386834, 7253646, 7234123, 7225756, 7079412, 7073147, 7065355, 6970544, 6865280, 6771691, 6718204, 6553958, 6529130, 6420527, 6219808, 6191770, 6100446, 5876665, 5745769, 5657249, 5557067, 5490490, 5444960, 5381907, 5244562, 5135871, 5092680, 5087384, 5024381, 5004261, 4949328, 4887600, 4933806, 4926437, 4997733, 5104335, 5144354, 5136510, 5152191, 5153780, 5156867]
4718E156867j2655k7052r0474q8268k2781N2748j35081j18508p6926j88103r688
4707D440079o1344j79443j62525m0420j97538o1606j3974m6362n052j27558j1158
4696C533099k19357j8106Q95K991j5922j57136o4384Q5666N5666j80924J950j5638
4684C008800o8012M7750J9380m1226j7812k1984m4742J8888l0409j836L1463n8179
4672B842081j54211M2841J1975M3675L1029N9451J6901j43864K1672O5286K3236
4661B860072K6856p5622J7202K9836m2132m6470O871m3614J26415m58K5036K3935
4649B907927J01110q2056m4846J66177o6432l4239n147J11811J64385N4852J0450
4638C283992k4011n4971J51859N4020L7650P3909O1090P3810J92992L4445P8664
$$ y = [5156867, 5144212, 5117160, 5026686, 4938418, 4915637, 4968385, 4833304, 4714796, 4637870, 4449767, 4440079, 4378735, 4199292, 4036767, 3996347, 3798809, 3737203, 3723229, 3676867, 3671815, 3544257, 3533099, 3313742, 3295636, 3296531, 3299522, 3283600, 3126464, 3062080, 3147746, 3203412, 3022488, 3024438, 3008800, 2940788, 2988538, 3007918, 2966692, 2948880, 2926896, 2882154, 2901042, 2870633, 2868797, 2900260, 2842081, 2687870, 2730711, 2742686, 2786361, 2817390, 2876841, 2893742, 2749878, 2771550, 2836836, 2860072, 2886928, 2811306, 2828508, 2858344, 2816212, 2769742, 2776613, 2732999, 2859414, 2858956, 2883992, 2907927, 3009037, 2926981, 2882135, 3048312, 2981880, 2947641, 2942494, 3054305, 3218690, 3273542, 3283992, 3259981, 3205010, 3356869, 3410889, 3448539, 3522448, 3583538, 3657348, 3850340, 3884785, 3963449]
4627C963449J78721N6865J81394K21116K32490Q9123R6429K03441K35531K68982
4617E727541L28518M64578M51396M41292O09223N76694O53647R44082J028084
4608A1225055J420888J718280K260757K953885L571019L905809L294732J514611
4600C1865036q18239l033852l947207l983727l391680k721770j942104j464144
4592A0562313j254620j051386q59649n74244m30714m33571m41503l73338l77226
4583D766062j63428k64665k45926k67914j3307j90415k81726r9087j2042q0999
4573C146553k21131J9838p4705j96835j06618j03442n0775J7659j57916p0190
4563B202438m0519m5440J2695L397j71128p0751m7927M7058N2406l0546n470m023
$$ y = [3963449, 4142170, 4199035, 4380429, 4601545, 4834035, 4923158, 5019587, 5223028, 5458559, 5727541, 6056059, 6520637, 6972033, 7413325, 8022548, 8599242, 9252889, 10196971, 11225055, 12645943, 14364223, 16624980, 19578865, 23149884, 27055693, 30350425, 31865036, 31046797, 28012945, 24065738, 20082011, 16690331, 13968561, 12026457, 10562313, 9307693, 8256307, 7396658, 6822414, 6391700, 5958129, 5516626, 5143288, 4766062, 4602634, 4337969, 4092043, 3824129, 3810822, 3620407, 3338681, 3239594, 3227552, 3146553, 2925422, 2945260, 2870555, 2673720, 2567102, 2463660, 2412885, 2430544, 2272628, 2202438, 2161919, 2116479, 2129174, 2132571, 1961443, 1890692, 1842765, 1889823, 1942229, 1911683, 1906213, 1902190]
4551A902190j43889m2969N6539m7568m3785n6115o306p8003o6590Q8254l0122
4540A531636M7222o020j11266J5389n3862m6637k6785q1857p542n1517P463Q5372
4528A301596O6660k6220n2590j5803L5956k5712k0702M7919m6063N9869R1369
4517A416279K3891M8518J44974n8852J1463o984j7602r4647j20277j18926N9634
4506A287471q0501j1270r714p6761r5438k0238J56511k4335j19730N926J10770
4495A122691J23253j06604m9560p048k482k2084l3047L0479J15905k0506j32430
4484A018567J22388k8749p2809k1670l152J6043j5223J41083J08535K5208J2954
4473A303175p8066l7910m104j6970K0007p1154n0791o1319Q207N1463l2761N9607
$$ y = [1902190, 1758301, 1715332, 1771871, 1724303, 1680518, 1624403, 1618097, 1540094, 1473504, 1561758, 1531636, 1578858, 1572838, 1461572, 1476961, 1423099, 1376462, 1349677, 1267820, 1260278, 1208761, 1216224, 1301596, 1368256, 1342036, 1289446, 1273643, 1309599, 1283887, 1263185, 1311104, 1265041, 1324910, 1416279, 1440170, 1488688, 1633662, 1574810, 1586273, 1579289, 1561687, 1467040, 1346763, 1227837, 1287471, 1206970, 1195700, 1185986, 1109225, 1013787, 993549, 1150060, 1125725, 1005995, 1011921, 1122691, 1245944, 1139340, 1089780, 1082732, 1080250, 1058166, 1025119, 1055598, 1171503, 1150997, 1018567, 1140955, 1112206, 1039397, 1017727, 1014575, 1030618, 1015395, 1156478, 1265013, 1290221, 1303175, 1225109, 1187199, 1183095, 1166125, 1186132, 1114978, 1064187, 1002868, 1011075, 1062538, 1029777, 1089384]
4461A089384j36765k7649J2544J9575m35M249j11573K5001J2542r5361J0809J64315
4449I66636o3069r7161O6351K285o6490K6218J08634n996l7778p0692L2049k6800
4437H34187M9756K7044o4112o2757p109M2379J27148Q808p1503m7052K3697K7267
4425H87753R1397p7933k132q2144M0610L005L0130K6904N9166M56j08752r7489
4413G70971l1620R7584Q2809r5896j16168K8604J41953J03021r0259R2553j21053
4402H62499K0222J37035q7149M8697p84n6041Q7454m1513k8992o2345l3392R4085
4390I39776K2622j1118o9716k4570m239K7605Q9495K1771L9674J0821k2198J3607
4378A033530J2824J3537P1397K96J02685L342r1037j31142N9621M6413n1418N0652
$$ y = [1089384, 952619, 924970, 937514, 957089, 956654, 960903, 849330, 874331, 886873, 791512, 802321, 966636, 903567, 806406, 872757, 875042, 808552, 834770, 943404, 937408, 899630, 828938, 860987, 834187, 883943, 910987, 846875, 784118, 777009, 819388, 946536, 955344, 883841, 836789, 860486, 887753, 979150, 901217, 899085, 816941, 857551, 860556, 890686, 917590, 976756, 977212, 868460, 770971, 739351, 836935, 919744, 823848, 707680, 736284, 878237, 981258, 890999, 983552, 862499, 882721, 1019756, 932607, 981304, 980520, 924479, 1011933, 970420, 941428, 879083, 845691, 939776, 962398, 951280, 881564, 856994, 852755, 880360, 969855, 991626, 1031300, 1042121, 1019923, 1033530, 1046354, 1059891, 1131288, 1131584, 1234269, 1237611, 1146574, 1015432, 1075053, 1121466, 1070048, 1120700]
4366A120700J43703K0226m4468l8093J04197L4816l845o6262M8461K8215M3723
4355A391373o7058L3651J06281m856l7007r261p4626R351r224J79461k0110K3602
4343A521577J26729m0454J05099J09568J7631p4229m3526r279L7943K6506L9645
4332A817210J19513l2758R6445k8358p4648J06699j5371P1860R827Q3528L9784
4321B193731J03196p9692q9353k2262J59963P1154o3856J5219R0696J5608K747
4310B397151J4274P3639m5755j7843m8597m9722R228j8886N1846Q4854M1155K3405
4298B514749l3418m1453J21198N2099M5633r7670j06887k2416m8804J7867j3611
4287B387287j10389m8873J9256N6503J4634p8175j9279j27142l9318q0232N7153
$$ y = [1120700, 1264403, 1284629, 1240161, 1202068, 1306265, 1341081, 1337236, 1270974, 1319435, 1347650, 1391373, 1324315, 1357966, 1464247, 1459391, 1422384, 1413123, 1338497, 1347848, 1338624, 1518085, 1497975, 1521577, 1648306, 1607852, 1712951, 1822519, 1840150, 1765921, 1722395, 1713116, 1751059, 1777565, 1817210, 1936723, 1903965, 2000410, 1972052, 1897404, 2004103, 1988732, 2060592, 2070419, 2153947, 2193731, 2296927, 2217235, 2127882, 2105620, 2265583, 2336737, 2272881, 2288100, 2378796, 2394404, 2397151, 2411425, 2485064, 2439309, 2421466, 2372869, 2323147, 2332375, 2313489, 2365335, 2450189, 2491344, 2514749, 2481331, 2439878, 2561076, 2613175, 2658808, 2561138, 2454251, 2431835, 2383031, 2400898, 2387287, 2276898, 2228025, 2247281, 2303784, 2318418, 2240243, 2220964, 2093822, 2054504, 1974272, 2031425]
4276B031425j31524k1424l9960k0800K0509M6860j51317k3198l6983R4011l6451
4265A731148k7025l1254p0635K6212n9369r4669j9813k549K4213o0271r3046j0318
4253A312624l0188L1355l7959J8086j06321L1405l7291O0448k7286p6526L5563
4242A173910M546J3045o9341m1822M002k7344K0102J3986r0891m191O8127o5558
4230I98571O7235p9619l3158M7755p461m9693P0047r877J7221O1104J2303j00257
4218I94171O1320j19749j9851J5107Q5640M9692m7321q637p3674Q7456k4523n4986
4206I44645M6956J7919k3654O8216m2360L0240m159m5513K3991L042j8553J4644
4194A015414N7858K5749m5727K3044q2180n9570Q6394L0686q3760L9765R4972
$$ y = [2031425, 1899901, 1878477, 1838517, 1817717, 1838226, 1885086, 1733769, 1710571, 1673588, 1767599, 1731148, 1704123, 1672869, 1602234, 1628446, 1569077, 1474408, 1454595, 1452046, 1476259, 1415988, 1322942, 1312624, 1282436, 1313791, 1275832, 1293918, 1187597, 1219002, 1181711, 1242159, 1214873, 1138347, 1173910, 1178456, 1191501, 1122160, 1080338, 1084340, 1056996, 1077098, 1091084, 1000193, 996002, 1064129, 998571, 1065806, 986187, 953029, 1000784, 993323, 943630, 1013677, 1003800, 1021021, 1082125, 1094428, 994171, 1055491, 935742, 915891, 930998, 1016638, 1066330, 1019009, 1010372, 936698, 1024154, 999631, 944645, 991601, 1009520, 985866, 1054082, 1011722, 1041962, 1037803, 992290, 1016281, 1019323, 1000770, 1015414, 1073272, 1099021, 1053294, 1076338, 994158, 934588, 1020982, 1051668, 967908, 1007673, 1102645]
4183A102645n1394m8306N6056J5397l6914M3458K8661J0699Q4987N9368Q0112
4172A344769p189j66434O0843k6126K3519k295J20121J2160j2489n9627R8754
4161A386006O8831L5626J880N552q6925L2208J52224J9824Q7510O0065j18645
4150A644156r257J18355j8837J72299N2996N7520n0343p4960R7359O824m0261
4139A955851J15064K9828J9749Q3383N3340K3521O8815n5679N6796J47846J45660
4128B644174M3297N7179M456R3243J14733L2736J45411J37984m8907P1410J76895
4117C472611Q4317P1956J91457J58683J52121R0598r048J23985K53120J96558
4107D786358j2926L12811K37812J32252K00151J99724K05598K58531K40686L52985
$$ y = [1102645, 1051251, 1002945, 1059001, 1074398, 1037484, 1080942, 1109603, 1120302, 1205289, 1264657, 1344769, 1337580, 1171146, 1231989, 1205863, 1229382, 1227087, 1347208, 1359368, 1346879, 1287252, 1386006, 1454837, 1490463, 1492343, 1497895, 1410970, 1443178, 1595402, 1615226, 1702736, 1762801, 1644156, 1634899, 1753254, 1734417, 1906716, 1959712, 2017232, 1966889, 1891929, 1989288, 1996112, 1955851, 2070915, 2100743, 2120492, 2203875, 2257215, 2280736, 2349551, 2293872, 2350668, 2498514, 2644174, 2687471, 2744650, 2749106, 2842349, 2957082, 2989818, 3135229, 3273213, 3224306, 3295716, 3472611, 3556928, 3628884, 3820341, 3979024, 4131145, 4221743, 4212695, 4336680, 4589800, 4786358, 4773432, 5086243, 5324055, 5456307, 5656458, 5856182, 6061780, 6320311, 6560997, 6913982]
4097F913982L68332K97598K51717L27569L48118L12025M16103M03479L96563K95718
4087A0331204M30188N12769L60535L91773N59735O85398P23779N29795O49951
4078A5175127N80540N37737M05505M17657L93176M88604M88187M35296O62802
4069A9584631O17220P58269R01082P68483Q04368O58053N44111J79684K07872
4060B5023773J81330j8425o1679O9534K60867K93273M56753N57099O13373M75076
4050B7850974M92020K13670j23656l12700m17411n99758n93058n58845m44283
4041B5506953m20971l07916j53285J8770R6797j13757j72457l52179o14481p74994
4031B2712480p84449q37681q64328q80669p51571n46911n93036m53537l98511
$$ y = [6913982, 7282314, 7579912, 7831629, 8159198, 8507316, 8819341, 9235444, 9638923, 10035486, 10331204, 10761392, 11274161, 11634696, 12026469, 12586204, 13271602, 13995381, 14525176, 15175127, 15755667, 16293404, 16698909, 17116566, 17509742, 17998346, 18486533, 18921829, 19584631, 20201851, 20960120, 21861202, 22629685, 23434053, 24092106, 24636217, 24815901, 25023773, 25205103, 25186678, 25124999, 25194533, 25455400, 25748673, 26205426, 26762525, 27375898, 27850974, 28342994, 28556664, 28433008, 28120308, 27702897, 27103139, 26510081, 25951236, 25506953, 25085982, 24778066, 24624781, 24643551, 24740348, 24626591, 24454134, 24101955, 23487474, 22712480, 21928031, 21090350, 20226022, 19345353, 18593782, 18046871, 17453835, 17000298, 16601787]
4022A6601787n03505l90276l72486n20815o66202o41523n87709o09382o93860
4013A1616029p50669m38654m38956m83593m64546l81558l54686l44965l15468
4004G642934k99883l23129l10509l68848l39059j94764k26403j98159l11855l29348
3994D740977k32898j89371k14910j27592j12405j54749q0033q4322j20173p9573
3984C344951j00609j168p8315l8191j29555j5740n7663j43152j26236r5031j03721
3973B455570m9410M962j99163j43732q6620M3714m9610k445m7973p0404k8795
3962A826094K0586m710l5411k1051j67509K0313L2791j4643J27354J9847p4190
3951A729471L1132p9803j14239K711n369K818j02111o1671n8718O7940J1505K4498
$$ y = [16601787, 16098282, 15708006, 15335520, 14814705, 14148503, 13506980, 12919271, 12309889, 11616029, 10865360, 10426706, 9987750, 9504157, 9039611, 8658053, 8303367, 7958402, 7642934, 7343051, 7019922, 6709413, 6340565, 6001506, 5806742, 5580339, 5382180, 5070325, 4740977, 4508079, 4318708, 4103798, 3976206, 3863801, 3709052, 3629019, 3544697, 3424524, 3344951, 3244342, 3243174, 3164859, 3126668, 2997113, 2981373, 2923710, 2780558, 2654322, 2559291, 2455570, 2406160, 2411122, 2211959, 2068227, 1981607, 2025321, 1975711, 1973266, 1925293, 1854889, 1826094, 1846680, 1841970, 1806559, 1785508, 1617999, 1638312, 1671103, 1656460, 1783814, 1803661, 1729471, 1760603, 1680800, 1566561, 1569272, 1563903, 1566721, 1464610, 1402939, 1344221, 1412161, 1423666, 1448164]
3939A448164k036P0947m8989j85915K4437Q3811k247L4179j22896J0161J4105
3928A323721R5278r5869p5546k2189k692N2440o0792J06601N510Q295O0875j8454
3916A377178n2794k4571L389m3438L2954J8741j5896n5852O0298J71000j91864
3905A279145K6523m5536p109N2568j608R0508l3138p1505j48722O7749J06601
3894A315476j07306K3689N6613R700j8651j4038l2620J0226o7084R5666K1889
3883A293560m3173J1964l9657Q038O7544L3618q4846M3046J008L3426Q015k1201
3871A311342N8110j06991o0342P5883L2793J04590J03163K5380m5707r6885J11365
3860A512701N657j7150m5536N5988l5872q0064m6197L2234J14546P5354n4575
$$ y = [1448164, 1446128, 1517075, 1468086, 1282171, 1306608, 1390419, 1388172, 1422351, 1299455, 1309616, 1323721, 1418999, 1323130, 1247584, 1225395, 1222703, 1275143, 1214351, 1320952, 1326462, 1334757, 1395632, 1377178, 1324384, 1299813, 1303202, 1259764, 1292718, 1311459, 1295563, 1239711, 1300009, 1471009, 1279145, 1305668, 1260132, 1253023, 1305591, 1303983, 1394491, 1361353, 1289848, 1141126, 1208875, 1315476, 1208170, 1231859, 1288472, 1298172, 1279521, 1265483, 1232863, 1243089, 1176005, 1271671, 1293560, 1250387, 1262351, 1222694, 1230732, 1298276, 1331894, 1247048, 1290094, 1291102, 1324528, 1332543, 1311342, 1369452, 1262461, 1202119, 1278002, 1310795, 1415385, 1518548, 1543928, 1498221, 1401336, 1512701, 1518358, 1501208, 1455672, 1511660, 1475788, 1395724, 1349527, 1381761, 1496307, 1571661, 1517086]
3849A517086k0445K4280R4865j1614K0415k1088m2487Q7827L3770l7982O7262
3838A711889J40608M5787J7597J671J8061L6277r631J31182P7917N4509L9386
3827B265253N5792P4780O013Q5073m5583J2029P4510J78406L9071N6143J1301
3816B812788J59629M725p129K5933n7751J26701N6439k1820O5663L6722m4379
3805C157521l9415l8390J4500L7159J4138j611o8656j06723R76O1956p1608N3916
3793C013763j80724k6093L2891n6286N8409J0455o0583J43616P909j6150Q2715
3782C009922j26819Q278N9876m6311q0628K7399N0948P5842K20519j8307j8608
3771C162111l3947L4596P5273L4390J29016K997N4061M8277R426K9715N3968J1870
$$ y = [1517086, 1496641, 1520921, 1615786, 1604172, 1624587, 1603499, 1561012, 1648839, 1682609, 1644627, 1711889, 1852497, 1898284, 1915881, 1917552, 1935613, 1971890, 1962259, 2093441, 2171358, 2225867, 2265253, 2321045, 2395825, 2401838, 2486911, 2441328, 2453357, 2527867, 2706273, 2745344, 2801487, 2812788, 2972417, 2977142, 2970013, 2995946, 2938195, 3064896, 3121335, 3099515, 3165178, 3201900, 3157521, 3118106, 3079716, 3094216, 3131375, 3145513, 3143902, 3075246, 2968523, 2969499, 3031455, 2959847, 3013763, 2833039, 2806946, 2839837, 2783551, 2841960, 2852415, 2791832, 2935448, 2943357, 2927207, 3009922, 2883103, 2891381, 2951257, 2904946, 2824318, 2851717, 2902665, 2978507, 3199026, 3180719, 3162111, 3128164, 3162760, 3238033, 3272423, 3401439, 3404436, 3458497, 3506774, 3516200, 3545915, 3599883, 3611753]
3759C611753l3536q5723o6557n0039L6663o0897o5565n3703J01386l6479j8694
3748C278609p0927o4514r1392k4176n3722J7407o8226l5745n8504j90680M9205
3737B687335j12343r0164p4306o0041p2928n5817J7002k8939j66755o6859l3276
3726A942909j18704J29910n4938k8232j5769m0490J1807L3241j12974n9058L2747
3715A720449N621O3293L7885l9130M6822k1062p2322L3257l7679l383n6392k935
3703A674424j6503N6163n1063J6581j51M5938r3103J0722L3599N3061n3473J2503
3691A688698k5030o0455J04101N5876q6315Q4354P6177q1723n5240O958p0495
3680A636906P4112m0003p845N7188k9136O5674l6588M5081K1895N8569Q8924l6236
$$ y = [3611753, 3578217, 3492494, 3425937, 3375898, 3412561, 3351664, 3286099, 3232396, 3333782, 3297303, 3278609, 3207682, 3143168, 3051776, 3027600, 2973878, 2991285, 2923059, 2887314, 2828810, 2638130, 2687335, 2574992, 2484828, 2410522, 2350481, 2277553, 2221736, 2238738, 2209799, 2043044, 1976185, 1942909, 1824205, 1954115, 1899177, 1870945, 1855176, 1814686, 1826493, 1859734, 1746760, 1687702, 1720449, 1726070, 1789363, 1827248, 1788118, 1834940, 1813878, 1741556, 1774813, 1737134, 1733751, 1677359, 1674424, 1657921, 1714084, 1663021, 1679602, 1679451, 1725389, 1632286, 1643008, 1676607, 1729668, 1676195, 1688698, 1663668, 1603213, 1707314, 1763190, 1676875, 1761229, 1837406, 1755683, 1700443, 1707401, 1636906, 1711018, 1671015, 1663170, 1720358, 1691222, 1756896, 1720308, 1765389, 1787284, 1845853, 1934777, 1898541]
3668A898541j07541P1592l9082L5541r900O6069P8670O1029j00677n4668K3614
3657A923188K568J9662n3620J3903Q0060L1999P1583j5029l3746J05228n1023
3646B094773K4564P3078m5433R5707M3371q1317l7538k5030K3539J41704P0969
3635B378387o1081l1963J21630O9730N1747J33837o642M389k9907P3723k5954
3624B677896N225l2676M9112J88846j1538l883N3547J67611J08651m3651n082
3613C154058m3020P9567J0559R340J3512k8632Q6028k2493m2979J30803j04424
3602C242319o2641J43744L7975j32656j4846J49639m3591J10881j11868n5526
3592C263430J35274J05533J05640j1635M0423J50244q8254M1494O6697N3412P8067
$$ y = [1898541, 1791000, 1862592, 1823510, 1859051, 1849151, 1915220, 1993890, 2054919, 1954242, 1899574, 1923188, 1925756, 1945418, 1891798, 1905701, 1985761, 2017760, 2089343, 2074314, 2040568, 2145796, 2094773, 2119337, 2192415, 2146982, 2242689, 2286060, 2204743, 2167205, 2142175, 2165714, 2307418, 2378387, 2317306, 2285343, 2406973, 2476703, 2528450, 2662287, 2655645, 2660034, 2630127, 2703850, 2677896, 2683121, 2650445, 2699557, 2888403, 2876865, 2872982, 2926529, 3094140, 3202791, 3159140, 3154058, 3111038, 3190605, 3201164, 3210504, 3224016, 3195384, 3281412, 3258919, 3215940, 3346743, 3242319, 3179678, 3323422, 3361397, 3228741, 3213895, 3363534, 3319943, 3430824, 3318956, 3263430, 3398704, 3504237, 3609877, 3598242, 3638665, 3788909, 3700655, 3742149, 3808846, 3862258, 3940325]
3581C940325n8586j4907J03311J84583Q6541j05739K00229J61666L9533n6893
3571D480063P7971J49728J56558K442K5377J14110Q1549L0060J01357N4038O4555
3560E337808Q1206Q4221J2191K4238Q2388K7075J7520M6811M9990K5872O6561
3549E855881j4684J55012n1227Q1995O9670K06655J91721J55114m2989k1524j79
3538F585445Q3045P0241J64773J82424K7025J19786K98830j0250J1432R6789P3807
3527G703347O5382r6241J76272J59646p3708j6754r785K1239J27931l2167P3135
3516H098297N1115j0255l2576Q5682Q4410p689J1939O7105o227M2509K04598M9960
3504H638868L1560M5974J14596M8545J61311K02114J34383P2523N743j8350J59491
$$ y = [3940325, 3881739, 3866832, 3970143, 4154726, 4241267, 4135528, 4335757, 4497423, 4536956, 4480063, 4558034, 4707762, 4864320, 4866762, 4892139, 5006249, 5087798, 5117858, 5219215, 5273253, 5337808, 5419014, 5503235, 5515426, 5539664, 5622052, 5649127, 5666647, 5713458, 5763448, 5789320, 5855881, 5841197, 5996209, 5944982, 6026977, 6096647, 6303302, 6495023, 6650137, 6607148, 6585624, 6585445, 6668490, 6738731, 6903504, 7085928, 7112953, 7232739, 7531569, 7521319, 7532751, 7629540, 7703347, 7768729, 7672488, 7848760, 8008406, 7934698, 7917944, 7908159, 7929398, 8057329, 8025162, 8098297, 8149412, 8139157, 8106581, 8192263, 8276673, 8268984, 8280923, 8348028, 8341801, 8384310, 8588908, 8638868, 8670428, 8716402, 8830998, 8879543, 9040854, 9242968, 9377351, 9449874, 9455617, 9437267, 9596758]
3493I596758J41987L2934M7375N3278L0347k8441L8303J3761k7616N1749l904
3482I946531J22100R6325L7889O7015P8415J29010O0755R3875J59048J87880K38963
3471A1217806M1964R8285J18884J90226J62771Q6620J32273J4088Q9139j4634
3461A2137422M6268P1913O4772N21J35333K5896R8630P418L2710o1813Q0473J47293
3449A2786836O4018l2900N9793R2098R2524J49561o958R3529N3860J52229K2661
3438A3527251J09650J10886j065L6431J38700J40299J20512O7865J71048J98710
3428A4620287J88119J73691R1022J88749L07303K53065L20509K85428J33403K05627
3418A6767203K29542K81689J87564L20767K94817L47560J83649J35969K45842
$$ y = [9596758, 9738745, 9771679, 9819054, 9872332, 9902679, 9874238, 9912541, 9926302, 9898686, 9950435, 9946531, 10068631, 10164956, 10202845, 10269860, 10348275, 10477285, 10538040, 10631915, 10790963, 10978843, 11217806, 11259770, 11358055, 11476939, 11667165, 11829936, 11916556, 12048829, 12062917, 12152056, 12137422, 12183690, 12255603, 12320375, 12320896, 12456229, 12482125, 12580755, 12588173, 12620883, 12559070, 12639543, 12786836, 12850854, 12817954, 12877747, 12969845, 13062369, 13211930, 13204972, 13298501, 13352361, 13504590, 13527251, 13636901, 13747787, 13746722, 13783153, 13921853, 14062152, 14182664, 14250529, 14421577, 14620287, 14808406, 14982097, 15073119, 15261868, 15569171, 15822236, 16142745, 16428173, 16561576, 16767203, 16996745, 17278434, 17465998, 17786765, 18081582, 18429142, 18612791, 18748760, 18994602]
3409A8994602J56785K96640K72289J18894J96824K97382K58666J75649K54528
3400B1022259K44576K94560M01393K77869M60365M20562K05198K98167L84174
3391B4009123L15804M03819M69040L93453L55846L44551L71051M38487M09641
3382B7510815K66955L13687K29053L26463L72618J60073J62490K09250Q9394L20588
3372B9961386L34653K28819J38573K20613R4710K35397J87047L2167M9181J34688
3362C1617234P3733J50946J83707P1943R9292L1503J11264J58464J34596K25192
3352C2857874K70157J24368L04040L07648L10523M02005N55835L86237O11290
3343C6129977Q73838Q92309R38017J198839J405438J486967J646043J990550K209038
$$ y = [18994602, 19151387, 19448027, 19720316, 19839210, 20036034, 20333416, 20592082, 20767731, 21022259, 21266835, 21561395, 21962788, 22240657, 22701022, 23121584, 23326782, 23624949, 24009123, 24324927, 24728746, 25197786, 25591239, 25947085, 26291636, 26662687, 27101174, 27510815, 27777770, 28091457, 28320510, 28646973, 29019591, 29179664, 29342154, 29551404, 29640798, 29961386, 30296039, 30524858, 30663431, 30884044, 30978754, 31214151, 31401198, 31433365, 31482546, 31617234, 31690967, 31841913, 32025620, 32097563, 32196855, 32228358, 32339622, 32498086, 32632682, 32857874, 33128031, 33252399, 33556439, 33864087, 34174610, 34576615, 35132450, 35518687, 36129977, 37003815, 37896124, 38834141, 40032980, 41438418, 42925385, 44571428, 46561978, 48771016]
3334D8771016K306986K339339K493805K402813K102443J871677J478224J070847
3326F4837150P81250L39304K20547o8627j36817q8803k964K30687K25808L96227
3316F6733762N12789K98359J8170k98919o79218r79011j410397j677288j972268
3307F0545979k071662j963010k056085j836980j677067j497529j167651r52096
3299D7323899q71961o72919m44500k24249r8833O4332J93972L71961N14494O63004
3289D6819200P24901R77962J141400J155892J419029J597919J681462J949684
3281E7467449K313433K251426K490565K827835L070196L419601L561576L758910
3273H1160991M030431M289352M439801M715766M952321N165590N365977N425730
$$ y = [48771016, 51078002, 53417341, 55911146, 58313959, 60416402, 62288079, 63766303, 64837150, 65618400, 65957704, 66178251, 66109624, 65972807, 65884004, 65881040, 66111727, 66337535, 66733762, 67246551, 67544910, 67563080, 67264161, 66584943, 65605932, 64195535, 62518247, 60545979, 58474317, 56511307, 54455222, 52618242, 50941175, 49443646, 48275995, 47323899, 46451938, 45779019, 45334519, 45110270, 45011437, 45075769, 45269741, 45641702, 46156196, 46819200, 47544101, 48522063, 49663463, 50819355, 52238384, 53836303, 55517765, 57467449, 59780882, 62032308, 64522873, 67350708, 70420904, 73840505, 77402081, 81160991, 85191422, 89480774, 93920575, 98636341, 103588662, 108754252, 114120229, 119545959]
3265A19545959N861220N900460N814813N513788N111009M457722L657792K748619
3257A58611382J975850J227493M23079j55725n66703n67804p05520q68893o69727
3248A58703432l51349m16775q02150j092414j581227k202619k998823l592262
3240A45665813m305249m835159n224230n516209n371272m967789m735216m185173
3232A06525516l713563l395713k783061k564183k423698k403391k368203k293748
3224H4579956k455035k378110k230545k208766k054166k054398k265525k319057
3216F6614354k085470j914823j724395j485386j320557j150933j019856j035595
3208E4877339r97211p20902o69786n99749n00144n12273m38559l66947l85369
$$ y = [119545959, 125407179, 131307639, 137122452, 142636240, 147747249, 152204971, 155862763, 158611382, 160587232, 161814725, 162237804, 162082079, 161515376, 160947572, 160242052, 159373159, 158703432, 158352083, 157935308, 157133158, 156040744, 154459517, 152256898, 149258075, 145665813, 141360564, 136525405, 131301175, 125784966, 120413694, 115445905, 110710689, 106525516, 102811953, 99416240, 96633179, 94068996, 91645298, 89241907, 86873704, 84579956, 82124921, 79746811, 77516266, 75307500, 73253334, 71198936, 68933411, 66614354, 64528884, 62614061, 60889666, 59404280, 58083723, 56932790, 55912934, 54877339, 53880128, 53159226, 52489440, 51889691, 51389547, 50877274, 50438715, 50071768, 49686399]
3199D9686399q3732j8640l2226K8727J46821L26117M02821O40019P78677Q45561
3189E2720544J020435J051759R48553R17283P35285P18376O06627M61153N19627
3180E9699642L52264K86496K18971J44009o5433j72238j12979k68985k77360k76301
3170E9528086l25233k35766k36350m05337j10496j77300j50371j35470j08404
3161E7643359j28347o9460n2912j04380q0592k12463k49720p1239j70559J0201
3151E6513888j0928J17030K48114J57297L50736N55320N72718O75189J038843
3142F0218207J270715J607225J990764K406635K893614L462343L742026M088763
3134H1680292M272489M486134M389618M287081M168394M052603L902035L619843
$$ y = [49686399, 49602667, 49584027, 49551801, 49580528, 49727349, 50053466, 50456287, 51096306, 51874983, 52720544, 53740979, 54792738, 55741291, 56658574, 57393859, 58112235, 58718862, 59180015, 59699642, 60051906, 60338402, 60557373, 60701382, 60635949, 60463711, 60350732, 60081747, 59804387, 59528086, 59202853, 58967087, 58730737, 58325400, 58214904, 58037604, 57887233, 57751763, 57643359, 57515012, 57445552, 57392640, 57288260, 57207668, 56995205, 56745485, 56674246, 56503687, 56513888, 56502960, 56619990, 56868104, 57025401, 57376137, 57931457, 58504175, 59179364, 60218207, 61488922, 63096147, 65086911, 67493546, 70387160, 73849503, 77591529, 81680292, 85952781, 90438915, 94828533, 99115614, 103284008, 107336611, 111238646, 114858489]
3126A14858489L076620K517220J813808J336733N89477J09878k17450o88305r06712
3117A22489758j264931j491511j482994j703700j740324j735519j926780k130674
3109A09013325k582283k638457k676209k744495k632808k382961k314440k110366
3101H8931306k227473k158422k177845j986677j940027j970439j991573j775121
3093G2703729j760170j687864j648031j493783j369934j199332j012399q89551
3085F1642665p75085o52167l79102m20376j76366j24186j55226l00977l19506
3076E8339674m08423n63650p61441j045768j248632j354599j482579j430033j501580
3067D8542969j588500j585410j475310j335019j231046j143765j112537j102256
$$ y = [114858489, 117935109, 120452329, 122266137, 123602870, 124192347, 124302225, 124084775, 123396470, 122489758, 121224827, 119733316, 118250322, 116546622, 114806298, 113070779, 111143999, 109013325, 106431042, 103792585, 101116376, 98371881, 95739073, 93356112, 91041672, 88931306, 86703833, 84545411, 82367566, 80380889, 78440862, 76470423, 74478850, 72703729, 70943559, 69255695, 67607664, 66113881, 64743947, 63544615, 62532216, 61642665, 60867580, 60215413, 59836311, 59415935, 59239569, 59115383, 58960157, 58659180, 58339674, 57931251, 57367601, 56606160, 55560392, 54311760, 52957161, 51474582, 50044549, 48542969, 46954469, 45369059, 43893749, 42558730, 41327684, 40183919, 39071382, 37969126]
3059C7969126q97363q87191q03925q27439r27111p45409p55500r07990q38536
3050C0378662r35117q82318p87621q17461q82285q83417p59409n92541p29245
3041B3109248o36166n34444n57811l67105l45042l19421k58878k28825k09230
3032A9652326k32523j52087m592k6091J870r918J49893J09656J67500K53358J63150
3021B0072542K08202J20144J05530J28346L9761J37388O4621p7025k8346p3744
3011B0697419j91750r9120m9311N314O0953J36523J54688J22775K07831L55483
3001B1400805L21268M24759L05029J51289L11428J70620J20480J35424J50750
2992B3491852J49717K33617K52876K26244L06645L27090M36446M77477N57398
$$ y = [37969126, 37071763, 36184572, 35380647, 34553208, 33626097, 32880688, 32125188, 31217198, 30378662, 29443545, 28561227, 27773606, 26956145, 26073860, 25190443, 24431034, 23838493, 23109248, 22473082, 21938638, 21380827, 21013722, 20668680, 20349259, 20090381, 19861556, 19652326, 19419803, 19267716, 19263124, 19237033, 19238903, 19228985, 19378878, 19488534, 19656034, 19909392, 20072542, 20280744, 20400888, 20506418, 20634764, 20674525, 20811913, 20876534, 20799509, 20771163, 20697419, 20505669, 20406549, 20357238, 20362552, 20423505, 20560028, 20714716, 20837491, 21045322, 21400805, 21722073, 22146832, 22451861, 22603150, 22914578, 23085198, 23205678, 23341102, 23491852, 23641569, 23875186, 24128062, 24354306, 24660951, 24988041, 25424487, 25901964, 26459362]
2983B6459362N50132K64465J29955k20807m38304n57212n83749o76722q32757
2974B4094363q64389q40786q15092p51857o20199n65302n77485p03854n79639
2965A7775760m83506m13930l16215k70079l42523k56314k22822j99363k14363
2956A5056645j09129K912r2174J3364L5557M7397J51204J04872J22699L4147J70969
2945A5538463R0506K41411J81551N8956K97648K64728J81553K19224L38115K12032
2935A7624187K40501J59818J91695K66485L62157L02238K72784L90354M71431
2926B0281650L94678M60293L96690M26065M97394M42820N91481M79210N32211
2917B4502492P00414P36073O77388P81401P23645P53968R09852Q86810J082048
$$ y = [26459362, 27009494, 27273959, 27403914, 27183107, 26744803, 26187591, 25603842, 24927120, 24094363, 23229974, 22389188, 21574096, 20822239, 20202040, 19636738, 19059253, 18355399, 17775760, 17292254, 16878324, 16562109, 16292030, 15949507, 15693193, 15470371, 15271008, 15056645, 14947516, 14950428, 14858254, 14871618, 14907175, 14954572, 15105776, 15210648, 15333347, 15367494, 15538463, 15628969, 15870380, 16051931, 16110887, 16408535, 16673263, 16854816, 17074040, 17412155, 17624187, 17864688, 18024506, 18216201, 18482686, 18844843, 19147081, 19419865, 19810219, 20281650, 20676328, 21136621, 21533311, 21959376, 22456770, 22899590, 23491071, 23970281, 24502492, 25202906, 25938979, 26616367, 27397768, 28121413, 28875381, 29785233, 30672043, 31754091]
2908C1754091J156388J165428J219021J310477J368349J489920J644252J707034
2900D2814960J755464J851709K056453K220003K305378K581320K806664L218216
2892F1610167L341090L527866L927105M147874M576922N045410N563775O021882
2884I7762091O607518P429977Q317159R142812R998957J0810496J1604264J2008121
2876A73681395J2712797J3552905J4708073J6619736J9449279K2551748K5195932
2869B98471865K5193141K0295683J0243016l648906j7410517k7477697l1855130
2862B73811455l0800039k6601438k1658924j6340215j2332294r411275o638563
2855A50028707m555762l051902j761841j021124p49869j087250k217759l890659
$$ y = [31754091, 32910479, 34075907, 35294928, 36605405, 37973754, 39463674, 41107926, 42814960, 44570424, 46422133, 48478586, 50698589, 53003967, 55585287, 58391951, 61610167, 64951257, 68479123, 72406228, 76554102, 81131024, 86176434, 91740209, 97762091, 104369609, 111799586, 120116745, 129259557, 139258514, 150069010, 161673274, 173681395, 186394192, 199947097, 214655170, 231274906, 250724185, 273275933, 298471865, 323665006, 343960689, 354203705, 350554799, 333144282, 305666585, 273811455, 243011416, 216409978, 194751054, 178410839, 166078545, 156667270, 150028707, 145472945, 142421043, 140659202, 139638078, 138888209, 137800959, 135583200, 131692541]
2847A31692541n608156o876860p875978q261902q154920p510582o876043o152540
2839G4375560n347767m875555m260931l849172l471742l207404k861109k576329
2831D3925551k387041k106982j932782j814016j621277j614621j428366j310105
2823B9710361j174469j007808j067620r50027j061382q25383q18793p61652o72076
2814B1371151n64573p18360o64590o63841o52000n61095m85432n53630n80692
2805A5926938n16587n65665m88642m13415m91455m46422l44852k77559l26375
2796A2055966m17899k19378l51856l85334k58906k52879l20817k27057j74415
2787I447425k76873l36254j93116j48882j97262k69681j37680j92518j68196j05799
$$ y = [131692541, 126084385, 119207525, 111331547, 103069645, 94914725, 87404143, 80528100, 74375560, 69027793, 64152238, 59891307, 56042135, 52570393, 49362989, 46501880, 43925551, 41538510, 39431528, 37498746, 35684730, 34063453, 32448832, 31020466, 29710361, 28535892, 27528084, 26460464, 25510437, 24449055, 23623672, 22804879, 22043227, 21371151, 20806578, 20088218, 19423628, 18759787, 18107787, 17546692, 17061260, 16507630, 15926938, 15410351, 14844686, 14356044, 13942629, 13451174, 13004752, 12659900, 12382341, 12055966, 11638067, 11418689, 11066833, 10681499, 10422593, 10169714, 9848897, 9621840, 9447425, 9170552, 8834298, 8641182, 8492300, 8295038, 8025357, 7887677, 7695159, 7526963, 7421164]
2777G421164r1493k15823k81178j94129j36149r2169r9969j34097q2094j17964
2767E976099j85012j10741j03472k07773j12365p355j05529o5700o4768M9025
2757E062409q6394j76831j52077o5736m8712j60298p0638k2544K5165j09015m0805
2746D154524n2115k6272j03285r6531k7593N379r4158l5929k3630j26278j07552
2735C466560j68438O315On9117n7007l9300o1588k6044j07574k387O7298o2648
2723B956076p1230l6742j8972m0064j05439K0293J3515j10118r1315m6953n6887
2712B412164M3059n3719k9755n1906n2266p1720K3709J7499o47M927j28787R9290
2700B211848O2818j33812p1888m2647p3846n425o4730m4878O2526j0274p2762
$$ y = [7421164, 7329671, 7113848, 6832670, 6638541, 6502392, 6410223, 6310254, 6176157, 6094063, 5976099, 5791087, 5680346, 5576874, 5369101, 5256736, 5249381, 5143852, 5078152, 5013384, 5062409, 4976015, 4799184, 4647107, 4581371, 4532659, 4372361, 4301723, 4279179, 4304344, 4195329, 4154524, 4102409, 4076137, 3972852, 3876321, 3848728, 3854107, 3759949, 3724020, 3700390, 3574112, 3466560, 3298122, 3304437, 3304443, 3245326, 3188319, 3149019, 3087431, 3061387, 2953813, 2951426, 3018724, 2956076, 2884846, 2848104, 2829132, 2789068, 2683629, 2703922, 2717437, 2607319, 2516004, 2469051, 2412164, 2455223, 2401504, 2371749, 2319843, 2267577, 2195857, 2219566, 2237065, 2236418, 2241345, 2112558, 2211848, 2274666, 2140854, 2068966, 2026319, 1952473, 1947048, 1882318, 1837440, 1899966, 1889692, 1816930]
2689A816930K0387j0427j5062p5595k1687L9136L4197k0253j06913M5277n6245
2678A649745K5557l1224n7427l7546J6689M0116m4137m1813O7035r2860L3261
2667A527396J41738j21979K973j22853o9281M8733K0590K1886M3813l6377p5942
2656A380697j2716q1878O677J7440o2822M829n5670N6852q9318O0235K0064M6557
2644A290947l2024J8895o4244q7596J9460P279M5392l388O0688m2237k7124n9539
2632A126509N3101J10578p1485j2631K5157k3684J27447j75390O461P1728p3343
2621A164448o1485L672R5873k2119l6841M1588j868p4148L7687q4157J0894J99788
2609A273332m4818N4405J8944p0180Q098j4855Q6391J260O583L7402M2704m8530
$$ y = [1816930, 1837317, 1826890, 1811828, 1736233, 1714546, 1753682, 1787879, 1767626, 1660713, 1705990, 1649745, 1675302, 1644078, 1586651, 1549105, 1565794, 1605910, 1561773, 1519960, 1586995, 1494135, 1527396, 1669134, 1547155, 1550128, 1427275, 1357994, 1406727, 1427317, 1449203, 1493016, 1456639, 1380697, 1367981, 1286103, 1292780, 1310220, 1247398, 1252227, 1196557, 1253409, 1164091, 1224326, 1244390, 1290947, 1258923, 1277818, 1213574, 1125978, 1145438, 1152717, 1198109, 1194721, 1255409, 1213172, 1186048, 1126509, 1179610, 1290188, 1218703, 1206072, 1231229, 1207545, 1334992, 1159602, 1166063, 1237791, 1164448, 1102963, 1106635, 1202508, 1180389, 1143548, 1185136, 1183268, 1109120, 1146807, 1062650, 1073544, 1273332, 1228514, 1282919, 1301863, 1231683, 1239781, 1224926, 1311317, 1312577, 1319160, 1356562, 1399266, 1350736]
2597A350736J9890J10802N3473J3580J18784J4399R4583K19424o9500J10442J32317
2586B168930P7360J40203R3859k904p3350q5803j89556j49067k9855j03537j88734
2575A657546q7096l714n2502n4149J5052q4649j38051Q5059M1069N5930l7661
2564A396834j31229q0911r1050J7404n9708l4269j8784j745K0980j86692K3057
2553H53887O6704J8103n2985p4659m7457q7182L4083J1025K364o0266p6765k2833
2541E64019J10192l9455R777n3908Q844j7996r3591p1956J00751L6551M4521m3133
2529E54616q3812M6172j24548J0618N2149k1214K0695J11882q1376j05094M7552
2518D27640N4380k3566j937O812p171j60961J04385P8317l0252k9088j48182R6018
$$ y = [1350736, 1370626, 1481428, 1534901, 1548481, 1667265, 1681664, 1776247, 1995671, 1926171, 2036613, 2168930, 2246290, 2386493, 2480352, 2477448, 2404098, 2318295, 2128739, 1979672, 1949817, 1846280, 1657546, 1570450, 1566736, 1514234, 1460085, 1475137, 1390488, 1252437, 1337496, 1378565, 1434495, 1396834, 1265605, 1184694, 1093644, 1111048, 1051340, 1017071, 998287, 996542, 1017522, 830830, 853887, 920591, 938694, 885709, 811050, 763593, 676411, 710494, 721519, 723883, 663617, 586852, 564019, 674211, 634756, 644533, 590625, 599469, 581473, 487882, 415926, 516677, 553228, 597749, 554616, 470804, 516976, 392428, 403046, 455195, 433981, 454676, 566558, 485182, 380088, 427640, 482020, 458454, 456517, 463329, 456158, 295197, 399582, 477899, 447647, 418559, 270377, 366395]
2506C66395K3586p7037Q8054Q7702m5835n3920L5495l8177j46878N0618N7945
2495C47948k8530j7718r1086R1711O4027M0464J12992Q7611q8781n9552N0752
2484E09838o228p303L7712r011L6258k6151j22444m3440J8608O304q1334j3103
2472B99706P4629K9171N6619j4027M0874r2509o3788Q4532M2829j05267R012K920
2460C64701m8797n6031l6727J39980M7774o664m4934O8778k6673M8447r3235n2822
2448C03797o9037M571l8687k7610P5805R8531k9214j63726K4454L1454n0723O288
2436A65903J1798J28237J5760o7536L1803n3542O747L6743K2734j42970j5718
2425A39959K28878j21689L0382Q6420l0932j32331p8853J38123J7996J02091j01558
$$ y = [366395, 389981, 312944, 400998, 488700, 442865, 388945, 424440, 386263, 239385, 290003, 347948, 319418, 301700, 210614, 302325, 366352, 406816, 519808, 607419, 518638, 459086, 509838, 503610, 496307, 534019, 525008, 561266, 535115, 412671, 369231, 387839, 394143, 312809, 299706, 374335, 403506, 460125, 446098, 486972, 394463, 330675, 415207, 458036, 352769, 361781, 364701, 315904, 259873, 223146, 363126, 410900, 404236, 359302, 428080, 401407, 449854, 356619, 303797, 234760, 239331, 200644, 173034, 248839, 347370, 318156, 154430, 178884, 210338, 159615, 165903, 177701, 305938, 321698, 254162, 285965, 232423, 239170, 275913, 298647, 155677, 139959, 368837, 247148, 277530, 363950, 333018, 200687, 121834, 259957, 277953, 380044, 278486]
2414B78486J7180K0376j44603J08579J9950k6715L2717r4219j6035n878l4229
2403A55609L3157K4897J14289m1210N2342J0042m9553r062L3367k2052N943o8970
2391B38799q5974J5005l8293J78491M9294L8250q2720j00423j9391k2702J33789
2380C04125j08348O6721N5617p6407M9197j12662n159J0506P2096L7118J7225
2369C10029Q949j20584l3467J62500o3612L7835O3103L1102r740k3935M3449Q1926
2357D87555J9847J4021m4546j07588m8337K042J3345j0751k4860L2287j2943O4413
2345C84485n8826o6804q7430P4822L1941l8036K4917m1328o1195R1151l0462m0982
2333A82253O6741n7201J25875j04113j884m8735Q1373j1821j3972L3797l3911
$$ y = [278486, 295666, 316042, 171439, 280018, 299968, 273253, 305970, 211751, 195716, 189838, 155609, 188766, 213663, 327952, 286742, 339084, 349126, 299573, 290511, 323878, 301826, 307769, 238799, 152825, 167830, 129537, 308028, 357322, 395572, 312852, 212429, 193038, 170336, 304125, 195777, 262498, 318115, 241708, 290905, 178243, 173084, 183590, 255686, 292804, 310029, 318978, 198394, 164927, 327427, 263815, 301650, 364753, 395855, 386115, 362180, 405629, 487555, 507402, 521423, 476877, 369289, 320952, 322994, 336339, 325588, 300728, 333015, 320072, 384485, 325659, 258855, 171425, 246247, 278188, 240152, 265069, 223741, 162546, 253697, 223235, 182253, 248994, 191793, 317668, 213555, 211671, 162936, 244309, 232488, 218516, 252313, 218402]
2322B18402O7596K9963m5111O660Q6628r7219j26890Q1493p341k2245M0445m6198
2310A86183q161M155R834m455O5924o9485Q391O6276j8975J07840m716q9695n5668
2297A97448K573J37554n487n1602m4920P6742n0338j17779J41096l8234M827L0505
2285B82385K625P25n8180o6370K0365O962K8235N0744k9434O3824O1145j3851
2273C49175k739r8220l5115L6525L4360o9687m5710J7138J14108q8054J25504
2262C37285R096o4037j6752J1274o7571L4089J00286p3988j1149L2635O7757j1305
2250C47620m1863O805m2537k84J2949m0093L4585q2741Q6121P6133R153K2582
2238C88430R5017K9538r8228j00608m3795o109Q1716l0994K954J15224j906l1383
$$ y = [218402, 285998, 315961, 270850, 277510, 364138, 266919, 140029, 221522, 214181, 191936, 232381, 186183, 178022, 182177, 192011, 187556, 253480, 183995, 192386, 258662, 239687, 347527, 342811, 253116, 197448, 200021, 337575, 332088, 280486, 235566, 312308, 261970, 144191, 285287, 247053, 251880, 282385, 285010, 285735, 227555, 161185, 181550, 188512, 216747, 267491, 238057, 301881, 363026, 349175, 346436, 248216, 213101, 249626, 283986, 214299, 168589, 185727, 299835, 211781, 337285, 346381, 282344, 265592, 276866, 209295, 243384, 343670, 269682, 258533, 291168, 358925, 347620, 305757, 312562, 270025, 269741, 282690, 242597, 277182, 194441, 280562, 356695, 365848, 388430, 483447, 512985, 414757, 314149, 270354, 264245, 345961, 314967, 317921, 433145, 431239, 399856]
2226C99856k9825q1663j4031O8249R3200l0410p7859n2155P8554R7419l1961J7828
2214D37202J05434k5846k01219n4612J12648J8583P3205l355j2241p2200N5419
2203D33018Q1679N928O23o1327j8718l1630N776R1842p43r000M8373O9741J1816
2190F27378m6575J32573m6108j16227J55513k3612j21663N1419j7368K7349O9120
2179F91799P135J20195j0145K3777K8346J4379R6384P2994L0973o1581j8602R3009
2167A088663o7267L3370R1943R5619J7774j5079M9402J3568L2467j07509Q5640
2156A318591k7148N6203J23689M2242o1964m6698J43442K5248k0083O9865M6257
2145A669644m1927n3220J45307J87430M8219l1641O9711R4292N7017l1456J21016
$$ y = [399856, 370031, 288368, 274337, 342586, 435786, 405376, 327517, 275362, 353916, 451335, 419374, 437202, 542636, 516790, 315571, 260959, 373607, 392190, 465395, 462040, 449799, 377599, 433018, 514697, 520625, 521248, 459921, 441203, 409573, 415349, 507191, 506448, 497448, 545821, 615562, 627378, 580803, 713376, 667268, 551041, 706554, 682942, 561279, 612698, 595330, 622679, 691799, 698934, 819129, 808984, 832761, 861107, 875486, 971870, 1044864, 1075837, 1014256, 995654, 1088663, 1021396, 1054766, 1146709, 1242328, 1260102, 1245023, 1294425, 1307993, 1340460, 1232951, 1318591, 1291443, 1347646, 1471335, 1513577, 1451613, 1404915, 1548357, 1573605, 1553522, 1623387, 1669644, 1627717, 1574497, 1719804, 1907234, 1955453, 1923812, 1993523, 2087815, 2144832, 2113376, 2234392]
2134B234392J61018L6437J52115R4736Q4755P8001J60757J24616O4100N0169J60136
2123C401232J82529K43721K33765J00767J88311J95795K54018K70790J99828L66277
2113E637033L51850K07894L80057N28969N21071N93170P20208O78823Q16042O99493
2103A1134610R12161R63325J096595J367512J692095K102786K755418L460311
2095B5484813M998270P087291Q865859Q271427N374712M35980n861438q547935
2087D6108979q636284p446407n534433l947061k930153k256696j771273j361419
2079A2225253j067632p31040o24097m74440o14264p01052n95431o43556n57894
2070F215847m50144k62768m52060j97632l30708k66268j57297j41092p8362k05950
$$ y = [2234392, 2395410, 2431847, 2583962, 2678698, 2763453, 2841454, 3002211, 3126827, 3190927, 3241096, 3401232, 3583761, 3827482, 4061247, 4162014, 4350325, 4546120, 4800138, 5070928, 5270756, 5637033, 5988883, 6196777, 6576834, 7105803, 7626874, 8220044, 8940252, 9619075, 10435117, 11134610, 12046771, 13010096, 14106691, 15474203, 17166298, 19269084, 22024502, 25484813, 30483083, 37570374, 46436233, 54707660, 60082372, 60518352, 54656914, 46108979, 37472695, 30026288, 24491855, 20544794, 17614641, 15357945, 13586672, 12225253, 11157621, 10426581, 9802484, 9328044, 8713780, 8012728, 7417297, 6773741, 6215847, 5765703, 5502935, 5050875, 4853243, 4522535, 4256267, 4098970, 3957878, 3879516, 3673566]
2060C673566k28745j52846j14681j99783q0351j41174j54882j8714j16909j19006
2050B346475m6089j41203k6895Q84p4198j24797k53720q948N9336J9896p6934
2039A673807j35765J0009l8736J07973n6186m7825O932j62155m5748r0222k283
2028A219801O3943j04038j8419j5345k5516j07741o5987j48328j9612m0555k8748
2017G09455M7110M058m4679M8779m4186k4072K090J5863q2917n0394j5911J8180
2005E83376n626j6658K5728p6011J1004Q5641o464M1426M7351q3911r526p6794
1993E19536j3835l7033k7101k8228M7746p3512o0547K0152n112N0435N5431J8089
1981D66021q2182n4763p353j7281m2028J30137k2050o5186J0150L51o1002M3578
$$ y = [3673566, 3444821, 3291975, 3177294, 2977511, 2897160, 2755986, 2601104, 2582390, 2465481, 2346475, 2300386, 2159183, 2132288, 2133172, 2058974, 1934177, 1680457, 1671509, 1730845, 1750741, 1673807, 1538042, 1548051, 1509315, 1617288, 1561102, 1513277, 1520209, 1358054, 1312306, 1222084, 1219801, 1283744, 1179706, 1161287, 1145942, 1120426, 1012685, 946698, 798370, 778758, 738203, 709455, 756565, 760623, 715944, 764723, 720537, 696465, 698555, 714418, 631501, 581107, 565196, 583376, 577750, 561092, 586820, 510809, 521813, 607454, 600990, 642416, 689767, 605856, 596330, 519536, 505701, 468668, 441567, 413339, 461085, 387573, 327026, 347178, 342066, 392501, 447932, 466021, 383839, 329076, 321723, 304442, 262414, 392551, 370501, 305315, 315465, 315816, 254814, 298392]
1969B98392J4955R3141m4386q3348P329M6437L1861p1965P9j09184J606Q4848
1957B69765K3807J20118J2826j26709N4169l2611r2909L3607k1653o2691M2208
1946B19927J1916N7436n3522m809J9319M0510n2395Q1315o5669r6159k4185R1154
1934B24838Q955R096N3563J25220j63379K1445p737j02025K7230q120Q5188m322
1922B69952M7902n6452q7314L8282L2808m3233m7715P0038q9372k5864K9542J9630
1910A58204l4251j5133J8880K9342R2183k2378K2099L4900j36082n1758J1300
1899A07306Q914K0701m1844j6100O8071K1342J7603N4051j13119k6968K7987J03344
1887B31288m8654J859l5970O5536o5929o0967O3890O8478j22553J8415j835M943
$$ y = [298392, 313347, 406488, 362102, 278754, 286083, 332520, 364381, 292416, 292495, 183311, 184917, 269765, 293572, 413690, 426516, 299807, 353976, 321365, 228456, 262063, 240410, 177719, 219927, 231843, 289279, 235757, 230948, 250267, 290777, 238382, 319697, 254028, 157869, 133684, 224838, 233793, 242889, 296452, 421672, 258293, 279738, 272001, 169976, 197206, 189086, 274274, 269952, 317854, 261402, 174088, 212370, 245178, 201945, 154230, 224268, 134896, 109032, 138574, 158204, 123953, 108820, 127700, 157042, 249225, 226847, 248946, 283846, 147764, 96006, 107306, 116220, 136921, 95077, 78977, 147048, 168390, 185993, 240044, 126925, 99957, 127944, 231288, 182634, 184493, 148523, 214059, 148130, 87163, 151053, 219531, 96978, 115393, 113558, 118501]
1875A18501J2175K683N4793p057q5219N2350M6240M7795r975m7347p3131l3823
1863G7985L8296K7269r1599l2640O989l8464J62392M0155p4743L6936l1124j9269
1851A02183K8641N9893j05571p5010P9424R707o4000J23675K6336k8987K7004
1840A83295p0435L0136J22563O5112j46670J4796O4357k6530l4629J345n3745
1829A49595J26358L1269K5135o5689n573N0679K6416J08961n1246r5869J35344
1818D35380J1775j15424j06216J9468J4460m2213j05697k505O036N5998M8136
1807B19198j26629P2248k6140O5674n9552n0495Q7102n8355K8201n0290l3370
1796F7592N754L7212J5885m7864n3985J1123M1476k0661q7260o803N0267j5944
$$ y = [118501, 130676, 133359, 188152, 181095, 95876, 148226, 194466, 242261, 232286, 184939, 111808, 77985, 116281, 143550, 51951, 19311, 26300, -12164, 150228, 190383, 115640, 152576, 121452, 102183, 130824, 190717, 85146, 10136, 89560, 99267, 35267, 158942, 185278, 156291, 183295, 112860, 142996, 265559, 330671, 184001, 198797, 263154, 236624, 201995, 203340, 149595, 275953, 307222, 332357, 266668, 261095, 311774, 338190, 447151, 395905, 300036, 435380, 447155, 331731, 225515, 244983, 259443, 217230, 111533, 109028, 115064, 171062, 219198, 92569, 164817, 138677, 204351, 144799, 94304, 181406, 123051, 151252, 100962, 67592, 73346, 110558, 126443, 78579, 24594, 35717, 77193, 56532, -30728, -37531, 12736, -3208]
1784c208k367o4335L44M4935O2270R973p2326j8914K6402L8180K6334j5447r2388
1771f0547l5202J59083j0941m0306J2563L055J2624n78P5712L4000j17697j0417
1759B1349P9037j65237J7635J0970j01191K06422Q3832n1009n2296p3036N1504
1748B7980N6358K7109m3338J857L3701J468r5316k0617M1670l7018M5552j13096
1736g3690j07639Q5110n208O1109r674L4502m0687K2386K2625P4846J3042k1194
1724E5528M0272K4228n1558L462J5091l9104j02228L8127J03565k3982L290P962
1712G4653o054q993o1042m9798Q5127q394R372j23246M2009J36314o6550K9552
1700E2950J72441j38721L3608q799J7957n1336k0966m653q4852k5311j5620l6898
$$ y = [-3208, -5575, -69910, -69566, -24631, 37639, 47612, -24714, -43628, -17226, 20954, 47288, 31841, -60547, -95749, 63334, 52393, 12087, 24650, 27705, 40329, 39751, 115463, 149463, 31766, 21349, 100386, -64851, -47216, -36246, -137437, 68985, 152817, 101808, 49512, -23524, 27980, 84338, 111447, 68109, 69966, 103667, 105135, 9819, -10798, 30872, -6146, 39406, -73690, -181329, -96219, -101427, -40318, -49992, -15490, -56177, -33791, -11166, 63680, 76722, 55528, 95800, 120028, 68470, 71932, 87023, 47919, -54309, -16182, 87383, 63401, 66691, 74653, 68599, 59606, -1436, -51234, 33893, 25499, 34871, -88375, -46366, 89948, 23398, 52950, 225391, 86670, 120278, 111479, 129436, 78100, 57134, 52481, -32371, -57682, -73302, -110200]
1688a10200J04252N7297q9646m4621l890J212K7204N0234R8194O1138n4277p4990
1676B1907m3184L4412L8564L3054p33m5107N933J6887j4720p1134q0405n828J146
1663a09208O9592J3231q2899P6643J34555J5783J741R25j9152l7814r830J5879
1651F9446P425L8311l0541j02552P5566Q424k4600n973j27297P8537J52374o3247
1639G5873n57l0332N540o7768M7020J4654q2193J9681Q9746J8517l0238J1518
1627G1461l5351m1797L009K5224l4027m289N6746N0293l1564m1686R4503m8313
1615F4209M7451k2610J7849j03111O7024M757o0348m9664r4288K0601J48568l633
1603C6805p6441J7754o1112J96236j9520n710J346j6279j19754k1314M5540J9821
$$ y = [-110200, -5948, 51349, -38297, -82918, -86808, -85596, -58392, -8158, 90036, 151174, 96897, 21907, -21277, 13135, 51699, 84753, 84020, 38913, 44846, 61733, 47013, -24121, -104526, -110354, -109208, -39616, -26385, -109284, -32641, 101914, 117697, 119438, 120363, 101211, 63397, 53567, 69446, 76871, 115182, 84641, -17911, 57655, 66079, 41479, 35506, -91791, -13254, 139120, 75873, 75316, 44984, 50524, -17244, 29776, 44430, -37763, -18082, 71664, 90181, 59943, 71461, 36110, -5687, -2678, 22546, -11481, -15770, 40976, 91269, 59705, 18019, 112522, 64209, 111660, 89050, 106899, 3788, 70812, 75569, 15221, -34443, -128731, -108130, 40438, 36805, -39636, -21882, -82994, 113242, 93722, 88012, 89358, 73079, -46675, -67989, -22449, -2628]
1591b628K1914K0653m8691P298J4789J48569J4701p5827J1123n5644j565j1318
1579D3374K1508j57499j37597J32492O8125K9551R5902N1085m7499k091K6066
1568A23417n9072q1380k1161j261Q0692M5550P922J8981K1003K6125k3308j27189
1556A0319m1808J5962L970K2938Q000l8932n7609l4458R337J24990O9750M8507
1544A40966q6929j14990n5429M7062j5659M3754R5675K7153k1868p9170j0274
1533b9709R1910P2455j07017l5434n1485J19672R1869L607p8672j01070N8161
1522C4287N2278k6237m6897J4286m0148R7762k685L9372m430q4514M7039J6323
1510I6436p4542o0948K9274N7643K1204p3623l5318P0211J0309j9284M5519n0946
$$ y = [-2628, 19286, 39939, -8752, -1454, 13335, 161904, 176605, 100778, 111901, 56257, 54692, 43374, 64882, -92617, -230214, -97722, -29597, -46, 95856, 146941, 99442, 97351, 123417, 64345, -17035, -38196, -39457, 41235, 86785, 94707, 113688, 134691, 160816, 137508, 10319, -31489, -15527, -11557, 11381, 19381, -19551, -77160, -111618, -102281, 22709, 92459, 140966, 54037, -60953, -116382, -69320, -84979, -41225, 54450, 81603, 59735, -19435, -29709, 62201, 134656, 27639, -7795, -59280, 60392, 152261, 155868, 77196, -23874, 34287, 86565, 60328, 13431, 27717, -12431, 85331, 82646, 122018, 117588, 33074, 80113, 96436, 21894, -39054, -9780, 47863, 69067, -4556, -39874, 30337, 40646, 21362, 66881, 15935]
1498A5935R6903Q3945l1894n3692j51802K8318O8506m3695j3448m5285m1332Q1551
1486e990M1664K4730k7716k3744L0711l7327p7345Q6191n512q7060M1282k4419
1474f4535N4416J26078j16994m8791O4030k3463r281L7842l1680K1220Q5308n6761
1462C7389l2467k7766K341M2924Q0612r1177q5754p0215P1272O1970M7548k3416
1450A3261n5336R2867L8994j5844l0794J0247K9893j2214Q79Q2541k3737j34133
1438c376n9871M2320k2811J26017K6189n9658N8380o4115Q223Q8985m1167j4586
1426H4530q4790N887R3355m4730k2812l2065l0071L5455p651N6058l6624O9803
1414H6345o742j8980L7792l4667n301j22696l4646J80019n6800n7397n0558L7001
$$ y = [15935, 112838, 196783, 164889, 111197, -40605, -12287, 56219, 12524, -924, -46209, -87541, -5990, 35674, 60404, 32688, 8944, 39655, 2328, -75017, 11174, 5662, -81398, -40116, -64535, -10119, 115959, -1035, -49826, 14204, -9259, -18540, 19302, -12378, 8842, 94150, 37389, 4922, -22844, -20503, 22421, 103033, 11856, -73898, -144113, -72841, -10871, 36677, 13261, -42075, 50792, 89786, 73942, 43148, 53395, 83288, 71074, 71953, 154494, 130757, -3376, -63247, -20927, -43738, 82279, 108468, 48810, 107190, 43075, 51298, 140283, 99116, 84530, -260, 5627, 98982, 54252, 31440, -625, -30696, 4759, -2892, 53166, 16542, 86345, 79603, 60623, 98415, 63748, 58447, -64249, -98895, 81124, 24324, -33073, -83631, -46630]
1402d6630N1296p4627j0186N016O0065L6766M782j02799m5312N7245K5833R9122
1390F0571l1062r0509L6753j2933L3603K1688J24542L1716o5693j00386J1551
1379A9841P3769n5367k4210n5873n3282j9097m2759L7357J00221J40080l9055
1368H1625k22335N9079J00641J40980k3197j22866q654O3462L0673r7138J4863
1357A7133j00324K9941Q7778m6208n4855J70932r2908m3563N6668O2571j40499
1346e3334J9186r4410R1304P1747n4199M0118J1899O0417p4001M0653l1564o1885
1334c4069J2317m4915Q8522j3460p4592N3588j0401j3360p379O1393j18044k7959
1322a28359L9720J7542N8662J2018K25q987l2215O3061O5754q5288j0575L5832
$$ y = [-46630, 4666, -69961, -80147, -75131, -15066, 21700, 26482, -76317, -121629, -64384, -38551, 60571, 29509, -61000, -24247, -37180, -3577, 18111, 142653, 174369, 108676, 8290, 19841, 93610, 38243, 14033, -41840, -95122, -114219, -156978, -119621, -19400, 120680, 81625, -140710, -81631, 19010, 159990, 136793, 13927, 5273, 68735, 99408, 2270, 17133, -83191, -53250, 34528, -11680, -66535, 104397, 11489, -32074, 24594, 87165, -53334, -34148, -128558, -37254, 34493, -19706, 20412, 32311, 92728, 18727, 59380, 27816, -34069, -21752, -66667, 21855, 8395, -66197, -12609, -23010, -36370, -43749, 17644, -100400, -128359, -88639, -71097, -12435, -417, -192, -9179, -41394, 21667, 87421, 2133, -8442, 27390]
1310B7390o2082k9787l3190Q1040J31092j0681n9676M3243l0781N6417j2397k9873
1298G0715l3953L7129k4895l7193M1977K4564p7090n0745n1984M8570O8654l155
1286A2594n7544L0791J18459n691o6307q9692M1855M2803L0197l678n4183O2327
1274F1931n1540R010O2471j6753p8402m8771L6552K8017k5055N381j4111R1532
1262F0262j4490n6173J19774L7578k7901J7129j382j10242L1697P821q1075N2855
1250C5853j1136L1317k008o2880P2418L851p7742N5606j7373n4927P6233K0101
1238F9313p1220O3861l8078q2665O1619R2972j4555j13673j1731O1967j8678L638
1226B770O0057k8138M9674K4930j11514q5811J1784R5485j2046m9786L9620M4129
$$ y = [27390, -34692, -64479, -97669, -16629, 114463, 103782, 44106, 87349, 56568, 112985, 100588, 70715, 36762, 73891, 48996, 11803, 53780, 78344, 1254, -49491, -101475, -52905, 15749, 12594, -44950, -14159, 104300, 98609, 32302, -57390, -15535, 27268, 57465, 53787, -396, 61931, 10391, 19401, 81872, 65119, -13283, -62054, -25502, 2515, -22540, -17159, -31270, 60262, 45772, -10401, 109373, 146951, 119050, 136179, 134797, 24555, 56252, 64073, -17002, 35853, 24717, 56034, 54026, -8854, 63564, 67415, -10327, 45279, 27906, -27021, 49212, 69313, -1907, 61954, 23876, -58789, 2830, 95802, 81247, -32426, -44157, 17810, -868, 2770, 62827, 34689, 84363, 109293, -2221, -88032, -76248, 19237, 7191, -42595, -2975, 41154]
1214D1154L6150j23072l8492O8143P1679N65j2834j6722j7974J2224j127l4161
1202a4467j5160o3803R6220J344J98L0725L0596j55127k2270Q0884k4705o7792
1190a23357j7513R0183P8981j20128N0706R9340O6937L245j94467p8582J07918
1179c6737O1046l479P1960m525M0743K370j43535R976O5970j4185N1822m5790
1167E5636L221n0903q869k914O6981O5133q8761N3484J6199q1961j8040m9605
1155d0399J0322O8867L9560o9375n7293k565K6299L0227n186n4916J1526J3587
1143b9346K561O1153K834R4154p1765o4393J03755p1430J7607n7980o8339O8215
1131a2974o661O5781j51366J2237M757Q188R163M7560J8720l323O0412l9562l1144
$$ y = [41154, 77304, -45768, -84260, -16117, 55562, 56127, 43293, 26571, 8597, 20821, 19694, -14467, -29627, -93430, 2790, 4134, 4332, 35057, 65653, -89474, -111744, -30860, -55565, -123357, -140870, -50687, 28294, -91834, -41128, 58212, 125149, 128394, -66073, -144655, -36737, 24309, 20830, 92790, 88265, 129008, 131378, -12157, -2181, 63789, 49604, 101426, 55636, 58857, 7954, -915, -3829, 63152, 128285, 39524, 93008, 109207, 27246, 9206, -40399, -30077, 38790, 78350, 8975, -48318, -50883, -24584, 5643, 457, -54459, -42933, -29346, -26785, 34368, 37202, 131356, 59591, -4802, 98953, 27523, 45130, -12850, -81189, -12974, -19635, 46146, -105220, -92983, -88226, -80038, -70875, -23315, -4595, -7918, 52494, 12932, -18212]
1118a8212m1937L2635K5586l345j6013P807k8195J45499r5718n2383q146R8072
1106D5650O1161o0101l0715n5266M4538j4196j0921J6954N7071m3225K2291Q4173
1094A17414j24148k9842N7289p1696o8841J10949r689M1382R0095l0824j47268
1083f5179k8224K7346O8974l7705L7395P3777m4478K8130q5084M0532o938p4570
1071f6024J09653l9858q1762O8056N4804j4552o7015q072k1221M601L8175j0272
1059c3487N5157r5336p329R6505n0547j4395m5091J2440J0796M2748L4739M5810
1047E2010M5270p4694N6616j19189l6504j2186j689j0306N8632J27301l619j36
1035H1506l3169k5722m2536m044j3417R4322j9975k0173k1997P3323m8597o0691
$$ y = [-18212, -60149, -27514, -1928, -5273, -21286, -13479, -41674, 103825, 8107, -44276, -52422, 45650, 106811, 46710, 15995, -39271, 5267, -8929, -19850, -2896, 54175, 10950, 33241, 117414, -6734, -36576, 20713, -50983, -119824, -8875, -18564, 22818, 112913, 82089, -65179, -93403, -66057, 2917, -34788, 2607, 76384, 31906, 60036, -25048, 15484, 8546, -66024, 43629, 3771, -77991, -9935, 44869, 30317, -36698, -44770, -65991, -61390, -23215, -33487, 21670, -73666, -80995, 15510, -35037, -49432, -94523, -82083, -71287, -28539, 6200, 52010, 97280, 22586, 79202, -39987, -76491, -88677, -90366, -100672, -42040, 85261, 81642, 81506, 48337, 22615, -19921, -23965, -37382, 56940, 36965, 16792, -5205, 68118, 19521, -41170]
1023d1170M9938K0451k7471k0381j20163M5733J42055m7466K6196Q4735j69488
1012e7031q4239L2597N9985r783k1638J898l5301J38003j9295p9379L646M3433
1000b7104m2943l2486N3885N5596R9957r4362l5798J06928j3525Q3794q4758r6276
988b7092J5257j52858J5173J75666m0810o0102K8962j1344P8137J9589j4762m9481
976b3665J3058R1225m7838o2164m4825R7893J16597j34917n5055j553R4868k9332
964A4292n9816K9038j330K7282J00540M7380j49869N464M2024j65834L3273R077
952f8479l5793M5720Q1953M6519j19304J10739q1833l2193J08879j3429q7122
941d4343n8379Q5762R768L6033K5900j17113l7171O6961Q1522r1130M9882l928
$$ y = [-41170, 8768, 29219, 1748, -18633, -138796, -93063, 48992, 1526, 27722, 112457, -57031, -141270, -108673, -48688, -58471, -80109, -78211, -113512, 24491, 5196, -74183, -70537, -27104, -70047, -102533, -48648, 6948, 106905, 12543, -23255, 83673, 70148, 153942, 69184, -27092, -11835, -164693, -149520, 26146, -14664, -74766, -45804, -57148, 20989, 40578, 25816, -23665, -10607, 80618, 32780, -29384, -74209, 23684, 140281, 5364, -49691, -51244, 43624, 14292, -45524, -16486, -17816, 9466, 110006, 157386, 7517, 12981, 55005, -110829, -77556, -68479, -104272, -58552, 23401, 69920, -49384, 61355, -20478, -52671, 56208, 42779, -44343, -102722, -16960, -7192, 28841, 54741, -62372, -99543, -32582, 48940, -42190, 7692, 3764]
929C764M2045J1390J2769J2278n4350r128J0629L469n6813J7800Q4473L2816j54396
916d3254J01879p9641n4302J10882J0395l587M8650j03237J8306K5516q4966N702
904d7657O883m2392L7761p5679Q424J07208O3736p2517k8927R6230l9391Q8372
892A02051m3965l7302n433j9785O9683n6693n4069k8933N8038j2017m7547M4196
880c1776k2189j2651J8240O1438M2895K9594j8020k1760O214K2900J295K6977
868A03157J4943m9037o3112j1599p4695m210N2317K2694o8403J8493q9104J18099
856c0457K6132O2767j23400j7820M0593j4006m4754j1535J25074n1625K5226M825
844h980r805k0603l0213K9499O7412O9729m3735j11006K4983O6836L9642J3157
$$ y = [3764, 45809, 57199, 69968, 82246, 27896, 18768, 29397, 32866, -23947, -6147, 78326, 111142, -43254, 58625, -21016, -75318, 35564, 45959, 42372, 91022, -12215, 6091, 31607, -53359, -47657, -40774, -83166, -45405, -121084, -112660, -5452, 58284, -14233, -43160, 53070, 13679, 102051, 58086, 20784, 15351, -4434, 65249, 8556, -45513, -74446, -16408, -28425, -75972, -31776, -53965, -66616, -48376, 13062, 55957, 85551, 67531, 45771, 51985, 74885, 76180, 103157, 118100, 69063, 5951, -5648, -80343, -84553, -32236, -9542, -77945, -59452, -148556, -30457, -4325, 58442, -64958, -82778, -42185, -56191, -100945, -112480, 12594, -39031, -13805, -8980, -18785, -39388, -69601, -40102, 27310, 97039, 53304, -57702, -32719, 34117, 73759, 86916]
832H6916p574j06611j9249n4579J8783k2616M6415k6435M06M7740L0023M3008
820C6227q8787O1910M7675N743O547K2421j37965L6039j3838J7943P7606j58024
808h6503N2264O7015n6343R3175r802J1289O5120j05726n3042P6350p7927k7897
796e2027O3479K9932n2496n9792J29395j8882K622q2458k8339R0588k6312p8929
784h3219O4609N3688L1732j35382R7910l6293k8149r899J06237j21689j34360
773a94815N6354J19846J11108l3545Q546q6450N8707J494k7270L5499p184j43136
761a00846n7940Q6804N6057j1158Q9876j24042q0839j7549O2306J8005o182M8004
749c7504p4441K6666K9413R6781n517q2541K525J1315q3105J13498k386J172J0229
$$ y = [86916, 79342, -27269, -46518, -101097, -82314, -104930, -58515, -84950, -84544, -36804, -6781, 36227, -52560, 9350, 57025, 62768, 69315, 91736, -46229, -10190, -24028, -6085, 71521, -86503, -34239, 32776, -23567, 69608, 59806, 71095, 136215, 30489, -22553, 53797, -24130, -52027, 11452, 41384, -11112, -70904, 58491, 39609, 42231, -40227, -68566, 22022, -4290, -83219, -18610, 35078, 66810, -68572, 29338, -6955, -35104, -45003, 61234, -60455, -194815, -138461, -18615, 92493, 58948, 67494, -18956, 39751, 41245, 13975, 49474, 42290, -100846, -158786, -71982, -15925, -27083, 62793, -61249, -142088, -159637, -97331, -79326, -85508, -37504, -111945, -85279, -55866, 40915, 35398, -47143, -44618, -33303, -116408, -2910, -5296, -4124, 6105]
736F105l9189k7177o1485M7233K2214L2272L9413k1910k1946O8654m801M8744
724H8127J04j40124P265o689p014J2559P0056l0450M9692k3421j18631R0712P2340
711F4526j45177Q626P193o2923L9489P8734L4390n8304K1805m3186k6430K3525
699e7732j3974M12M1239q7710Q6222J7527l5052o1654K6120m1876L9575K3463
687f3440J0689J5235P6603O9864j79813L6154Q8140L4106j6473o917l6670J9652
675D7130k8253j49313M0366Q3410o7846m4388J805L2869L2778k7997K5464N1917
663b058J26365j3412j20053n3942P1641k362M5179o1649M1629r1614N0589J2062
651B375j1953j3875l3296o3199R0997O8581n1081L2834J2761j8519q8953R5019
$$ y = [6105, -33084, -60261, -121746, -74513, -52299, -20027, 19386, -2524, -24470, 44184, 39383, 88127, 88231, -51893, -44628, -51317, -58331, -45772, 24284, -6166, 43526, 20105, -98526, -7814, 64526, -80651, -72025, -64832, -127755, -88266, -9532, 24858, -33446, -11641, -54827, -81257, -57732, -71706, -71294, -30055, -117765, -31543, -14016, -49068, -110722, -84602, -126478, -86903, -63440, -52751, -37516, 39087, 108951, -70862, -34708, 53432, 87538, 71065, 64148, 27478, 47130, 18877, -130436, -90070, -6660, -74506, -118894, -117089, -84220, -51442, -79439, -53975, -2058, 124307, 110895, -9158, -63100, 8541, 6179, 51358, -10291, 31338, -60276, -9687, 2375, -9578, -23453, -56749, -119948, -28951, 39630, -11451, 21383, 34144, 15625, -73328, 21691]
639B1691J31843r3732j46194L1038R3631j39804q0473p933J64270J62471n5732
628H1076r0158j00591K8975J516O4103M6588K8121n3467j2440O9827o0544k5702
616b2696L603r5660k4437M4780J00236m4627L2818j5439o2383m7996J18248P4596
604F1043q818P1188q9468j02686J26117l4832j1030Q87J7235J0795n7318j2177
592b9064J0271l7415L9477j8885k7275l874L4619Q4924j13990m3667j0150K9162
580h5867Q3871l8965k019l3717J30062K4453L8084q7848J3324L9385j9258n7517
568C988k8735L5676K9426O1376j7078k7680q2217J4389m0735q772J3584R8877
556E2099N1260m1056O1585j57364p4695O4285M8939l4985J5614O5756m2202o0358
$$ y = [21691, 153534, 59802, -86392, -55354, 38277, -101527, -182000, -189933, -25663, 136808, 81076, -9082, -109673, -80698, -79182, -15079, 31509, 59630, 6163, -6277, 63550, 3006, -22696, -19093, -114753, -139190, -94410, 5826, -38801, -5983, -21422, -83805, -131801, -13553, 61043, 52225, 123413, 33945, -68741, 57376, 22544, 11514, 12401, 29636, 40431, -16887, -29064, -18793, -56208, -16731, -35616, -62891, -66765, -32146, 52778, -61212, -104879, -115029, -85867, -1996, -40961, -42980, -76697, 53365, 77818, 115902, 28054, 41378, 80763, 61505, 3988, -24747, 10929, 40355, 101731, 84653, 56973, -25244, -10855, -51590, -60362, -46778, 52099, 103359, 62303, 123888, -33476, -108171, -43886, 5053, -29932, -14318, 51438, 9236, -51122]
544e1122L0879p7909n0429J07559n2467J16804K3213p7607k0790Q497o6540k4532
532a34444L2265k8838K3496R3277M7311j04134k8099J6125K9959m505L6789J12333
520I1535l2944o1310O0920O8804j40797M0096m8030j03048J4240L6586L7360M05
508c6183J08194m3101K3124p2802K7225K3100m7508j3234M9493q2138q8779J5271
496a37338j3394J15597J6185J1067k0328j1231N205J26585j03907j17791K8392
485a00958J15897j8391r2982L7209J27433j56565M755K7815Q0138k1895k5718
474b3262m3716k3205P7160r70n6140j2041J44676k2021k1193R0221k1574m2457
462D5478o6992N8447L1806L1220N6421j63497k9406O7536q2250n4341l5477m2980
$$ y = [-51122, -20243, -98152, -148581, -41022, -93489, 23315, 46528, -31079, -51869, -43372, -109912, -134444, -102179, -131017, -107521, -14244, 33067, -71067, -99166, -83041, -53082, -57587, -20798, 91535, 58591, -2719, 58201, 127005, -13792, 26304, -21726, -124774, -110534, -73948, -36588, -36183, 72011, 28910, 52034, -20768, 6457, 29557, -17951, -31185, 18308, -63830, -152609, -137338, -150732, -35135, -18950, -7883, -28211, -39442, -34237, 92348, -11559, -129350, -100958, 14939, -3452, -96434, -59225, 68208, -88357, -83602, -55787, 24351, 2456, -23262, -66978, -90183, -13023, -13993, -70133, -82174, 62502, 40481, 19288, 109509, 87935, 45478, -21514, 36933, 68739, 99959, 156380, -7117, -36523, 31013, -51237, -105578, -141055, -184035]
450a84035J38424L9206J8522m7108J2455m2598M7746L1013k3418M1151j14099
439h2741q472J33659n3028j42845K9388j491K3337Q9112j10327N3370J41911q6659
427a4786m2942M1860O8440j17685L9391O5296q5190K3883k2822l8113l8220M0352
415h0536k369P824j1970j8173j8395O5595L7499r1643L1352r229j0665K5176L6809
402c8725k8153K3981M172j9824Q7180j8562j176K4956L355l0239L82o9511l9209
389a01373J8679k7629K1791p4257N0534O2252R3567m2126o0497K7800M035J8328
377h896J6025m1117p0209l3072M7407N9448k1621J7163q0425M6536l0518J7175
365h2104J6203L7265m5699L4867k1583L6366K0346K8371l4130J5582r0106K6378
$$ y = [-184035, -45611, -6405, 12117, -34991, -22536, -65134, -17388, 13625, -9793, 31358, -82741, -91213, 42446, -10582, -153427, -124039, -125530, -102193, -13081, -123408, -70038, 71873, -14786, -57728, -15868, 52572, -65113, -25722, 39574, -45616, -21733, -44555, -82668, -120888, -80536, -82905, -75081, -87051, -105224, -123619, -58024, -20525, -112168, -80816, -90045, -100710, -75534, -38725, -66878, -42897, -38725, -58549, 28631, 10069, 8893, 33849, 37204, 6965, 7347, -62164, -101373, -82694, -110323, -88532, -162789, -112255, -50003, 43564, 1438, -59059, -31259, -27224, -8896, 7129, -33988, -104197, -137269, -89862, -30414, -52035, -34872, -115297, -68761, -99279, -82104, -65901, -28636, -74335, -39468, -61051, -24685, -4339, 24032, -10098, 5484, -84622, -58244]
353e8244J19804O64j6688O6852r4088p2765M2472m8346J7716j29236J5726Q4236
341g1897M7886Q0647j49130l1159P3872l9940l8938L7404L9268j4338j1192M305
329g3212K887m4789J9778k0482j20909M3864J8337L3298P0806O790L8349r2154
317a17437P329p4505O8647J15328l418r378R7740L1030p8596J5236r766k5909
305A6301l9478m1324L4155N324K1144M9291o4907r0610K0840Q2104K67L2595q6852
292f1150J7139j2316m2912J13579k9452RL6333O0065q2805j6991N185o8168n1201
279a32685L6173m7254k3824n0028J6511O107J18874N5465N351j6217n4072K8080
267e7519l5248k5319N2045L9289J963J3577k1537m2077O5285M813k3372j8459
$$ y = [-58244, 61560, 62224, 45536, 112388, 18300, -54465, -11993, -60339, -42623, -171859, -156133, -71897, -24011, 56636, -92494, -123653, -49781, -89721, -128659, -91255, -51987, -66325, -77517, -73212, -70325, -115114, -95336, -115818, -236727, -192863, -174526, -141228, -70422, -63632, -25283, -117437, -110108, -184613, -115966, -638, -4056, -13434, 84306, 115336, 36740, 51976, 42210, 16301, -23177, -64501, -30346, -25022, -3878, 45413, -19494, -110104, -89264, -7160, -6893, 25702, -61150, -44011, -56327, -99239, 14340, -15112, -15103, 21230, 81295, -1510, -18501, -13316, -81484, -132685, -96512, -143766, -167590, -217618, -201107, -195000, -76126, -20661, -15310, -31527, -85599, -57519, -92767, -118086, -66041, -26752, -24789, -11212, -32749, -74826, -9541, -4728, -28100, -46559]
255d6559l9714j196R8500n2925n1189M5482o2672k7969J07193Q3298k9248j25658
243a02657N0812k9044J9249j5275L9268p0045O6817M8593Q8066n1554j65248O8727
231e2291j7702j01304P29J23456n8447n475J4545k0998o2415k7543J23997j171
219h4619L0140R9047j8296Q06l5799J2234k0831M761J2815l1484q5959N4441n0613
206a13357J6272p618O571M561j8320K7482N0480m8277j2055M2332n3658R471R7921
193A805j27122Q8663r0214J5741J23948n5186r859N8210k3412J4731k227m4403
181d9325J1803l8001n1915J25840j0875r749m6570N6506N7656j20796l4746l9899
169a50071j8423j9197N0425R5715L7713O4175n6235m1424M2502k9354q9481m230
$$ y = [-46559, -86273, -87469, 11031, -41894, -93083, -47601, -110273, -138242, -31049, 52249, 23001, -102657, -51845, -80889, -61640, -76915, -37647, -107692, -40875, 7718, 95784, 44230, -121018, -52291, -69993, -171297, -170568, -47112, -105559, -111034, -96489, -117487, -179902, -207445, -83448, -84619, -54479, 44568, 26272, 27078, -8721, 3513, -17318, -12557, 258, -31226, -117185, -62744, -113357, -97085, -104703, -98132, -93571, -111891, -84409, -33929, -82206, -94261, -51929, -105587, -96116, 1805, -125317, -36654, -126868, -111127, 12821, -42365, -52224, 5986, -17426, -2695, -4922, -49325, -37522, -75523, -127438, -1598, -12473, -22222, -68792, -12286, 45370, -75426, -110172, -150071, -168494, -187691, -137266, -41551, -3838, 60337, 4102, -37322, 5180, -24174, -113655, -117885]
157a17885N0996k0618j1262O1089L4232j07238P6789o8137K3612O2229K7503m7466
145c6156k3645J05593J9405Q3296j40203m6420j137n5336l2900N9004P307R815
133e1377k0160P435M9069m4353k737J7925r801l8879O0885j7363J338R64K7295
120a9759k5943m8105r4979k5826N1703M0999j1833O4952M0570O6998j1719k1826
108E232o6906j3779q3782L5858N0452j6235j5616M757M4413J2131J6961l0478
96e6992K6403l240K6592k2940M4425j2441m9486k9127l3930l0532j6884Q9671
84f8481j6634r2432J4818N4135q2602p919N5837M9962j3391L7132p4697Q0011
72f4261N9702j9352m1570K0263L7643k7306N193n9333l7230K5052R0759q5335
$$ y = [-117885, -66889, -87507, -98769, -37680, -3448, -110686, -33897, -102034, -78422, -16193, 11310, -36156, -59801, 45792, 65197, 148493, 8290, -38130, -39267, -94603, -127503, -68499, -61192, -51377, -71537, -64102, -15033, -59386, -62123, -44198, -53999, -92878, -31993, -49356, -48018, -47054, -19759, -45702, -93807, -188786, -214612, -162909, -121910, -133743, -68791, -28221, 38777, 27058, 5232, -61674, -75453, -159235, -123377, -72925, -89160, -104776, -100019, -55606, -43475, -26514, -56992, -30589, -33829, -7237, -30177, 14248, 1807, -47679, -76806, -110736, -141268, -158152, -68481, -85115, -177547, -162729, -108594, -191196, -199115, -143278, -93316, -106707, -69575, -144272, -64261, -4559, -23911, -65481, -45218, -7575, -34881, -29688, -89021, -126251, -101199, -10440, -95775]
60i5775k4923K3272j7764K8109m7781O6869M1969j10853L7999j3212J3096K0928
48g8066p018N5546J786J5219J5603K8557L5945O77l8472J1176n0289k9189J1272
35b7253N401j4086p9842L0508M7515p187J0418J9380k2825k7919N053L4250n2487
22g9074n1716L3714L3125J8033N501m9722j558p7296L137K8938K324j7702P1035
9h1261K5494M4320j8445p565m7123K512j5294k272O0423
0c9211
$$ y = [-95775, -120698, -97426, -115190, -87081, -134862, -67993, -26024, -136877, -98878, -112090, -98994, -78066, -85084, -29538, -27752, -12533, 3070, 31627, 67572, 68249, 29777, 40953, -9336, -38525, -27253, -21852, -35938, -115780, -85272, -37757, -44944, -34526, -15146, -37971, -65890, -60837, -26587, -79074, -130790, -97076, -63951, -45918, -40417, -90139, -91697, -168993, -165856, -136918, -134594, -152296, -81261, -55767, -11447, -29892, -37457, -84580, -82068, -97362, -99634, -39211]
$$ Imaginary data points
##PAGE= N=2
##DATA TABLE= (X++(I..I)), XYDATA
16383a917013L4834N0333K7964N8924j6860o129n005k5352J32304K0595m7587
16372a692992M1168N4712J8898L0294L2500N2689j8399L207J29623O0561n9098
16361a346837K8115k7703j648M3089R9505J7081n514K9714P0123R408p2384J1348
16349a145703R1713M09L0657K7177J2922J422M8097M9667N5835n8000o39O1058
16337h25385n191O5229N7113q7033k4979K6325R7183P5182k7879k2738m4067R956
16325g06284P6763P7070J06671K8407J9779p443p286P4983j02072o4250P5098
16314d28564Q4794j7054J1031L5353L2969j8160j0672O2513K367j2922k023M882
16302b55486J26243J6237L1259k6066Q234Q401J19365J9725q840R735Q9636j03379
$$ y = [-1917013, -1882179, -1831846, -1803882, -1744958, -1761818, -1767947, -1772952, -1798304, -1666000, -1645405, -1692992, -1651824, -1597112, -1578214, -1547920, -1515420, -1462731, -1481130, -1477923, -1348300, -1287739, -1346837, -1318722, -1346425, -1348073, -1304984, -1205479, -1188398, -1193912, -1164198, -1094075, -1084667, -1157051, -1145703, -1053990, -1053581, -1022924, -995747, -982825, -981403, -933306, -883639, -827804, -885804, -886443, -825385, -830576, -765347, -708234, -795267, -820246, -793921, -696738, -621556, -649435, -672173, -716240, -706284, -629521, -552451, -445780, -417373, -397594, -405037, -412323, -337340, -439412, -503662, -428564, -343770, -360824, -349793, -314440, -281471, -299631, -310303, -247790, -245423, -258345, -260368, -255486, -129243, -113006, -81747, -107813, -99579, -91178, 28187, 47912, 39072, 48807, 138443, 35064]
16290C5064J708N6095k5144Q337Q991l4002M3883J58522l4099r373p3941K3956
16278A59997J3742K5275R8464N2335L8409K3629k9839J8327l0970l5089R4829
16267D29109j0599P7242K4738k233J0259L4253j7933o8284M9765R3794M441k7306
16255E97246O9272l0219P3290o9927k9336J07570j0401K6332m757J04023N8881
16244H91974j01737p525P1002r117j0760j6262K4950k0452n0746r908J79413L9133
16232I79965j04018L187P1851l714k074J3952Q74N3924l2488k0901K1450k0643
16220I61365j9108J22655M0172n8329k8546M0704O7664M0345q0987p1189M7334
16209A062080P4768j6537J3569O1204N5711L16K265o9579J9904l5904L4379p0709
$$ y = [35064, 36772, 92867, 67723, 76060, 85051, 51049, 94932, 253454, 219355, 209982, 136041, 159997, 173739, 199014, 297478, 349813, 388222, 411851, 382012, 400339, 369369, 334280, 429109, 418510, 495752, 520490, 518257, 528516, 562769, 544836, 476552, 526317, 620111, 624552, 597246, 666518, 636299, 709589, 639662, 610326, 717896, 707495, 733827, 729070, 833093, 891974, 790237, 782712, 853714, 844597, 833837, 817575, 842525, 822073, 771327, 761419, 940832, 979965, 875947, 879134, 950985, 947271, 945197, 959149, 960023, 1013947, 981459, 960558, 982008, 961365, 942257, 1064912, 1105084, 1046755, 1018209, 1058913, 1126577, 1166922, 1085935, 1014746, 1062080, 1136848, 1120311, 1133880, 1195084, 1250795, 1251111, 1253376, 1183797, 1203701, 1167797, 1202176, 1131467]
16197A131467j9782M3059Q9312o246m5472n0141n789N0041J15000L311M039q419
16185A300380J3122N3053p0757M8124K8587P707m6193R1422j3144l8236J2950
16174A387015n667J8128K6666l8376J4445j45904k7421O2841J52055M8992J7115
16163A509889j09155N6988Q2724j62553r6754m3644J74033O6148P8394l5713J12338
16152A632695j55300j20265P8062L8443k209R758l4703N5152J48713k3536l2697
16141A594113m7127n6497M1826J0369R537P1920K3147q323m2518l2530M9384m8949
16129A564352q8166L4619N1647M0054l6513O5858Q4044o0159q0107k5762J00406
16118A650273J37419j45759o8716L0599M3258R2674m3200m7752O9257k5585J3320
$$ y = [1131467, 1111685, 1154744, 1244056, 1237810, 1192338, 1142197, 1136408, 1186449, 1301449, 1304760, 1308799, 1300380, 1313502, 1366555, 1295798, 1343922, 1372509, 1380216, 1334023, 1425445, 1412301, 1374065, 1387015, 1381348, 1399476, 1426142, 1387766, 1402211, 1256307, 1228886, 1291727, 1443782, 1492774, 1509889, 1400734, 1457722, 1540446, 1377893, 1281139, 1237495, 1411528, 1477676, 1556070, 1520357, 1632695, 1477395, 1357130, 1435192, 1473635, 1471426, 1481184, 1446481, 1501633, 1650346, 1626810, 1594113, 1546986, 1490489, 1532315, 1542684, 1552221, 1624141, 1647288, 1638965, 1596447, 1563917, 1613301, 1564352, 1476186, 1510805, 1562452, 1602506, 1565993, 1631851, 1715895, 1655736, 1575629, 1549867, 1650273, 1787692, 1641933, 1573217, 1603816, 1647074, 1739748, 1696548, 1648796, 1718053, 1692468, 1705788]
16107A705788j7606K7527J21866j21921j53584J9979N5010J13J7403M4294L5810
16096A734679M9722r5332o5131l9325M2052K9999o4119r342L4445l5078N0705
16085A633275k6469k851M3569p6530j5620J00157O6791l1996k9629O4991j19070
16074A606618M8303Q8158l3670k2310l7994m4619r580O5646o2226J16217P9790
16063A794333k9446o6782p7653P5984N1010k7892J1995j22783M3094Q1983k7879
16052A705964j749P7514l3023P42L5649n6219j2075r7425j1634J61844l2968o3444
16040A673176O6435J00230m9772j00876L5776j041k6927K291K0538j9492j28757
16029A571581R0697J01414N97j16153Q599M4220J3606M7159K3116k8114Q222j8948
$$ y = [1705788, 1688182, 1715709, 1837575, 1715654, 1562070, 1582049, 1637059, 1637172, 1654575, 1698869, 1734679, 1784401, 1689069, 1623938, 1584613, 1626665, 1656664, 1592545, 1583203, 1617648, 1582570, 1633275, 1606806, 1603955, 1647524, 1570994, 1555374, 1655531, 1722322, 1690326, 1660697, 1725688, 1606618, 1654921, 1743079, 1709409, 1687099, 1649105, 1604486, 1594906, 1660552, 1598326, 1714543, 1794333, 1764887, 1698105, 1620452, 1696436, 1747446, 1719554, 1731549, 1608766, 1651860, 1733843, 1705964, 1704215, 1781729, 1748706, 1749448, 1785097, 1728878, 1716803, 1619378, 1607744, 1769588, 1736620, 1673176, 1739611, 1839841, 1790069, 1689193, 1724969, 1723928, 1697001, 1699292, 1719830, 1700338, 1571581, 1662278, 1763692, 1764289, 1648136, 1656735, 1700955, 1714561, 1761720, 1784836, 1756722, 1764944, 1745996]
16017A745996L244N4462m2871m9283L6932K6975n3775K0387q332P1567P096n8887
16005A753511n3976L6061N7667K9217j93019M8451J9851J5984L9341o1315K8983
15994A720756o0578p01m3071M7562N0323l2591n705N7325J27502m5331j01288
$$ y = [1745996, 1749240, 1803702, 1760831, 1711548, 1748480, 1775455, 1721680, 1742067, 1733735, 1805302, 1812398, 1753511, 1699535, 1735596, 1793263, 1822480, 1629461, 1677912, 1697763, 1713747, 1753088, 1691773, 1720756, 1660178, 1659477, 1616406, 1663968, 1714291, 1681700, 1675995, 1733320, 1860822, 1815491, 1714203]
$$ [...]
##END NTUPLES=NMR SPECTRUM
##END=
