##TITLE=1H_EC-3289(11)
 CDCl3
 8 sc, 
 23.1.2023
##JCAMPDX= 6.0         $$ Bruker NMR JCAMP-DX V2.0
##DATA TYPE= NMR SPECTRUM
##DATA CLASS= NTUPLES
##ORIGIN= UXNMR, Bruker Analytische Messtechnik GmbH
##OWNER= root
$$ XWIN-NMR		Version 3.5
$$ Mon Jan 23 14:32:29 2023 Russian Standard Time (UT+4h)  she@DPX200
##.OBSERVE FREQUENCY= 200.13135
##.OBSERVE NUCLEUS= ^1H
##.ACQUISITION MODE= SIMULTANEOUS
##.ACQUISITION SCHEME= undefined
##.AVERAGES= 8
##.DIGITISER RES= 18
##SPECTROMETER/DATA SYSTEM= spect
##.PULSE SEQUENCE= zg30
##.SOLVENT NAME= CDCl3
##.SHIFT REFERENCE= (INTERNAL, CDCl3, 0, 15.7447)
##AUDIT TRAIL= $$ (NUMBER, WHEN, WHO, WHERE, WHAT)
$$ ##TITLE= Audit trail, XWIN-NMR		Version 3.5
$$ ##JCAMPDX= 5.01
$$ ##ORIGIN= Bruker BioSpin GmbH
$$ ##OWNER= she
$$ F:/spectra/data/she/nmr/H-F/1/pdata/1/auditp.txt
$$ ##AUDIT TRAIL=  $$ (NUMBER, WHEN, WHO, WHERE, WHAT)
(   1,<2023-01-23 14:31:06.14 +0400>,<she>,<DPX200>,
      <created by zg, POWCHK disabled, PULCHK disabled
       configuration hash MD5:
       00 E9 B6 7A A2 85 ED C7 34 08 36 98 17 FE 4E 26
       data hash MD5: 16K
       F1 0A 34 FA 22 77 EF 19 B7 6A CB B4 D4 AA B6 FE>)
(   2,<2023-01-23 14:31:08.46 +0400>,<she>,<DPX200>,
      <Start of raw data processing
       efp BC_mod = 2 LB = 0.24 FT_mod = 6 PKNL = 1 PHC0 = -19111.95 PHC1 = 12.20079 SI = 16K 
       data hash MD5: 16K
       86 95 61 88 61 AD A4 B2 17 B9 31 F4 A1 3C 51 EB>)
(   3,<2023-01-23 14:31:27.90 +0400>,<she>,<DPX200>,
      <pk PHC0 = -0.7737539 PHC1 = 0.2 
       data hash MD5: 16K
       1B DF 5A 98 A2 93 DF 6D E7 32 04 B8 6F DA 6E 4E>)
(   4,<2023-01-23 14:31:31.32 +0400>,<she>,<DPX200>,
      <abs ABSG = 5 
       data hash MD5: 16K
       E1 C6 0B 06 CF 1F 4C BD 98 46 B7 19 23 60 20 8D>)
$$ ##END=
$$ 
$$ hash MD5
$$ BA CC 15 5E 4F 1B 53 42 E5 FD 2F 76 5F 45 4B 3F
##$RELAX= 
##$RELAX= 
##$RELAX= 
##$RELAX= 
##$RELAX= 
##$RELAX= 
$$ Bruker specific parameters
$$ --------------------------
##$DU= <F:/spectra>
##$EXPNO= 1
##$NAME= <H-F>
##$PROCNO= 1
##$TYPE= <nmr>
##$USER= <she>
##$AMP= (0..31)
100 100 100 100 100 100 100 100 100 100 100 100 100 100 100 100 100 100 
100 100 100 100 100 100 100 100 100 100 100 100 100 100 
##$AQSEQ= 0
##$AQ_mod= 1
##$AUNM= <au_zg>
##$AUTOPOS= <>
##$BF1= 200.13
##$BF2= 200.13
##$BF3= 200.13
##$BF4= 200.13
##$BF5= 200.13
##$BF6= 200.13
##$BF7= 200.13
##$BF8= 200.13
##$BYTORDA= 1
##$CFDGTYP= 0
##$CFRGTYP= 5
##$CHEMSTR= <none>
##$CNST= (0..31)
1 1 145 1 1 1 1 1 1 1 1 1 1 1 1 1 1 1 1 1 1 1 1 1 1 1 1 1 1 1 1 1 
##$CPDPRG= <>
##$CPDPRG1= <>
##$CPDPRG2= <>
##$CPDPRG3= <>
##$CPDPRG4= <mlev>
##$CPDPRG5= <mlev>
##$CPDPRG6= <mlev>
##$CPDPRG7= <mlev>
##$CPDPRG8= <mlev>
##$CPDPRGB= <>
##$CPDPRGT= <>
##$D= (0..31)
0 1.2 0 0 0 0 0 0 0 0.06 0 0.03 0 0 0 0 0.0002 0 0 0 0 0 0 0 0 0 0 0 0 
0 0 0 
##$DATE= 1674469865
##$DBL= (0..7)
120 120 120 120 120 120 120 120 
##$DBP= (0..7)
150 150 150 150 150 150 150 150 
##$DBP07= 0
##$DBPNAM0= <>
##$DBPNAM1= <>
##$DBPNAM2= <>
##$DBPNAM3= <>
##$DBPNAM4= <>
$$ [...]
##$SUBNAM3= <"">
##$SUBNAM4= <"">
##$SUBNAM5= <"">
##$SUBNAM6= <"">
##$SUBNAM7= <"">
##$SUBNAM8= <"">
##$SUBNAM9= <"">
##$SW= 18.05172834244
##$SWIBOX= (0..15)
0 0 2 0 0 0 0 0 0 0 0 0 0 0 0 0 
##$SW_h= 3612.71676300578
##$TD= 16384
##$TD0= 1
##$TE= 0
##$TE2= 300
##$TE3= 300
##$TEG= 300
##$TL= (0..7)
0 120 120 120 120 120 120 120 
##$TP= (0..7)
150 150 150 150 150 150 150 150 
##$TP07= 0
##$TPNAME0= <>
##$TPNAME1= <>
##$TPNAME2= <>
##$TPNAME3= <>
##$TPNAME4= <>
##$TPNAME5= <>
##$TPNAME6= <>
##$TPNAME7= <>
##$TPOAL= (0..7)
0.5 0.5 0.5 0.5 0.5 0.5 0.5 0.5 
##$TPOFFS= (0..7)
0 0 0 0 0 0 0 0 
##$TUNHIN= 0
##$TUNHOUT= 0
##$TUNXOUT= 0
##$USERA1= <user>
##$USERA2= <user>
##$USERA3= <user>
##$USERA4= <user>
##$USERA5= <user>
##$V9= 5
##$VALIST= <valist>
##$VCLIST= <CCCCCCCCCCCCCCC>
##$VD= 0
##$VDLIST= <DDDDDDDDDDDDDDD>
##$VPLIST= <PPPPPPPPPPPPPPP>
##$VTLIST= <TTTTTTTTTTTTTTT>
##$WBST= 1024
##$WBSW= 4
##$XGAIN= (0..3)
0 0 0 0 
##$XL= 0
##$YL= 0
##$YMAX_a= 268464
##$YMIN_a= -381849
##$ZGOPTNS= <>
##$ZL1= 120
##$ZL2= 120
##$ZL3= 120
##$ZL4= 120
##$ABSF1= 15.74909
##$ABSF2= -2.302759
##$ABSG= 5
##$ABSL= 3
##$ALPHA= 0
##$AQORDER= 0
##$ASSFAC= 0
##$ASSFACI= 0
##$ASSFACX= 0
##$ASSWID= 0
##$AUNMP= <proc_1d>
##$AZFE= 0.1
##$AZFW= 0.1
##$BCFW= 0
##$BC_mod= 2
##$BYTORDP= 0
##$COROFFS= 0
##$CY= -3
##$DATMOD= 1
##$DC= 0
##$DFILT= <>
##$DTYPP= 0
##$F1P= 0
##$F2P= 0
##$FCOR= 1
##$FTSIZE= 16384
##$FT_mod= 6
##$GAMMA= 0
##$GB= 0
##$INTBC= 1
##$INTSCL= 3.70164e-10
##$ISEN= 128
##$LB= 0.24
##$LEV0= 0
##$LPBIN= 0
##$MAXI= 10000
##$MC2= 0
##$MEAN= 0
##$ME_mod= 0
##$MI= 1.114404
##$NCOEF= 0
##$NC_proc= -6
##$NLEV= 6
##$NOISF1= 3.799351
##$NOISF2= 2.8
##$NSP= 0
##$NTH_PI= 0
##$NZP= 0
##$OFFSET= 15.74469
##$PC= 1
##$PHC0= -19112.72
##$PHC1= 12.40079
##$PH_mod= 1
##$PKNL= yes
##$PPARMOD= 0
##$PSCAL= 0
##$PSIGN= 0
##$REVERSE= no
##$SF= 200.130005374595
##$SI= 16384
##$SIGF1= 3
##$SIGF2= 2
##$SINO= 5.538805
##$SIOLD= 16384
##$SREGLST= <1H.CDCl3>
##$SSB= 0
##$STSI= 16384
##$STSR= 0
##$SW_p= 3612.71676300578
##$SYMM= 0
##$S_DEV= 0
##$TDeff= 16384
##$TDoff= 0
##$TI= <>
##$TILT= no
##$TM1= 0
##$TM2= 0
##$TOPLEV= 0
##$USERP1= <user>
##$USERP2= <user>
##$USERP3= <user>
##$USERP4= <user>
##$USERP5= <user>
##$WDW= 1
##$XDIM= 16384
##$YMAX_p= 455733949
##$YMIN_p= -307858
$$ End of Bruker specific parameters
$$ ---------------------------------
##NTUPLES= NMR SPECTRUM
##VAR_NAME=  FREQUENCY,     SPECTRUM/REAL,   SPECTRUM/IMAG
##SYMBOL=    X,             R,               I
##VAR_TYPE=  INDEPENDENT,   DEPENDENT,       DEPENDENT
##VAR_FORM=  AFFN,          ASDF,            ASDF
##VAR_DIM=   16384,         16384,           16384
##UNITS=     HZ,            ARBITRARY UNITS, ARBITRARY UNITS
##FACTOR=    0.220516191357247, 1,           1
##FIRST=     3150.98488259496, 0,            0
##LAST=      -461.731880410816, 0,           0
##MIN=       -461.731880410816, -307858,     0
##MAX=       3150.98488259496, 455733949,    0
$$ Real data points
##PAGE= N=1
##DATA TABLE= (X++(R..R)), XYDATA
$$ [...]
5777B310915N9523n3614J9497j990J5421O2998m3912P099R2183J04402R8081r6356
5765B574247k3365M9175m6516J8823Q0423J23795o0434Q7522J43871P5550O4428
5754C087519n3440J14278J0615M0553Q985m8710R4549O2125P6750m1838k1129
5743C330257j09207l2114l2138L8097n8770K4998L3369K325N39j38039J8091M0132
5731C117540O0351m506N9936J13122R8972J34769k325m7072Q3357j22519l0143
5720C461482L6695k9169P0316K8564o2443R2278n8568o7531J7337k9815J40684
5709C599830J32798l8502o3128J13019N654J46539J0093L9372R0651j13851j20058
5698C802417N1794J51699k3858N1995J09626l383L7086J44191Q1209o075k5043
$$ plain form
5777 2310915 2370438 2316824 2336321 2334331 2349752 2412750 2368838 2375937 2468120 2572522 2670603 2574247
5765 2574247 2550882 2600057 2553541 2572364 2652787 2776582 2716148 2803670 2947541 3023091 3087519
5754 3087519 3034079 3148357 3158972 3199525 3208510 3159800 3254349 3316474 3393224 3351386 3330257
5743 3330257 3221050 3188936 3156798 3194895 3136125 3161123 3194492 3196817 3197356 3059317 3077408 3117540
5731 3117540 3177891 3173385 3233321 3346443 3445415 3580184 3577859 3530787 3614144 3491625 3461482
5720 3461482 3498177 3469008 3539324 3567888 3505445 3597723 3539155 3471624 3488961 3459146 3599830
5709 3599830 3732628 3694126 3630998 3744017 3749671 3896210 3906303 3945675 4036326 3922475 3802417
5698 3802417 3854211 4005910 3982052 4034047 4143673 4140290 4177376 4321567 4402776 4396701 4371658
5687D371658N5392L7312k6764j70472j76473j5718L5429o4370q7866P5207J61082
5676D194417K9962K9259m5614k7647j37980k69417j23897j22484p0277j366p2531
5665C382425p1477o9533j4936M7868K7406P3482n5957q4155J96772L3826J78601
5654C644322J9590M7838J86910K36558J26948K58808K31154N8139L7787p3864
5644D774190N493N8540Q462J14782J58798M2738J37261R5579J11035R0145O062
5633E603085j92204r9481j60610j39095j67950k08923j61176j29886j3592k9341
5623D300827P885J55596J0018J83121J32140l6876P5985r6282k01888j62475j56176
5612D211875j22956j11271J9324O0895J58869J6907M9665O4604k0302J74528J0872
$$ plain form
5687 4371658 4427050 4464362 4437598 4267126 4090653 4074935 4110364 4045994 3958128 4033335 4194417
5676 4194417 4224379 4253638 4208024 4180377 4042397 3772980 3649083 3526599 3456322 3454956 3382425
5665 3382425 3310948 3241415 3226479 3274347 3301753 3375235 3319278 3235123 3431895 3465721 3644322
5654 3644322 3663912 3711750 3898660 4135218 4262166 4520974 4752128 4810267 4848054 4774190
5644 4774190 4779683 4838223 4846685 4961467 5120265 5163003 5300264 5395843 5506878 5597023 5603085
5633 5603085 5410881 5311400 5150790 5011695 4843745 4634822 4473646 4343760 4330168 4300827
5623 4300827 4308712 4464308 4474326 4657447 4789587 4752711 4828696 4732414 4530526 4368051 4211875
5612 4211875 4088919 3977648 3996972 4057867 4216736 4233643 4283308 4347912 4327610 4502138 4513010
5601D513010Q6937J42553J94202M12474N43507M10695L23216J94596k77105m22877
5591F121208m38604l77508j70248j06120n7250j5313J94446J95826N8998q024
5581E397411n6598m3568j45155j30386r6957J99601K40926J92422L27378L40422
5571F225496M39055L21951j40461k97561m35032m32711l23790j21511j44043j59580
5561D931813j15202j38917k24267r5398j12073r4458j74127J0628L8385p1287
5551C955097r1834k32380j85015j58615n2411q7901r760p2876L9152q5896n400
5540C012161K2413l6365K1245j3142J32993n5091K8409L9360k2896m0017k8422
5529C060648J41848O9212J2444k2336r5760P5077L4183Q0750O9713M2980K13210
$$ plain form
5601 4513010 4599947 4742500 4936702 5349176 5892683 6303378 6626594 6821190 6544085 6121208
5591 6121208 5682604 5305096 5134848 5028728 4971478 4956165 5150611 5346437 5405435 5397411
5581 5397411 5340813 5297245 5152090 5021704 4924747 5124348 5365274 5557696 5885074 6225496
5571 6225496 6664551 6986502 6846041 6548480 6113448 5680737 5356947 5235436 5091393 4931813
5561 4931813 4816611 4677694 4453427 4358029 4245956 4151498 3977371 3987999 4026384 3955097
5551 3955097 3863263 3630883 3445868 3287253 3234842 3146941 3137181 3064305 3103457 3017561 3012161
5540 3012161 3034574 2998209 3019454 3006312 3139305 3084214 3112623 3151983 3129087 3089070 3060648
5529 3060648 3202496 3271708 3284152 3261816 3166056 3241133 3275316 3356066 3425779 3468759 3681969
5518C681969J06656J17391M5844K8835K04205J41970K2801J06966l1660o5468
5508D359509q1300j32257p2767O6075l9042p9233N7237K9652M3229J63889P6044
5497D391036J0675r9785J59500J78351O4728K0511K41271K01200K26066J78445
5487E571998R8127K52704K44248J78991k8572k18703k03589j61699j11294j33065
5477E489146j4584j04092M0521L1711l9906P8870R7066J09624J80005K82994K78501
5466F429856K25454L65349M43455L09383J83186J03470K37081R4642J26153J24814
5456H642843P7011J21214p6957j13737r9893k34780j94165j16536L8185j1815
5446H031370J26878J50162K07860J50219K10505J95197L74091L78885K02751K94947
$$ plain form
5518 3681969 3788625 3906016 3951860 3980695 4184900 4326870 4349671 4456637 4424977 4359509
5508 4359509 4278209 4145952 4073185 4139260 4100218 4020985 4078222 4107874 4151103 4314992 4391036
5497 4391036 4401711 4301926 4461426 4639777 4704505 4725016 4966287 5167487 5393553 5571998
5487 5571998 5670125 5922829 6167077 6346068 6317496 6098793 5895204 5733505 5622211 5489146
5477 5489146 5474562 5370470 5410991 5442702 5402796 5481666 5578732 5688356 5868361 6151355 6429856
5466 6429856 6655310 7020659 7464114 7773497 7956683 8060153 8297234 8391876 8518029 8642843
5456 8642843 8719854 8841068 8764111 8650374 8550481 8315701 8121536 8005000 8043185 8031370
5446 8031370 8158248 8308410 8516270 8666489 8876994 9072191 9446282 9825167 10027918 10322865
5436A0322865K34490J67624J88345J51857M29285M99869N13736M89535L87287
5427A3384893N84861O07773O25593O63472R60057J103156J629619K062286K495419
5418B4117129K450559J799820Q93938r917j150331j674800j216956o41939j77912
5409B4389591m5763l46069p93234q82278j099619q89033n49870l33345p2051J28840
5399A9507169J5134L18724N18536P44371R89079J343349J508447K110948K908303
5390B9964060L612954M257721M080344L146455J845461L77900j182914j203205
5382D4898776R6307J195580J587432Q33246m14298k332976m109943m891418m570604
5373C2292102l666779k770007j996832j615881j149539j020502q11088k92311
$$ plain form
5436 10322865 10557355 10724979 10913324 11065181 11494466 11994335 12508071 12997606 13384893
5427 13384893 13969754 14577527 15203120 15866592 16826649 17929805 19559424 21621710 24117129
5418 24117129 26567688 28367508 29261446 29251529 28101198 26426398 25209442 24567503 24389591
5409 24389591 24343828 23997759 23204525 22322247 21222628 20333595 19783725 19450380 19378329 19507169
5399 19507169 19522303 19841027 20359563 21103934 22093013 23436362 24944809 27055757 29964060
5390 29964060 33577014 37834735 41915079 45061534 46906995 47284895 46101981 44898776
5382 44898776 44995083 46190663 47778095 48611341 48197043 45864067 41754124 36862706 32292102
5373 32292102 28625323 25855316 23858484 22242603 21093064 20072562 19261474 18969163
5365A8969163m1429J06906M82795N85938Q79166J332665J473070J422451J123624
5356B6334349Q35470N07867K90535O17059R39823J444131J464226N69875n13100
5347C2490235j833866l114808l476668l097878k551087j841343j545347j072680
5339A3956558q58815q33133p08315o43223m26801l40915l49148k46823k47267
5330I302118l47668k50943k34620k08018l35664j35536l33139l25562k53305k79165
5320F598498j22264J5485k3697j28226r6077l4340R3123O200L7897J08795Q2485
5309F537879o737n9435O5418M6132l3147r3608j06549M7379l7598j24373q0294
5298F155067j59121j70819k31931j18142l07756j75712p6660j07713R9516o8659
$$ plain form
5365 18969163 18927734 19034640 19517435 20103373 20982539 22315204 23788274 25210725 26334349
5356 26334349 27169819 27677686 27968221 28585280 29525103 30969234 32433460 33003335 32490235
5347 32490235 30656369 27541561 24064893 20967015 18415928 16574585 15029238 13956558
5339 13956558 13097743 12264610 11556295 10913072 10486271 10145356 9796208 9549385 9302118
5330 9302118 8954450 8703507 8468887 8260869 7925205 7789669 7456530 7130968 6877663 6598498
5320 6598498 6476234 6491719 6468022 6339796 6243719 6209379 6302502 6308702 6346599 6455394 6537879
5309 6537879 6531142 6471707 6537125 6583257 6550110 6456502 6349953 6397332 6359734 6235361 6155067
5298 6155067 5995946 5825127 5593196 5475054 5167298 4991586 4914926 4807213 4906729 4838070
5288D838070M9477j4724J3672m5862J40936K33755R7272J62958J34639K48264
5278E858457J76753k3165o4829p3807L0207J31274o5330k9018m9294j25038q8420
5267E677790o9422r4353j08377o1032o758J11972r44J0077O3577O8046J33389
5256E723965J05110P597J92152R2288P3814m0517m5152m7008R3017O8085J24874
5245F348225J87858J01746J33782J12240R1725J78451J90963K40793L03506K59469
5235H148758L44845L08152L80022L05171M53964L37132L21057L82662L60126M27864
5225A1769753O08314N68536P82580Q26660R82587J129316J223941J543932K152735
5216B1588354K675725L139007L402276L068605J986107O43496p73325j956387
$$ plain form
5288 4838070 4887547 4872823 4886495 4840633 4981569 5215324 5312596 5475554 5610193 5858457
5278 5858457 6035210 6012045 5947216 5873409 5903616 6034890 5969560 5940542 5891248 5766210 5677790
5267 5677790 5608368 5514015 5405638 5344606 5337848 5449820 5448876 5458953 5522530 5590576 5723965
5256 5723965 5829075 5836672 6028824 6121112 6194926 6154409 6109257 6062249 6155266 6223351 6348225
5245 6348225 6536083 6637829 6771611 6883851 6975576 7154027 7344990 7585783 7889289 8148758
5235 8148758 8493603 8801755 9181777 9486948 9940912 10278044 10599101 10981763 11341889 11769753
5225 11769753 12378067 12946603 13729183 14555843 15538430 16667746 17891687 19435619 21588354
5216 21588354 24264079 27403086 30805362 33873967 35860074 36503570 35730245 33773858
5208C3773858k078825j343383o94121k61540l05319o03983r74981j456819j505736
5199B4549151j165887q12709n73009j91812P4271L00813N02918R17470J138645
5190B4739851J368084J942277K557952L220996L826406L843460L427706K381243
5182D7307975R13839p53097j714309j666704q92140O156M72527O5080q15858k041076
5172D0882393l390738m021018m035857l292780k516053j743118j482798j189904
5164A9210127p92273o68199l90092k75443m5423K87563N08563O14562P86114Q03166
5154B0038665Q96030P08389K84953K78251K66584O72657R96847J032192Q14560
5145B5989128k3891r63599k081230k774908k724181k225858j705632j281048j051678
$$ plain form
5208 33773858 31695033 30351650 29657529 29395989 29090670 28486687 27511706 26054887 24549151
5199 24549151 23383264 22570555 21997546 21805734 21880005 22180818 22683736 23601206 24739851
5190 24739851 26107935 28050212 30608164 33829160 37655566 41499026 44926732 47307975
5182 47307975 48221814 47468717 45754408 44087704 43195564 43201720 43674247 43739327 42923469 40882393
5172 40882393 37491655 33470637 29434780 26142000 23625947 21882829 20400031 19210127
5164 19210127 18417854 17749655 17359563 17084120 17038697 17326260 17834823 18449385 19235499 20038665
5154 20038665 20934695 21643084 21928037 22206288 22472872 23145529 24142376 25174568 25989128
5145 25989128 25965237 25001638 22920408 20145500 17421319 15195461 13489829 12208781 11157103
5136A1157103p08499o43509n70443m58586m09775l06634j77759j10921j34054
5127G636923j30535j16703q6803p1131j39877j74933j80823j31504j39081j67626
5117F297907m7301J14709k2135j08065O5154J03272K1767M1235M0759r3554l2732
5106F381016p7399p8489l6298k7985M0104J17341J11848L4164P382J94948K26299
5095F892931K25718J77347J96416Q690n7755j34182k04214j49163k64520j97425
5085F493843k56211l6819p2139l9222k4805J4758k9446J46070J05458K5787L3252
5074F360526K0163O9703J29275J02110J64965P5746m7959J57664J21366J80316
5064G333875J53292K56880K13359K48751L7067k7252M1258j96565k58899j37929
$$ plain form
5136 11157103 10448604 9805095 9234652 8776066 8366291 8059657 7881898 7770977 7636923
5127 7636923 7506388 7389685 7302882 7231751 7091874 6916941 6736118 6604614 6465533 6297907
5117 6297907 6250606 6365315 6343180 6235115 6300269 6403541 6425308 6466543 6507302 6413748 6381016
5106 6381016 6303617 6225128 6188830 6160845 6200949 6318290 6430138 6464302 6471684 6666632 6892931
5095 6892931 7118649 7295996 7492412 7501102 7443347 7309165 7104951 6955788 6691268 6493843
5085 6493843 6237632 6200813 6128674 6089452 6064647 6079405 6049959 6196029 6301487 6327274 6360526
5074 6360526 6380689 6450392 6579667 6681777 6846742 6922488 6874529 7032193 7153559 7333875
5064 7333875 7487167 7744047 7957406 8206157 8243224 8215972 8257230 8060665 7801766 7663837
5054G663837j93959k33400r4620j37000r438j17478p7483J05134m9144M7846J7981
5043F922276K03549J19525J7819J06675J42159J65950R1732J41559J69800J19497
5033H200541J18728J39350K05829J12186J43468O0411l4351R5289j2673j92220
5023H836558j26149o2714q1445n2699Q7064L7488n715o4043J9789J86573N8373
5012H833080J01042K12555M2802K38225J62284J63998K26349J62063Q2118L10311
5002A0534827K75392J16978J59235R5552J69247O9136p6193K3754j0624l5621
4992A1321683N7125J61458J12388O0688P1479J4672J11915L8935J14861J03317
4982A2168521J82920J40641N8736R1582J73630M9295N6266N5295J82187J99516
$$ plain form
5054 7663837 7469878 7236478 7141858 7004858 6995420 6877942 6800459 6905593 6856449 6904295 6922276
5043 6922276 7125825 7245350 7263169 7369844 7512003 7677953 7769685 7911244 8081044 8200541
5033 8200541 8319269 8458619 8664448 8776634 8920102 8980513 8946162 9041451 9028778 8836558
5023 8836558 8710409 8647695 8566250 8513551 8600615 8638103 8632388 8568345 8588134 8774707 8833080
5012 8833080 8934122 9146677 9189479 9427704 9589988 9753986 9980335 10142398 10224516 10534827
5002 10534827 10810219 10927197 11086432 11181984 11351231 11420367 11344174 11367928 11357304 11321683
4992 11321683 11378808 11540266 11652654 11713342 11784821 11799493 11911408 11950343 12065204 12168521
4982 12168521 12351441 12492082 12550818 12642400 12816030 12865325 12921591 12976886 13159073 13358589
4972A3358589K56122L73224K87875N24580N36270O30843P79178Q74740J235432
4963A8856853J520197J761166J811941J720185J808574J661003J598061J712729
4955C2450709J553560J321653J028948N52575J309571K480833K603949J480411
4947D4782209O8202j945939m519451n237318m557265l393544k716093k231482
4939B0249319j862714j472413j411986r94627q00680q35764p41998o18690n22362
4930A0988085m98864n03239l70733k66772l59262k92927j44165j04119j64374
4921H283630k11028k5021l0831j9222m1494o4668L2211J0825J23279J22866L36244
4910H516791N26670O22111N43903L18762k5342l38800p52771q91545q08639m82765
$$ plain form
4972 13358589 13614711 13987935 14275810 14800390 15336660 15967503 16746681 17621421 18856853
4963 18856853 20377050 22138216 23950157 25670342 27478916 29139919 30737980 32450709
4955 32450709 34004269 35325922 36354870 36907445 38217016 40697849 43301798 44782209
4947 44782209 44850411 42904472 38385021 33147703 28590438 25196894 22480801 20249319
4939 20249319 18386605 16914192 15502206 14507579 13706899 12871135 12129137 11510447 10988085
4930 10988085 10489221 9985982 9615249 9348477 8989215 8696288 8552123 8448004 8283630
4921 8283630 8072602 8047581 8016750 7997528 7956034 7891366 7923577 7934402 8057681 8180547 8516791
4910 8516791 9043461 9665572 10209475 10528237 10502895 10164095 9411324 8519779 7711140 7228375
4900G228375l15283l20458k10680k61833j35537r0805k11112o0151j1256l4397
4890E576863P8668m177K9930m7786n3999q4263j40922r1465q3034j54052m6980
4879D978783K4866m5573o0599l7028R4363N7756j17140L6358M3070j5936Q1878
4868E040798P9589M9882r050J47645K56490m9318J29749K81135K79640K43930
4858F450490K48533L03871L36940K85733M71995M84978M26140O76322P80822R79934
4848A1445758J114481J047907P44515O44151O3283o83662q31848m11702j87672
4839A2945211O6225M36324Q50748J277397J942361K752632K991737K245878J199183
4830B6707696r7393k101805l639775l261898k414839j667460j167690r03442o28994
$$ plain form
4900 7228375 6913092 6592634 6381954 6120121 5984584 5893779 5682667 5622516 5611260 5576863
4890 5576863 5655531 5651354 5681284 5633498 5579499 5495236 5354314 5262849 5179815 5025763 4978783
4879 4978783 5003649 4958076 4897477 4860449 4954812 5012568 4895428 4931786 4974856 4958920 5040798
4868 5040798 5120387 5170269 5161219 5308864 5565354 5516036 5645785 5926920 6206560 6450490
4858 6450490 6699023 7002894 7339834 7625567 8097562 8582540 9008680 9685002 10465824 11445758
4848 11445758 12560239 13608146 14352661 14996812 15060095 14376433 13544585 13132883 12945211
4839 12945211 13011436 13447760 14298508 15575905 17518266 20270898 23262635 25508513 26707696
4830 26707696 26610303 24508498 20868723 17606825 15191986 13524526 12356836 11453394 10824400
4821A0824400n55544m04290l83736m49840m31633m05756l05456j88339j27596
4812G572210k82692j95048m5495q0640j04510j08026j11421j79503p5831l3719
4802F355325o6143J2274j3318J2266m4171K4715N7716K26180J89938J76788J95744
4791G127314J72722Q9353J09398J13135J5963o4528j81206j74979j35954j27860
4781F943358j99055k13457k3203k06158k27344j03689J6418N8487j88932j70191
4771E686234P050J5435q1245R1185J14623J7768k3980k0456J15980Q434R5658
4760F026686l3845L0894K97274J04944K6229p1232n092j59177j26050j64946l24610
4749E601075k92443k79949k50266j49449k23712K2401j15821j50841j60103l0752
$$ plain form
4821 10824400 10268856 9864566 9480830 9030990 8599357 8193601 7888145 7699806 7572210
4812 7572210 7289518 7094470 7048975 6968335 6863825 6755799 6644378 6464875 6389044 6355325
4802 6355325 6289182 6301456 6288138 6300404 6256233 6280948 6338664 6564844 6754782 6931570 7127314
4791 7127314 7300036 7389389 7498787 7611922 7627885 7563357 7382151 7207172 7071218 6943358
4781 6943358 6744303 6530846 6507643 6301485 6074141 5970452 5986870 6045357 5856425 5686234
4771 5686234 5693284 5708719 5627474 5718659 5833282 5851050 5827070 5806614 5922594 5931028 6026686
4760 6026686 5992841 6023735 6321009 6425953 6452182 6380950 6375858 6216681 6090631 5925685 5601075
4749 5601075 5308632 5028683 4778417 4628968 4405256 4427657 4311836 4160995 4000892 3970140
4739C970140r3689r2180N998L522O1303p2213J5102k2681N494k7797j9099P32
4727C734632j08454J5099J9542P899m2415Q2368N0713m586k6933p7762l238j38831
4715C508034o5666j32710j26367N9949k47333j14391L6207q4719k373J7718q342
4704B840007p6168p5172m2065k505N3834k089k4074m542O7358M3280J02882O6212
4692B946958P0249j2540P126j2822J51272J48754K8231N9136j06655j02248K6918
4681C204379M9856J39397M1219J02131n06J00064L21942K21035J38604L27151
4671D645272M33374N58224P15108P89689P14275M60728J57008l15037m60260p00478
4661F997903p48688q42144p65308n81509m58517l45869k48214k27670j40286q6958
$$ plain form
4739 3970140 3876451 3784271 3790269 3793791 3855094 3782881 3797983 3775302 3780796 3752999 3733900 3734632
4727 3734632 3626178 3641277 3660819 3668718 3626303 3708671 3759384 3754798 3727865 3650103 3646865 3508034
4715 3508034 3442368 3309658 3183291 3243240 2995907 2881516 2917723 2833004 2830631 2848349 2840007
4704 2840007 2763839 2688667 2646602 2644097 2697931 2695842 2671768 2667226 2734584 2777864 2880746 2946958
4692 2946958 3017207 3004667 3011793 2998971 3150243 3298997 3327228 3386364 3279709 3177461 3204379
4681 3204379 3254235 3393632 3434851 3536982 3536476 3636540 3958482 4179517 4318121 4645272
4671 4645272 5078646 5636870 6351978 7141667 7855942 8316670 8473678 8158641 7698381 6997903
4661 6997903 6249215 5407071 4641763 4060254 3601737 3255868 3007654 2779984 2639698 2552740
4651B552740j23334r6117j99892k00360J26032M4044l0616p7419r2445m1624k3594
4640A837415j3010q6509k8566j5357p8006l5329Q6693m682J6028j5863r0679l6629
4628A535506o9781K3857o0831r5822O014n1490j04322l6816m9371P2855K0842
4617A190641n4958r9025P2538R219l9659L4564q6975m1989Q8326k0493P2608m439
4605A120358j5401r1785k6935k8983j5100q4956J22659R8420l4737j35545r628
4594H98367J37754j08913j5265O9936p5741K896L1085K070J6061k6099l230k6566
4582I02355R8985n3568p3938J11271Q788l2036p2201M5700o1080r565o2130J8302
4570H20883M6405n151N4111Q7668k8660q1926O4176k6532O9156l040N8388n1164
$$ plain form
4651 2552740 2429406 2333289 2133397 1933037 2059069 2103113 2072497 1995078 1902633 1861009 1837415
4640 1837415 1824405 1737896 1709330 1693973 1615967 1580638 1667331 1662649 1678677 1662814 1572135 1535506
4628 1535506 1465725 1489582 1428751 1332929 1338943 1287453 1183131 1146315 1096944 1169799 1190641
4617 1190641 1135683 1036658 1109196 1118415 1078756 1113320 1026345 984356 1072682 1052189 1124797 1120358
4605 1120358 1104957 1013172 986237 957254 942154 857198 979857 1078277 1043540 907995 898367
4594 898367 1036121 927208 911943 981879 906138 909034 940119 942189 958250 932151 928921 902355
4582 902355 1001340 947772 873834 985105 993893 961857 889656 935356 874276 864711 802581 820883
4570 820883 867288 862137 916248 1003916 975256 893330 957506 930974 1000130 997090 1055478 1004314
4558A004314J2470j08064J0965J2155K5383j21269J55681R6024K3312K0671l5610
4547A096032L9192Q3939O5517J19508J54127J5008K7879l1461P6221p5678o6685
4536A503599L8346j29596j00598m4923m79M2117K6976k0776r9678R0809l2857
4525A272940o3179k2658N5127Q5535j39430K2747l231M7052N6653Q5734J92692
4514A589982J6430j34788Q2082J30774n0442n844m442j19559k26780r5400K4766
4503A206779j1114K7708O437P2115r4154j39432O6354Q8127p3794L8530n3136
4492A134420m3324P1139j9903n1308k1391L4176M3195q1906O2111k3737J2384
4481A115856J73002J03598n4424q1478N8494J27367P4145N4016p5653P9221L2423
$$ plain form
4558 1004314 1016784 908720 919685 931840 957223 835954 991635 1087659 1110971 1131642 1096032
4547 1096032 1135224 1219163 1284680 1404188 1558315 1573323 1601202 1569741 1645962 1570284 1503599
4536 1503599 1541945 1412349 1311751 1266828 1266349 1308466 1335442 1314666 1214988 1305797 1272940
4525 1272940 1209761 1187103 1242230 1327765 1188335 1211082 1207851 1254903 1311556 1397290 1589982
4514 1589982 1606412 1471624 1553706 1684480 1634038 1628194 1623752 1504193 1277413 1182013 1206779
4503 1206779 1195665 1223373 1229810 1301925 1207771 1068339 1134693 1222820 1149026 1187556 1134420
4492 1134420 1091096 1162235 1142332 1091024 1069633 1103809 1147004 1065098 1127209 1103472 1115856
4481 1115856 1288858 1392456 1338032 1256554 1315048 1442415 1516560 1570576 1494923 1574144 1606567
4470A606567n4429n5841r2326N8297m4024m843L6378m7217K7868R317k10138L4358
4458A263967m1326k3171L810L2212N5887j62137k4784j0507P1755j730P0008J49837
4446A383821j6361L0064Q0264P4403k8704j9016j17773q6769M151J4785o6509
4435A252356r6498P891k00454l9556J09406k7428k7261J4292J66480k7823o5076
4424A066329j1784K013J9998J02545j83141P8857O7500o5269O1303o2865q1755
4413I93731j6309p7899O8598K503M7837L7413m1494l7172K6380j10281k8187K7873
4401H92993L5788R5904J1678j9144r303o6011j00671K0841n0627j5813J00453
4390H96088j19525k1753P6306l605m233P7796m0704j1275J3517r4865r106J05098
$$ plain form
4470 1606567 1552138 1496297 1403971 1462268 1418244 1413401 1449779 1402562 1430430 1439747 1229609 1263967
4458 1263967 1222641 1199470 1203280 1235492 1291379 1129242 1104458 1093951 1165706 1163976 1233984 1383821
4446 1383821 1367460 1397524 1477788 1552191 1523487 1504471 1386698 1299929 1304080 1318865 1252356
4435 1252356 1155858 1163749 963295 923739 1033145 1005717 978456 992748 1159228 1131405 1066329
4424 1066329 1054545 1056558 1076556 1179101 995960 1074817 1142317 1077048 1138351 1075486 993731
4413 993731 977422 899523 968121 970624 1018461 1055874 1014380 977208 1003588 893307 865120 892993
4401 892993 928781 1024685 1036363 1017219 1007916 941905 841234 862075 811448 795635 896088
4390 896088 776563 754810 831116 827511 823278 901074 860370 849095 862612 767747 758641 863739
4378H63739j29545j8382J10054m7000K6395o7491M7012M2723p2037M7113J3750
4367H16331m935P4797k5167l5947l3444K0861J32526N4576j04030Q4979J25962
4356A106509k5313r0293N1562m8722n7416o3336O8806Q7272j4950n4632R371J4391
4344I83249o6083j21215J08768N3045J2519J275j04023J8656m9426J6999o230
4333H47534o3889J0315M3819l33o0340M922O5130M6995j36970M5231j03734o4603
4321F34077J00613R081J28988l939j18822J7265K8019M5923j10690p3170P9785
4310G37130K6044L35m268R8086J0650o7244j20245Q2912M9309j20792L9835L2748
4298G64500O4346k1384m2434q4957j01910Q5139Q4402k0842Q3621n4257J52377
$$ plain form
4378 863739 734194 715812 825866 778866 805261 737770 784782 827505 755468 802581 816331
4367 816331 811396 886193 861026 825079 791635 812496 945022 999598 895568 980547 1106509
4356 1106509 1081196 990903 1042465 993743 936327 872991 941797 1029069 1014119 959487 968858 983249
4344 983249 917166 795951 904719 957764 970283 971558 867535 886191 836765 853764 847534
4333 847534 783645 793960 837779 837446 777106 782028 847158 894153 757183 802414 698680 634077
4321 634077 734690 743771 872759 868820 749998 767263 795282 841205 730515 657345 737130
4310 737130 763174 763509 759241 857327 867977 800733 680488 763400 812709 691917 731752 764500
4298 764500 828846 807462 765028 680071 578161 663300 747702 726860 810481 756224 908601
4287I08601j13924j46981N109O0629j04217j3883J07376J06575J31437j37147
4277H03575q0707l9838J03444o9296m2698m1100N5594N8336p9295o7133q0270
4266E20612J05966P4281J09092j9337l9504M6858k5507m3660K8914O926p1783
4255F92858J7650P703O5724p271K9205K5089K4340p307L065k6463J81274K4747
4243A030614j16837k2477o7334j1173Q257R09l8696J11962N9508p1360K4635j0040
4231H97968q911j6964J00546J02902p6184m3269K9045M3423j8578j0871p8911
4220I20196P1588k0087o1945J24527K040J6461k8211m4431j2470Q3625o342n3783
4208I91168o8779M1781L644R2534P2898R9750r1284l1806j09904L7395K8518n299
$$ plain form
4287 908601 794677 647696 652805 713434 609217 595334 702710 809285 940722 803575
4277 803575 722868 683030 786474 717178 674480 633380 688974 747310 668015 600882 520612
4266 520612 626578 700859 809951 790614 751110 797968 772461 728801 757715 764641 692858
4255 692858 710508 718211 783935 776664 805869 830958 855298 847991 851056 824593 1005867 1030614
4243 1030614 913777 891300 823966 812793 821050 821959 783263 895225 954733 883373 908008 897968
4231 897968 889057 872093 972639 1075541 999357 956088 985133 1028556 1009978 999107 920196
4220 920196 991784 971697 909752 1034279 1036319 1052780 1024569 980138 967668 1051293 1044951 991168
4208 991168 922389 964170 967814 1060348 1133246 1232996 1141712 1109906 1000002 1037397 1065915 1060616
4196A060616J44817l969m9330R8702l1023j19224L8764o1150J35461R2988r9311
4185A207341M4992o7795j8385O3587Q8073J40507l7779L8385L1521j00M7114L9411
4173A576872n6410P2683J01983l4799m615l4080o660N0861J93905O2014q8904
4162A832850L1064Q7231R3977Q0562O1400K1602J58519P2015J43374J84601J11041
4151B878236J31153K8103l6939j79761j53565p4557k4358j24911k5884Q1728J0824
4140B510069K3968l7175J57538j7009M7992N1804J4063N740J067Q2815N6453O4724
4128B962049O7804n534L7071J45090J33942J32235L2832J6246P1047N2541P5706
4117C721029O8609J53060J68924J51292R2251R3648J59014O0210R6076J71122
$$ plain form
4196 1060616 1205433 1201464 1152134 1250836 1219813 1100589 1139353 1078203 1213664 1306652 1207341
4185 1207341 1252333 1184538 1166153 1229740 1317813 1458320 1420541 1458926 1490447 1490347 1537461 1576872
4173 1576872 1520462 1593145 1695128 1660329 1655714 1621634 1614974 1665835 1859740 1921754 1832850
4162 1832850 1863914 1951145 2045122 2125684 2187084 2208686 2367205 2439220 2582594 2767195 2878236
4151 2878236 3009389 3037492 3000553 2820792 2667227 2592670 2568312 2443401 2417517 2499245 2510069
4140 2510069 2534037 2496862 2654400 2637391 2685383 2737187 2751250 2756990 2758057 2840872 2897325 2962049
4128 2962049 3029853 3024319 3061390 3206480 3340422 3472657 3505489 3521735 3592782 3645323 3721029
4117 3721029 3789638 3942698 4111622 4262914 4355165 4448813 4607827 4668037 4764113 4935235
4107D935235R8601K14564K51466K06208J14496J20545L82912J66587K60785L38564
4097G089963K80421L50758K37671L55894L30322L59727L53678L59097K79117M59393
4087A0456041M96518N97541M94402O89434P58722O44520P74574J019195P02611
4078A6633558N80532M55334L55116L71919M77468M96485N37950O72535Q75919
4069B1456816J096561J191419J150144J058253J072795R47950N50954Q6158k07477
4060B8403573m63772k79515r7503K18138M18241P21146R91000J091307J165447
4051C2168062J210999P33409K60831k71584r08867j252232j367024j163896p89249
4042B8620449n20098k21112J69472M71213L39737M13452J20602j01597n93358
$$ plain form
4107 4935235 5033836 5248400 5499866 5706074 5820570 5941115 6324027 6490614 6751399 7089963
4097 7089963 7370384 7721142 7958813 8314707 8645029 9004756 9358434 9717531 9996648 10456041
4087 10456041 10952559 11550100 12044502 12733936 13492658 14137178 14911752 15930947 16633558
4078 16633558 17214090 17669424 18024540 18396459 18873927 19370412 19908362 20580897 21456816
4069 21456816 22553377 23744796 24894940 25953193 27025988 27973938 28524892 28611050 28403573
4060 28403573 27939801 27660286 27562783 27780921 28199162 28920308 29911308 31002615 32168062
4051 32168062 33379061 34112470 34373301 34101717 33192850 31940618 30573594 29409698 28620449
4042 28620449 28100351 27879239 28048711 28519924 28859661 29273113 29393715 29292118 28698760
4033B8698760r50793j391831j532126j453745j126734r15615p11432n45331n71250
4024A9499903k98474k38238k13146l92680m62096o16220q84674q78454r89595
4015A4526326q11662o41089o66440n75670m49587l57574l36120l89525m77720
4006I820939l21856k86872l87027l75948m23685l05570k98822l23914k41278k41449
3996F614518j66879j74610k10182j77373k07356j80556r7529j19282j06367j37880
3986E036504k3306j80095k9368j04574l0847n0185o9242k9556o8566O848k28552
3975D229061p9647o134o4495q4498j31225j1446N192J1671n3275j39695l021J28072
3963C800560q8817J7512N8896j03637K2195n888M3984m7983o6884j01450k4785
$$ plain form
4033 28698760 27747967 26356136 24824010 23370265 22243531 21327916 20616484 20071153 19499903
4024 19499903 19201429 18963191 18750045 18357365 17895269 17279049 16394375 15515921 14526326
4015 14526326 13714664 13073575 12407135 11831465 11381878 11024304 10688184 10298659 9820939
4006 9820939 9499083 9212211 8825184 8449236 8025551 7719981 7421159 7097245 6855967 6614518
3996 6614518 6447639 6273029 6062847 5885474 5678118 5497562 5400033 5280751 5174384 5036504
3986 5036504 5013198 4833103 4803735 4699161 4668314 4618129 4548887 4519331 4450765 4457613 4229061
3975 4229061 4149414 4143280 4078785 3994287 3863062 3851616 3856808 3868479 3815204 3675509 3672488 3800560
3963 3800560 3711743 3729255 3788151 3684514 3706709 3700821 3744805 3696822 3629938 3528488 3503703
3952C503703j74437p9842l9319m3091q4966l3056Q7363j06415j42531q5385j3109
3941B788915p4422o710L7822N266m3133j14556j47263L8352j05324N9262j9323
3930B418886k2762j07229j18566J5741j62M7805j9481m9886l5028j20892n518
3919B002908L5760k4068n3604M354o1618j26696q12j03380m116M805R341r9986
3907A582888m0220N4688J65032j15933j21245K7807l8967n214K2490k5183m777
3896A501366q4263K2524L757L5744m9561m4360L4517O3712N129p4858m6966o2067
3884A304674m5218K4175k018J9275k2129n3339O1283M0175n1466K295j9814o4040
3872A193853J16627j04189M7083Q5657J8554j19991l8442n3197L8203L2854r0260
$$ plain form
3952 3503703 3329266 3249424 3210105 3167014 3082048 3048992 3136355 3029940 2887409 2802024 2788915
3941 2788915 2714493 2707783 2745605 2750871 2707738 2593182 2445919 2484271 2378947 2438209 2418886
3930 2418886 2396124 2288895 2170329 2186070 2185908 2233713 2214232 2164346 2129318 2008426 2002908
3919 2002908 2038668 2014600 1960996 1965350 1903732 1777036 1776224 1672844 1668728 1673533 1682874 1582888
3907 1582888 1542668 1597356 1762388 1646455 1525210 1553017 1514050 1508836 1531326 1506143 1501366
3896 1501366 1417103 1439627 1443384 1479128 1429567 1385207 1419724 1483436 1488565 1413707 1366741 1304674
3884 1304674 1259456 1283631 1281613 1300888 1278759 1225420 1286703 1326878 1275412 1277707 1257893 1193853
3872 1193853 1310480 1206291 1253374 1339031 1357585 1237594 1199152 1145955 1184158 1217012 1126752
3861A126752L9627L7694j226M4356l3061N7942k2433k1706o6003L967k8449M865
3849A142325j6487K1693r6022M3521N5994j9552O47Q2433j0657j0559M854p2135
3837A126055K8253Q3414l2073j74652K1960Q6580M3363l0247j9873Q5297q402
3826A209675j12758n4317l6177M2663J05136K6421o8008O3930p4429l9918m035
3815A058183N3577N8455O2351Q145J0240P09K0509j08500o1627m3799P0790J11527
3803A240560j3807K0991O0264j30489l6744L7314O4331l8199M5461k9666o4230
3792A155786p487M1289N8864K101J09417M036J00381Q6397K8726J2402J8734O5612
3780A676258p0957l3376J36240J01900J15426J11602J98158K45907Q9372J96332
$$ plain form
3861 1126752 1166379 1204073 1202847 1247203 1214142 1272084 1249651 1227945 1161942 1165909 1137460 1142325
3849 1142325 1125838 1147531 1051509 1095030 1151024 1131472 1132119 1214552 1203895 1193336 1198190 1126055
3837 1126055 1154308 1237722 1205649 1030997 1052957 1139537 1182900 1152653 1132780 1218077 1209675
3826 1209675 1096917 1042600 1006423 1049086 1154222 1180643 1112635 1176565 1102136 1062218 1058183
3815 1058183 1111760 1170215 1232566 1240711 1250951 1251660 1272169 1163669 1102042 1058243 1129033 1240560
3803 1240560 1226753 1247744 1308008 1177519 1140775 1178089 1242420 1204221 1249682 1220016 1155786
3792 1155786 1148299 1189588 1248452 1250553 1359970 1364006 1464387 1550784 1579510 1591912 1610646 1676258
3780 1676258 1605301 1571925 1708165 1810065 1925491 2037093 2235251 2481158 2570530 2766862
3770B766862J53860K4332o2445o1082k61862j99076j32711q7123J8125j05305
3760B053575M316n3500n5483J41284j6870P7496M1704k5771j1597J09949J03420
3749B368523N0116J12711J23883K35756K58964K37001K00394K33248R1575P5386
3739C987557N8408m9709j02763p3532l522k7403j02891n1867r0217j17236n9951
3728C366874p6277Q732L7847j9481L4994l5667m2606J9979r8165q5045k6629j86994
3716B897562q2721o1488k06835j66396Q4413j82653q8771q1882j83093n8488N1764
3705A921412n9788j53615J2449K4683M3519l8518l7204K1951J6042L9879o584
3694A784226p9044j02324J897Q270Q3478r68o1624p8475p3145L0810N9918N8917
$$ plain form
3770 2766862 2920722 2945054 2882609 2821527 2559665 2360589 2227878 2140755 2158880 2053575
3760 2053575 2057891 2004391 1948908 2090192 2073322 2150818 2192522 2166751 2155154 2265103 2368523
3749 2368523 2418639 2531350 2655233 2890989 3149953 3386954 3587348 3820596 3912171 3987557
3739 3987557 4045965 3996256 3893493 3819961 3816439 3789036 3686145 3634278 3544061 3426825 3366874
3728 3366874 3290597 3299329 3337176 3317695 3352689 3317022 3274416 3294395 3196230 3111185 3084556 2897562
3716 2897562 2814841 2753353 2546518 2380122 2464535 2281882 2193111 2111229 1928136 1869648 1921412
3705 1921412 1861624 1708009 1720458 1745141 1788660 1750142 1712938 1734889 1750931 1790810 1784226
3694 1784226 1705182 1602858 1604755 1613025 1696503 1695535 1633911 1555436 1482291 1513101 1573019 1631936
3682A631936j24234K4966J25878n1459K5662J3144M469n0695M9296m590P6324
3671A720697Q899r5565O3998Q6880M2415K7373K168m4479L7230r660k5236M4586
3659A859306l105j6148M8322q7520K0230J18844K7796j7473J18115K8084n5274
3648B041177K6271Q3024L1097n5602l7437K970M7692N1718l0208J06185p0320
3637B196567L5875o3701q0607J15408J4652N8728R7798J50328K7332K7469K3414
3626B603263m8183P2747M3633N9288Q297o4241O3423O9862M8695N045R9343N3021
3614C014193Q2414j8429o0735l378Q9935O6197R2896R0098J88671q6890L4858
3603C489830O9110o9815J18234O4588j5139J0183Q6803N054P9863K4010m0521
$$ plain form
3682 1631936 1507702 1532668 1658546 1607087 1632749 1645893 1650362 1599667 1648963 1644373 1720697
3671 1720697 1729596 1634031 1698029 1784909 1827324 1854697 1856865 1812386 1849616 1839956 1814720 1859306
3659 1859306 1856201 1840053 1888375 1800855 1821085 1939929 1967725 1950252 2068367 2096451 2041177
3648 2041177 2067448 2150472 2181569 2125967 2088530 2091500 2139192 2190910 2160702 2266887 2196567
3637 2196567 2232442 2168741 2088134 2203542 2218194 2276922 2374720 2525048 2552380 2579849 2603263
3626 2603263 2555080 2627827 2671460 2730748 2739045 2674804 2738227 2808089 2856784 2861829 2961172 3014193
3614 3014193 3096607 3078178 3017443 3014065 3104000 3170197 3263093 3353191 3541862 3454972 3489830
3603 3489830 3558940 3489125 3607359 3671947 3656808 3666991 3753794 3758848 3838711 3862721 3822200
3592C822200o6984P9105P1782q599O1175K9889K8005P7813R5134K965K458J8743
3580D213686j1424J53913J38668N7144K36482J4679r653P2408Q2543J95321J04505
3569E248272j5914J33563J85578J36302J07275N0865J26839J21413J39963R8347
3559F332503K30896J52964K86790J70532K01879L00457L99573J63264L16724K39086
3549H794668J65954P6945J92864P8991J99121L9508N5279Q0618P6210J13271l7742
3538I835687R1041J37329J22936J42643K28448N5192O3456M5470P7996j57932
3528A0642266j38676j62871j41817k60828k58813j3939j67701k96290p8046j08921
3518I014364j16734m22818j36136k03316j58258j72518k22964k06118k34865j24362
$$ plain form
3592 3822200 3755216 3834321 3906103 3897504 3958679 3988568 4016573 4094386 4189520 4192485 4194943 4213686
3580 4213686 4202262 4356175 4494843 4551987 4788469 4803148 4793495 4865903 4948446 5143767 5248272
3569 5248272 5232358 5365921 5551499 5687801 5795076 5845941 5972780 6094193 6234156 6332503
3559 6332503 6563399 6716363 7003153 7173685 7375564 7676021 8075594 8238858 8555582 8794668
3549 8794668 8960622 9037567 9230431 9309422 9508543 9548051 9603330 9683948 9760158 9873429 9835687
3538 9835687 9926728 10064057 10186993 10329636 10558084 10613276 10676732 10722202 10800198 10642266
3528 10642266 10503590 10340719 10198902 9938074 9679261 9665322 9497621 9201331 9123285 9014364
3518 9014364 8897630 8474812 8338676 8135360 7977102 7804584 7581620 7375502 7140637 7016275
3508G016275p422q2940r0932q3562j87736j16166j9533l2549o7k5723J5504J36059
3496F521208L0758j1725j21590J66493Q040L7164n7347J6206J41628O6886R2121
3485F889842J27201J44931P5490P8697J39848L18956J98960J30208K00234J74106
3475H478473J57845L36501K10168K42826K06505J93146L14188J97003K38501K20130
3465A0795286K59373L25948K32152J50492J88259K49597Q1492J22726J51074J16978
3455A2673377J24063J22795K2667p4931J24043N5962m5699M4328N097m8662L1616
3444A3034656m338j18924k1464m7986q3465q0996j38224k4117M7184l0716o0779
3433A2470831J06694J10156J07957J45123J79084K78926J27710L31939M92441
$$ plain form
3508 7016275 7008853 6925913 6834981 6751419 6563683 6447517 6427984 6395435 6395368 6369645 6385149 6521208
3496 6521208 6551966 6540241 6418651 6585144 6593184 6630348 6573001 6589207 6730835 6797721 6889842
3485 6889842 7017043 7161974 7237464 7316161 7456009 7774965 7973925 8104133 8304367 8478473
3475 8478473 8636318 8972819 9182987 9425813 9632318 9825464 10139652 10336655 10575156 10795286
3465 10795286 11054659 11380607 11612759 11763251 11951510 12201107 12282599 12405325 12556399 12673377
3455 12673377 12797440 12920235 12942902 12867971 12992014 13047976 13002277 13046605 13051702 13003040 13034656
3444 13034656 13030318 12911394 12889930 12841944 12758479 12677483 12539259 12515142 12562326 12531610 12470831
3433 12470831 12577525 12687681 12795638 12940761 13119845 13398771 13526481 13858420 14350861
3424A4350861O77948M58990L04277J87889j58306m60188m02561l03316j23721
3415A4531873o4954j87360K7414J55049r2890o220K28405J88943K50879K37229
3405A5268368K17595J27646O5820J07469Q2841m0636k1351J23612K12336K90734
3395A6434434M16631N60998R31063J128807J141827P73507L99934j51688j021228
3386B0614285j010762o75687n55612j19872N0928J5124Q1466L71061L44688N54660
3376A9670279M41051L08843O37177O87635N55739N57992O63155P49171O77309
3367B4948351P59954Q20559P59798N88684O36789P36674R43509R92532R74167
3358C2161017R03259P91853P36494M23303J95611L68330P74452P66109Q86340
$$ plain form
3424 14350861 15028809 15487799 15792076 15979965 15821659 15361471 14958910 14655594 14531873
3415 14531873 14466919 14279559 14306973 14462022 14369132 14362912 14591317 14780260 15031139 15268368
3405 15268368 15485963 15613609 15679429 15786898 15869739 15829103 15807752 15931364 16143700 16434434
3395 16434434 16851065 17412063 18343126 19471933 20613760 21387267 21787201 21635513 20614285
3386 20614285 19603523 18927836 18372224 18252352 18303280 18318404 18399870 18770931 19115619 19670279
3376 19670279 20111330 20420173 21057350 21744985 22300724 22858716 23521871 24271042 24948351
3367 24948351 25708305 26528864 27288662 27877346 28514135 29250809 30194318 31186850 32161017
3358 32161017 33064276 33856129 34592623 35015926 35211537 35579867 36354319 37120428 38006768
3349C8006768J004913J196437J358611J627267J755137K127939K614431K868124
3341E2559627L370989L554063L621943L407871L195351K697184K096909J455849
3333G5959786P61546M7943n62016o78734o31752n99904j51704J39856N55883J154064
3323G5994968J029378Q04236O36057Q4287o19425j337280k142316k666982k891896
3314F8891027l172313l189756l091448k929135k401674k038333j810209j520228
3306D8737931j016252r75711p25900o55538n23251l68211l36346j86275j28297
3297D3822150n8349q197J38102L42300K70188L67857O38604O00507P78081Q21163
3287D7712406J092607J255359J361444J568407J707688J840935K171225K346086
$$ plain form
3349 38006768 39011681 40208118 41566729 43193996 44949133 47077072 49691503 52559627
3341 52559627 55930616 59484679 63106622 66514493 69709844 72407028 74503937 75959786
3333 75959786 76721332 76769275 76207259 75528525 74896773 74296869 74145165 74285021 74840904 75994968
3323 75994968 77024346 77828582 78464639 78548926 77929501 76592221 74449905 71782923 68891027
3314 68891027 65718714 62528958 59437510 56508375 54106701 52068368 50258159 48737931
3306 48737931 47721679 46745968 46020068 45364530 44841279 44473068 44136722 43950447 43822150
3297 43822150 43763801 43755604 43893706 44236006 44506194 44874051 45512655 46113162 46891243 47712406
3287 47712406 48805013 50060372 51421816 52990223 54697911 56538846 58710071 61056157
3279F1056157K742983K973288L162133L620883M127340M514584M962848N728880
3271I2889096O292187P080389P925403Q613748R313307R668249R582600R144948
3263A60509927Q217466O787913N099074L516055J764077P26865m12348r89259
3255A85219770j198937q80421j38224M90490J370680J573353J359720N11849o58387
3246A87649893j918400l354576m734723n975637o839240p697357q196441q046051
3238A40887468p559943o757994o010188n328967m744514m290998m034875l939753
3230I8220236l937485l991640l786410l566537l367389l341102l146806l115900
3222F9966967k849522k574051k359785k370618k290532j973807j851016j622668
$$ plain form
3279 61056157 63799140 66772428 69934561 73555444 77682784 82197368 87160216 92889096
3271 92889096 99181283 106261672 114187075 122800823 132114130 141782379 151364979 160509927
3263 160509927 168727393 175515306 180614380 184130435 185894512 186621377 186209029 185219770
3255 185219770 184020833 183140412 183002188 183492678 184863358 186436711 187796431 188308280 187649893
3246 187649893 185731493 182376917 177642194 171666557 164827317 157129960 148933519 140887468
3238 140887468 133327525 126569531 120559343 115230376 110485862 106194864 102159989 98220236
3230 98220236 94282751 90291111 86504701 82938164 79570775 76229673 73082867 69966967
3222 69966967 67117445 64543394 62183609 59812991 57522459 55548652 53697636 52074968
3214E2074968j465127j397594j230365j127927q24595q60434o87865o43414m47299
3205D3390348j93596j34989l3959J08443K56880L03318R7151n3015k8034j89419
3195D3523128j8373J14947N5993J05004J30373P8186J26603J33039j33899q9821
3185D4025180L8750j56389K6606j79959j93949k33484j64048j47372j017J80263
3175D3194581M06840N55353P99897O49780J031654J367446J404583J265549J378918
3166E2054601J328947J324357J291609J248336J207436J100260J072732J082619
3158F1710897J059833J048674J134313R78349J216348J234372J357844J579223
3150G1319853J657222J775284J901132K206505K721968L109203L727337M466928
$$ plain form
3214 52074968 50609841 49212247 47981882 46853955 46029360 45168926 44481061 43837647 43390348
3205 43390348 43196752 43061763 43027804 43136247 43393127 43696445 43793596 43740581 43712547 43523128
3195 43523128 43504755 43619702 43675695 43780699 43911072 43989258 44115861 44248900 44115001 44025180
3185 44025180 44063930 43907541 43934147 43754188 43560239 43326755 43162707 43015335 43014318 43194581
3175 43194581 43601421 44156774 44956671 45606451 46638105 48005551 49410134 50675683 52054601
3166 52054601 53383548 54707905 55999514 57247850 58455286 59555546 60628278 61710897
3158 61710897 62770730 63819404 64953717 65932066 67148414 68382786 69740630 71319853
3150 71319853 72977075 74752359 76653491 78859996 81581964 84691167 88418504 92885432
3142I2885432M900841N178341N335948N108949M859778M546724M267832M196047
3134A31279892M045410L603713K903217J964143R10499J02062p98868j255476
3126A42754592j588486j791555k136908k489033k627468k779331k812219l212182
3118A23317410l475550l492659l535907l551650l406433l004449k512561k173203
3110I8164998j799195j546149j482436j361740j336672j288823r28367o69113
3102H7752503m42259o46427q76043j355176j822347k019505k283308k100582k011685
3093G4195171j829155j679213j283786j112448p17120l20626L0145L12501N39184
3084F8134653O30552O19710O01451L93480K81208j06765m87441r69151j267144
$$ plain form
3142 92885432 97786273 102964614 108300562 113409511 118269289 122816013 127083845 131279892
3134 131279892 135325302 138929015 141832232 143796375 144706874 144808936 144010068 142754592
3126 142754592 141166106 139374551 137237643 134748610 132121142 129341811 126529592 123317410
3118 123317410 119841860 116349201 112813294 109261644 105855211 102850762 100338201 98164998
3110 98164998 96365803 94819654 93337218 91975478 90638806 89349983 88421616 87752503
3102 87752503 87310244 86663817 85787774 84432598 82610251 80590746 78307438 76206856 74195171
3093 74195171 72366016 70686803 69403017 68290569 67573449 67252823 67282968 67595469 68134653
3084 68134653 68765205 69384915 69986366 70379846 70661054 70554289 70066848 69097697 67830553
3075F7830553j706487j994285k300969k443502k414478k390977k371292k374849
3067D9833714k442733k187133k130818k027385j943313j762994j523363j348207
3059C4467768j329077j179691j158734q85082q78558q39705r70224q29506q15912
3050B5581279p41989p97647q19340o95997o85885o99407p64432n72794n81368
3041A9222420m95923l98680l30655m16674k17753k22567j90229j38123n7860m0553
3031A6713403J09704j337J1831K3538O6829J27263Q6344J04450J92359O5829q8678
3020A7411535j45090j57697m04024l35755m60519m25829l54780n08029m78440
3011A4141372m34200l46194l74026l10944l02130k53868j54500j47279j32875
$$ plain form
3075 67830553 66124066 64129781 61828812 59385310 56970832 54579855 52208563 49833714
3067 49833714 47390981 45203848 43073030 41045645 39102332 37339338 35815975 34467768
3059 34467768 33138691 31959000 30800266 29915184 29036626 28196921 27226697 26397191 25581279
3050 25581279 24839290 24041643 23222303 22526306 21840421 21141014 20376582 19803788 19222420
3041 19222420 18726497 18327817 17997162 17580488 17362735 17140168 16949939 16811816 16753956 16713403
3031 16713403 16823107 16821770 16833601 16857139 16923968 17051231 17137575 17242025 17434384 17500213 17411535
3020 17411535 17266445 17108748 16704724 16368969 15908450 15482621 15127841 14619812 14141372
3011 14141372 13707172 13360978 12986952 12676008 12373878 12120010 11965510 11818231 11685356
3002A1685356m0278M781j03045l2262p7654j70029j24889m0970n004r8872j02932
2991A0894202j47521m7770q5214O0635n7604n3640J9338P6722O2497n3308N1850
2980A0720187j687Q4811J49398Q3454J26856K15494J37938J71039O3044O218J10209
2969A1866961m3468k9009p354J2289K11255J84136J50283J64911K57030J52764
2959A2919798K31249L65112K87496L24800J94087J42439J11982K86672J58504
2950A5022139J22807L10146K36219J96037L42403K78077K34136L06979L79822
2941A7428765K40421J86626K27547J23375K47067K29254L99601K97161M13411
2932A9793228M38436L97830L85503L12030L14924N21928M76074M47142N15685
$$ plain form
3002 11685356 11645078 11649859 11546814 11514552 11436898 11266869 11141980 11101010 11096006 10997134 10894202
2991 10894202 10746681 10698911 10613697 10674332 10616728 10563088 10582426 10659148 10721645 10668337 10720187
2980 10720187 10718500 10803311 10952709 11036163 11163019 11378513 11516451 11687490 11750534 11756752 11866961
2969 11866961 11823493 11794484 11787130 11799419 12010674 12194810 12345093 12510004 12767034 12919798
2959 12919798 13151047 13516159 13803655 14128455 14322542 14464981 14576963 14863635 15022139
2950 15022139 15144946 15455092 15691311 15887348 16229751 16507828 16741964 17048943 17428765
2941 17428765 17669186 17855812 18083359 18206734 18453801 18683055 19082656 19379817 19793228
2932 19793228 20231664 20629494 21014997 21327027 21641951 22163879 22639953 23087095 23602780
2923B3602780M75293M27243O35254O88971M83766O29044N86331O18227P36260
2914B8883169Q77614Q71283R42099J119081J188094J329233J517617J504026J612118
2905C9844334J604037J558701J779804J781787J770638J915947K129589K266296
2897E4651133K350661K359149K593227K871436L056725L455065M034590M678572
2889H0050558N575119O542050P563384Q469635Q888704R316197R499462R776053
2881A45681162J0725627J2275332J4523778J6986397K0086688K4286443L0023250
2874B74588677L7163385M3500919M4261317L6155239K0064412j310312k5897732
2867D28525905m5256007n0668125m4941344l5649127k7156967k0738033j6623083
$$ plain form
2923 23602780 24078073 24505316 25140570 25829541 26313307 26942351 27528682 28146909 28883169
2914 28883169 29760783 30632066 31574165 32693246 33881340 35210573 36728190 38232216 39844334
2905 39844334 41448371 43007072 44786876 46568663 48339301 50255248 52384837 54651133
2897 54651133 57001794 59360943 61954170 64825606 67882331 71337396 75371986 80050558
2889 80050558 85625677 92167727 99731111 108200746 117089450 126405647 135905109 145681162
2881 145681162 156406789 168682121 183205899 200192296 220278984 244565427 274588677
2874 274588677 311752062 355252981 399514298 435669537 455733949 454423637 428525905
2867 428525905 383269898 332601773 287660429 252011302 224854335 204116302 187493219
2860A87493219j3813995j2009365j0501433r272046p452792n587441m075691l105802
2852A21674654k848371l108036l978571m947514n770700o150346o311718o147106
2844H2412292o031365n633466n238171m658593l939818l554384l257251l082655
2836D7016589k653211k215167j919794j859521j666896j462060j456151j375797
2828C2407992j109603j298688j201746j057874r04898j075949q13793q34929p78136
2819B3332376p63855p85916o00039p17306m71895n00822n14632m99388n80383
2810A7898140m75100n31288m73449n14803m94498l58906l77863m93892l72675
2801A3805666l83246m17855l29411l55945l24802k66638k37451l34261k88959
$$ plain form
2860 187493219 173679224 161669859 151168426 141896380 134443588 128856147 124780456 121674654
2852 121674654 118826283 115718247 111739676 106792162 101021462 94871116 88559398 82412292
2844 82412292 76380927 70747461 65509290 60850697 56910879 53356495 50099244 47016589
2836 47016589 44363378 42148211 40228417 38368896 36702000 35239940 33783789 32407992
2828 32407992 31298389 29999701 28797955 27740081 26835183 25759234 24945441 24110512 23332376
2819 23332376 22568521 21782605 21182566 20465260 19993365 19492543 18977911 18478523 17898140
2810 17898140 17423040 16891752 16418303 15903500 15409002 15050096 14672233 14178341 13805666
2801 13805666 13422420 13004565 12675154 12319209 11994407 11727769 11490318 11156057 10867098
2792A0867098k55401j78221l49989j98993k24149k59854l26758k19865j95544
2783H658324l32685k31995j42512k09524k00948n8797j02385j41139j45738j28515
2773F964086j70203k09301K0627p2854k48754n77j48568j56858q3801r5708j18899
2762E679190k29741K6642j00367k01711k8271j6521j56218j8689j9079j33144
2752D802091j52806M5769j32629p7141j34161r0104p5515p9364j51349j9805O215
2741C941201r9846j82565p5661n4201m2499O4585n2135O390m5262l0835P9040
2730C508212j8934j16848M1733K5950k1578r439j51588L9597m0937j66346L7145
2719C126967P77j40446j196m97j41287j23328j1491L1399j23463j08576k4684
$$ plain form
2792 10867098 10611697 10433476 10083487 9884494 9660345 9400491 9073733 8853868 8658324
2783 8658324 8325639 8093644 7951132 7741608 7540660 7481863 7379478 7238339 7092601 6964086
2773 6964086 6793883 6584582 6605209 6532355 6283601 6283024 6134456 5977598 5893797 5798089 5679190
2762 5679190 5449449 5476091 5375724 5174013 5145742 5129221 4973003 4954314 4935235 4802091
2752 4802091 4649285 4695054 4562425 4485284 4351123 4261019 4185504 4106140 3954791 3934986 3941201
2741 3941201 3841355 3658790 3583129 3528928 3486429 3551014 3498879 3505269 3460007 3429172 3508212
2730 3508212 3489278 3372430 3414163 3440113 3418535 3409096 3257508 3297105 3256168 3089822 3126967
2719 3126967 3127744 2987298 2986102 2985605 2844318 2720990 2709499 2740898 2617435 2508859 2484175
2708B484175P936o7280K2432j19771m2419k7772P192r5807P2543O9347l5098q4548
2696B190930p7363L0716M742m9038k0247m811j53197M192m3541q5005k5337n2413
2684A719628j583j10404J38057j5264o1800L3604K8101j7299J3988p9525o8940
2673A578563p7471j16906Q8871N7353p8116o5253r5836M5477p6421l5823N3620
2662A278058p1843K4393J7805o6855n7660j1551j76730n2442J49078K5347r419
2651A048181J9183j1177l7529n9806R055J09551N5956m5730n4548O785K4226J30133
2639A194280o2192q6503P6593m9911j6352M8104l8500p3010O2412j5284J6369
2628A056006K1042p9R1102l0705r6889r472J3010J01502M3197q276k4732j6841
$$ plain form
2708 2484175 2492111 2424831 2447263 2327492 2285073 2257301 2264493 2168686 2241229 2310576 2275478 2190930
2696 2190930 2113567 2144283 2149025 2099987 2079740 2074929 1921732 1925924 1882383 1797378 1772041 1719628
2684 1719628 1718045 1607641 1745698 1730434 1668634 1702238 1730339 1713040 1727028 1647503 1578563
2673 1578563 1501092 1384186 1473057 1530410 1452294 1387041 1291205 1336682 1260261 1224438 1278058
2662 1278058 1206215 1230608 1248413 1181558 1123898 1112347 935617 883175 1032253 1057600 1048181
2651 1048181 1067364 1056187 1018658 958852 967907 1077458 1133414 1087684 1033136 1039921 1064147 1194280
2639 1194280 1132088 1045585 1122178 1072267 1055915 1104019 1065519 992509 1054921 1039637 1056006
2628 1056006 1077048 1076969 1168071 1137366 1040477 1031005 1044015 1145517 1188714 1180438 1155706 1138865
2616A138865r303j04025j03502R7801j1417r900Q4791O7388J3301j7238J6979
2605A163740k8197M0582J35441l798J37272J1418n1336M5745O3165J74891M9404
2594A738327J09849M0148J38479K80394O7584J19710J93411P2753J34156j3512
2584B881299k37278j29356j63397k57000k85760j07757j55857j03840L5894q093
2574A468855r6956k9843o6884j0631m7903o43l0552p1333l6515l2790l2773L2408
2562A044440p9957M9330N8426p2027n4091o0925L051n4852k4394n0955J9009r9980
2550F77075Q0884l6529j3377r4128q5163n5676m8776J00539O4216P3619K1857
2539F84541o9781k3291K4722O4808q2426l1005q139k5060O2886p1207m3733L8526
$$ plain form
2616 1138865 1129562 1025537 922035 1019836 1008419 998519 1083310 1150698 1163999 1146761 1163740
2605 1163740 1135543 1176125 1311566 1307768 1445040 1456458 1405122 1450867 1514032 1688923 1738327
2594 1738327 1848176 1888324 2026803 2307197 2374781 2494491 2687902 2760655 2894811 2881299
2584 2881299 2644021 2514665 2351268 2094268 1808508 1700751 1544894 1441054 1476948 1468855
2574 1468855 1371899 1342056 1275172 1264541 1216638 1215995 1185443 1114110 1077595 1044805 1012032 1044440
2562 1044440 964483 1013813 1072239 1000212 946121 885196 888247 833395 809001 758046 777055 677075
2550 677075 757959 721430 708053 613925 528762 473086 424310 524849 589065 662684 684541
2539 684541 614760 591469 616191 680999 598573 567568 559429 534369 597255 526048 482315 520841
2527E20841P3372r8036P4990J07041r8815m1234P8562l2899j57163j201Q9136
2516E14594L2638n1209k2993J6205q1313j1015R7298o3016j34046P1088J11943
2505D80174M4748p2256K1555j7141o5703R8969l5660k6565m5261p6431q286M0125
2493C38268j2088J1188L1549Q8588M5470L2501r5834K0950q0713m5335O2514J1722
2481D08780P4173j9836M7646j12507j18184P0504j01389o5428l5770R0974k9848
2470B09115L6458P1086K4908j38623L1817L6052r7450K22886j1042j16957o1058
2459B07192k5854n548J01803m2639Q3948k809n5685m902k9963k5131J47602j77502
2447A70512M0633J11793m243r5028l2227J25413K8144j12695L266J12918o9283
$$ plain form
2527 520841 594213 496177 571167 678208 579393 538159 616721 583822 426659 425458 514594
2516 514594 547232 496023 473030 489235 407922 396907 494205 431189 297143 368231 480174
2505 480174 524922 452666 474221 457080 391377 490346 454686 428121 382860 306429 298143 338268
2493 338268 326180 337368 368917 457505 502975 535476 439642 460592 379879 334544 397058 408780
2481 408780 482953 463117 510763 398256 280072 350576 249187 183759 147989 238963 209115
2470 209115 245573 316659 341567 202944 234761 270813 173363 396249 385207 268250 207192
2459 207192 181338 175790 277593 234954 318902 316093 260408 255506 225543 200412 348014 170512
2447 170512 211145 322938 318695 223667 191440 316853 344997 232302 235568 348486 279203
2436B79203N7236k0273M1623q6890r5890N9286M0836k8998j68843r7583J13559
2425I3266Q2041Q5819j0678M7272j5338n2666m3764n6905n305P9118J4518n4516
2413A62862R917p073K2228J11834l048l6306o1664o688k179M7393J16446M8807
2401D02529o8554k7264r047q3397r8585m451M9256L671o9008K0760j1371J12426
2389B16965K4992Q310r461j9223K978j47960R5838l5994r0540p669J57878k7476
2377A68638K9524Q0440o6017m7083J8895n511L4293k5862J45443J12228j08075
2366C36913k771n381N3697m7212Q7460J21500q6643n4081j10325M9424j23295
2355B19286o3815N6396L9420p0130k2178M2135q3875k5664O3948m0909O1138l2360
$$ plain form
2436 279203 336439 316166 357789 270899 175009 234295 275131 246133 77290 -20293 93266
2425 93266 175307 261126 250448 297720 282382 229716 185952 129047 123742 202860 217378 162862
2413 162862 172779 165706 187934 299768 296720 260414 198750 192062 189883 237276 353722 402529
2401 402529 333975 306711 297664 214267 115682 111231 160487 164158 95150 115910 104539 216965
2389 216965 241957 250267 240806 221583 224561 76601 172439 136445 45905 38236 196114 168638
2377 168638 198162 278602 212585 165502 184397 178886 213179 187317 332760 444988 336913
2366 336913 334142 328761 382458 335246 422706 544206 457563 403482 293157 342581 219286
2355 219286 155471 211867 251287 181157 158979 201114 117239 91575 155523 114614 175752 143392
2343A43392k3609q644O9316J03790n0443J7444k6340O7692j02977j67056Q9364
2332A11929J45836j71114k0123P3127K6392L7526j13885N8380P5635l6792k8530
2321A58381J13416r5158M671N149l1426J2855o3183J05709M8426n8510K4986J5596
2309B40912q0437P6267j6930P20n5965K5206m7061q6722P013J39217O155Q129
2297B16504J6052J0648q5336q3320J9048M2653n8865k1000K4460Q2487K3236l0688
2285A55879l1427j5987o0480R2551O3219j50129O2229L9879o1222j5831r1135
2274a2454O9079P3147j47258m3613L7974O5951J37271N4464k1726j7534l6351
2263A58950L039l1396L5858Q7225m5119r3876L6554P348l877L0527m8318n1847
$$ plain form
2343 143392 119783 111139 180455 284245 233802 251246 224906 292598 189621 22565 111929
2332 111929 257765 86651 66528 139655 166047 203573 89688 148068 223703 186911 158381
2321 158381 271797 176639 181310 186459 155033 167888 104705 210414 258840 200330 225316 240912
2309 240912 160475 236742 219812 220532 164567 189773 142712 55990 63003 202220 208375 216504
2297 216504 232556 243204 157868 74548 93596 136249 77384 56384 80844 163331 186567 155879
2285 155879 124452 108465 47985 140536 203755 53626 115855 155734 94512 78681 -12454
2274 -12454 56625 129772 -17486 -61099 -23125 42826 180097 234561 212835 195301 158950
2263 158950 161989 130593 166451 253676 208557 114681 151235 158583 154706 185233 136915 85068
2251H5068J00292j213n9049Q016m5526R3232N0067j8344j633l9990N9116O0358
2239B90394n6348O3917P8536p3183q1369K3860k4208L7400l7439l5546J45242
2228C31256l9832p6008M3679M8496Q719O13j52231J20280P0625l2599n7538k4687
2216B40773Q4823O5647p0136R527K4317L1555N0968J4258n3032O1012P076m3154
2204D23634J2219m3860L3867J5023N7447q7181M8760J9779N551l7074n5162N6772
2192D49775l5089Q5451R9316Q8373p1193J8533R7514k0989O1872J41193R614k06004
2180G18366j8099J29837J27803J0149j4599K498M4758J1465O7284L6658k2299
2169A093821K0456M4299o0556K238p1119n4141K11805O6244J5091l0895J96495
$$ plain form
2251 85068 185360 184147 125098 133114 87588 180820 230887 212543 210910 170920 230036 290394
2239 290394 234046 297963 376499 303316 221947 245807 221599 258999 221560 186014 331256
2228 331256 291424 215416 259095 307591 316310 316923 164692 284972 355597 322998 265460 240773
2216 240773 325596 391243 321107 330634 354951 386506 437474 451732 398700 459712 466788 423634
2204 423634 435853 391993 425860 440883 498330 411149 459909 479688 485239 448165 393003 449775
2192 449775 414686 500137 599453 687826 616633 635166 732680 711691 773563 914756 924370 718366
2180 718366 700267 830104 957907 968056 953457 955955 1000713 1012178 1079462 1116120 1093821
2169 1093821 1114277 1158576 1098020 1100258 1029139 974998 1186803 1253047 1268138 1237243 1433738
2158A433738P8088O0413L3164M1953j2680L7611q3093m2346J23602L5670J6340
2147A722460J47020J04242k4814K5384M8246J04228K828K6095Q8265J13659J08136
2136B465749O1667Q6006J22006J12189J28687K34104K17665K31637J78161N8921
2126C896792J30834J72984J73078J96830Q1404K47289K79953J70316K39520K62335
2116E851335L54818M93308M83433P36298O58670Q78798Q44557R03048P57742O23441
2106A2585448R63049J331048J725223J829458K300725K833119L970319N795691
2098C3334080Q289290Q789677O021476K876481K65800p799566j1298025q627757
2090C1851456n946163m185050l179102k636218k095412j490849j078274p15743
$$ plain form
2158 1433738 1511826 1572239 1605403 1647356 1634676 1672287 1589194 1546848 1670450 1706120 1722460
2147 1722460 1869480 1973722 1948908 1974292 2022538 2126766 2129594 2155689 2243954 2357613 2465749
2136 2465749 2527416 2613422 2735428 2847617 2976304 3210408 3428073 3659710 3837871 3896792
2126 3896792 4027626 4200610 4373688 4570518 4651922 4899211 5179164 5349480 5589000 5851335
2116 5851335 6206153 6699461 7182894 7919192 8577862 9456660 10301217 11204265 11962007 12585448
2106 12585448 13548497 14879545 16604768 18434226 20734951 23568070 27538389 33334080
2098 33334080 41623370 50413047 56434523 59311004 59576804 51777238 40479213 31851456
2090 31851456 25905293 21720243 18541141 15904923 13809511 12318662 11240388 10524645
2082A0524645o95606n03543n66655m30242o15353n55287n65668m03367m20330
2073E768594l66064l37110l65684l66234k67258k30603j58213j46818j87902j83773
2063C158935j38036k21687j31930j17983p5315j14710l078o328o7396l4948j88258
2052B059266k23960L4856O8549n0396p4090m0200J6049j77550j26934P0753m2464
2041A513879m8876j00110m473j73659O514Q8661r2754j01326m7820M1246O1229
2030A142511j46310j2371N686k4705L4395P4008k0712j68942m7297j49953o3637
2019F22673J52856l9591l3709m5008m4907m3342Q7285q2767n7468K21088j28083
2008F09027n6224N456k7954K8979r6011n606K4886J8313J0863j5199p9450j8062
$$ plain form
2082 10524645 9829039 9325496 8758841 8328599 7713246 7157959 6592291 6188924 5768594
2073 5768594 5402530 5065420 4699736 4333502 4066244 3835641 3677428 3530610 3342708 3158935
2063 3158935 3020899 2799212 2667282 2549299 2473984 2359274 2356196 2349868 2282472 2247524 2059266
2052 2059266 1835306 1870162 1938711 1888315 1814225 1774025 1790074 1612524 1485590 1556343 1513879
2041 1513879 1465003 1364893 1360420 1186761 1193275 1281936 1189182 1087856 1040036 1081282 1142511
2030 1142511 996201 983830 989516 964811 999206 1073214 1052502 883560 836263 686310 622673
2019 622673 775529 735938 702229 657221 612314 568972 656257 573490 516022 737110 609027
2008 609027 552803 558259 530305 559284 463273 457667 482553 500866 511729 496530 417080 399018
1996C99018N1801n2625O8623J05272m9262k5802O268q8928k5126r9005j9893J07219
1984C77560N3479j5988J1410p158j3442K3397j8425o6821N6367q2771l9660l2916
1972B45032J12613L0539k4872J4134k7453M0702m0839k0478l1467p0346m1745
1961A85820N1427K8250j8181O9879o832n3679m1298Q0144k2817l4577o2262P704
1949A83578P5660j7144O6406l5523J04357o7795q1812m9744m0021l4262k7947
1938G5753O1372L1880p2567M9051J6591J1836n9659M4427J7293q9810K4242L1750
1926A42159K2334p0747k3044M2024Q6281M0704j21503r1592R576L1782N5667R915
1914A33556n5550p9371p8711J81779O9175M1522n1227r1076J6315j23511Q0512
$$ plain form
1996 399018 450819 398194 466817 572089 522827 497025 503293 414365 389239 290234 270341 377560
1984 377560 431039 415051 426461 419303 405861 429258 410833 344012 400379 317608 277948 245032
1972 245032 357645 388184 363312 377446 349993 390695 349856 329378 297911 227565 185820
1961 185820 237247 265497 247316 317195 310363 256684 215386 295530 272713 238136 175874 183578
1949 183578 259238 242094 308500 272977 377334 309539 227727 177983 137962 103700 75753
1938 75753 137125 169005 96438 145489 162080 173916 114257 158684 175977 86167 110409 142159
1926 142159 164493 93746 70702 112726 199007 239711 118208 26616 36192 67974 123641 133556
1914 133556 78006 -1365 -80076 101703 170878 212400 161173 70097 86412 -37099 43413
1903D3413P6403p0368J9368N8284j08923M1253l4644R0564l91j27746j5777L8708
1891A0144m464M6364m2828Q9986k1783r453K7839p8159O3141L4458j00545L6096
1879E0796Q1422j50463q1482J74895r019j8380k3104k4862K6376M3937l2751k1955
1867A5410P009o2729Q4674P6465o2758J9427Q3191o0458O251K2053K2020k0075
1855A30480j838M0230j42928K2526M1770J1724M0959j21882P2572q2903M333K9489
1843D4532P5922k730O5031j09105n5820O0419L9924l8031R891M3333k6202m5688
1831F1476k9214O3462Q8969N5626P0247N8718M6811L0656k6826l4472j52737r395
1819B23321l2359j84908M6521k7141p6558L5300p0869O4596R8342Q4232j07279
$$ plain form
1903 43413 119816 49448 68816 127100 18177 59430 24786 115350 114959 -12787 -28564 10144
1891 10144 5680 52044 9216 99202 77419 67966 95805 17646 80787 115245 14700 50796
1879 50796 132218 -18245 -99727 75168 66149 47769 24665 -197 26179 70116 37365 15410
1867 15410 22419 -40310 44364 120829 58071 77498 160689 100231 106482 128535 150555 130480
1855 130480 128642 168872 25944 48470 90240 101964 142923 21041 93613 10710 15043 44532
1843 44532 120454 117724 182755 73650 17830 78249 118173 80142 90033 133366 107164 61476
1831 61476 32262 95724 184693 240319 310566 369284 416095 446751 419925 385453 232716 223321
1819 223321 190962 6054 52575 25434 -51124 -15824 -86693 -22097 76245 160477 53198
1808E3198J4352m9665M6340J03183o8610o3069m279l4072r769P342J30819k1493
1796A04277m6740p9410k2353J45234M9975n9261o7027J35978j06934q3688M5694
1785A5745K8184l57M9020m5845K6272q7995j3635J5817k0664K7970J05349k7354
1773G2507m5976p2409k621O4350j17612m0327J07350n354M6442m4626o5179J31786
1761B8331j519j7496L9256N8199o8405o979P1490k8942j18087N7766K650q1742
1749f5478n2081R0052N8978J5136J3787N6304J2466j14600n3838N778j1727p449
1737e2672O3021m2272N8090k0492J09034Q0688j11252j09857p9889o5864J41410
1726c0055J13591p6135M4079j1813k682p1113m8842k9358N8700M5521o9416J3152
$$ plain form
1808 53198 67550 17885 64225 167408 98798 35729 31450 -2622 -12391 -5049 125770 104277
1796 104277 57537 -21873 -44226 101008 150983 91722 24695 160673 53739 -29949 15745
1785 15745 43929 43572 92592 46747 73019 -14976 -28611 -12794 -33458 -5488 99861 72507
1773 72507 26531 -45878 -48499 15851 -101761 -142088 -34738 -40092 6350 -38276 -103455 28331
1761 28331 26812 9316 48572 106771 38366 31387 102877 73935 -44152 13614 16264 -65478
1749 -65478 -117559 -27507 31471 46607 60394 116698 129164 14564 -39274 -33496 -45223 -52672
1737 -52672 10349 -31923 26167 5675 114709 195397 84145 -25712 -105601 -171465 -30055
1726 -30055 83536 7401 51480 39667 36985 -34128 -82970 -112328 -53628 -8107 -77523 -64371
1714f4371P9773m9418j42111L0922L5893l0358N6219r6873n99M9379M7321K0192
1702f4031P4419Q06L2417M5923M9336j40747o864n160l9754J10866n7472p4639
1690g4900M79K7351K1639m9623M8371O6920K0177r870l3930q711N3510j8480j03152
1677f0219M0994k79J7298o9636M7589L699K8475P9339K3941j8961o0653P5281
1665A06868j5262m0846k4642p011m3134k92Q320J51231j8501j38451M2225K7190
1653D7695j0817r3067K9748M162m155N0489J1720M5994M3960j14229O6983q5801
1641g318j9761r576k4193M8499R0735p6129q0696P3313j5275K0j3195P5236O584
1628D8244o4823j5042N2671O8422p0404L6422j4764j36820K7884K1830k7346J09311
$$ plain form
1714 -64371 15402 -34016 -176127 -145205 -109312 -139670 -83451 -180324 -180923 -131544 -84223 -64031
1702 -64031 10388 11194 43611 89534 138870 -1877 -8741 -13901 -53655 57211 -261 -74900
1690 -74900 -74421 -47070 -25431 -75054 -26683 40237 60414 50544 16614 7903 61413 42933 -60219
1677 -60219 -19225 -19504 -2206 -71842 -24253 -20554 7921 87260 111201 92240 31587 106868
1665 106868 91606 50760 26118 19107 -24027 -24319 -15999 135232 116731 -21720 20505 47695
1653 47695 36878 -56189 -26441 -22279 -26434 24055 35775 81769 125729 11500 78483 -7318
1641 -7318 -27079 -36655 -60848 -12349 78386 2257 -78439 -5126 -20401 -20381 -33576 41660 48244
1628 48244 -16579 -31621 21050 89472 19068 55490 40726 -96094 -68210 -46380 -73726 35585
1616C5585J1977r4962j072L9809m8364n1929J28342r1917r9282J66224L7627L4532
1604F6570j907n5576K5919Q4106P4044j06709o1853k3337k3656L399K5362M2119
1592D8481k4004l7826J3673N9156m0581k8501j08809j4259O7472j9425q9990J22474
1580e2139M4780o8169p4169k2274J06517O9599n4320o7816N0113M7085k3815o945
1568e1553J40015j009Q36j09199N2867J9998j3634K6354j64n0819k6353n7085
1556f9746n1835Q1346l3148Q06k0982o625L8150m5723n5286J21154L8400q4757
1544h8246O327J8838O2566j1065Q509m4745J2740k8944k7830J01077L0079M2176
1532H1482K5529m6235R243k8933L2924J5909r400N5118j3470m5284n3290j07011
$$ plain form
1616 35585 47562 -47400 -48472 -8663 -57027 -108956 19386 -72531 -171813 -5589 32038 66570
1604 66570 64663 9087 35006 119112 193156 86447 24594 1257 -22399 -19000 6362 48481
1592 48481 24477 -13349 324 59480 18899 -9602 -118411 -132670 -65198 -84623 -174613 -52139
1580 -52139 -7359 -75528 -149697 -171971 -65454 4145 -50175 -117991 -67878 -20793 -44608 -51553
1568 -51553 88462 87453 88289 -20910 31957 51955 38321 64675 64511 13692 -12661 -69746
1556 -69746 -121581 -40235 -73383 -72577 -93559 -100184 -62034 -107757 -163043 -41889 -3489 -88246
1544 -88246 -81919 -63081 -515 -11580 -3071 -47816 -35076 -64020 -91850 9227 39306 81482
1532 81482 107011 60776 70019 41086 74010 89919 80519 135637 122167 76883 23593 -83418
1520h3418l0387k045R5480m3670J049L4699j17167o6375J62535K8916q1424M3712
1508e8095L593n809O3108M6642o844k1125O1130j62822n2517J55985J19813K8333
1496A71392m3343q7534m0336K5118j5763K6702m7471J06174l8866l6156k3095
1485c178M3452L0332M4478p3845m7600M5334o0094q0670P3576o975J042R543p2736
1472i7341L9088L9316r9392K2245J2658Q1523L8207j04445q576J1820l719Q1547
1460A2931O65j6645p6050k5841k245K5973Q1664O8079j6087l1713K3792M6304
1448I0827Q1921q1955q2968N9408q5360m4302J3159k7782j1560L4720J11541m5510
1436A2139o2659k7470o2923J0198Q4690N5823J5771q4661j08044J14762M792k7346
$$ plain form
1520 -83418 -113805 -115850 -20370 -64040 -62991 -28292 -145459 -211834 -49299 -20383 -101807 -58095
1508 -58095 -54502 -60311 2797 49439 42595 21470 82600 -80222 -132739 23246 143059 171392
1496 171392 128049 40515 179 25297 9534 36236 -11235 94939 56073 19917 -3178
1485 -3178 40274 70606 115084 41239 -6361 38973 -21121 -101791 -28215 -35190 -34148 -24605 -97341
1472 -97341 -58253 -18937 -118329 -96084 -83426 -1903 36304 -68141 -76717 -64897 -68616 12931
1460 12931 13596 -3049 -79099 -104940 -107185 -81212 452 68531 52444 20731 44523 90827
1448 90827 172748 90793 7825 67233 -18127 -62429 -49270 -77052 -88612 -53892 57649 12139
1436 12139 -50520 -77990 -140913 -130715 -46025 9798 25569 -59092 -167136 -52374 -47582 -74928
1424g4928O4749q0474M71L1552J53260j0633l6389L8908k8627o9611R0124P3883
1412A52285n4526l9875n2170q0210p3026P2038J3774n2534k2916K7335o6570Q0999
1400i5396J4775j68630J75803k1426K5053J3230L4390R1979p3276J4375r1709
1389h0832M4270P3074l5399o1637o566m9407J6946K4051r785J09196l4804p5991
1377h6884K0667J07718l1493j5571j1861P4785k4821l3483R1074m4429m2668j8659
1365a5625r6170L4636J6211l56K7400L7270N9696n4534q0581J08814L0165p8934
1353a2008M7054k4317m9207j1435p318Q92P6016j5662q24l0506K9175o2379R8565
1340C8046l2575n4076P8748m3648Q353m5386j4991p3276P5313N6650J0558m2530
$$ plain form
1424 -74928 -10179 -90653 -90182 -58630 94630 83997 47608 86516 57889 -11722 78402 152285
1412 152285 97759 57884 5714 -74496 -147522 -75484 -61710 -114244 -137160 -109825 -176395 -95396
1400 -95396 -80621 -249251 -73448 -94874 -69821 -56591 -22201 69778 -3498 10877 -80832
1389 -80832 -36562 36512 1113 -60524 -67090 -116497 -99551 -75500 -85285 23911 -10893 -86884
1377 -86884 -66217 41501 10008 -5563 -17424 57361 32540 -943 90131 45702 3034 -15625
1365 -15625 -111795 -77159 -60948 -61304 -33904 3366 63062 8528 -72053 36761 66926 -12008
1353 -12008 35046 10729 -38478 -49913 -57231 -56339 19677 4015 3191 -27315 1860 -60519 38046
1340 38046 5471 -48605 30143 -13505 -5152 -50538 -65529 -138805 -63492 -6842 3716 -38814
1328c8814K1470J4066o1479J3178K9229n2601j1254n707J50841M2192O3669O212
1316A71002n4540q8201J8114O9349k545p5843m6075k9540N2392L5695m7581k4504
1304b2277j6955J01572q2482M1093P9570j29380l7921K9828l342J42865j7413
1293H5158o5820l4265O7153m337j5080l5025L3061L4567q3644L6621k4299J4263
1281H353M9705J5965J5817l9276j5350j19782R0784N8515K898j06219k3074j23993
1269a85657O1023Q8359m5509N4670j44918M627Q9736q6798K0732k2244Q7741O2538
1257a5700R9962m4397Q4859K9401j60099l8445k362j3126J02266l6240M7920Q2368
1245A36407j66160Q234M7381K2809j0809O9973J00126o2438j37769L3775j2389
$$ plain form
1328 -38814 -17344 -3278 -64757 -51579 -22350 -74951 -86205 -91912 58929 101121 164790 171002
1316 171002 116462 28261 46375 115724 113179 37336 -8739 -38279 14113 49808 2227 -22277
1304 -22277 -39232 62340 -20142 20951 100521 -28859 -66780 -36952 -40294 102571 85158
1293 85158 19338 -14927 52226 47889 32809 -2216 30845 65412 -18232 18389 -5910 8353
1281 8353 58058 74023 89840 50564 35214 -84568 6216 64731 67629 -38590 -61664 -185657
1269 -185657 -124634 -36275 -81784 -27114 -172032 -167405 -77669 -164467 -143735 -165979 -78238 -15700
1257 -15700 84262 39865 124724 154125 -5974 -44419 -46781 -59907 42359 6119 54039 136407
1245 136407 -29753 -21519 25862 48671 37862 107835 207961 145523 7754 41529 29140
1234B9140N8893p4175j04233L5112J32383m8863l9670Q2520n0267m6774O1445
1223C5511m8256R283j60880P3152Q7860o2449P1192m6753l1245O4628K3081j02354
1211h7230M5446Q0873k8810k1782r647n1317P7599K4617n1388L1489L4000K3205
1199F7055q8480N777r030J7469n0068p505J15276O6224r7473k4918K6919L6275
1187E7521m9197M933P0740m1002j31431j8450l764j8632J15777O9303L2094j3241
1175G4651j65185l1003O2934L0621K5553N9506j11259r998J22735J736n9811p148
1163f668K6107l5050n589m6876O70K7535o2188j1036O6608k1400Q6282k2903m2841
1150d7349L4841O6993J2701l3162L8583o5412R075n1769k8079L1651l2508Q9705
$$ plain form
1234 29140 88033 13858 -90375 -55263 77120 28257 -11413 71107 20840 -25934 35511
1223 35511 -12745 -3462 -164342 -91190 -3330 -65779 5413 -41340 -72585 -7957 15124 -87230
1211 -87230 -41784 39089 10279 -11503 -21150 -72467 5132 29749 -21639 9850 43850 67055
1199 67055 -21425 -15648 -24678 -7209 -57277 -64782 50494 116718 19245 -5673 21246 57521
1187 57521 8324 13257 83997 42995 -88436 -106886 -110650 -129282 -13505 55798 87892 74651
1175 74651 -90534 -121537 -58603 -27982 -2429 57077 -54182 -64180 58555 60291 480 -6668
1163 -6668 19439 -15611 -21200 -68076 -67406 -39871 -102059 -113095 -46487 -67887 18395 -4508 -47349
1150 -47349 -12508 54485 67186 34024 72607 7195 16270 -35499 -63578 -31927 -64435 25270
1138B5270M7038m6988p1403J09141m1329j57796M7943k6909L9445J15968m6058
1127e678m5503m2383o4401P2151J04170k1941M3674o8524k730J7689J3093m0755
1115d1138p082P0818J1258M229q9038m8745L5939k3363J06170L9902j7731m6798
1103e579k2614j5232K846J02963J1047j3900m5242q8183o283l8727O1072J5963
1091d1869L3848J0601j9769o815J10382L7061n3774L7985k3227j24666J7188O8132
1079D5077n0069J0645K9324m2537r2209o896O6225R7336o7169L0692o3512M595
1067c8498J30323j6893q7903n2754k4338K364j2652K9375P0843r5703K0527j3085
1055h8394k0629P8918o096O3493K9006L5691o0177p0395J3180R1886l0873n3562
$$ plain form
1138 25270 72308 25320 -46083 63058 21729 -136067 -88124 -115033 -75588 40380 -5678
1127 -5678 -51181 -93564 -157965 -85814 18356 -3585 40089 -28435 -31165 -13476 -383 -41138
1115 -41138 -48220 22598 33856 38085 -50953 -99698 -63759 -87122 19048 58950 41219 -5579
1103 -5579 -28193 -43425 -40579 62384 73431 59531 14289 -73894 -80177 -118904 -57832 -41869
1091 -41869 -8021 2580 -17189 -24004 86378 123439 69665 107650 84423 -40243 -23055 45077
1079 45077 -4992 5653 34977 -7560 -99769 -106665 -40440 56896 -10273 20419 -43093 -38498
1067 -38498 91825 74932 -12971 -65725 -90063 -87699 -100351 -70976 -133 -95836 -75309 -88394
1055 -88394 -109023 -30105 -36201 27292 56298 91989 31812 -38583 -25403 66483 35610 -17952
1043a7952J26324l3875p7077M2548r8928R7154j00247k5573J08053L5342n3808
1032A961N324J13915j252p7529q238M4644j4714K6160q8094n680Q9805K9327q9533
1019B6096J8268r405L9142n484k0671p1962j6280q075L1833N7914M447j16782
1007g0959j00624J64449k5961l8126P2567M9552J2928n2635k4427n9997k0951
996i4184m3982Q1208J835k7688j889o7551N5669M0270r0297r558J45932l036k5263
983c8534J40598j03624K1151N1180q9388n3330p1798L6622Q9616O4166l2957l81
971A3321p084j7499n8051R573R4176L316p5709K5817k0992J58435l3908k3537
959F7858q1389k1485O3463l9961n7043K3662j6744q223O3762n1607m8209j4461
$$ plain form
1043 -17952 108372 74497 -2580 39968 -58960 38194 -62053 -87626 20427 55769 1961
1032 1961 7285 121200 119948 42419 34181 78825 64111 90271 2177 -3503 86302 115629 26096
1019 26096 44364 34959 74101 68617 47946 -24016 -40296 -48371 -16538 41376 45823 -70959
1007 -70959 -171583 -7134 -33095 -71221 1346 50898 63826 11191 -13236 -73233 -94184
996 -94184 -138166 -56958 -55123 -82811 -84700 -152251 -96582 -56312 -146609 -156167 -10235 -13271 -38534
983 -38534 102064 -1560 19591 70771 -18617 -71947 -143745 -107123 -17507 46659 13702 13321
971 13321 6237 -11262 -69313 -59740 34436 37752 -37957 -12140 -33132 125303 91395 67858
959 67858 -13531 -35016 28447 -11514 -68557 -44895 -61639 -69862 -6100 -57707 -105916 -120377
947a20377J20342Q6049M760m7512j25393O3559J5467m5893Q8605p7206k0542m7109
935a05250L7554L5249p5073K660J04084o0276J24698J02545k8300j13951o4926
924d0986J9823k5233M0067m8682P1463L5816l9808L0152P3670o0131R781j4370
912E1562j03178K9792J01140r8396l5997M6605L2298n7537r546O4083J9287M678
900D4791j06451K8973K5106J8551K0727m5029J2416K9551O9731n3752j9307l2109
888f802l446Q6557n2947n6375N7696p280j087J8986l6831l7510J0014K462N2965
875B6402r0358j13265K4769J9938R4280J3013K071j25259M7228p0082P2557O8593
863c0113k4078O6227r1909k1567m3623P8023R0476k4969K5146q8650M7477j7632
$$ plain form
947 -120377 -35 86014 90774 43262 -82131 -18572 -3105 -48998 39607 -37599 -58141 -105250
935 -105250 -67696 -32447 -107520 -104860 -776 -61052 63646 166191 137891 23940 -40986
924 -40986 -21163 -46396 -6329 -55011 16452 52268 12460 42612 116282 56151 65932 51562
912 51562 -51616 -21824 79316 -19080 -55077 -8472 23826 -33711 -43257 20826 40113 44791
900 44791 -61660 -32687 -7581 10970 31697 -13332 -916 28635 98366 44614 25307 -6802
888 -6802 -10248 76309 23362 -33013 24683 17403 16316 35302 -1529 -39039 -29025 -26563 26402
875 26402 -63956 -177221 -152452 -132514 -38234 -25221 -23150 -148409 -101181 -171263 -98706 -30113
863 -30113 -54191 12036 -79873 -101440 -145063 -67040 23436 -1533 23613 -65037 -17560 -35192
851c5192j2258j2679J5244k6996n715O045m5884M0928M1150n6364J44468L4050
839H6797n6986l1980J10966m379j55929n5230N5380K1619m6927J944O4845m6162
827e6042P8401J40398j65730R6769n8494k5033J00342j573j26796m2062n7041
816a16861P9957R3533r3822l1637k1844M6001J8511M8538J7411l5633Q8834m7333
804D5655k4781k916O4917p3231M8447J8156j22261M7845J10545n1378l1725j16716
792h7443K6227m2245n381P6882Q4278K2106K236j12874lO0381p6891M9561j0682
779a3848N1382O8322k4169m9830P9178o6528n4682j9714K900j6983L8710J3660
767H398m8003o0211M3934P4199j15589L3525Q7709k5055k1696p7962J55155k5302
$$ plain form
851 -35192 -47450 -60129 -44885 -71881 -77596 -71551 -117435 -76507 -35357 -91721 52747 86797
839 86797 29811 -2169 108797 104418 -51511 -106741 -51361 -29742 -76669 -74725 -9880 -56042
827 -56042 22359 162757 -2973 93796 35302 10269 110611 109038 -17758 -59820 -116861
816 -116861 -36904 56629 -37193 -68830 -90674 -44673 -26162 22376 39787 4154 92988 45655
804 45655 20874 17958 82875 9644 58091 76247 -46014 1831 112376 60998 29273 -87443
792 -87443 -61216 -103461 -108842 -31960 52318 74424 76660 -36214 -36217 24164 -52727 -3166 -13848
779 -13848 37534 105856 81687 31857 111035 44507 -10175 -29889 -26989 -43972 -5262 8398
767 8398 -39605 -99816 -55882 18317 -97272 -63747 23962 -1093 -22789 -100751 54404 29102
755B9102l5945M9979O1431n2241k4650M6981k2494j8114p496O5247j01876N5933
743D5857k6281k8824J2603J1194R7748j2258r6436j00225o0896R2600O3637M6158
731D4877Lq4629j926K786J54183q0682k9077k442N2273O0865o0438r6485O0741
718B0049j4052M1337n2126j17212J12566k749M7773K9666m8037n7961M4006m2022
706c8762O094J20527p2756m5592J7725L7458k3271J3947l1476k2052L872K7866
694f420K5132j26690M9868l0850m106R571O9420Q2050j4937k1189j13603N546
682g6208n502k084o012N4320O3744m3530O8286J2082n2971n9423o4781n96J09364
669c311k9433k5547J762l2220m4358K2633N0938R6335p6811L4985j56445O5438
$$ plain form
755 29102 -6843 43136 104567 52326 27676 74657 52163 34049 26553 91800 -10076 45857
743 45857 19576 -9248 3355 14549 112297 100039 3603 -96622 -157518 -64918 -1281 44877
731 44877 44880 -39749 -41675 -38889 115294 34612 5535 3093 55366 116231 55793 -40692 20049
718 20049 5997 47334 -4792 -122004 -9438 -12187 35586 65252 17215 -40746 3260 -38762
706 -38762 -32668 87859 15103 -30489 -12764 24694 1423 15370 -16106 -38158 -34286 -6420
694 -6420 18712 -107978 -58110 -88960 -93066 -83495 -14075 67975 53038 31849 -81754 -76208
682 -76208 -81710 -83794 -89806 -35486 28258 -15272 53014 65096 12125 -47298 -112079 -112675 -3311
669 -3311 -32744 -58291 -56529 -88749 -133107 -110474 -59536 36799 -40012 -5027 -161472 -96034
657i6034J98720j6517q2052n372l0462R076l6506N4347J08295j25583N3222L2282
645F3416q7572n709J56094m8376j17988M3399M9041K1939K9922l9476j20954J3638
633d2626O3866j1946l7542l2768Q6819N6936K1684k0931M89j6604j5931O0049
621A11495L1881q9631o2227q1746M4222j6499M1846K7664R7411K2997p275J972
609A22110j16967m7531q777q7683N7381m7631Q8378M6005O2626K0630n4365n3070
597a8894L0598P008k079K9033o6975k2833K8360k9281R359N9029J6912P4196q0573
584C3860O1797m6009r2091l3485m2565J5616N4064P0158l1027L0956L9810o9282
572h198m557n6056R1768k4463k2099J0898o1628R5534p9219K4043Q7425q1081
$$ plain form
657 -96034 102686 86169 4117 -1255 -31717 -22641 -59147 -4800 103495 -22088 31134 63416
645 63416 -24156 -29865 126229 77853 -40135 3264 52305 74244 104166 64690 -56264 -42626
633 -42626 21240 9294 -28248 -61016 25803 82739 104423 83492 83981 67377 51446 111495
621 111495 143376 53745 -8482 -90228 -46006 -62505 -20659 7005 104416 127413 120138 122110
609 122110 5143 -42388 -51165 -138848 -81467 -129098 -40720 5285 67911 88541 34176 -18894
597 -18894 11704 18712 16633 45666 -21309 -44142 -15782 -45063 -35704 23325 40237 114433 33860
584 33860 95657 49648 -42443 -75928 -118493 -102877 -48813 21345 -9682 21274 61084 -8198
572 -8198 -12755 -68811 22957 -1506 -23605 -12707 -74335 21199 -58020 -33977 53448 -27633
560b7633J6802M5229J0877o5965j9308O327M3654n3828P4755L1966m9842j5298
548b264k2641O0451o844j30885R5243J41674K4130J1053o4700o3702j07559M4542
536b1502J01391m5254Q7126J8233p6031n2554L0725p2945q9061N0590p3630L4781
524a08131N2081N2299j550j21540K8472J9193R738K6286J02546l2526r6565Q9561
512A9864N5080j4370o4698J3492M6479n9320M0039k2493R7335L3588n0094K3583
500A18485j16112Q5412j02610K2894m3533L267J6445j8277l9932k8123k0351J23293
488H58m4467j09931P3425P9544k3139j2500N4917L4056j1051j46561J17739k1489
476h599J3607J39025j896n3872m6631j095M6359m9147Q9171j37810l2828j0043
$$ plain form
560 -27633 -10831 34398 45275 -20690 -39998 -33671 9983 -43845 30910 62876 13034 -2264
548 -2264 -24905 35546 28702 -102183 -6940 134734 158864 169917 105217 41515 -66044 -21502
536 -21502 79889 34635 121761 139994 63963 11409 42134 -30811 -119872 -69282 -142912 -108131
524 -108131 -56050 -3751 -5301 -126841 -98369 -79176 -69438 -43152 59394 26868 -69697 19864
512 19864 74944 60574 -4124 9368 55847 -3473 36566 14073 111408 144996 94902 118485
500 118485 2373 87785 -14825 8069 -35464 -32197 -15752 -34029 -73961 -102084 -122435 858
488 858 -43609 -153540 -80115 -571 -23710 -36210 18707 52763 41712 -104849 12890 -8599
476 -8599 5008 144033 142137 88265 41634 40539 86898 37751 126922 -10888 -43716 -53759
464e3759L1493M9476j7243m4305m1662K0826R0358q0199J7965J2520K714k816
452a4632Q036l7121j4276m2295n1211O0480O0240M0460j5587J5313l6969J09574
440H2012p2226j6963o4082K2479J11759Q9917j3598m3636n1742l1217q1943o4560
428a33800J85947O0739l9825J4291k7858L6376k8145Q9273l7749N316j04147p9051
416e8633j42955j8536Q7535L9690p7762P2410J01474j296k5331r670J07146o3790
404A0282k4193Q479N6732o7396n2520K0563O270L340m3046n3696J2479P854J3327
391a01525N9755P2693J0357L458l1706R3825Q250j51910M1035q4899L0424k8699
379g8942M1277Q9897j38915m4187M5066P1618M6396j761l1039M6321n2695n2675
$$ plain form
464 -53759 -22266 27210 9967 -34338 -76000 -55174 35184 -45015 -27050 -14530 -11816 -14632
452 -14632 -6596 -43717 -57993 -100288 -151499 -91019 -30779 9681 -5906 9407 -27562 82012
440 82012 9786 -7177 -71259 -48780 62979 152896 139298 95662 43920 12703 -69240 -133800
428 -133800 52147 112886 73061 87352 59494 95870 67725 156998 119249 124565 20418 -58633
416 -58633 -201588 -220124 -132589 -92899 -170661 -98251 3223 1927 -23404 -33074 74072 10282
404 10282 -13911 -5432 51300 -16096 -68616 -48053 -41783 -38443 -81489 -135185 -122706 -114852 -101525
391 -101525 -41770 30923 41280 44738 13032 106857 115107 -36803 4232 -80667 -50243 -78942
379 -78942 -37665 52232 -86683 -130870 -85804 -14186 32210 30449 -590 45731 -6964 -59639
367e9639k8611k4181o0111K9577M0520J70753j6760p7904K526j2184K0354j4250
355b9910K1940j6872N20o116j14201L5474L6738O5417l5250l014N2033j00838
343i4079J18916l4064p1565o4824K8769J64318N3246j39664p5099N7628m5852
332a02270L3611M7314Q7698o4533o2734l8778J10521l8746j6183q992o577M3168
320a6501Q9647P2063r0341k8834J126P1816L2456l2181j01957q0920M9727Q161
308b5738k6853N5496n6955l7376J4879j590J16119l1991m0610k1088p8887J64342
296B9748k4420Q898j35741N0016L011l7016M0619k4682J4243R663k2354P799L8746
283d1470o3820Q5969M7284l1441j50322k6663P9762J43655M6116m5078K9099L1722
$$ plain form
367 -59639 -88250 -112431 -172542 -142965 -102445 68308 51548 -26356 -23830 -36014 -15660 -29910
355 -29910 -7970 -24842 -24322 -30438 -144639 -109165 -72427 -7010 -42260 -45274 6759 -94079
343 -94079 24837 -9227 -80792 -145616 -116847 47471 100717 -38947 -114046 -56418 -102270
332 -102270 -68659 -21345 66353 1820 -60914 -99692 10829 -27917 -44100 -53092 -59669 -16501
320 -16501 73146 145209 54868 26034 27160 98976 131432 99251 -2706 -83626 -33899 -25738
308 -25738 -52591 2905 -54050 -91426 -76547 -78137 37982 5991 -34619 -55707 -134594 29748
296 29748 5328 14226 -121515 -71499 -68488 -105504 -64885 -89567 -75324 -65661 -88015 -80216 -41470
283 -41470 -105290 -19321 27963 -3478 -153800 -180463 -100701 42954 89070 43992 73091 104813
271A04813l0746r1061p852l4489L7803r8467O0059N2447j6809P9604k8940p8040
259e1678L5663l746n6065J5445k903m3976n5030R0522N0022m230J8186M1414N4087
246H7711M2926m7292j10744N3558L5585o8046j393k3251P0765k3127l891n6455
234d3654p580L720P3686n8344o5019L6881p7045k1770M6660J15650L2022n8409
222b3202k03977J5983J21755J4019j9791J7941k1619n1713K2357K4780N5330K8081
210b0056k1708N81Q7567O1353r4723l6860J9502P4479l0794r180O959j75203M3228
197i4855r887P6277k0489L5662j6935n9494K2547J712m7865P4817M7851r3906
185h4565p340N3894r158n2708L3208l8492J21824N7353j7249p6125q716q090L1254
$$ plain form
271 104813 74067 -16994 -24846 -59335 -21532 -119999 -59940 -7493 -24302 55302 26362 -51678
259 -51678 -16015 -19761 -75826 -60381 -63284 -107260 -162290 -71768 -21746 -25976 -7790 33624 87711
246 87711 130637 83345 -27399 26159 61744 -6302 -7695 -30946 39819 16692 12801 -43654
234 -43654 -51234 -47514 26172 -32172 -97191 -60310 -137355 -159125 -112465 3185 35207 -23202
222 -23202 -227179 -211196 -89441 -75422 -95213 -77272 -98891 -150604 -128247 -103467 -48137 -20056
210 -20056 -41764 -41183 46384 107737 13014 -23846 -4344 70135 39341 30161 37120 -138083 -94855
197 -94855 -104742 -28465 -48954 -13292 -30227 -89721 -67174 -65462 -113327 -38510 9341 -84565
185 -84565 -91905 -38011 -47169 -99877 -66669 -105161 16663 74016 56767 -19358 -28074 -36164 -4910
172d910N6398L2337p6145m9124p9724k2577M7275j8372k520J7476M0460J31496
160G2070j11475K8409m7239k5249J48909n4216p4404j19043R6593L7873m2984
149i0756Q5060k0633m378L5290J1707M8803M0118j32573m7983Q5480J8152K1356
137D9643j00670j4841M7251j4602l4061J8145l8019p170L6191Q1485K3071q0985
125c4562o6332J2739l1159n1102O9450J1158N5290Q1718l5756L6070J0668r649
113D8533l6321n4836K3119p8484M4489m8749j3413J16398K9993M677n6350q4937
101a05881o5493M6075l1728J5691Q263J10007k0641o5340O621O2205J9054j441
89b2608K5258N080N786o0446K1009N5522m8747j1950k5182l0259L352K3675K0553
$$ plain form
172 -4910 51488 83825 7680 -41444 -121168 -143745 -96470 -114842 -117362 -99886 -59426 72070
160 72070 -39405 -10996 -58235 -83484 65425 11209 -63195 -182238 -85645 -47772 -90756
149 -90756 -5696 -26329 -30707 4583 16290 65093 105211 -27362 -75345 10135 28287 49643
137 49643 -51027 -65868 -18617 -33219 -67280 -49135 -87154 -94324 -58133 23352 46423 -34562
125 -34562 -100894 -88155 -119314 -170416 -100966 -89808 -34518 47200 11444 47514 58182 48533
113 48533 12212 -42624 -19505 -97989 -53500 -102249 -115662 736 30729 35406 -20944 -105881
101 -105881 -171374 -125299 -157027 -141336 -133073 -23066 -43707 -109047 -102426 -40221 -21167 -22608
89 -22608 2650 7730 13516 -46930 -25921 29601 -19146 -31096 -56278 -86537 -83185 -59510 -38957
76c8957J8693m6477O4676N7646j07028o366O2058Q685o8019L5939L9609n3545
64c3086O2632m4212m2038O8236m2854m0314o7541N1909P671l8541M4086K6829
52d7223L7645J4345k3777P52L3446J3690P707K624o1230n1834o6049N0999N2512
39c6393o5569K6003J4759n9496Q6474L289J6112l6318k101l579K4293j8021N4313
26C766L8103j08181r810L8942J7695o1002J8188K6325j8683j6534L1141K9359
14a0691m1892K8125n1558n9303Q6006Q37L71O5703l8767L331o4658K9077K3190
1c0229k6339
0e6568
$$ plain form
76 -38957 -20264 -66741 -2065 55581 -51447 -57813 4245 12930 -55089 -19150 20459 -33086
64 -33086 29546 -14666 -56704 11532 -31322 -71636 -139177 -87268 -79597 -118138 -74052 -47223
52 -47223 -9578 4767 -19010 -18258 15188 28878 36585 39209 -22021 -73855 -139904 -88905 -36393
39 -36393 -101962 -75959 -61200 -120696 -34222 -30933 -14821 -51139 -53240 -56819 -32526 -50547 3766
26 3766 41869 -66312 -76122 -37180 -19485 -80487 -62299 -35974 -54657 -71191 -40050 -10691
14 -10691 -52583 -24458 -76016 -135319 -49313 -48476 -48105 17598 -21169 -17838 -82496 -53419 -30229
1 -30229 -56568
0 -56568
$$ Imaginary data points
##PAGE= N=2
##DATA TABLE= (X++(I..I)), XYDATA
16383a949206M0668M9440O6105Q837k8090n9587p757J52761k010J3541O6735l4650
16371a683213J863O2777L8366m918k4249M0717P6739L0610O4274l1161N9785K9301
16359a339109j1093k8764K8051L6668q657L9020N3114K4260k0331j6370J16043
16348a127168O7979m4436J5193Q8470J6857m8867l9371J05231K7763N990k5609
16337i57968j5658L4889n6871J58671M5903N8287j6084J17949l393j2946j8546
16326f65767j4094K1532O0939P1280j7162j4260J01415J709l1673Q384M1311J1753
16314d24633m6820M9714r06P2247M6777l5o787j948O648O7748L1006J2463M2729
16301a51797k6729L678J5281m1200R0315J0132k6226R7131M6070O962J0552M7941
$$ plain form
16383 -1949206 -1908538 -1859098 -1792993 -1784156 -1812246 -1871833 -1879590 -1726829 -1728839 -1715298 -1648563 -1683213
16371 -1683213 -1681350 -1618573 -1580207 -1585125 -1609374 -1568657 -1491918 -1461308 -1397034 -1428195 -1368410 -1339109
16359 -1339109 -1350202 -1378966 -1350915 -1314247 -1322904 -1283884 -1230770 -1206510 -1226841 -1243211 -1127168
16348 -1127168 -1059189 -1103625 -1088432 -999962 -983105 -1031972 -1071343 -966112 -938349 -932359 -957968
16337 -957968 -973626 -938737 -995608 -836937 -791034 -732747 -748831 -630882 -634275 -647221 -665767
16326 -665767 -679861 -658329 -597390 -526110 -543272 -557532 -456117 -454408 -486081 -477697 -436386 -424633
16314 -424633 -471453 -421739 -422645 -350398 -303621 -303656 -310443 -312391 -305743 -237995 -206989 -194526 -151797
16301 -151797 -178526 -174848 -159567 -200767 -110452 -100320 -126546 -29415 16655 23617 34169 82110
16289H2110o7456L3890k7912m5711J38347J17466p0466j6958j4759J1208K9046
16278A68805l6602L468M9051R1301L0718J0862m3425p151J5937L5389j6824R6709
16266C98238K8560l825M1918Q7619r21K7112n5149q8199K5076L6636l1521J54085
16254F19629p3496o377N6974J1343m3561n4777Q3711J12081P112p1610p946R6842
16242G29925K9907n4517P3716N7682k8400j3481j7345m3106J23309l5258q099
16231H14333J3064L8735n214J36542n7906k2346k8624J6907N2169R5930j3758
16220A039832j72242J2437N8178J6631J63468m0758P7808J9262j19180K7359l2264
16209A050531O3288l6704O0172j3140J641L3817K0593J3357J8448J8005l9329
$$ plain form
16289 82110 14654 48544 20632 -25079 113268 230734 160268 143310 128551 139759 168805
16278 168805 132203 135671 184722 276023 306741 317603 274178 267027 282964 318353 301529 398238
16266 398238 426798 422973 464891 552510 551589 578701 523552 435353 460429 497065 465544 619629
16254 619629 546133 539756 596730 608073 564512 509735 593446 705527 712639 641029 633083 729925
16242 729925 759832 705315 779031 836713 808313 794832 777487 734381 857690 822432 814333
16231 814333 827397 866132 860918 997460 939554 917208 888584 905491 957660 1053590 1039832
16220 1039832 867590 880027 938205 954836 1118304 1077546 1155354 1174616 1055436 1082795 1050531
16209 1050531 1113819 1077115 1137287 1124147 1125788 1159605 1180198 1193555 1212003 1230008 1190679
16198A190679k9419K4085M9361J13299p8453o2340r5335l9840J30828L0554l3566
16187A199853N9300P0194r6078l6127P1569J5089q3993M3922N0048O8413R4447
16176A456637r2418m6614N3561k2803l9592k6261M749K253M6039j561k3708P5330
16164A385612M519p6088q5858p397O7300J09586q122P1241J5214n5843p4066m2429
16152A303669J37097M3927j4559M645r6854O7567r3899N758L9349p002L2693k1765
16140A400626j1281O258J3402k7008J20881j7200N3379q5553J56704K8435j8890
16129A619753o4871j5278J06457m3413k7003P763L843J1695Q756m4601n5340n4780
16117A452981J19050Q3166n9894j34282M9401N4972K5292J21240m4993o2122o045
$$ plain form
16198 1190679 1161260 1185345 1234706 1348005 1269552 1207212 1111877 1072037 1202865 1233419 1199853
16187 1199853 1259153 1329347 1233269 1197142 1268711 1283800 1199807 1243729 1293777 1362190 1456637
16176 1456637 1364219 1317605 1371166 1348363 1308771 1282510 1287259 1289512 1335551 1333990 1310282 1385612
16164 1385612 1390131 1314043 1228185 1220788 1288088 1397674 1389552 1460793 1476007 1420164 1346098 1303669
16152 1303669 1440766 1484693 1470134 1474779 1377925 1445492 1351593 1357351 1396700 1389698 1422391 1400626
16140 1400626 1389345 1395603 1409005 1381997 1502878 1485678 1539057 1453504 1610208 1638643 1619753
16129 1619753 1554882 1539604 1646061 1602648 1575645 1583408 1587251 1598946 1607702 1563101 1507761 1452981
16117 1452981 1572031 1655197 1595303 1461021 1510422 1565394 1590686 1711926 1666933 1604811 1598766
16106A598766q804J52496j48702L9335M0081M052l918k317J5532O9887o1070j38892
16094A556446j2065K9364M0355K155k6835l6532L4141m9410j1396J4527j0757
16083A529993L9562J6277n057Q5885o5773p7834p3054P1742N0747O5114k7264
16072A610338J33693m2640q2690J36304k0500k7051l4414n6655j1209k1491n8913
16061A524772R715P9496p047n7598k0704R1959L8900n438Q546o9501l0708L2834
16049A595226J9602J07200l5956j27031k8948j3090J20209q1028N9K9530O5708
16038A651481l9012l2208O2205J2575Q351N5528N5198j62889Q6214K7321N3555
16027A778319J07452q5481j49593O1864j933j01275J09470k3636j14127r3385
$$ plain form
16106 1598766 1589962 1742458 1593756 1633091 1673172 1677224 1673306 1670989 1686521 1756408 1695338 1556446
16094 1556446 1544381 1573745 1614100 1616255 1589420 1552888 1587029 1537619 1526223 1540750 1529993
16083 1529993 1569555 1585832 1580775 1666660 1600887 1523053 1449999 1521741 1572488 1637602 1610338
16072 1610338 1744031 1701391 1618701 1755005 1734505 1707454 1673040 1616385 1605176 1583685 1524772
16061 1524772 1534487 1613983 1606936 1549338 1528634 1620593 1659493 1654055 1662601 1593100 1562392 1595226
16049 1595226 1614828 1722028 1686072 1559041 1530093 1517003 1637212 1556184 1556243 1585773 1651481
16038 1651481 1612469 1580261 1642466 1655041 1663392 1718920 1774118 1611229 1697443 1724764 1778319
16027 1778319 1885771 1800290 1650697 1712561 1710628 1609353 1718823 1695187 1581060 1487675
16017A487675J05452j56j23333P9627M6090L1273P655q0418J3690P6464N5710
16006A699729j34699L3890J82607n112l5365p596j36649j25124M9592J5317p5457
15995A461133K3741N1816O0719N6206J01580n7804j36536m325L7937k1969j296
15984A571202N5989K7j134l893n2864M8577m6237P2577k7669k3981O7413k7194
$$ plain form
16017 1487675 1593127 1592971 1469638 1549265 1595355 1626628 1634283 1553865 1567555 1644019 1699729
16006 1699729 1565030 1598920 1781527 1776415 1741050 1733454 1596805 1471681 1521273 1536590 1461133
15995 1461133 1484874 1536690 1597409 1653615 1755195 1697391 1560855 1556530 1594467 1572498 1571202
15984 1571202 1627191 1627218 1626084 1622191 1569327 1617904 1571667 1644244 1616575 1592594 1660007 1632813
$$ [...]
##END NTUPLES=NMR SPECTRUM
##END=
