##TITLE=1H_EC-3289(1)
 CDCl3
 8 sc, 
 20.1.2023
##JCAMPDX= 6.0         $$ Bruker NMR JCAMP-DX V2.0
##DATA TYPE= NMR SPECTRUM
##DATA CLASS= NTUPLES
##ORIGIN= UXNMR, Bruker Analytische Messtechnik GmbH
##OWNER= root
$$ XWIN-NMR		Version 3.5
$$ Fri Jan 20 14:06:21 2023 Russian Standard Time (UT+4h)  she@DPX200
##.OBSERVE FREQUENCY= 200.13135
##.OBSERVE NUCLEUS= ^1H
##.ACQUISITION MODE= SIMULTANEOUS
##.ACQUISITION SCHEME= undefined
##.AVERAGES= 8
##.DIGITISER RES= 18
##SPECTROMETER/DATA SYSTEM= spect
##.PULSE SEQUENCE= zg30
##.SOLVENT NAME= CDCl3
##.SHIFT REFERENCE= (INTERNAL, CDCl3, 0, 15.7568)
##AUDIT TRAIL= $$ (NUMBER, WHEN, WHO, WHERE, WHAT)
$$ ##TITLE= Audit trail, XWIN-NMR		Version 3.5
$$ ##JCAMPDX= 5.01
$$ ##ORIGIN= Bruker BioSpin GmbH
$$ ##OWNER= she
$$ F:/spectra/data/she/nmr/H-F/1/pdata/1/auditp.txt
$$ ##AUDIT TRAIL=  $$ (NUMBER, WHEN, WHO, WHERE, WHAT)
(   1,<2023-01-20 14:05:15.60 +0400>,<she>,<DPX200>,
      <created by zg, POWCHK disabled, PULCHK disabled
       configuration hash MD5:
       00 E9 B6 7A A2 85 ED C7 34 08 36 98 17 FE 4E 26
       data hash MD5: 16K
       F4 A2 4C F9 8A 15 B3 51 E6 43 F0 6F AA DF FA 6B>)
(   2,<2023-01-20 14:05:18.14 +0400>,<she>,<DPX200>,
      <Start of raw data processing
       efp BC_mod = 2 LB = 0.24 FT_mod = 6 PKNL = 1 PHC0 = -19110.26 PHC1 = 8.800791 SI = 16K 
       data hash MD5: 16K
       CF 7F 82 BC 1D C8 8C 9C B5 33 38 3D C4 6B 2D 49>)
(   3,<2023-01-20 14:05:36.14 +0400>,<she>,<DPX200>,
      <pk PHC0 = -0.3333926 PHC1 = 1 
       data hash MD5: 16K
       3E E9 94 84 C6 97 D2 42 EB 1B DD FF 73 9F F7 62>)
(   4,<2023-01-20 14:05:41.67 +0400>,<she>,<DPX200>,
      <abs ABSG = 5 
       data hash MD5: 16K
       AA 36 6E 36 F1 0A C4 32 3D CA 1D 00 0D BA D0 19>)
$$ ##END=
$$ 
$$ hash MD5
$$ 17 D1 36 95 4D 10 24 2B 0C E1 40 38 F6 A3 7E D4
##$RELAX= 
##$RELAX= 
##$RELAX= 
##$RELAX= 
##$RELAX= 
##$RELAX= 
$$ Bruker specific parameters
$$ --------------------------
##$DU= <F:/spectra>
##$EXPNO= 1
##$NAME= <H-F>
##$PROCNO= 1
##$TYPE= <nmr>
##$USER= <she>
##$AMP= (0..31)
100 100 100 100 100 100 100 100 100 100 100 100 100 100 100 100 100 100 
100 100 100 100 100 100 100 100 100 100 100 100 100 100 
##$AQSEQ= 0
##$AQ_mod= 1
##$AUNM= <au_zg>
##$AUTOPOS= <>
##$BF1= 200.13
##$BF2= 200.13
##$BF3= 200.13
##$BF4= 200.13
##$BF5= 200.13
##$BF6= 200.13
##$BF7= 200.13
##$BF8= 200.13
##$BYTORDA= 1
##$CFDGTYP= 0
##$CFRGTYP= 5
##$CHEMSTR= <none>
##$CNST= (0..31)
1 1 145 1 1 1 1 1 1 1 1 1 1 1 1 1 1 1 1 1 1 1 1 1 1 1 1 1 1 1 1 1 
##$CPDPRG= <>
##$CPDPRG1= <>
##$CPDPRG2= <>
##$CPDPRG3= <>
##$CPDPRG4= <mlev>
##$CPDPRG5= <mlev>
##$CPDPRG6= <mlev>
##$CPDPRG7= <mlev>
##$CPDPRG8= <mlev>
##$CPDPRGB= <>
##$CPDPRGT= <>
##$D= (0..31)
0 1.2 0 0 0 0 0 0 0 0.06 0 0.03 0 0 0 0 0.0002 0 0 0 0 0 0 0 0 0 0 0 0 
0 0 0 
##$DATE= 1674209115
##$DBL= (0..7)
120 120 120 120 120 120 120 120 
##$DBP= (0..7)
150 150 150 150 150 150 150 150 
##$DBP07= 0
##$DBPNAM0= <>
##$DBPNAM1= <>
##$DBPNAM2= <>
##$DBPNAM3= <>
##$DBPNAM4= <>
$$ [...]
##$SUBNAM3= <"">
##$SUBNAM4= <"">
##$SUBNAM5= <"">
##$SUBNAM6= <"">
##$SUBNAM7= <"">
##$SUBNAM8= <"">
##$SUBNAM9= <"">
##$SW= 18.05172834244
##$SWIBOX= (0..15)
0 0 2 0 0 0 0 0 0 0 0 0 0 0 0 0 
##$SW_h= 3612.71676300578
##$TD= 16384
##$TD0= 1
##$TE= 0
##$TE2= 300
##$TE3= 300
##$TEG= 300
##$TL= (0..7)
0 120 120 120 120 120 120 120 
##$TP= (0..7)
150 150 150 150 150 150 150 150 
##$TP07= 0
##$TPNAME0= <>
##$TPNAME1= <>
##$TPNAME2= <>
##$TPNAME3= <>
##$TPNAME4= <>
##$TPNAME5= <>
##$TPNAME6= <>
##$TPNAME7= <>
##$TPOAL= (0..7)
0.5 0.5 0.5 0.5 0.5 0.5 0.5 0.5 
##$TPOFFS= (0..7)
0 0 0 0 0 0 0 0 
##$TUNHIN= 0
##$TUNHOUT= 0
##$TUNXOUT= 0
##$USERA1= <user>
##$USERA2= <user>
##$USERA3= <user>
##$USERA4= <user>
##$USERA5= <user>
##$V9= 5
##$VALIST= <valist>
##$VCLIST= <CCCCCCCCCCCCCCC>
##$VD= 0
##$VDLIST= <DDDDDDDDDDDDDDD>
##$VPLIST= <PPPPPPPPPPPPPPP>
##$VTLIST= <TTTTTTTTTTTTTTT>
##$WBST= 1024
##$WBSW= 4
##$XGAIN= (0..3)
0 0 0 0 
##$XL= 0
##$YL= 0
##$YMAX_a= 419108
##$YMIN_a= -619124
##$ZGOPTNS= <>
##$ZL1= 120
##$ZL2= 120
##$ZL3= 120
##$ZL4= 120
##$ABSF1= 15.79206
##$ABSF2= -2.259791
##$ABSG= 5
##$ABSL= 3
##$ALPHA= 0
##$AQORDER= 0
##$ASSFAC= 0
##$ASSFACI= 0
##$ASSFACX= 0
##$ASSWID= 0
##$AUNMP= <proc_1d>
##$AZFE= 0.1
##$AZFW= 0.1
##$BCFW= 0
##$BC_mod= 2
##$BYTORDP= 0
##$COROFFS= 0
##$CY= -3
##$DATMOD= 1
##$DC= 0
##$DFILT= <>
##$DTYPP= 0
##$F1P= 0
##$F2P= 0
##$FCOR= 1
##$FTSIZE= 16384
##$FT_mod= 6
##$GAMMA= 0
##$GB= 0
##$INTBC= 1
##$INTSCL= 3.70164e-10
##$ISEN= 128
##$LB= 0.24
##$LEV0= 0
##$LPBIN= 0
##$MAXI= 10000
##$MC2= 0
##$MEAN= 0
##$ME_mod= 0
##$MI= 1.114404
##$NCOEF= 0
##$NC_proc= -5
##$NLEV= 6
##$NOISF1= 3.799351
##$NOISF2= 2.8
##$NSP= 0
##$NTH_PI= 0
##$NZP= 0
##$OFFSET= 15.75681
##$PC= 1
##$PHC0= -19110.59
##$PHC1= 9.800791
##$PH_mod= 1
##$PKNL= yes
##$PPARMOD= 0
##$PSCAL= 0
##$PSIGN= 0
##$REVERSE= no
##$SF= 200.130002948899
##$SI= 16384
##$SIGF1= 3
##$SIGF2= 2
##$SINO= 5.538805
##$SIOLD= 16384
##$SREGLST= <1H.CDCl3>
##$SSB= 0
##$STSI= 16384
##$STSR= 0
##$SW_p= 3612.71676300578
##$SYMM= 0
##$S_DEV= 0
##$TDeff= 16384
##$TDoff= 0
##$TI= <>
##$TILT= no
##$TM1= 0
##$TM2= 0
##$TOPLEV= 0
##$USERP1= <user>
##$USERP2= <user>
##$USERP3= <user>
##$USERP4= <user>
##$USERP5= <user>
##$WDW= 1
##$XDIM= 16384
##$YMAX_p= 372717817
##$YMIN_p= -164852
$$ End of Bruker specific parameters
$$ ---------------------------------
##NTUPLES= NMR SPECTRUM
##VAR_NAME=  FREQUENCY,     SPECTRUM/REAL,   SPECTRUM/IMAG
##SYMBOL=    X,             R,               I
##VAR_TYPE=  INDEPENDENT,   DEPENDENT,       DEPENDENT
##VAR_FORM=  AFFN,          ASDF,            ASDF
##VAR_DIM=   16384,         16384,           16384
##UNITS=     HZ,            ARBITRARY UNITS, ARBITRARY UNITS
##FACTOR=    0.220516191357247, 1,           1
##FIRST=     3153.41046944841, 0,            0
##LAST=      -459.306293557369, 0,           0
##MIN=       -459.306293557369, -164852,     0
##MAX=       3153.41046944841, 372717817,    0
$$ Real data points
##PAGE= N=1
##DATA TABLE= (X++(R..R)), XYDATA
$$ [...]
$$ plain form
5872 375642 371138 414390 450397 435553 418238 469819 395504 416135 399553 429979 442257 440755
5860 440755 408180 364849 364592 425101 466984 429949 430610 444808 460420 491040 477409 483518 505242
5847 505242 508014 498673 486237 507936 462119 464252 486983 505510 510601 474823 492860 525924
5835 525924 520366 489960 470208 487064 533178 505005 521114 512915 480326 525667 565280 644271
5823 644271 619244 646606 606219 636560 688624 630435 645239 682320 719316 743177 771531 788064
5811 788064 721516 703339 698787 748105 769821 760923 746699 774756 852896 879017 867657 911846
5799 911846 932557 923711 961701 967380 1034529 1062978 1131652 1193909 1222502 1203505 1171631 1176808
5787 1176808 1254917 1332939 1375440 1392793 1396880 1436752 1464426 1480659 1510127 1523178 1525483 1551662
$$ packed form
5872C75642m504M3252L6007j4844j7315N1581p4315K0631j6582L0426J2278j502
5860D40755l2575m3331k57O0509M1883l7035O61J4198J5612L0620j3631O109K1724
5847E05242K772r341j2436K1699m5817K133K2731J8527N091l5778J8037L3064
5835E25924n558l0406j9752J6856M6114k8173J6109q199l2589M5341L9613P8991
5823F44271k5027K7362m0387L0341N2064n8189J4804L7081L6996K3861K8354J6533
5811G88064o6548j8177m552M9318K1716q898j4224K8057P8140K6121j1360M4189
5799I11846K0711q846L7990N679O7149K8449O8674O2257K8593j8997l1874N177
5787A176808P8109P8022M2501J7353M087L9872K7674J6233K9468J3051K305K6179
$$ plain form
5775 1551662 1483288 1479297 1536559 1576673 1562362 1554248 1540889 1550636 1574704 1616328 1595292 1569156
5763 1569156 1635180 1659690 1622711 1676634 1686300 1730596 1774558 1834681 1852297 1843096 1849187 1885286
5751 1885286 1944107 1957376 1933512 1950745 1987601 1990438 2031989 1989736 1973756 2020916 2018951 1929395
5739 1929395 1916245 1881427 1885726 1895121 1940602 1966024 1984038 1985478 2013724 2047740 2026823 2000188
5727 2000188 2008496 2018953 2003359 2004490 2037141 2002020 2002053 1990028 2003155 1990553 2044487 2059842
5715 2059842 2058473 2057672 2106383 2102245 2025921 1955266 1924116 1932934 1926041 1907863 1935597 1923903 1870143
5702 1870143 1867548 1918113 1925326 1929299 1945420 1921753 1887435 1913431 1944784 1951098 2017009 1981041
5690 1981041 1953537 1903317 1932204 1938512 1957259 1939125 1934539 1986969 2007831 2043721 2039594 2071038
$$ packed form
5775A551662o8374l991N7262M0114j4311q114j3359R747K4068M1624k1036k6136
5763A569156O6024K4510l6979N3923R666M4296M3962O0123J7616r201O091L6099
5751A885286N8821J3269k3864J7233L6856K837M1551m2253j5980M7160j965q9556
5739A929395j3150l4818M299R395M5481K5422J8014J440K8246L4016k0917k6635
5727B000188Q308J0457j5594J131L2651l5121L3j2025J3127j2602N3934J5355
5715B059842j369q01M8711m138p6324p0655l1150Q818o893j8178K7734j1694n3760
5702A870143k595N0565P213L973J6121k3667l4318K5996L1353O314O5911l5968
5690A981041k7504n0220K8887O308J8747j8134m586N2430K0862L5890m127L1444
$$ plain form
5678 2071038 2099034 2082013 2073464 2025949 1975652 1949237 1908317 1898651 1915541 1900218 1890508 1883439
5666 1883439 1945056 2005686 1948456 1864030 1839203 1825627 1848393 1774423 1720005 1651427 1587072
5655 1587072 1573071 1552918 1530037 1545982 1536580 1536355 1532830 1541025 1585617 1627848 1689916 1710927
5643 1710927 1722471 1787068 1809142 1882932 1939854 1977917 2042882 2100526 2089653 2131441 2180661
5632 2180661 2208840 2249884 2297959 2372150 2453915 2524016 2572205 2654101 2684994 2676635 2654742 2569843
5620 2569843 2518580 2421601 2346180 2251809 2171897 2164036 2066312 2082873 2093910 2174634 2221121 2275320
5608 2275320 2303487 2359833 2437237 2415985 2378463 2343004 2307262 2298782 2263310 2266949 2246574 2283900
5596 2283900 2218708 2188922 2186583 2171633 2198934 2265606 2333879 2453059 2604674 2830662 3042421
$$ packed form
5678B071038K7996j7021q549m7515n0297k6415m0920r666J6890j5323r710p069
5666A883439O1617O0630n7230q4426k4827j3576K2766p3970n4418o8578o4355
5655A587072j4001k0153k2881J5945r402k25l525Q195M4592M2231O2068K1011
5643A710927J1544O4597K2074P3790N6922L8063O4965N7644j0873M1788M9220
5632B180661K8179M1044M8075P4191Q1765P0101M8189Q1896L0893q359k1893q4899
5620B569843n1263r6979p5421r4371p9912p861r7724J6561J1037Q0724M6487N4199
5608B275320K8167N6346P7404k1252l7522l5459l5742q480l5472L639k0375L7326
5596B283900o5192k9786k339j4950K7301O6672O8273J19180J51615K25988K11759
$$ plain form
5585 3042421 3182683 3202396 3077839 2991310 2841507 2664264 2593878 2616705 2682469 2745340 2732282
5574 2732282 2774203 2776155 2846499 2908019 2910248 2936010 2934442 2882980 2954552 2980806 3037582 3160372
5562 3160372 3301075 3436356 3420512 3410746 3312212 3164210 3044158 2954283 2966225 3020044 3079903
5551 3079903 3111912 3163908 3132339 3104835 3074201 3083506 2949686 2851528 2783850 2760749 2698575
5540 2698575 2635328 2579322 2439972 2336296 2331805 2268879 2222591 2216952 2133888 2086144 2073033
5529 2073033 2086294 2018758 1985265 1944077 1962122 1974082 1984111 1979188 1982656 2007131 2018521 2029974
5517 2029974 2063983 2066532 2082195 2115751 2124077 2148965 2200321 2212709 2274381 2323087 2391558 2418756
5505 2418756 2422005 2442179 2477793 2539638 2530431 2519719 2428499 2413088 2360836 2294220 2283306 2268247
$$ packed form
5585C042421J40262J9713j24557q6529j49803j77243p0386K2827O5764O2871j3058
5574B732282M1921J952P0344O1520K229K5762j568n1462P1572K6254N6776J22790
5562C160372J40703J35281j5844r766r8534j48002j20052q9875J1942N3819N9859
5551C079903L2009N1996l1569k7504l0634R305j33820r8158o7678k3101o2174
5540B698575o3247n6006j39350j03676m491o2926m6288n639q3064m7744j3111
5529B073033J3261o7536l3493m1188J8045J1960J0029m923L468K4475J1390J1453
5517B029974L4009K549J5663L3556Q326K4888N1356J2388O1672M8706O8471K7198
5505B418756L249K0174L5614O1845r207j0712r1220j5411n2252o6616j0914j5059
$$ plain form
5493 2268247 2306029 2307285 2315024 2358496 2354767 2352954 2435582 2488265 2539973 2611631 2630405 2644418
5481 2644418 2666903 2748242 2843387 2888648 2962208 3041405 3151881 3199394 3154992 3082278 3027307
5470 3027307 2911980 2900359 2936126 2868494 2849013 2852673 2917836 2961572 2946361 3024813 3066817
5459 3066817 3173909 3295780 3342210 3391932 3488368 3598362 3699227 3859646 4005032 4156347
5449 4156347 4299751 4449927 4553338 4614208 4615414 4468461 4416379 4304739 4244544 4240553 4259130
5438 4259130 4237679 4239598 4283384 4315332 4390653 4470388 4603078 4724522 4803799 4959101 5110398
5427 5110398 5252108 5389522 5463236 5599818 5716216 5867188 6109193 6330425 6480671 6693376
5417 6693376 6890618 7078297 7288309 7516854 7879520 8340038 8939567 9702497 10671236 11792424
$$ packed form
5493B268247L7782J256P739M3472l729j813Q2628N2683N1708P1658J8774J4013
5481B644418K2485Q1339R5145M5261P3560P9197J10476M7513m4402p2714n4971
5470C027307j15327j1621L5767o7632j9481L660O5163M3736j5211P8452M2004
5459C066817J07092J21871M6430M9722R6436J09994J00865J60419J45386J51315
5449D156347J43404J50176J03411O0870J206j46953n2082j11640o0195l991J8577
5438D259130k1451J919M3786L1948P5321P9735J32690J21444P9277J55302J51297
5427E110398J41710J37414P3714J36582J16398J50972K42005K21232J50246K12705
5417F693376J97242J87679K10012K28545L62666M60518N99529P62930R68739J121188
$$ plain form
5407 11792424 12994678 14016579 14557670 14457718 13866559 13149695 12666793 12384230 12284538
5398 12284538 12299801 12138149 11895468 11466639 10976428 10528917 10143353 9981821 9876361 9885828
5388 9885828 9968642 10107179 10444984 10844220 11319575 11891811 12729210 13770085 15144399
5379 15144399 16807924 18765012 20885652 22727015 23841790 23988220 23420778 22901239 22842949
5370 22842949 23337622 24156198 24803666 24740363 23643921 21616741 19300503 17101396 15330230
5361 15330230 14002029 13015957 12314307 11789251 11373525 11154411 11035378 11025930 11123448 11351503
5351 11351503 11733600 12218184 12874811 13665283 14478007 15236856 15806968 16081481 16292367
5342 16292367 16669597 17305307 18090581 18935759 19459520 19512849 18873568 17712709 16475751
$$ packed form
5407A1792424J202254J021901N41091r9952n91159p16864m82902k82563r9692
5398A2284538J5263j61652k42681m28829m90211m47511l85564j61532j05460R467
5388I885828Q2814J38537L37805L99236M75355N72236Q37399J040875J374314
5379A5144399J663525J957088K120640J841363J114775J46430n67442n19539n8290
5370B2842949M94673Q18576O47468o3303j096442k027180k316238k199107j771166
5361A5330230j328201r86072p01650n25056m15726k19114j19033r448R7518K28055
5351A1351503L82097M84584O56627P90472Q12724P58849N70112K74513K10886
5342A6292367L77230O35710P85274Q45178N23761N3329o39281j160859j236958
$$ plain form
5333 16475751 15370749 14733890 14445710 14419568 14694698 15111824 15419594 15523610 15241425
5324 15241425 14802162 14191056 13583747 13229401 12927486 12682502 12426512 12186510 11883491
5315 11883491 11542085 11159750 10846859 10642608 10542019 10591324 10702839 10820534 11028048 11408329
5305 11408329 11959735 12728839 13637948 14647899 15886459 17310938 18674228 19901890 20856304
5296 20856304 21398638 21656606 21678115 21647029 21668097 21969033 22548231 23266013 23803125 23728633
5286 23728633 22908248 21290739 19274090 17365989 15785201 14590368 13658080 13020146 12512447
5277 12512447 12263707 12088334 12045824 12242362 12622732 13084593 13712806 14415674 15290417 16151021
5267 16151021 16767055 17121251 17380525 17613493 18065829 18725522 19402398 19942239 19950575 19286396
$$ packed form
5333A6475751j105002o36859k88180k6142K75130M17126L07770J04016k82185
5324A5241425m39263o11106o07309l54346l01915k44984k55990k40002l03019
5315A1883491l41406l82335l12891k04251j00589M9305J11515J17695K07514L80281
5305A1408329N51406P69104R09109J009951J238560J424479J363290J227662R54414
5296B0856304N42334K57968K1509l1086K1068L00936N79198P17782N37112p4492
5286B3728633q20385j617509k016649j908101j580788j194833r32288o37934n07699
5277A2512447k48740j75373m2510J96538L80370M61861O28213P02868Q74743Q60604
5267A6151021O16034L54196K59274K32968M52336O59693O76876N39841Q336o64179
$$ plain form
5257 19286396 18033853 16486444 14977535 13572405 12441336 11529434 10782143 10280264 9887210
5248 9887210 9586410 9304136 9190618 9060185 8910859 8827460 8731382 8601048 8556859 8516357
5238 8516357 8605698 8664146 8798311 8935676 9107602 9314986 9604913 9912563 10320891 10773039
5228 10773039 11295933 11905302 12625436 13499222 14547879 15927787 17435264 19067930 20571913
5219 20571913 21882697 22628976 22583285 21999665 21229295 20517816 20244215 20168989 20287648 20402221
5209 20402221 20403170 20305693 20329411 20616771 21226102 22289717 23724881 25530980 27295525 28832966
5199 28832966 29830794 30137647 30288560 30700524 31472836 32486326 33273818 33565371 33177520
5190 33177520 32110163 30755319 29472324 28451715 27772742 27227407 26714119 26179643 25723367
$$ packed form
5257A9286396j252543j547409j508909j405130j131069r11902p47291n01879l93054
5248I887210l00800k82274j13518j30433j49326q3399r6078j30334m4189m0502
5238H516357Q9341N8448J34165J37365J71926K07384K89927L07650M08328M52148
5228A0773039N22894O09369P20134Q73786J048657J379908J507477J632666J503983
5219B0571913J310784P46279m5691n83620p70370p11479k73601p5226J18659J14573
5209B0402221R49r7477K3718K87360O09331J063615J435164J806099J764545J537441
5199B8832966R97828L06853J50913M11964P72312J013490P87492K91553l87851
5190C3177520j067357j354844j282995j020609o78973n45335n13288n34476m56276
$$ plain form
5181 25723367 25500881 25492964 25482923 25484989 25487394 25582698 26077680 27015152 28223416 29475037
5171 29475037 30303818 30403663 29840272 29058243 28368231 28102025 28230904 28666733 28954432 28728594
5161 28728594 27817248 26224284 24379393 22696784 21391626 20545219 19928157 19313663 18579045
5152 18579045 17578082 16439806 15408339 14567360 13942344 13592152 13509064 13613898 13839700
5143 13839700 14148989 14496209 14799583 14976860 15107265 15202986 15371356 15641342 15955086 16123960
5133 16123960 15891229 15108230 13800963 12387549 11112218 10032929 9173368 8485718 8043124
5124 8043124 7641355 7362782 7136352 6908802 6749269 6726138 6740430 6781080 6876340 7045046
5114 7045046 7269178 7509113 7756805 7878672 7861928 7570607 7102933 6578912 6187825 5877344
$$ packed form
5181B5723367k22486p917j0041K066K405R5304M94982R37472J208264J251621
5171B9475037Q28781R9845n63391p82029o90012k66206J28879M35829K87699k25838
5161B8728594r11346j592964j844891j682609j305158q46407o17062o14494p34618
5152A8579045j000963j138276j031467q40979o25016l50192q3088J04834K25802
5143A3839700L09289L47220L03374J77277J30405R5721J68370K69986L13744J68874
5133A6123960k32731p82999j307267j413414j275331j079289q59561o87650m42594
5124H043124m01769k78573k26430k27550j59533k3131J4292M0650R5260J68706
5114G045046K24132K39935K47692J21867j6744k91321m67674n24021l91087l10481
$$ plain form
5104 5877344 5600158 5361857 5253612 5150465 5061020 4970165 4917037 4908112 4826009 4732914 4663366
5093 4663366 4618084 4549472 4517144 4511544 4539264 4555882 4521798 4537266 4603135 4590004 4602013 4656824
5081 4656824 4779909 4883488 4887537 4780556 4664315 4623453 4553653 4434471 4361842 4313586 4316565
5070 4316565 4314067 4299348 4294335 4307783 4285068 4316190 4313428 4397863 4444866 4441462 4492301 4431841
5058 4431841 4428168 4483443 4549500 4613664 4667288 4702872 4726759 4804729 4956718 5121330 5183933
5047 5183933 5206831 5228682 5189479 5130225 5060298 5024404 4926332 4965310 4993987 4960736 4967221 4953846
5035 4953846 4993589 5073610 5138156 5180803 5260857 5334623 5379718 5435458 5528609 5586866 5664542
5024 5664542 5752772 5754997 5737415 5796707 5829984 5870712 5876282 5913083 5939035 5955201 5943735 5997006
$$ packed form
5104E877344k77186k38301j08245j03147q9445r0855n3128q925q2103r3095o9548
5093D663366m5282o8612l2328n600K7720J6618l4084J5468O5869j3131J2009N4811
5081D656824J23085J03579M049j06981j16241m0862o9800j19182p2629m8256K979
5070D316565k498j4719n013J3448k2715L1122k762Q4435M7003l404N0839o0460
5058D431841l673N5275O6057O4164N3624L5584K3887P7970J51989J64612O2603
5047E183933K2898K1851l9203n9254o9927l5894r8072L8978K8677l3251O485j3375
5035D953846L9743Q0021O4546M2647Q0054P3766M5095N5740R3151N8257P7676
5024E664542Q8230K225j7582N9292L3277M0728N570L6801K5952J6166j1466N3271
$$ plain form
5012 5997006 5970364 5991776 6050928 6080964 6195870 6244872 6240647 6295200 6338415 6343263 6369886 6472475
5000 6472475 6625901 6745126 6879931 7036008 7130571 7260768 7252715 7309912 7413772 7519376
4990 7519376 7596725 7605123 7626901 7564315 7420616 7306574 7292681 7179435 7126961 7124901 7144311
4979 7144311 7065384 7066752 7053035 7012495 7042326 7043740 7062739 7137528 7183729 7262211 7347555 7335571
4967 7335571 7392617 7546029 7652091 7736685 7777249 7887027 8042574 8176943 8391973 8603117
4957 8603117 8839567 9145297 9523113 10037447 10556485 11161054 11844536 12572891 13165577 13653047
4947 13653047 14329780 15203429 16323201 17425464 18360277 19145148 20070412 21401014 23098062
4938 23098062 24897803 26135854 26160376 24550229 22128310 19889566 18219232 17056220
$$ packed form
5012E997006k6642K1412N9152L0036J14906M9002m225N4553M3215M848K6623J02589
5000F472475J53426J19225J34805J56077R4563J30197q053N7197J03860J05604
4990G519376P7349Q398K1778o2586j43699j14042j3893j13246n2474k060J9410
4979G144311p8927J368j3717m0540K9831J414J8999P4789M6201P8482Q5344j1984
4967G335571N7046J53412J06062Q4594M0564J09778J55547J34369K15030K11144
4957H603117K36450L05730L77816N14334N19038O04569O83482P28355N92686M87470
4947A3653047O76733Q73649J119772J102263R34813P84871R25264J330602J697048
4938B3098062J799741J238051K4522j610147k421919k238744j670334j163012
$$ plain form
4930 17056220 16263720 15539610 14610483 13488954 12316430 11238327 10337368 9593617 8996054
4921 8996054 8527139 8144228 7848763 7588020 7329637 7100592 6950293 6794162 6788611 6756862
4911 6756862 6741522 6767597 6770577 6865127 6942254 7095193 7318197 7584721 7947620 8400031 8937509
4900 8937509 9707911 10598360 11530480 12205973 12440448 11891713 10735319 9557828 8644821
4891 8644821 7922986 7399882 7000832 6660440 6417953 6276846 6189435 6144595 6086154 6040166
4881 6040166 6007460 5959815 5932220 5850135 5772448 5771919 5741775 5708899 5747881 5806953 5888057 5901856
4869 5901856 5973036 6006069 5989662 5995115 5961360 5958453 5994662 6102081 6250549 6424554 6626946
4858 6626946 6781934 6921815 7160848 7418180 7769081 8052467 8282609 8607104 8952591 9318095
$$ packed form
4930A7056220p92500p24110r29127j121529j172524j078103r00959p43751n97563
4921H996054m68915l82911k95465k60743k58383k29045j50299j56131n551l1749
4911F756862j5340K6075K980R4550P7127J52939K23004K66524L62899M52411N37478
4900H937509P70402Q90449R32120O75493K34475n48735j156394j177491r13007
4891H644821p21835n23104l99050l40392k42487j41107q7411m4840n8441m5988
4881F040166l2706m7645k7595q2085p7687n29l0144l2876L8982N9072Q1104J3799
4869E901856P1180L3033j6407N453l3755k907L6209J07419J48468J74005K02392
4858F626946J54988J39881K39033K57332L50901K83386K30142L24495L45487L65504
$$ plain form
4848 9318095 9707952 10171581 10692614 11240260 11895831 12636073 13375720 14109206 14875096 15796223
4838 15796223 16819336 18073296 19637635 21353667 23295325 25259292 27301349 29638266
4830 29638266 32465364 36206367 41024895 47181371 55261095 65562940 78251153 91748213
4822 91748213 101637632 104980917 96239788 80088950 64773417 52432812 43261827 36436822
4814 36436822 31495797 27751502 24830888 22333666 20355654 18691636 17432616 16446085
4806 16446085 15519081 14572801 13696380 12905395 12281561 11723632 11321954 10948930 10673437
4797 10673437 10419617 10141173 9761914 9400745 9074380 8800283 8530034 8342473 8180379
4788 8180379 8089031 7982766 7823575 7746478 7611814 7451883 7327719 7250809 7282133 7258314
$$ packed form
4848I318095L89857M63629N21033N47646O55571P40242P39647P33486P65890R21127
4838A5796223J023113J253960J564339J716032J941658J963967K042057K336917
4830B9638266K827098L741003M818528O156476Q079724J0301845J2688213J3497060
4822I1748213R889419L343285q741129j6150838j5315533j2340605r170985o825005
4814C6436822m941025l744295k920614k497222j978012j664018j259020r86531
4806A6446085r27004r46280q76421p90985o23834n57929m01678l73024k75493
4797A0673437k53820k78444l79259l61169l26365k74097k70249j87561j62094
4788H180379r1348j06265j59191p7097j34664j59931j24164p6910L1324k3819
$$ plain form
4778 7258314 7204297 7054933 6955314 6773524 6676770 6514478 6318233 6273370 6174210 6042193
4768 6042193 5914675 5712862 5567201 5425967 5289298 5113422 5029841 4957850 4847824 4858054
4758 4858054 4822846 4751351 4702921 4623804 4558858 4533028 4481656 4390396 4335957 4334451 4323990 4295215
4746 4295215 4305041 4225725 4168302 4108869 4034028 3948197 3842928 3762354 3621874 3441936 3302272
4735 3302272 3176199 3092093 2984417 2946575 2914808 2874343 2848069 2794747 2764526 2749174 2692167
4724 2692167 2683885 2728508 2665178 2664440 2668297 2663485 2650335 2638697 2655723 2653263 2632613 2652736 2650508
4711 2650508 2658860 2662091 2686648 2684921 2640426 2620080 2581295 2504623 2369779 2347565 2275343 2232121
4699 2232121 2154030 2125747 2185845 2155532 2160181 2071706 1978964 1987279 1982341 1990953 1966631 1982587
$$ packed form
4778G258314n4017j49364r9619j81790r6754j62292j96245m4863r9160j32017
4768F042193j27518k01813j45661j41234j36669j75876q3581p1991j10026J0230
4758D858054l5208p1495m8430p9117o4946k5830n1372r1260n4439j506j0461k8775
4746D295215R826p9316n7423n9433p4841q5831j05269q0574j40480j79938j39664
4735C302272j26073q4106j07676l7842l1767m0465k6274n3322l0221j5352n7007
4724B692167q282M4623o3330p38L857m812j3150j1638J7026k460k0650K0123k228
4711B650508Q352L231K4557j727m4495k0346l8785p6672j34844k2214p2222m3222
4699B232121p8091k8283O0098l0313M649q8475r2742Q315m938Q612k4322J5956
$$ plain form
4687 1982587 1979233 1943320 1963317 1928912 1861827 1889125 1917313 1864439 1858580 1859171 1839532 1880736
4675 1880736 1901314 1849000 1850508 1771304 1767182 1759510 1769938 1812818 1879045 1890843 1906292 1951958
4663 1951958 2024218 2122742 2180236 2287174 2509205 2707049 2948458 3156234 3267619 3236905
4653 3236905 3092033 2905988 2716960 2542111 2341638 2148451 2001312 1888808 1778227 1724681
4643 1724681 1736065 1747216 1699669 1637258 1628012 1587650 1546323 1484290 1493181 1509589 1528919 1545180
4631 1545180 1547993 1600415 1575281 1542564 1553406 1590949 1609230 1624007 1648504 1649803 1690249 1727093
4619 1727093 1736101 1721346 1712483 1763328 1819257 1887223 1952096 2004134 2050533 2102486 2172045 2317130
4607 2317130 2449902 2625043 2820446 3086677 3325391 3661700 4109590 4688347 5387917 6233988
$$ packed form
4687A982587l354l5913J9997l4405o7085K7298K8188n2874n859N91j9639M1204
4675A880736K0578n2314J508p9204m122p672J0428M2880O6227J1798J5449M5666
4663A951958P2260R8524N7494J06938K22031J97844K41409K07776J11385l0714
4653C236905j44872j86045j89028j74849k00473j93187j47139j12504j10581n3546
4643A724681J1384J1151m7547o2411r246m0362m1327o2033Q891J6408J9330J6261
4631A545180K813N2422k5134l2717J0842L7543J8281J4777K4497J299M0446L6844
4619A727093R008j4755q863N0845N5929O7966O4873N2038M6399N1953O9559J45085
4607B317130J32772J75141J95403K66231K38714L36309M47890N78757O99570Q46071
$$ plain form
4597 6233988 7280308 8293200 9037073 9211332 8484102 7185530 5993385 5017343 4292396
4588 4292396 3676359 3219129 2892715 2595781 2359705 2223360 2104596 1973958 1877211 1826232
4578 1826232 1698765 1637719 1587975 1544428 1514420 1459126 1436162 1386426 1357307 1312474 1235243
4567 1235243 1193565 1164442 1109250 1143859 1133284 1079970 1060601 1098928 1102450 1075973 1064754 1049339
4555 1049339 1060725 1033472 1015766 998205 976528 918458 885528 903553 896326 922416 908961 920454
4543 920454 890781 843312 879231 889695 917552 850783 870671 935021 999591 1041529 1062499 1062386
4531 1062386 1036061 1041288 1053970 1065566 1046326 1073759 1037238 1060425 1022465 983730 980463 961566
4519 961566 942033 958002 966980 946278 996233 1031060 1030063 1077542 1024928 1074369 1140153 1200277
$$ packed form
4597F233988J046320J012892P43873J74259p27230j298572j192145r76042p24947
4588D292396o16037m57230l26414k96934k36076j36345j18764j30638r6747n0979
4578A826232j27467o1046m9744m3547l0008n5294k2964m9736k9119m4833p7231
4567A235243m1678k9123n5192L4609j0575n3314j9369L8327L522k6477j1219j5415
4555A049339J1386k7253j7706j7561k1677n8070l2930J8025p227K6090j3455J1493
4543I20454k9673m7469L5919J0464K7857o6769J9888O4350O4570M1938K0970j13
4531A062386k6325N227J2682J1596j9240K7433l6521K3187l7960l8735l267j8897
4519I61566j9533J5969Q978k0702M9955L4827r97M7479n2614M9441O5784O0124
$$ plain form
4507 1200277 1272764 1346687 1365380 1415604 1412468 1371089 1304414 1268959 1206863 1169368 1182602 1130333
4495 1130333 1084282 1035750 1009918 945493 941070 893661 873712 898036 850245 779885 813034 829703
4483 829703 807141 812864 845917 894019 898059 893034 889064 870087 874833 826843 832916 871880 882872
4470 882872 895794 877695 851029 885875 947100 1027471 1024285 1111809 1116009 1086622 1055096 966272
4458 966272 969205 992442 975831 927323 911818 933087 909013 842896 876902 879432 888648 867694
4446 867694 833393 862539 902615 936501 952545 962985 999642 981354 998437 1034584 1050831 1091732
4434 1091732 1063983 1056556 1077360 1091139 1060673 1066961 1081188 1053297 1014427 1008328 977144 945244
4422 945244 957015 970050 962354 925175 914884 922300 914538 883789 902004 924590 882445 861972
$$ packed form
4507A200277P2487P3923J8693N0224l136m1379o6675l5455o2096l7495J3234n2269
4495A130333m6051m8532k5832o4425m423m7409j9949K4324m7791p0360L3149J6669
4483H29703k2562N723L3053M8102M040n025l970j8977M746m7990O073L8964J0992
4470H82872J2922j8099k6666L4846O1225Q0371l186Q7524M200k9387l1526q8824
4458I66272K933K3237j6611m8508j5505K1269k4074o6117L4006K530R216k0954
4446H67694l4301K9146M0076L3886J6044J0440L6657j8288J7083L6147J6247M0901
4434A091732k7749p427K0804J3779l0466O288J4227k7891l8870o099l1184l1900
4422I45244J1771J3035p696l7179j0291P416p762l0749J8215K2586m2145k0473
$$ plain form
4410 861972 854797 885028 910381 889266 861996 859707 923211 931944 895593 918366 943115 898061
4398 898061 860443 885102 908190 905273 903392 891024 875792 880051 926570 957445 929273 895546
4386 895546 876364 913816 907653 910528 908435 890841 854368 847395 802670 815063 851912 838829
4374 838829 935940 923452 904528 908291 930295 924441 901290 913349 930261 921408 920301 926491 968695
4361 968695 946045 993112 1027378 962914 930846 931212 928160 942029 1001151 1041534 1008533 972036
4349 972036 986844 995706 1002473 1014430 1065408 1053215 1094611 1080730 1140041 1127767 1094938 1088661
4337 1088661 1104600 1120394 1109460 1083223 1098473 1121305 1110876 1134530 1158756 1139314 1163840
4326 1163840 1168781 1175013 1176497 1155682 1196002 1167611 1121075 1129971 1194346 1213831 1218872 1222507 1260211
$$ packed form
4410H61972p175L0231K5353k1115k7270k289O3504Q733l6351K2773K4749m5054
4398H98061l7618K4659K3088k917j881j2368j5232M259M6519L0875k8172l3727
4386H95546j9182L7452o163K875k093j7594l6473o973m4725J2393L6849j3083
4374H38829R7111j2488j8924L763K2004n854k3151J2059J6912q853j107O190M2204
4361I68695k2650M7067L4266o4464l2068L66l052J3869N9122M0383l3001l6497
4349I72036J4808Q862O767J1957N0978j2193M1396j3881N9311j2274l2829o277
4337A088661J5939J5794j0934k6237J5250K2832j0429K3654K4226j9442K4526
4326A163840M941O232J484k0815M0320k8391m6536Q896O4375J9485N041L635L7704
$$ plain form
4313 1260211 1193160 1199537 1221596 1196427 1229153 1197165 1219730 1213383 1216582 1327971 1281104 1282214
4301 1282214 1322591 1313868 1312076 1338235 1281565 1248353 1283323 1249955 1195685 1168416 1205708 1233285
4289 1233285 1319341 1354116 1299587 1217839 1159788 1151859 1117908 1104298 1079858 1041213 1015022 1046111
4277 1046111 1017353 1048679 1080549 1023448 1010328 955041 953713 948019 915918 933269 873784 851783
4265 851783 868766 888470 882742 823436 804885 829814 818567 789865 759273 773034 766135 724240
4253 724240 753083 734319 706753 661168 722991 765217 737824 751850 734403 716884 652214 665461
4241 665461 724186 687699 635155 688232 682924 683803 712438 704777 693175 671219 693229 703823
4229 703823 721715 691201 673129 718196 695386 758716 748638 716166 748699 737531 710958 680995
$$ packed form
4313A260211o7051O377K2059k5169L2726l1988K2565o347L199J11389m6867J110
4301A282214M0377q723j792K6159n6670l3212L4970l3368n4270k7269L7292K7577
4289A233285Q6056L4775n4529q1748n8051p929l3951j3610k4440l8645k6191L1089
4277A046111k8758L1326L1870n7101j3120n5287j328n694l2101J7351n9485k2001
4265H51783J6983J9704n728n9306j8551K4929j1247k8702l0592J3761o899m1895
4253G24240K8843j8764k7566m5585O1823M2226k7393J4026j7447j7519o4670J3247
4241F65461N8725l6487n2544N3077n308Q79K8635p661j1602k1956K2010J0594
4229G03823J7892l0514j8072M5067k2810O3330j0078l2472L2533j1168k6573k9963
$$ plain form
4217 680995 671322 670396 717644 736841 675935 674734 669027 701172 717682 718513 689945 668525 713347
4204 713347 693916 631992 544057 663371 731363 735794 767232 765341 793669 800506 768484 787461
4192 787461 733624 750649 762694 732628 714015 734491 831369 838838 791241 798908 797097 807395
4180 807395 806905 803020 790240 812207 813473 844355 899081 957927 898515 889470 921571 874222 837585
4167 837585 889894 943704 981634 969997 957842 994861 1006335 1036635 1069002 1043329 1055124 1081635
4155 1081635 1045284 1097766 1118784 1196354 1267422 1295094 1316971 1362501 1402796 1477538 1507278
4144 1507278 1583298 1730499 1862036 1991566 2108636 2192861 2194680 2030170 1897161 1838738
4134 1838738 1783297 1716189 1672351 1691016 1746862 1718807 1708921 1746235 1792978 1802840 1766813 1831723
$$ packed form
4217F80995r673r26M7248J9197o0906j201n707L2145J6510Q31k8568k1420M4822
4204G13347j9431o1924q7935J19314O7992M431L1438j891K8328O837l2022J8977
4192G87461n3837J7025J2045l0066j8613K0476R6878P469m7597P667j811J0298
4180H07395m90l885j2780K1967J266L0882N4726N8846n9412r045L2101m7349l6637
4167H37585N2309N3810L7930j1637j2155L7019J1474L0300L2367k5673J1795K6511
4155A081635l6351N2482K1018P7570P1068K7672K1877M5530M0295P4742K9740
4144A507278P6020J47201J31537J29530J17070Q4225J819j64510j33009n8423
4134A838738n5441o7108m3838J8665N5846k8055r886L7314M6743R862l6027O4910
$$ plain form
4122 1831723 1852651 1897133 1941541 2009696 2005907 2020959 2041481 2074292 2129701 2196987 2233559 2287137
4110 2287137 2356777 2374803 2480149 2549978 2605288 2631843 2724375 2866576 2951437 2996760 3061126
4099 3061126 3187838 3325439 3441416 3562431 3648990 3806431 3962089 4134124 4298738 4502021
4089 4502021 4684032 4899379 5112086 5413467 5700478 5950742 6191195 6468883 6793737 7098483
4079 7098483 7421821 7788706 8178993 8683925 9208141 9766249 10320831 10867533 11440158 11934752
4069 11934752 12417327 12894050 13339297 13762759 14228936 14629625 15155788 15835435 16626507
4060 16626507 17496077 18357241 19225853 20024708 20640779 21157937 21560598 21790178 21918026
4051 21918026 21972032 22003482 22073618 22242233 22686770 23253514 23975109 24638764 25233276 25724488
$$ packed form
4122A831723K0928M4482M4408O8155l789J5052K0522L2811N5409O7286L6572N3578
4110B287137O9640J8026J05346O9829N5310K6555R2532J42201Q4861M5323O4366
4099C061126J26712J37601J15977J21015Q6559J57441J55658J72035J64614K03283
4089D502021J82011K15347K12707L01381K87011K50264K40453K77688L24854L04746
4079G098483L23338L66885L90287N04932N24216N58108N54582N46702N72625M94594
4069A1934752M82575M76723M45247M23462M66177M00689N26163O79647P91072
4060A6626507Q69570Q61164Q68612P98855O16071N17158M02661K29580J27848
4051B1918026N4006L1450P0136J68615M44537N66744P21595O63655N94512M91212
$$ plain form
4041 25724488 25978065 26014550 25863611 25482462 24947584 24258869 23585866 22972521 22557527 22370836
4031 22370836 22361408 22385224 22391480 22425291 22243790 21892859 21378855 20778469 20019294 19072673
4021 19072673 18128229 17186508 16377868 15737158 15237280 14791073 14362307 14036593 13698511
4012 13698511 13257142 12837642 12326270 11715694 11075332 10411476 9789463 9207182 8698053
4003 8698053 8251243 7847308 7448870 7147710 6801897 6555483 6268980 5959861 5700296 5412266
3993 5412266 5041482 4811428 4596455 4312329 4160844 3908121 3762469 3609555 3436616 3274402
3983 3274402 3154866 3051114 2966450 2848642 2705935 2635357 2530877 2493909 2392973 2384847
3973 2384847 2362504 2207236 2112684 2047647 1993328 1982353 1856257 1782483 1699381 1628103 1590684
$$ packed form
4041B5724488K53577L6485j50939l81149n34878o88715o73003o13345m14994j86691
4031B2370836r428K3816O256L3811j81501l50931n14004o00386p59175r46621
4021A9072673r44444r41721q08640o40710m99878m46207m28766l25714l38082
4012A3698511m41369m19500n11372o10576o40362o63856o22013n82281n09129
4003H698053m46810m03935l98438l01160l45813k46414k86503l09119k59565k88030
3993E412266l70784k30054k14973k84126j51485k52723j45652j52914j72939j62214
3983C274402j19536j03752q4664j17808j42707p0578j04480l6968j00936q126
3973B384847k2343j55268r4552o5037n4319j0975j26096p3774q3102p1278l7419
$$ plain form
3962 1590684 1504966 1485918 1450169 1403277 1397100 1385701 1304865 1218118 1236430 1261198 1189610 1204489
3950 1204489 1189084 1173983 1203483 1195923 1202472 1211994 1180773 1109753 1036428 1006676 969347 966427
3938 966427 963763 974088 936910 870194 833633 818487 805649 845587 866484 873079 829031 786324
3926 786324 817405 794211 741036 762201 763634 735269 785780 798429 798448 764318 776857 714606
3914 714606 696430 618249 643113 673418 649515 692259 662659 648565 642869 588356 578494 589020
3902 589020 570512 559807 584703 553788 569019 617436 616601 563334 574789 585648 570474 533170
3890 533170 484901 476195 499855 528591 585605 592990 603681 579173 547450 511489 495867 523220
3878 523220 493471 495671 494350 471893 463812 453545 433803 455448 449439 469721 502548 493422 503601
$$ packed form
3962A590684q5718j9048l5749m6892o177j1399q0836q6747J8312K4768p1588J4879
3950A204489j5405j5101K9500p560O549R522l1221p1020p3325k9752l7329k920
3938I66427k664J0325l7178o6716l6561j5146j2838L9938K0897O595m4048m2707
3926G86324L1081k3194n3175K1165J433k8365N0511J2649J9l4130J2539o2251
3914G14606j8176p8181K4864L0305k3903M2744k9600j4094n696n4513r862J0526
3902E89020j8508j0705K4896l0915J5231M8417q35n3267J1455J0859j5174l7304
3890E33170m8269q706K3660K8736N7014P385J0691k4508l1723l5961j5622K7353
3878E23220k9749K200j321k2457q081j0267j9742K1645o009K0282L2827r126J0179
$$ plain form
3865 503601 550635 484663 485547 501638 463071 481450 479324 475892 536178 516315 527096 505466
3853 505466 524515 539081 525725 500941 539440 493646 511560 575836 555655 559138 577868 582219
3841 582219 552269 458520 535038 593704 593102 589788 630283 626764 690082 658513 618139 611455 587930
3828 587930 662284 706062 699671 725374 728114 700689 744223 735355 739948 794484 835393 891910
3816 891910 899170 901334 907418 904233 954084 997338 949971 910264 924797 993332 1024939 968430
3804 968430 985648 975720 1007776 996928 1021819 1026004 1037743 1011998 1028464 1012470 975062 993055
3792 993055 970702 974076 976406 992000 1030789 1017161 1061196 1047094 1081476 1043412 1066400 1044989
3780 1044989 1023005 1104910 1157083 1127478 1148620 1220161 1224623 1267602 1276292 1260011 1320175 1393582
$$ packed form
3865E03601M7034o5972Q84J6091l8567J8379k126l432O0286j9863J0781k1630
3853E05466J9049J4566j3356k4784L8499m5794J7914O4276k0181L483J8730M351
3841E82219k9950r3749P6518N8666o02l314M0495l519O3318l1569m0374o684k3525
3828E87930P4354M3778o391K5703K740k7425M3534q868M593N4536M0909N6517
3816H91910P260K164O084l185M9851M3254m7367l9707J4533O8535L1607n6509
3804I68430J7218r928L2056j0848K4891M185J1739k5745J6466j5994l7408J7993
3792I93055k2353L374K330J5594L8789j3628M4035j4102L4382l8064K2988k1411
3780A044989k1984Q1905N2173k9605K1142P1541M462M2979Q690j6281O0164P3407
$$ plain form
3768 1393582 1408028 1404257 1489081 1571509 1668255 1713677 1835428 1942193 2035521 2101007 2101957 2130239
3756 2130239 2111109 2007024 1957607 1948151 1925911 1921091 1868028 1844543 1832901 1800560 1799352 1817376
3744 1817376 1829658 1855147 1824586 1837565 1835690 1857743 1886709 1919678 1988806 2048347 2072607 2122671
3732 2122671 2136479 2156825 2172276 2104605 2072852 2045769 2003297 1938804 1859545 1809556 1763490
3721 1763490 1683745 1665158 1641066 1565902 1506850 1548723 1544875 1533622 1519390 1493780 1470672 1412149
3709 1412149 1385480 1355157 1372373 1294314 1224949 1179856 1194338 1148283 1053803 1048937 1037313 1032343
3697 1032343 1021801 1024801 977705 943706 944197 934848 943290 918916 948082 917278 917882 893732 911842
3684 911842 894436 896254 873381 902377 845488 839294 881045 852730 826236 831867 870160 863325
$$ packed form
3768A393582J4446l771Q4824Q2428R6746M5422J21751J06765R3328O5486R50K8282
3756B130239j9130j04085m9417r456k2240m820n3063k3485j1642l2341j208J8024
3744A817376J2282K5489l0561J2979j875K2053K8966L2969O9128N9541K4260N0064
3732B122671J3808K0346J5451o7671l1753k7083m2472o4493p9259m9989m6066
3721A763490p9745j8587k4092p5164n9052M1873l848j1253j4232k5610k3108n8523
3709A412149k6669l0323J7216p8059o9365m5093J4482m6055r4480m866j1624m970
3697A032343j0542L000m7096l3999M91r349Q442k4374K9166l0804O04k4150J8110
3684I11842j7406J818k2873K8996n6889o194M1751k8315k6494N631L8293o835
$$ plain form
3672 863325 824024 821452 837731 787120 835899 866905 833618 835652 881770 915649 868147 844103
3660 844103 877399 885802 933013 915559 933217 904332 871124 919529 902592 907698 929365 924705
3648 924705 934072 933210 920461 884902 899634 912718 985441 986680 987820 984234 971199 1007955 1000190
3635 1000190 1014491 1024285 1028810 1018067 1003163 1007718 1033646 1032622 1013518 1001755 987108 1018176
3623 1018176 1095747 1123332 1129292 1126580 1138650 1160532 1204710 1215600 1264347 1350997 1398263 1406503
3611 1406503 1426154 1391352 1392776 1436051 1479147 1502439 1568709 1624261 1579466 1571104 1611430 1628035
3599 1628035 1618686 1603781 1606332 1592512 1643037 1649414 1662256 1716044 1729453 1745309 1772653 1798324
3587 1798324 1762130 1695231 1696164 1777171 1748354 1750053 1755919 1812650 1839817 1793747 1784732 1848291
$$ packed form
3672H63325l9301k572J6279n0611M8779L1006l3287K034M6118L3879m7502k4044
3660H44103L3296Q403M7211j7454J7658k8885l3208M8405j6937N106K1667m660
3648I24705R367q62j2749l5559J4732J3084P2723J239J140l586j3035L6756p765
3635A000190J4301R794M525j0743j4904M555K5928j024j9104j1763j4647L1068
3623A018176P7571K7585N960k712J2070K1882M4178J0890M8747Q6650M7266Q240
3611A406503J9651l4802J424M3275M3096K3292O6270N5552m4795q362M0326J6605
3599A628035r349j4905K551j3820N0525O377J2842N3788J3409J5856K7344K5671
3587A798324l6194o6899R33Q1007k8817J699N866N6731K7167m6070r015O3559
$$ plain form
3575 1848291 1851900 1892515 1944806 1982093 2030873 2113230 2121495 2118291 2146038 2195710 2225541 2261824
3563 2261824 2313377 2363118 2371251 2387973 2430925 2504000 2565470 2581229 2591377 2658908 2774392
3552 2774392 2821614 2903172 2969641 3053723 3166463 3287728 3417616 3588030 3698398 3820185
3542 3820185 3953666 4044898 4254301 4417578 4461798 4559257 4577966 4625333 4699189 4727672 4689725
3531 4689725 4688404 4790878 4898614 4986099 4915402 4907481 4986679 5027842 4986114 4958841 4956274 4955896
3519 4955896 4956082 4929515 4885818 4901821 4790242 4659009 4592275 4543831 4516807 4438869 4450037
3508 4450037 4399585 4349455 4323136 4311016 4341949 4273409 4274957 4266910 4255578 4306738 4389856 4454533
3496 4454533 4461482 4451127 4516213 4591939 4644492 4704974 4731172 4763539 4832591 4856700 4863855 4938432
$$ packed form
3575A848291L609M0615N2291L7287M8780Q2357Q265l204K7747M9672K9831L6283
3563B261824N1553M9741Q133J6722M2952P3075O1470J5759J0148O7531J15484
3552B774392M7222Q1558O6469Q4082J12740J21265J29888J70414J10368J21787
3542C820185J33481R1232K09403J63277M4220R7459J8709M7367P3856K8483l7947
3531D689725j321J02474J07736Q7485p0697p921P9198M1163m1728k7273k567l78
3519D955896J86k6567m3697J6003j11579j31233o6734m8444k7024p7938J1168
3508D450037n0452n0130k6319j2120L0933o8540J548q047j1332N1160Q3118O4677
3496D454533O949j0355O5086P5726N2553O0482K6198L2367O9052K4109P155P4577
$$ plain form
3484 4938432 4982925 5002527 5018084 5081300 5162702 5141074 5131582 5185910 5244336 5331566 5407774 5465036
3472 5465036 5481264 5597836 5661662 5832747 5974576 6047658 6132528 6264134 6444489 6527365
3462 6527365 6671351 6797160 6840524 6934501 7064467 7175973 7262111 7355398 7451893 7559241
3452 7559241 7631161 7724948 7781502 7860430 7928564 8001563 8040115 7994856 7996333 8041997 8092144 8140167
3440 8140167 8180451 8234295 8267464 8265752 8267736 8274840 8273234 8271986 8283297 8288377 8228626 8219939 8274345
3427 8274345 8250417 8256419 8321838 8317338 8403171 8475507 8574941 8653513 8762562 8957421 9105694
3416 9105694 9243872 9418370 9673638 9944484 10262341 10643247 10881880 10910921 10869348 10737514
3406 10737514 10611328 10608569 10642252 10666048 10669813 10709786 10789166 10825139 10900820 11030245 11126384
$$ packed form
3484D938432M4493J9602J5557O3216Q1402k1628r492N4328N8426Q7230P6208N7262
3472E465036J6228J16572O3826J71085J41829P3082Q4870J31606J80355Q2876
3462F527365J43986J25809M3364R3977J29966J11506Q6138R3287R6495J07348
3452G559241P1920R3787N6554P8928O8134P2999L8552m5259J477M5664N0147M8023
3440H140167M0284N3844L3169j712J984P104j606j248J1311N080n9751q687N4406
3427H274345k3928O002O5419m500Q5833P2336R9434P8572J09049J94859J48273
3416I105694J38178J74498K55268K70846L17857L80906K38633K9041m1573j31834
3406A0737514j26186k759L3683K3796L765L9973P9380L5973P5681J29425R6139
$$ plain form
3395 11126384 11211922 11351169 11456703 11529668 11630571 11680698 11713322 11767949 11800645 11863809 12019929
3384 12019929 12297698 12580124 12985161 13403890 13960519 14522404 14953758 15185664 15020866
3375 15020866 14762363 14571699 14460534 14492158 14628219 14907037 15175082 15519383 15966809 16390046
3365 16390046 16802730 17230836 17658741 18064146 18537431 18989158 19431115 19845328 20247046
3356 20247046 20671558 21194422 21708611 22133534 22628115 23149146 23779755 24360389 24992468
3347 24992468 25736322 26360631 26807812 27184314 27466513 27823444 28231431 28713021 29390858
3338 29390858 30155053 31021382 32013516 33196595 34618077 36329480 38279476 40448829 43006623
3329 43006623 45739796 48713542 51779007 54746957 57534352 59970897 61997853 63641434
$$ packed form
3395A1126384Q5538J39247J05534P2965J00903N0127L2624N4627L2696O3164J56120
3384A2019929K77769K82426M05037M18729N56629N61885M31354K31906j64798
3375A5020866k58503j90664j11165L1624J36061K78818K68045L44301M47426M23237
3365A6390046M12684M28106M27905M05405M73285M51727M41957M14213M01718
3356B0247046M24512N22864N14189M24923M94581N21031O30609N80634O32079
3347B4992468P43854O24309M47181L76502K82199L56931M07987M81590O77837
3338B9390858P64195Q66329R92134J183079J421482J711403J949996K169353K557794
3329D3006623K733173K973746L065465K967950K787395K436545K026956J643581
$$ plain form
3321 63641434 64770929 65377462 65571968 65470387 65283907 65068471 64943272 65083279 65424165
3312 65424165 65928931 66447910 66945183 67173728 67014101 66514306 65547660 64002818 62066844
3303 62066844 59761297 57151084 54462284 51754491 49241271 46847540 44785499 42892845
3295 42892845 41227416 39772928 38541904 37484003 36664152 36002038 35443860 34960251 34680440
3286 34680440 34582955 34488832 34579376 34745194 35007631 35383121 35847405 36516203 37328547 38126476
3276 38126476 39084236 40203571 41520774 42976463 44576313 46438823 48425503 50708462
3268 50708462 53305625 56156443 59318998 62940809 66923363 71415564 76370243 81820546
3260 81820546 87832045 94317548 101218959 108466211 115695045 122729104 129249147 134934272
$$ packed form
3321F3641434J129495O06533J94506j01581j86480k15436j25199J40007L40886
3312F5424165N04766N18979M97273K28545j59627m99795r66646j544842j935974
3303F2066844k305547k610213k688800k707793k513220k393731k062041j892654
3295D2892845j665429j454488j231024j057901q19851o62114n58178m83609k79811
3286C4680440r7485r4123R0544J65818K62437L75490M64284O68798Q12344P97929
3276C8126476R57760J119335J317203J455689J599850J862510J986680K282959
3268E0708462K597163K850818L162555L621811L982554M492201M954679N450303
3260H1820546O011499O485503O901411P247252P228834P034059O520043N685125
$$ plain form
3252 134934272 139529682 143026853 145440035 146828062 147350027 147216969 146600234 145874458 145275448
3243 145275448 144895617 144833959 144970905 145044637 144834958 144008634 142350756 139791364 136249659
3234 136249659 131846263 126586074 120701990 114342156 107717022 101256866 95134333 89562127
3226 89562127 84675946 80420833 76754856 73540315 70651023 67955815 65424192 62981274
3218 62981274 60606829 58279335 56114517 54063442 52139958 50225072 48443476 46710415
3210 46710415 45066191 43542771 42131201 40825519 39566272 38428399 37447922 36485735
3202 36485735 35687866 34954425 34293939 33740999 33160285 32659208 32349903 32006800 31692587
3193 31692587 31498015 31367315 31264832 31263463 31427055 31524721 31643771 31733868 31857929 32104140
$$ packed form
3252A34934272M595410L497171K413182J388027N21965j33058o16735p25776n99010
3243A45275448l79831o1658J36946P3732k09679q26324j657878k559392l541705
3234A36249659m403396n260189n884084o359834o625134o460156o122533n572206
3226H9562127m886181m255113l665977l214541k889292k695208k531623k442918
3218F2981274k374445k327494k164818k051075j923484j914886j781596j733061
3210D6710415j644224j523420j411570j305682j259247j137873r80477r62187
3202C6485735p97869p33441o60486n52940n80714n01077l09305l43103l14213
3193C1692587j94572j30700j02483j369J63592R7666J19050R0097J24061K46211
$$ plain form
3183 32104140 32367607 32669236 33012965 33395979 33823238 34181547 34530434 34767618 34988814
3174 34988814 35205919 35372286 35499772 35585083 35611672 35595752 35594936 35610915 35614000 35730154 35961856
3163 35961856 36246868 36626909 37092370 37705236 38334302 39001921 39717501 40495308 41352151
3154 41352151 42131823 42838010 43485400 44089152 44722651 45328221 45986081 46516187 47055509
3145 47055509 47706744 48399380 49136627 49885373 50816001 51853510 52902180 54080397 55510983
3136 55510983 57194985 59240291 61807241 64896602 68451092 72507958 77053305 81909668
3128 81909668 86951228 91999021 96989741 101824293 106491627 110973936 115172005 118966286
3120 118966286 122217179 124694355 126297302 127219501 127495102 127161140 126428081 125243725 123699747
$$ packed form
3183C2104140K63467L01629L43729L83014M27259L58309L48887K37184K21196
3174C4988814K17105J66367J27486Q5311K6589j5920q16J5979L085J16154K31702
3163C5961856K85012L80041M65461O12866O29066O67619P15580P77807Q56843
3154D1352151P79672P06187O47390O03752O33499O05570O57860N30106N39322
3145D7055509O51235O92636P37247P48746R30628J037509J048670J178217J430586
3136E5510983J684002K045306K566950L089361L554490M056866M545347M856363
3128H1909668N041560N047793M990720M834552M667334M482309M198069L794281
3120A18966286L250893K477176J602947R22199K75601l33962p33059j184356j543978
$$ plain form
3111 123699747 121851033 119765452 117518208 115153381 112605826 109911711 107185338 104309267
3103 104309267 101373789 98354742 95362068 92489406 89801431 87280901 84982599 82798763
3095 82798763 80713427 78710538 76778991 74977035 73212185 71433992 69620101 67620309
3087 67620309 65491467 63413913 61474663 59694273 58199693 56850893 55792236 55029412
3079 55029412 54535781 54328499 54337944 54566573 54995193 55593044 56117298 56655418 57106857 57290290
3069 57290290 57252805 56858394 56171004 55194501 53891965 52413376 50734031 48872820 46960310
3060 46960310 45087873 43194480 41319230 39608401 37916641 36263801 34714134 33347977
3052 33347977 31959637 30669523 29458357 28273466 27223911 26244185 25323633 24385483 23501868
$$ packed form
3111A23699747j848714k085581k247244k364827k547555k694115k726373k876071
3103A04309267k935478l019047k992674k872662k687975k520530k298302k183836
3095H2798763k085336k002889j931547j801956j764850j778193j813891j999792
3087F7620309k128842k077554j939250j780390j494580j348800j058657p62824
3079E5029412m93631k07282R445K28629M28620N97851N24254N38120M51439J83433
3069E7290290l7485l94411o87390r76503j302536j478589j679345j861211j912510
3060D6960310j872437j893393j875250j710829j691760j652840j549667j366157
3052C3347977j388340j290114j211166j184891j049555r79726r20552r38150q83615
$$ plain form
3043 23501868 22669811 21935392 21190839 20479135 19815001 19207779 18580723 18002017 17442729
3034 17442729 16988928 16576657 16124651 15735115 15380440 15108663 14810505 14602599 14513272 14427469
3024 14427469 14402809 14401955 14399435 14433076 14612619 14823519 14959196 15111214 15269782 15410391 15632755
3013 15632755 15794296 15872579 15826847 15800863 15762213 15604417 15259370 14986649 14708678 14426451
3003 14426451 14115781 13763269 13424774 13080912 12898074 12693663 12545945 12493905 12504466 12611964
2993 12611964 12660491 12666850 12786937 12899091 13005118 13063330 13117053 13223105 13281719 13239068 13268430
2982 13268430 13226450 13237359 13208594 13234651 13407342 13584586 13699027 13593486 13421655 13128245
2972 13128245 12798648 12426973 12024652 11694388 11383521 11096455 10877867 10751126 10622869
$$ packed form
3043B3501868q32057p34419p44553p11704o64134o07222o27056n78706n59288
3034A7442729m53801m12271m52006l89536l54675k71777k98158k07906q9327q5803
3024A4427469k4660q54k520L3641J79543K10900J35677J52018J58568J40609K22364
3013A5632755J61541P8283m5732k5984l8650j57796l45047k72721k77971k82227
3003A4426451l10670l52512l38495l43862j82838k04411j47718n2040J0561J07498
2993A2611964M8527O359J20087J12154J06027N8212N3723J06052N8614m2651K9362
2982A3268430m1980J0909k8765K6057J72691J77244J14441j05541j71831k93410
2972A3128245l29597l71675m02321l30264l10867k87066k18588j26741j28257
$$ plain form
2963 10622869 10502849 10403424 10339455 10272427 10247227 10224369 10269973 10351336 10347911 10420598 10515421
2952 10515421 10583172 10670755 10700739 10719593 10740699 10829681 10937320 11026173 11126141 11301373 11474612
2941 11474612 11644029 11774482 11961043 12159137 12336930 12504984 12692638 12891469 13071003
2932 13071003 13358669 13570553 13722708 13865558 14001436 14061078 14168311 14329613 14537865 14839311
2922 14839311 15163782 15485091 15777236 16020528 16231157 16348325 16546204 16779203 16993203
2913 16993203 17339297 17728149 18125032 18654305 19180907 19661904 20137104 20563218 21007757
2904 21007757 21477026 21995117 22545098 23153505 23924776 24765427 25658190 26621454 27719851
2895 27719851 28877862 30153134 31521222 32970598 34555335 36160063 37876309 39710677
$$ packed form
2963A0622869j20020r9425o3969o7028k5200k2858M5604Q1363l425P2687R4823
2952A0515421O7751Q7583K9984J8854K1106Q8982J07639Q8853R9968J75232J73239
2941A1474612J69417J30453J86561J98094J77793J68054J87654J98831J79534
2932A3071003K87666K11884J52155J42850J35878N9642J07233J61302K08252L01446
2922A4839311L24471L21309K92145K43292K10629J17168J97879K32999K14000
2913A6993203L46094L88852L96883N29273N26602M80997M75200M26114M44539
2904B1007757M69269N18091N49981O08407P71271Q40651Q92763R63264J098397
2895B7719851J158011J275272J368088J449376J584737J604728J716246J834368
$$ plain form
2887 39710677 41662815 43861063 46208588 48800759 51619966 54700448 58051480 61639819
2879 61639819 65563406 69944201 74969288 80759855 87462354 95127955 103795255 113437364
2871 113437364 124036577 135707333 148911550 164162885 182196628 203756947 229540360
2864 229540360 259689891 293235387 327181097 355973711 372717817 371354115 350883086
2857 350883086 316117415 275928929 238366127 207046268 182459258 163525946 149041138
2850 149041138 137583575 128046636 119890107 112934965 107172430 102456888 98624606 95356700
2842 95356700 92114701 88640380 84736216 80461952 75815909 71158783 66654004 62357757
2834 62357757 58329792 54528014 50987543 47840530 44970451 42365944 40103441 38042099
$$ packed form
2887C9710677J952138K198248K347525K592171K819207L080482L351032L588339
2879F1639819L923587M380795N025087N790567O702499P665601Q667300R642109
2871A13437364J0599213J1670756J3204217J5251335J8033743K1560319K5783413
2864B29540360L0149531L3545496L3945710K8792614J6744106j363702k0471029
2857C50883086l4765671m0188486l7562802l1319859k4587010j8933312j4484808
2850A49041138j1457563r536939q156529o955142n762535m715542l832282l267906
2842I5356700l241999l474321l904164m274264m646043m657126m504779m296247
2834F2357757m027965l801778l540471l147013k870079k604507k262503k061342
$$ plain form
2826 38042099 36196357 34540482 32943552 31422652 29982233 28666846 27435099 26252173
2818 26252173 25247051 24262068 23331320 22362407 21438562 20651309 19839539 19184564 18592248
2809 18592248 18043332 17491443 16936777 16378142 15780822 15211853 14572998 14000861 13460169
2800 13460169 12954242 12550369 12177526 11873015 11642885 11329520 10944343 10537068 10142320
2791 10142320 9721675 9401187 9040745 8680856 8397275 8146360 7960312 7756330 7541842
2782 7541842 7323946 7071477 6827432 6625017 6385953 6170026 6033676 5788052 5560347 5364717
2772 5364717 5270421 5156711 5034921 4911504 4781670 4756646 4644693 4579588 4555397 4477844
2762 4477844 4414232 4434218 4420721 4333243 4313042 4273407 4220288 4155966 4032627 3949113 3870637
$$ packed form
2826C8042099j845742j655875j596930j520900j440419j315387j231747j182926
2818B6252173j005122r84983r30748r68913r23845p87253q11770o54975n92316
2809A8592248n48916n51889n54666n58635n97320n68969o38855n72137n40692
2800A3460169n05927m03873l72843l04511k30130l13365l85177m07275l94748
2791A0142320m20645l20488l60442l59889k83581k50915j86048k03982k14488
2782G541842k17896k52469k44045k02415k39064k15927j36350k45624k27705j95630
2772E364717r4296j13710j21790j23417j29834k5024j11953o5105k4191p7553
2762D477844o3612J9986j3497q7478k0201l9635n3119o4322j23339q3514p8476
$$ plain form
2751 3870637 3817971 3743794 3604301 3542276 3532744 3475629 3394116 3374112 3391073 3379247 3337937
2740 3337937 3273945 3257128 3200724 3107266 3071037 3013759 2963548 2858196 2843977 2828462 2689091
2729 2689091 2625754 2567672 2532907 2477335 2452905 2357222 2296882 2292836 2203444 2124580 2019027
2718 2019027 1943186 1892204 1866796 1750854 1643893 1623691 1607982 1565320 1514044 1455779 1424375
2707 1424375 1353931 1349174 1338336 1309047 1366913 1307129 1337792 1346341 1365533 1394965 1373964 1343143
2695 1343143 1344483 1332755 1320027 1349950 1345366 1274947 1218529 1241448 1258041 1213274 1209143 1217107
2683 1217107 1244648 1288841 1277330 1261209 1193923 1189929 1189771 1161430 1163532 1104135 1156604 1179268
2671 1179268 1175758 1200391 1115651 1036767 1038509 1060004 1008890 967435 922142 913827 900908 882800
$$ packed form
2751C870637n2666p4177j39493o2025r532n7115q1513k0004J6961j1826m1310
2740C337937o3992j6817n6404r3458l6229n7278n0211j05352j4219j5515j39371
2729B689091o3337n8082l4765n5572k4430r5683o0340m046q9392p8864j05553
2718B019027p5841n0982k5408j15942j06961k0202j5709m2662n1276n8265l1404
2707A424375p0444m757j0838k9289N7866n9784L0663Q549J9192K9432k1001l0821
2695A343143J340j1728j2728K9923m584p0419n6418K2919J6593m4767m131P964
2683A217107K7541M4193j1511j6121o7286l994j58k8341K102n9397N2469K2664
2671A179268l510K4633q4740p8884J742K1495n1114m1455m5293q315j2919j8108
$$ plain form
2659 882800 820386 779987 749626 741199 732638 763570 725554 664304 719582 741214 718347 689920
2647 689920 692889 718836 735215 680037 685259 696521 686961 722944 690001 725023 741507 700443
2635 700443 721425 761835 779982 765408 771260 756377 734886 694949 693769 723989 733898 686679
2623 686679 688977 673989 678350 652085 672811 678301 705814 708550 742179 745049 781907 796290 750096
2610 750096 750383 814210 837231 822780 796293 807979 827588 802106 819813 832261 898571 958951
2598 958951 986749 998514 1054191 1012951 1037406 1030673 1053594 1106505 1168066 1230836 1255071 1318268
2586 1318268 1288071 1334613 1457857 1549190 1670732 1779184 1935354 2057033 2225222 2303301
2576 2303301 2330253 2299862 2222668 2061766 1880097 1697319 1588577 1465362 1345658 1245459
$$ packed form
2659H82800o2414m0399l0361q427q561L0932l8016o1250N5278K1632k2867k8427
2647F89920K969K5947J6379n5178N222J1262r560L5983l2943L5022J6484m1064
2635G00443K0982M0410J8147j4574N852j4883k1491l9937j180L0220R909m7219
2623F86679K298j4988M361k6265K0726N490K7513K736L3629K870L6858J4383m6194
2610G50096K87O3827K3021j4451k6487J1686J9609k5482J7707J2448O6310O0380
2598I58951K7798J1765N5677m1240K4455o733K2921N2911O1561O2770K4235O3197
2586A318268l0197M6542J23244R1333J21542J08452J56170J21679J68189P8079
2576B303301K6952l0391p7194j60902j81669j82778j08742j23215j19704j00199
$$ plain form
2566 1245459 1168524 1115429 1074750 1054732 1027374 982653 937666 955133 958100 863444 847378 846849
2554 846849 765913 750705 701441 634872 590769 605672 557348 551299 468336 392390 407285 406905
2542 406905 406772 341738 360303 421963 415157 450573 416759 392172 364962 363248 382873 372345
2530 372345 355097 387584 386395 288482 296448 332452 330707 323099 326261 329975 317879 350206 381086
2517 381086 311581 309726 338221 342680 348045 316905 273151 268830 246860 328013 254487 158891
2505 158891 175667 254978 267646 207111 137504 233579 247931 257751 299106 217810 224563 229827
2493 229827 222472 217339 229335 170895 184195 188978 189574 193759 265229 295293 319618 293558 292520
2480 292520 229367 197965 175851 225358 235109 246258 220294 195951 219847 180490 212527 206483
$$ packed form
2566A245459p6935n3095m0679k0018k7358m4721m4987J7467K967r4656j6066n29
2554H46849q0936j5208m9264o6569m4103J4903m8324o049q2963p5946J4895l80
2542D06905j33o5034J8565O1660o806L5416l3814k4587k7210j714J9625j0528
2530C72345j7248L2487j189r7913P966L6004j745p608L162L714j2096L2327L0880
2517C81086o9505j855K8495M459N365l1140m3754m321k1970Q1153p3526r5596
2505A58891J6776P9311J2668o0535o9607R6075J4352R820M1355q1296O753N264
2493B29827p355n133J1996n8440J3300M783N96M185P1470L0064K4325k6060j038
2480B92520o3153l1402k2114M9507R751J1149k5964k4343K3896l9357L2037o044
$$ plain form
2468 206483 185388 197469 175452 170954 173931 167366 155998 141331 80643 61817 127646 100528
2456 100528 131043 126192 76296 83958 88998 135464 133365 184646 135940 102955 64905 113107
2444 113107 133748 118847 134073 110143 136046 144618 82926 122193 113518 78166 154791 138898
2432 138898 87834 98262 64130 39636 64124 71699 111364 96728 68590 26999 41962 69109
2420 69109 93106 68593 25844 3117 71040 51112 4643 18899 101570 52238 -11303 20087
2408 20087 46862 41360 68317 111893 164352 150878 104364 130498 167252 144452 92822 104300
2396 104300 153018 160340 174688 145820 108626 101583 111842 92936 106210 182218 163656 146381
2384 146381 111775 123884 162357 206982 181226 150922 144813 120065 149438 86075 49429 75493
$$ packed form
2468B06483k1095J2081k2017m498K977o565j1368j4667o0688j8826O5829k7118
2456A00528L0515m851m9896P662N040M6466k099N1281m8706l2985l8050M8202
2444A13107K0641j4901J5226k3930K5903Q572o1692L9267q675l5352P6625j5893
2432A38898n1064J0428l4132k4494K4488P575L9665j4636k8138m1591J4963K7147
2420F9109K3997k4513m2749k2727O7923j9928m6469J4256Q2671m9332o3541L1390
2408B0087K6775n502K6957M3576N2459j3474m6514K6134L6754k2800n1630J1478
2396A04300M8718P322J4348k8868l7194p043J0259j8906J3274P6008j8562j7275
2384A46381l4606J2109L8473M4625k5756l0304o109k4748K9373o3363l6646K6064
$$ plain form
2372 75493 95314 118447 151689 135931 167611 213642 251263 236815 186360 166116 188834 166453
2360 166453 185897 215821 187436 134347 72161 115754 139340 207292 229728 213765 242088 226948
2348 226948 174777 135182 148237 111650 103266 137201 166710 156746 150802 141407 147329 187188 218618
2335 218618 167879 163269 139224 117330 107455 75838 93090 95306 100151 85059 55675 85650
2323 85650 162136 124491 114233 135993 115266 76758 27064 35149 67167 84270 132810 106626
2311 106626 67847 62205 53682 57736 98010 88511 53261 38496 51125 55774 69214 52316 72212
2298 72212 46356 64593 93074 36165 54959 101035 52550 20480 66256 62501 11623 44195
2286 44195 79142 30541 -66250 -52097 17818 -40144 -21569 2401 27321 -4614 -1144 5762
$$ packed form
2372G5493J9821K3133L3242j5758L1680M6031L7621j4448n0455k0244K2718k2381
2360A66453J9444K9924k8385n3089o2186M3593K3586O7952K2436j5963K8323j5140
2348B26948n2171l9595J3055l6587q384L3935K9509r964n944r395N922L9859L1430
2335B18618n0739m610k4045k1894r875l1617J7252K216M845j5092k9384K9975
2323H5650P6486l7645j0258K1760k0727l8508m9694Q085L2018J7103M8540k6184
2311A06626l8779n642q523M054M0274r499l5250j4765J2629M649J3440j6898J9896
2298G2212k5856J8237K8481n6909J8794M6076m8485l2070M5776l755n0878L2572
2286D4195L4947m8601r6791J4153O9915n7962J8575K3970K4920l1935L470O906
$$ plain form
2274 5762 32293 57990 63673 63743 62938 61783 48782 17217 -18427 21858 744 1334 16130 17584
2260 17584 53567 102786 82936 96072 59465 46651 57321 85957 39338 33302 71528 61265
2248 61265 73133 78983 109250 147627 14174 25970 45793 47208 97553 49089 25367 82535
2236 82535 114660 168141 186053 145030 107146 66625 54080 54767 92084 83834 130138 109626
2224 109626 47715 61042 91138 105850 125273 128350 98951 91542 95963 53573 28048 49624
2212 49624 83385 81326 50557 25909 71754 94946 69701 47978 44012 79550 108169 65198
2200 65198 77198 59156 98945 113258 148375 137484 149743 147126 120102 111090 146297 220728
2188 220728 198119 167205 165683 134707 152000 198369 245815 299427 274578 264495 280574 258900
$$ packed form
2274E762K6531K5697N683P0q05j155j3001l1565l5644M0285k1114N90J4796J454
2260A7584L5983M9219j9850J3136l6607j2814J0670K8636m6619o036L8226j0263
2248F1265J1868N850L0267L8377j33453J1796J9823J415N0345m8464k3722N7168
2236H2535L2125N3481J7912m1023l7884m0521j2545O87L7317q250M6304k0512
2224A09626o1911J3327L0096J4712J9423L077k9399p409M421m2390k5525K1576
2212D9624L3761k059l0769k4648M5845K3192k5245k1723l966L5538K8619m2971
2200F5198J2000j8042L9789J4313L5117j0891J2259k617k7024r012L5207P4431
2188B20728k2609l0914j522l0976J7293M6369M7446N3612k4849j0083J6079k1674
$$ plain form
2176 258900 303815 331369 316835 352762 321247 346014 383811 384414 374620 369134 385211 433147
2164 433147 426384 444728 467274 499014 524025 507449 492299 471356 522387 519650 531772 549039
2152 549039 558571 536211 496110 584013 573734 591136 632795 649225 701178 657243 644473 682186
2140 682186 685749 689078 676138 689527 735474 758115 786078 841036 883485 924272 895912 937749
2128 937749 958755 965055 1017129 1068454 1063920 1058762 1109314 1148091 1249933 1384451 1466380 1513417
2116 1513417 1609729 1716410 1793681 1875093 1969577 1975710 2085079 2220795 2395412 2602571 2762963
2105 2762963 2910220 3145388 3361072 3661609 3965420 4246982 4593761 4931247 5307673 5786192
2095 5786192 6291367 6943004 7771338 8881815 10109991 11727714 13743084 16475835 19855764
$$ packed form
2176B58900M4915K7554j4534L5927l1515K4767L7797O03r794n486J6077M7936
2164D33147o763J8344K2546L1740K5011j6576j5150k0943N1031k737J2122J7267
2152E49039R532k2360m0101Q7903j0279J7402M1659J6430N1953m3935j2770L7713
2140F82186L563L329j2940J3389M5947K2641K7963N4958M2449M0787k8360M1837
2128I37749K1006O300N2074N1325m534n158N0552L8777J01842J34518Q1929M7037
2116A513417R6312J06681P7271Q1412R4484O133J09369J35716J74617K07159J60392
2105B762963J47257K35168K15684L00537L03811K81562L46779L37486L76426M78519
2095E786192N05175O51637Q28334J110477J228176J617723K015370K732751L379929
$$ plain form
2086 19855764 24098332 27509112 29500317 28113794 23042643 18256717 14469936 11765799
2078 11765799 9759331 8327210 7210501 6363807 5668986 5167166 4743959 4469537 4260740
2069 4260740 4061147 3786058 3443530 3168925 2920131 2674298 2484299 2376721 2312869 2182992
2059 2182992 2093003 2012611 1944307 1803214 1710087 1616414 1569370 1531220 1443934 1318968 1257854
2048 1257854 1224671 1221637 1213455 1157851 1104090 1102249 1041063 935231 851262 823931 745990 752701
2036 752701 717133 726904 747851 679294 647268 638586 634203 599908 548906 579316 536284 523251
2024 523251 483245 444979 457523 485091 437343 407893 405070 369091 340616 331573 266239 190511
2012 190511 212594 245350 269264 257953 231676 193556 231152 206958 271313 252757 242351 170725
$$ packed form
2086A9855764M242568L410780J991205j386523n071151m785926l786781k704137
2078A1765799k006468j432121j116709q46694o94821n01820m23207k74422k08797
2069D260740j99593k75089l42528k74605k48794k45833j89999j07578o3852j29877
2059B182992q9989q0392o8304j41093r3127r3673m7044l8150q7286j24966o1114
2048A257854l3183l034q182n5604n3761j841o1186j05832q3969k7331p7941O711
2036G52701l5568R771K0947o8557l2026q682m383l4295n1002L0410m3032j3033
2024E23251m0006l8266J2544K7568m7748k9450k823l5979k8475r043o5334p5728
2012A90511K2083L2756K3914j1311k6277l8120L7596k4194O4355j8556j0406p1626
$$ plain form
2000 170725 133075 150130 192951 189037 208201 146862 156847 168329 113244 100112 97051 49165
1988 49165 132120 120515 140003 232073 216778 177646 188210 178399 164695 144535 128056 168080
1976 168080 135292 107239 62074 44232 68167 94146 89744 89099 88624 58795 45645 70508 132121
1963 132121 81337 61242 52401 67141 74848 99724 66073 11833 10637 52857 45198 35929 4826
1950 4826 12392 71739 54453 44357 15248 57301 67451 764 -38325 -5414 -27758 3699
1938 3699 24997 -21039 2519 15458 4107 38551 65248 28592 15051 18617 -4311 -5493
1926 -5493 -22016 -9642 20412 40592 34274 34401 37694 29464 2380 -32864 -32418 21680 42242
1913 42242 -25907 22769 21847 3668 63252 48144 24402 29357 12678 24751 10047 -18208
$$ packed form
2000A70725l7650J7055M2821l914J9164o1339R985J1482n5085j3132l061m7886
1988D9165Q2955j1605J9488R2070j5295l9132J0564r811j3704k0160j6479M0024
1976A68080l2788k8053m5165j7842K3935K5979m402o45m75k9829j3150K4863O1613
1963A32121n0784k0095q841J4740P707K4876l3651n4240j196M2220p659r269l1103
1950D826P566N9347j7286j0096k9109M2053J0150o6687l9089L2911k2344L1457
1938C699K1298m6036K3558J2939j1351L4444K6697l6656j3541L566k2928j182
1926e493j6523J2374L0054K0180o318J27L293q230k7084l5244M46N4098K0562
1913D2242o8149M8676r22j8179N9584j5108k3742M955j6679J2073j4704k8255
$$ plain form
1901 -18208 -11601 -28428 13069 21517 30189 -12767 -27902 -27268 -4439 5185 42213 53549 -22488
1888 -22488 -76380 -7150 -33079 -28827 -22739 -21016 12631 22583 -1738 -3667 -6437 -30747 -85392
1875 -85392 -82180 10962 13635 -10368 -69795 4944 813 -20266 -81103 -78004 -31250 -26832 -62442
1862 -62442 -63448 -4567 -34897 -46482 -56221 -47006 -28479 -7694 -16423 -26268 -53852 -76583 -26051
1849 -26051 -53640 -23945 -71065 -73663 -18245 -13563 34533 -61558 -30207 -36148 -42429 43190 21597
1836 21597 -27631 -21203 -15082 -27109 25608 15093 -19963 12348 39234 53200 -12618 -5409
1824 -5409 -16900 -36560 32553 70082 28289 14076 53139 51512 33769 63542 71120 55144
1812 55144 36331 83209 139512 97266 43939 -8044 -39837 -43463 -73963 -73293 -19661 -3374
$$ packed form
1901a8208O607j6827M1497Q448Q672m2956j5135O34K2829R624L7028J1336p6037
1888b2488n3892O9230k5929M252O088J723L3647R952k4321j929k770k4310n4645
1875h5392L212R3142K673k4003n9427P4739m131k1079o0837L099M6754M418l5610
1862f2442j006N8881l0330j1585r739R215J8527K0785q729r845k7584k2731N0532
1849b6051k7589K9695m7120k598N5418M682M8096r6091L1351n941o281Q5619k1593
1836B1597m9228O428O121j2027N2717j0515l5056L2311K6886J3966o5818P209
1824e409j1491j9660O9113L7529m1793j4213L9063j627j7743K9773P578j5976
1812E5144j8813M6878N6303m2246n3327n1983l1793l626l0500O70N3632J6287
$$ plain form
1800 -3374 -7922 30869 -3863 3133 8514 -50317 -8912 -21929 -61581 -43587 -20877 -28197 -20991
1787 -20991 877 -35130 -78407 -18390 -42418 -58716 -33004 -29810 -42383 -106897 -56534 -21182
1775 -21182 -102 3012 -14045 -21380 -39934 -22976 -29484 -78307 -80189 -23781 40582 -9689 -88196
1762 -88196 -70536 -34703 -50163 5621 -7007 -3263 -50031 -75838 -3991 -25502 -86421 -99502
1750 -99502 -80017 -65590 -22254 2957 -8893 -6133 3859 2198 1764 -68171 10627 -6123 -3468
1737 -3468 1527 10023 -30608 -56684 -45633 -29040 -32374 27861 33111 20138 27775 2143 19398
1724 19398 -14863 -49538 -70058 -63549 -8938 9721 -22561 -4185 4421 -42225 -72805 -68084
1712 -68084 -29719 -43201 -64195 -31369 -15012 -10656 -8213 -35476 -17443 -17018 -11180 5805 -53439
$$ packed form
1800c374m548L8791l4732O996N381n8831M1405j3017l9652J7994K2710p320P206
1787b0991K1868l6007m3277O0017k4028j6298K5712L194j2573o4514N0363L5352
1775b1182K1080L114j7057p335j8554J6958o508m8823j882N6408O4363n0271p8507
1762h8196J7660L5833j5460N5784j2628L744m6768k5807P1847k1511o0919j3081
1750i9502J9485J4427M3336K5211j1850K760R992j661m34o9935P8798j6750K655
1737c468M995Q496m0631k6076J1051J6593l334O0235N250j2973P637k5632J7255
1724A9398l4261l4675k0520O509N4611J8659l2282J8376Q606m6646l0580M721
1712f8084L8365j3482k0994L2826J6357M356K443k7263J8033M25N838J6985n9244
$$ plain form
1699 -53439 -72689 -20920 -63061 -48382 -8143 16393 -13338 -11734 2500 -35367 -20426 -8902
1687 -8902 -12836 -31580 11713 -55163 -124858 -95951 -50531 -7193 53093 -30901 -64935 -17596
1675 -17596 -33359 -229 16185 -23204 -74641 -68428 -56963 -31739 -75062 -50293 -34112 -93380
1663 -93380 -76200 -79041 -80231 -56062 -57888 -57497 -72709 -92106 -79482 -74770 -40605 -41189 -49416 -67220
1649 -67220 -34005 -24327 -946 20705 -25499 -52363 -54709 -46419 25576 -7568 -11037 -10814 -56270
1636 -56270 -73658 -52591 -47816 -21162 -18321 -17951 -23832 -19278 -19204 -55837 -33542 -2779 -27119 -16170
1622 -16170 -1855 -17359 -77891 -76737 -54116 -31877 -39019 -28501 -33153 -56145 -50707 -48560 -25709
1609 -25709 9675 -28065 -27629 -46014 -66753 -90691 -48501 -47774 -36226 -14409 -39324 3423 -29836
$$ packed form
1699e3439j9250N1769m2141J4679M0239K4536k9731J604J4234l7867J4941J1524
1687h902l934j8744M3293o6876o9695K8907M5420M3338O0286q3994l4034M7339
1675a7596j5763L3130J6414l9389n1437O213J1465K5224m3323K4769J6181n9268
1663i3380J7180k841j190K4169j826L91j5212j9397J2624M712L4165n84q227j7804
1649f7220L3215R678K3381K1651m6204k6864k346Q290P1995l3144l469K23m5456
1636e6270j7388K1067M775K6654K841L70n881M554P4l6633K2295L0763k4340J0949
1622a6170J4315j5504o0532J154K2621K2239p142J0518m652k2992N438K147K2851
1609b5709L5384l7740M36j8385k0739k3938M2190P27J1548K1817k4915M2747l3259
$$ plain form
1596 -29836 7404 11033 -51620 -84846 -52650 -15936 -10773 -30440 -42775 -63993 -4632 -9984
1584 -9984 -18618 -23590 -75702 -50615 -56737 -66100 -77864 -101121 -56189 -64983 -73839 -36049 7214
1571 7214 -6173 10301 -57117 -81240 -80268 -58439 -2612 -33906 -92566 -84125 -61920 -78652 -96488
1558 -96488 -72420 -15283 -10768 -49736 -68956 -44858 -13912 -8454 14385 20583 1793 633 -31728
1545 -31728 2639 -29416 -81696 -50467 -43545 -61498 -85780 -75133 -72807 -43627 -36278 -11639
1533 -11639 -49067 -41001 -23377 19246 -9534 15685 -21810 -79503 -17447 -52293 -37528 -8093
1521 -8093 -5838 -22130 -42562 -57637 -84434 -107868 -39108 -58912 -59289 -59527 -77881 -59530 -76098
1508 -76098 -53329 -91051 -62995 -17246 -30658 -52894 -74437 -52778 -17713 -19839 -15625 15622
$$ packed form
1596b9836L7240L629o2653l3226L2196L6714N163j9667j2335k1218N9361n352
1584i984q634m972n2112K5087o122r363j1764k3257M4932q794q856L7790M3263
1571G214j3387J6474o7418k4123R72K1829N5827l1294n8660Q441K2205j6732j7836
1558i6488K4068N7137M515l8968j9220K4098L0946N458K2839O198j8790j160l2361
1545c1728L4367l2055n2280L1229O922j7953k4282J0647K326K9180P349K4639
1533a1639l7428Q066J7624M2623k8780K5219l7495n7693O2056l4846J4765K9435
1521h093K255j6292k0432j5075k6797k3434O8760j9804l77k38j8354J8351j6568
1508g6098K2769l7722K8056M5749j3412k2236k1543K1659L5065k126M214L1247
$$ plain form
1496 15622 -4943 -28622 -60428 -30994 50841 41466 33108 76238 26068 -59940 -63829 -42111
1484 -42111 -46284 -40663 -39853 -69652 -61181 -27434 -34735 -2317 -44825 -29221 -48220 -58582 -10650
1471 -10650 -48156 -88081 -39032 -56210 -53654 -19046 -5560 48323 2303 12852 -21823 -71234
1459 -71234 -54577 -48115 -101968 -92892 -118413 -79837 -26808 -61245 -5012 -21550 -43983 -67633
1447 -67633 -87161 -51947 -54522 -15979 14510 29696 2192 -28084 -34887 -16329 -51419 -82596
1435 -82596 -59361 -45901 -8519 9969 3019 -52973 -96286 -50455 -49968 -118895 -94652 -82424
1423 -82424 -101119 -69971 -38169 -34965 -13812 -14400 -22989 -8580 30032 41085 28730 -40641 -30005
1410 -30005 -34545 -40361 -53139 -19916 -33030 -43276 -23975 -15221 -49751 -39209 -78861 -103647
$$ packed form
1496A5622k0565k3679l1806K9434Q1835r375q358M3130n0170q6008l889K1718
1484d2111m173N621Q10k9799Q471L3747p301L2418m2508J5604j8999j0362M7932
1471a0650l7506l9925M9049j7178K556L4608J3486N3883m6020J0549l4675m9411
1459g1234J6657O462n3853R076k5521L8576N3029l4437N6233j6538k2433k3650
1447f7633j9528L5214k575L8543L0489J5186k7504l0276o803J8558l5090l1177
1435h2596K3235J3460L7382J8488o950n5992m3313M5831M87o8927K4243J2228
1423h2424j8695L1148L1802L204K1153n88q589J4409L8612J1053j2355o9371J0636
1410c0005m540n816j2778L3223j3114j0246J9301Q754l4530J0542l9652k4786
$$ plain form
1398 -103647 -33691 -26205 -44562 -83989 -104480 -83058 -21289 17299 -39519 -62199 -5183 -55503
1386 -55503 -96721 -42300 -37983 -48669 -75081 -79360 -27613 -47942 -51211 -65626 -84296 -42904
1374 -42904 17262 41628 19257 -11487 -28608 -36904 -62410 -13689 -20404 -10948 4759 -33240
1362 -33240 -38826 -46711 8155 28010 32200 -29433 -34192 -20361 -6043 -38609 -24779 -12612 -30341
1349 -30341 -4683 33268 29670 32591 75133 32747 5515 -24890 -59206 -45812 -51654 -54624 -9232
1336 -9232 -8895 -87094 -51614 4046 -51645 -53575 -23384 -28492 51668 12579 -19667 -78102 -50020
1323 -50020 -23578 12125 19708 -5172 12280 -94 -7509 -52183 -44152 5738 -30135 -71217
1311 -71217 -71641 -52215 -62809 -44857 20963 -4307 -41358 -17046 12148 60457 54250 -18931
$$ packed form
1398a03647O9956P486j8357l9427k0491K1422O1769L8588n6818k2680N7016n0320
1386e5503m1218N4421M317j0686k6412m279N1747k0329l269j4415j8670M1392
1374d2904O0166K4366k2371l0744j7121q296k5506M8721o715R456J5707l7999
1362c3240n586p885N4866J9855M190o1633m759J3831J4318l2566J3830J2167j7729
1349c0341K5658L7951l598K921M2542m2386k7232l0405l4316J3394n842k970M5392
1336i232L37p8199L5480N5660n5691j930L0191n108Q0160l9089l2246n8435K8082
1323e0020K6442L5703P583k4880J7452j2374p415m4674Q031M9890l5873m1082
1311g1217m24J9426j0594J7952O5820k5270l7051K4312K9194M8309o207p3181
$$ plain form
1299 -18931 1231 -33275 14222 574 -2921 -3165 28078 -1603 564 18662 39287 13753 -75733
1286 -75733 -26991 -8916 -41283 -47903 -16482 -34847 -28784 -42945 -28061 -46959 -78073 -56268
1274 -56268 -71753 -52880 -63050 -37030 -12123 -28897 -28275 5783 -15076 -40264 -29569 9406
1262 9406 -1136 -47825 -13988 7308 5074 8432 -14297 -42388 -81947 -99926 -51267 45356
1250 45356 62291 3080 -7598 -15694 -6465 -9005 -9744 -43883 -51364 -41749 -24280 -41309 7849
1237 7849 -2322 -57051 -51288 -59292 -44078 -26010 -23761 -31672 6950 34927 34120 -13540 21170
1224 21170 38691 37480 22148 -28403 -45469 -68190 -10305 30910 -14806 -17206 -3032 -15400
1212 -15400 19223 14758 -39045 -34795 -30600 -9503 16739 40 -45266 -89418 -101236 -80725
$$ packed form
1299a8931K0162l4506M7497j3648l495k44L1243k9681K167J8098K0625k5534q9486
1286g5733M8742J8075l2367o620L1421j8365O063j4161J4884j8898l1114K1805
1274e6268j5485J8873j0170K6020K4907j6774O22L4058k0859k5188J0695L8975
1262I406j0542m6689L3837K1296k234L358k2729k8091l9559j7979M8659R6623
1250D5356J6935n9211j0678q096R229k540p39l4139p481R615J7469j7029M9158
1237G849j0171n4729N763q004J5214J8068K249p911L8622K7977q07m7660L4710
1224B1170J7521j211j5332n0551j7066k2721N7885M1215m5716k400J4174j2368
1212a5400L4623m465n3803M250M195K1097K6242j6699m5306m4152j1818K0511
$$ plain form
1200 -80725 -87179 -65127 -77100 -23054 -32504 -57098 -36833 -22137 -19529 -24406 -17900 -45816 -28156
1187 -28156 -10348 -11515 -42698 1190 -9200 -15504 -20384 -6141 -29210 -26624 -43252 -51186 -55181
1174 -55181 -69163 -59306 -34051 -34335 -7131 37961 7844 14285 39843 -6184 -13140 -9768 -49009
1161 -49009 -54631 -28227 39948 -12227 13280 46886 35984 15613 -16474 -55042 -10767 24955
1149 24955 8089 16671 46877 17610 -20266 -38596 -3713 2881 -26506 2120 -2480 -17647
1137 -17647 -32852 -17593 36670 20354 47162 7268 -46760 -36278 -74850 -46917 7283 -5350
1125 -5350 -15093 -24207 -11529 -2029 -24616 -718 4439 5664 -29970 -37520 -26633 20611 33381
1112 33381 14642 24662 66774 33876 -70830 -62283 -38080 -70061 -50262 -30980 -42951 -5374
$$ packed form
1200h0725o454K2052j1973N4046r450k4594K0265J4696K608m877O506k7916J7660
1187b8156J7808j167l1183M3888j0390o304m880J4243k3069K586j6628p934l995
1174e5181j3982R857K5255k84K7204M5092l0117O441K5558m6027o956L372l9241
1161d9009n622K6404O8175n2175K5507L3606j0902k0371l2087l8568M4275L5722
1149B4955j6866Q582L0206k9267l7876j8330L4883O594k9387K8626m600j5167
1137a7647j5205J5259N4263j6316K6808l9894n4028J0482l8572K7933N4200j2633
1125e350r743r114J2678R500k2587K3898N157J225l5634p550J0887M7244J2770
1112C3381j8739J0020M2112l2898j04706Q547K4203l1981J9799J9282j1971L7577
$$ plain form
1100 -5374 -27056 -42404 -32760 -8574 40774 -2377 -102825 -43335 14087 -67391 -84154 -73677
1088 -73677 -8957 -33198 -103026 -110173 -68777 -72789 -47233 -5018 15955 -14801 41661 42465 30965
1075 30965 762 29783 29158 34854 82672 44703 11071 -23599 -19363 17072 -11172 -43562 -52467
1062 -52467 -51671 -67023 -66748 -68796 -59788 -86461 -105316 -307 7975 11963 -6151 -16474 -33332
1049 -33332 -9948 22868 -17902 -35726 -23156 22016 -4184 -9506 31979 27791 25449 -2041
1037 -2041 -19743 -15778 -4576 -28097 -75140 -35774 9422 -7612 -18388 -57315 -45032 -28434
1025 -28434 6394 -15135 -79882 -77406 -27217 -23282 25039 20307 -31748 -40581 -68462 -26218 -54170
1012 -54170 -50331 -4134 -63894 -17743 4770 62378 51120 10052 -20451 2665 -13369 -24625
$$ packed form
1100e374k1682j5348R644K4186M9348m3151j00448N9490N7422q1478j6763J0477
1088g3677O4720k4241o9828p147M1396m012K5556M2215K0973l0756N6462Q04j1500
1075C0965l0203K9021o25N696M7818l7969l3632l4670M236L6435k8244l2390q905
1062e2467P96j5352K75k048R008k6673j8855J05009Q282L988j8114j0323j6858
1049c3332K3384L2816m0770j7824J2570M5172k6200n322M1485m188k342k7490
1037b041j7702L965J1202k3521m7043L9366M5196j7034j0776l8927J2283J6598
1025b8434L4828k1529o4747K476N0189L935M8321m732n2055q833k7881M2244k7952
1012e4170L839M6197n9760M6151K2513N7608j1258m1068l0503K3116j6034j1256
$$ plain form
1000 -24625 -3383 27058 7343 11770 4580 4284 18660 -16206 -24941 -12185 -14355 32584 -31530
987 -31530 264 37603 2814 -38331 -63590 -32385 -31986 19567 16884 -7475 -10821 37766 70481
974 70481 26500 -8905 -19071 -42267 -58959 -48151 -21682 -23756 24536 -26456 30269 56129
962 56129 24300 2412 -42418 -17361 -36513 -62871 -48593 -58120 -47633 32976 41076 31793 19435
949 19435 7709 41178 24700 -24761 -63844 -60088 -31126 38812 -7429 19025 -34860 -51897
937 -51897 -36266 -211 16266 -6021 -19521 18513 22480 20651 901 38321 19312 -29471
925 -29471 20215 81673 18292 -14051 -8833 18668 -40241 -91895 -41898 -28366 -45284 -4352
913 -4352 -11402 -28518 43437 -31783 -32286 -24535 -47929 -49304 -51617 -29407 -27136 12722 27710 27150
$$ packed form
1000b4625K1242L0441j9715M427p190k96J4376l4866q735J2756k170M6939o4114
987c1530L1794L7339l4789m1145k5259L1205L99N1553k683k4359l346M8587L2715
974G0481m3981l5405j0166k3196j6692J0808K6469k074M8292n0992N6725K5860
962E6129l1829k1888m4830K5057j9152k6358J4278r527J0487Q0609Q100r283j2358
949A9435j1726L3469j6478m9461l9083L756K8962O9938m6241K6454n3885j7037
937e1897J5631L6055J6477k2287j3500L8034L967j829j9750L7420j9009m8783
925b9471M9686O1458o3381l2343N218K7501n8909n1654M9997J3532j6918M0932
913d352p050j7116P1955p5220n03P751k3394j375k313K2210K271L9858J4988n60
$$ plain form
899 27150 -1189 39496 21894 30239 83410 53668 40209 2773 21068 -15595 -25917 1853
887 1853 9046 34506 74324 46399 22918 -33752 26107 12362 11681 42320 50257 59627 94756
874 94756 36951 -36495 -45243 37652 26512 26308 7050 -29594 -23760 -4228 -5024 -22044 13085
861 13085 19210 -34071 -19859 -10309 25259 55716 61129 55107 9878 -4798 50282 74690 47557
848 47557 13417 6467 -52485 -58901 -18240 -5444 25665 77284 50282 36153 50056 7462
836 7462 -33797 -19145 -8292 -70532 4184 43891 32262 -3574 -22023 -34570 -33336 -44541
824 -44541 -55133 -3427 25394 5949 24572 -11369 -33954 -48683 -8298 -5045 35387 35717 20898
811 20898 60362 44395 5302 65897 40161 16113 18165 48014 40034 18861 13989 16607 25199
$$ packed form
899B7150k8339M0685j7602Q345N3171k9742j3459l7436J8295l6663j0322K7770
887A853P193K5460L9818k7925k3481n6670N9859j3745o81L0639P937R370L5129
874I4756n7805p3446q748Q2895j1140k04j9258l6644N834J9532p96j7020L5129
861A3085O125n3281J4212R550L5568L0457N413o022m5229j4676N5080K4408k7133
848D7557l4140o950n8952o416M0661J2796L1109N1619k7002j4129J3903m2594
836G462m1259J4652J0853o2240P4716L9707j1629l5836j8449j2547J234j1205
824d4541j0592N1706K8821j9445J8623l5941k2585j4729M0385L253M0432L30j4819
811B0898L9464j5967l9093O0595k5736k4048K052K9849p980k1173m872K618Q592
$$ plain form
798 25199 -6103 -6500 -12257 -23160 13949 44713 30916 53954 22156 19315 35400 -17035 -39253
785 -39253 -29579 -11052 -19211 -35879 -13464 11478 57930 -8409 -60587 -3395 34677 -2913
773 -2913 -31564 -9622 30483 24760 -34558 4326 -25341 -37697 -7128 14454 47926 22607
761 22607 59395 27755 6052 30586 76137 33471 20753 29794 3156 23487 24191 -17092 -19420
748 -19420 -7191 -13637 27999 -41794 -28467 4493 -4137 -55309 -36551 -23921 4578 36662
736 36662 2393 50285 43303 8053 15065 -14306 -15156 26585 19223 46501 40392 11453 9056
723 9056 1738 -10312 -42722 -24878 -40990 -24182 13592 36911 28672 -1597 5256 -32181 -22879
710 -22879 22894 62579 72733 72050 51580 71608 18651 52792 4900 -9707 41792 64287
$$ packed form
798B5199l1302l97n757j0903L7109L0764j3797K3038l1798k841J6085n2435k2218
785c9253R674J8527q159j6668K2415K4942M6452o6339n2178N7192L8072l7590
773b913k8651K1942M0105n723n9318L8884k9667j2356L0569K1582L3472k5319
761B2607L6788l1640k1703K4534M5551m2666j2718R041k6638K0331P04m1283k328
748a9420J2229o446M1636o9793J3327L2960q630n1172J8758J2630K8499L2084
736C6662l4269M7892o982l5250P012k9371q50M1741p362K7278o109k8939k397
723I056p318j2050l2410J7844j6112J6808L7774K3319q239l0269O853l7437R302
710b2879M5773L9685J0154o83k0470K0028n2957L4141m7892j4607N1499K2495
$$ plain form
698 64287 14022 -22809 -10934 17159 73131 70702 51192 63346 66403 12527 -14863 -8712 17937
685 17937 -7676 -52714 -69633 -21282 12328 49833 52100 24568 37007 61645 5222 39426
673 39426 35082 3690 -11675 -51961 1205 -4403 45561 25739 12223 -7930 -12048 33121 55593
660 55593 62490 10631 9720 1612 5579 13095 -14884 25439 44034 22316 23543 26564 26017 53982
646 53982 27047 36390 98912 33892 36905 91227 122917 127847 79562 74881 40482 -9673 27162
633 27162 18365 5868 18019 -10861 -7853 28921 41800 30030 -7994 -11790 23888 72407 33411
620 33411 27236 873 58873 73074 11385 -24126 -8446 37469 69716 83350 64724 20486
608 20486 11321 18985 13216 22674 62947 -3232 7599 16261 39888 53506 54374 105369 114653 114737
$$ packed form
698F4287n0265l6831J1875K8093N5972k429j9510J2154L057n3876k7390O151K6649
685A7937k5613m5038j6919M8351L3610L7505K267k7532J2439K4638n6423L4204
673C9426m344l1392j5365m0286N3166n608M9964j9822j3516k0153m118M5169K2472
660E5593O897n1859r11q108L967P516k7979M0323J8595k1718J227L021n47K7965
646E3982k6935R343O2522o5020L013N4322L1690M930m8285m681l4399n0155L6835
633B7162q797j2497J2151k8880L008L6774J2879j1770l8024l796L5678M8519l8996
620C3411o175k6363N8000J4201o1689l5511J5680M5915L2247J3634j8626m4238
608B0486r165P664n769R458M0273o6179J0831Q662K3627J3618Q68N0995R284Q4
$$ plain form
594 114737 112563 87275 40586 29689 4296 13126 22046 7312 25738 81546 30860 2017
582 2017 32395 63366 11760 50639 44191 63621 60661 17944 7372 4575 -206 15414 -38262
569 -38262 -12480 86509 2779 -25426 2742 21311 29788 23780 -97 392 18639 67323 60077
556 60077 6925 83799 62352 32480 75726 91746 47419 -6302 -31105 27737 60941 88618
544 88618 71454 21928 5666 20318 15442 14702 21214 6006 -14942 23631 65983 87992 57665
531 57665 16051 43686 47967 33442 70833 44578 6736 20207 57335 90824 110259 136204
519 136204 36156 -35898 -17718 36541 10204 9804 -20098 -2734 9405 -10308 21264 35597
507 35597 40208 29981 12937 73140 38455 47381 35929 3701 73539 65065 5945 12649 59996
$$ packed form
594A14737k174k5288m6689j0897k5393Q830Q920j4734J8426N5808n0686k8843
582B017L0378L0971n1606L8879o448J9430k960m2717j0572k797m781J5620n3676
569c8262K5782R8989q3730k8205K8168J8569Q477o008k3877M89J8247M8684p246
556F0077n3152P6874k1447k9872M3246J6020m4327n3721k4803N8842L3204K7677
544H8618j7164m9526j6262J4652m876p40O512j5208k0948L8573M2352K2009l0327
531E7665m1614K7635M281j4525L7391k6255l7842J3471L7128L3489J9435K5945
519A36204j00048p2054J8180N4259k6337m00k9902J7364J2139j9713L1572J4333
507C5597M611j0227j7044O0203l4685Q926j1452l2228O9838q474n9120O704M7347
$$ plain form
494 59996 43750 6109 1784 52923 62584 116068 67877 57923 79188 29986 16345 -17281 29023
481 29023 64479 114794 135185 55414 19028 1751 16870 33920 30535 5306 17120 61971
469 61971 45269 64886 57328 76049 55278 37616 34541 18144 -28232 -40539 3207 48508
457 48508 14061 -12949 31957 -1081 -28460 -7380 11505 9399 -12241 -1807 14705 -19246
445 -19246 -10794 15422 -14337 40682 38556 30124 -1323 37633 49163 31120 43458 82635 71570
432 71570 64134 41841 60181 46299 39136 58908 72847 91814 103438 97520 53050 49918 68965
419 68965 73584 32230 84872 91192 83179 42927 49581 14690 14555 29024 37020 -7885 38241
406 38241 46507 87516 90239 77725 23423 -30604 21229 28043 14632 38580 26310 65105 72770
$$ packed form
494E9996j6246l7641m325N1139R661N3484m8191r954K1265m9202j3641l3626M6304
481B9023L5456N0315K0391p9771l6386j7277J5119J7050l385k5229J1814M4851
469F1971j6702J9617p558J8721k0771j7662l075j6397m6376j2307M3746M5301
457D8508l4447k7010M4906l3038k7379K1080J8885k106k1640J0434J6512l3951
445a9246Q452K6216k9759N5019k126q432l1447L8956J1530j8043J2338L9177j1065
432G1570p436k2293J8340j3882p163J9772J3939J8967J1624n918m4470l132J9047
419F8965M619m1354N2642O320q013m0252O654l4891j35J4469P996m4905M6126
406C8241Q266M1009K723j2514n4302n4027N1833O814j3411K3948j2270L8795P665
$$ plain form
393 72770 36903 2908 -2572 22204 23913 49061 55407 47629 29445 13039 11639 14237 43421
380 43421 12490 94111 72385 23253 69493 7309 48826 57726 26557 25509 65055 72141 76462
367 76462 31963 -20570 -13761 18685 25045 4432 34087 70739 38364 62598 74290 73152 69971
354 69971 20643 25347 65890 113253 83222 29894 30365 65201 -8997 -12046 51351 33397 8004
341 8004 20736 45212 -6911 -1814 6500 -21680 -9085 4559 47434 59979 32472 2064 602
328 602 64866 59580 71988 58325 29268 17625 19207 46267 35795 21519 45587 88765 40545
315 40545 34115 19750 -21246 38526 61075 10114 3702 30325 65175 96743 49580 14818
303 14818 53712 49881 49697 76740 39140 41865 25126 49147 86356 51741 7908 67772 51311
$$ packed form
393G2770l5867l3995n480K4776J709K5148O346p778j8184j6406j400K598K9184
380D3421l0931Q1621k1726m9132M6240o2184M1517Q900l1169j048L9546P086M321
367G6462m4499n2533O809L2446O360k0613K9655L6652l2375K4234J1692j138l181
354F9971m9328M704M0543M7363l0031n3328M71L4836p4198l049O3397j7954k5393
341H004J2732K4476n2123N097Q314k8180J2595J3644M2875J2545k7507l0408j462
328F02O4264n286J2408j3663k9057j1643J582K7060j0472j4276K4068M3178m8220
315D0545o430j4365m0996N9772K2549n0961o412K6623L4850L1568m7163l4762
303A4818L8894l831j84K7043l7600K725j6739K4021L7209l4615m3833N9864j6461
$$ plain form
290 51311 61563 38395 -740 -9361 157 -11855 5499 46363 58597 46602 28252 38517
278 38517 79039 55423 7072 -2291 58348 86291 93251 51291 49057 39091 1536 42209 45640
265 45640 41652 95867 106214 102303 84068 55349 94813 43317 106354 86962 55682 14398
253 14398 -9672 25869 29558 51990 27734 46662 45450 47410 88460 58594 81747 68857 81210
240 81210 36735 41652 61099 108774 48332 70421 73018 65712 40712 -1139 54354 45793 38330
227 38330 27309 16038 -23394 40967 27534 -7085 -18247 11729 16960 -10407 -23402 -17286
215 -17286 -24479 30730 32166 34353 27290 1187 47001 46182 60326 92558 37502 31477 7111
202 7111 17664 68183 26274 26185 46665 -2852 -16369 28318 -8924 16832 64672 46898 10355
$$ packed form
290E1311J0252k3168l9135q621R518j2012J7354M0864J2234j1995j8350J0265
278C8517M0522k3616m8351r363O0639K7943O960m1960k234r966l7555M0673L431
265D5640l988N4215J0347l911j8235k8719L9464n1496O3037j9392l1280m1284
253A4398k4070L5541L689K2432k4256J8928j212J960M1050k9866K3153j2890J2353
240H1210m4475M917J9447M7675o0442K2089K597p306k5000m1851N5493q561p463
227C8330j1021j1271l9432O4361j3433l4619j1162K9976N231k7367j2995O116
215a7286p193N5209J436K187p063k6103M5814q19J4144L2232n5056o025k4366
202G111J0553N0519m1909q9K0480m9517j3517M4687l7242K5756M7840j7774l6543
$$ plain form
189 10355 3232 837 34282 39837 58838 86522 71276 15101 7661 -27270 23104 17016 58713
176 58713 72760 64359 70207 55779 123042 123224 59832 11553 37785 90000 108910 78168 74554
163 74554 72215 67249 56672 57038 78114 85297 34419 14859 53190 59546 44407 57608 14840
150 14840 52583 55286 58509 83815 61855 46719 27136 40000 25916 4356 20014 38034
138 38034 43341 2382 10157 76026 60535 61146 96256 94044 64113 14171 60007 53534 71489
125 71489 61551 67525 68333 35695 14667 25812 887 -1550 26686 36861 16012 -5023 54413
112 54413 60672 61627 76849 83002 34239 27460 42706 64201 53165 34819 19205 44878 27015
99 27015 6273 35143 51404 32926 57759 79726 51054 53010 52999 44297 13031 5062 29409
$$ packed form
189A0355p123k395L3445N555J9001K7684j5246n6175p440l4931N0374o088M1697
176E8713J4047q401N848j4428O7263J82o3392m8279K6232N2215J8910l0742l614
163G4554k339m966j0577L66K1076P183n0878j9560L8331O356j5139J3201m2768
150A4840L7743K703L223K5306k1960j5136j9583J2864j4084k1560J5658J8020
138C8034N307m0959P775O5869j5491O11L5110k212k9931m9942M5836o473J7955
125G1489r938N974Q08l2638k1028J1145k4925k437K8236J0175k0849k1035N9436
112E4413O259R55J5222O153m8763o779J5246K1495j1036j8346j5614K5673j7863
99B7015k0742K8870J6261j8478K4833K1967k8672J956j1q702l1266p969K4347
$$ plain form
86 29409 29777 10484 58041 63889 50525 54969 94279 74751 58519 76625 88173 67171 45013
73 45013 9816 11880 52704 46454 19448 26868 69353 59528 69364 51250 55456 43813 47288 12737
59 12737 -8608 40696 87055 66658 73945 58885 69605 57089 61080 37701 15513 55843 57653
46 57653 45000 40281 61033 49335 78086 66699 44835 48270 39922 47629 52490 17010 14909
33 14909 7908 42829 27276 43239 102721 103416 35974 1324 25323 52154 62957 57719 70954
20 70954 66995 38115 35753 42558 28132 18202 31442 56933 50666 58903 41322 65132 90070
7 90070 69198 28360 44833 5583 27431 90620 65963
0 65963
$$ packed form
86B9409L68j9293M7557N848j3364M444L9310j9528j6232J8106J1548k1002k2158
73D5013l5197K064M0824o250k7006P420M2485r825R836j8114M206j1643L475l4551
59A2737k1345M9304M6359k0397P287j5060J0720j2516L991k3379k2188M0330J810
46E7653j2653m719K0752j1698K8751j1387k1864L435q348P707M861l5480k101
33A4909p001L4921j5553J5963N9482O95o7442l4650K3999K6831J0803n238J3235
20G0954l959k8880k362O805j4426r930J3240K5491o267Q237j7581K3810K4938
7I0070k0872m0838J6473l9250K1848O3189k4657
0F5963
$$ Imaginary data points
##PAGE= N=2
##DATA TABLE= (X++(I..I)), XYDATA
$$ plain form
16383 -1541820 -1504805 -1515685 -1502534 -1457389 -1445520 -1417438 -1385058 -1392888 -1394653 -1366995 -1345274 -1339849
16371 -1339849 -1314187 -1262592 -1225443 -1220581 -1224648 -1165935 -1180946 -1185974 -1126323 -1137801 -1129687 -1088727
16359 -1088727 -1062779 -1020494 -1069190 -1049305 -1031040 -1029312 -968377 -928222 -961951 -926316 -899113
16348 -899113 -895012 -869951 -863457 -855592 -834446 -815135 -830224 -817618 -798215 -715364 -702478 -693310
16336 -693310 -643694 -657375 -672561 -619305 -614716 -556472 -521533 -550733 -574810 -601409 -552872 -519103
16324 -519103 -486395 -449737 -461695 -436449 -375986 -367074 -392073 -343843 -335397 -339635 -339094 -346279 -351786
16311 -351786 -352551 -288718 -249889 -260240 -265844 -203572 -208528 -188928 -157214 -135371 -115426 -137072
16299 -137072 -145292 -130720 -68026 -45445 -12322 -27885 -26378 24458 12409 26910 32557 33482
$$ packed form
16383a541820L7015j0880J3151M5145J1869K8082L2380p830j765K7658K1721N425
16371a339849K5662N1595L7149M862m067N8713j5011n028N9651j1478Q114M0960
16359a088727K5948M2285m8696J9885J8265J728O0935M0155l3729L5635K7203
16348h99113M101K5061O494P865K1146J9311j5089J2606J9403Q2851J2886R168
16336f93310M9616j3681j5186N3256M589N8244L4939k9200k4077k6599M8537L3769
16324e19103L2708L6658j1958K5246O0463Q912k4999M8230Q446m238N41p185n507
16311c51786p65O3833L8829j0351n604O2272m956J9600L1714K1843J9945k1646
16299a37072q220J4572O2694K2581L3123j5563J507N0836j2049J4501N647R25
$$ plain form
16287 33482 39655 57220 73654 63420 97788 122727 101234 123262 176328 197009 173967 154074
16275 154074 198067 224118 254986 250604 259174 315841 328784 316419 323631 321132 316248 331147
16263 331147 365653 386813 339060 393202 436258 455971 433190 409951 445653 469475 458013
16252 458013 456525 471796 502250 523665 515710 559066 564740 545094 538237 563294 573348 528190
16240 528190 555506 616058 633114 642546 669363 649969 638725 660639 684294 706769 674325 667858
16228 667858 714480 743817 723489 749603 730985 685169 716647 729418 769189 807231 828199
16217 828199 848055 851993 901482 836748 803197 847469 856537 839388 846142 856380 792543 822951
16205 822951 876725 888304 877139 853262 862556 901322 952142 921318 883311 885513 900186 917197
$$ packed form
16287C3482O173J7565J6434j0234L4368K4939k1493K2028N3066K0681k3042j9893
16275A54074M3993K6051L0868m382Q570N6667J2943j2365P212k499m884J4899
16263C31147L4506K1160m7753N4142M3056J9713k2781k3239L5702K3822j1462
16252D58013j488J5271L0454K1415p955M3356N674j9646o857K5057J0054m5158
16240E28190K7316O0552J7056R432K6817j9394j1244K1914K3655K2475l2444o467
16228F67858M6622K9337k0328K6114j8618m5816L1478J2771L9771L8042K0968
16217H28199J9856L938M9489o4734l3551M4272R068j7149O754J0238o3837L0408
16205H22951N3774J1579j1165k3877R294L8766N0820l0824l8007K202J4673J7011
$$ plain form
16193 917197 954616 964099 980056 960260 976381 938920 970859 989297 1026792 1028079 1046828 1058428
16181 1058428 1045692 1035562 1005598 1014396 1086115 1045184 1014656 1008094 972066 1030710 1037517 1061474
16169 1061474 1033120 1058420 1064935 1049818 1091114 1135490 1105108 1088171 1064426 1103193 1043124
16158 1043124 1083330 1096744 1114971 1122241 1108777 1132841 1157720 1133123 1117518 1107896 1136448 1129982
16146 1129982 1098022 1146383 1146512 1131061 1164533 1161697 1197597 1194983 1206518 1225784 1229437 1168378
16134 1168378 1160824 1142335 1131520 1143728 1172052 1214442 1231600 1212202 1130069 1150633 1204620
16123 1204620 1220989 1211270 1197193 1167991 1213707 1174258 1192919 1197372 1208120 1199938 1238054 1213107
16111 1213107 1233535 1219970 1218076 1249065 1229611 1213986 1173633 1167176 1209075 1228533 1210606 1217448
$$ packed form
16193I17197L7419R483J5957j9796J6121l7461L1939J8438L7495J287J8749J1600
16181A058428j2736j0130k9964Q798P1719m0931l0528o562l6028N8644O807K3957
16169A061474k8354K5300O515j5117M1296M4376l0382j6937k3745L8767o0069
16158A043124M0206J3414J8227P270j3464K4064K4879k4597j5605r622K8552o466
16146A129982l1960M8361J29j5451L3472k836L5900k614J1535J9266L653o1059
16134A168378p554j8489j0815J2208K8324M2390J7158j9398q2133K0564N3987
16123A204620J6369r719j4077k9202M5716l9449J8661M453J0748q182L8116k4947
16111A213107K0428j3565j894L0989j9454j5625m0353o457M1899J9458j7927O842
$$ plain form
16099 1217448 1223010 1218069 1205555 1206388 1210772 1246705 1250856 1234912 1186527 1210465 1258207 1266762 1263647
16086 1263647 1246454 1282803 1258940 1295713 1343786 1310241 1318496 1270553 1249228 1282881 1294621
16075 1294621 1286848 1251843 1300027 1322091 1339346 1336191 1291812 1250330 1250335 1300470 1352820 1371007
16063 1371007 1355479 1330891 1267111 1273987 1292734 1298505 1330638 1313496 1309882 1309310 1330379 1321918
16051 1321918 1282479 1294269 1305518 1303971 1309767 1287792 1303100 1301417 1309763 1292723 1291710 1334495
16039 1334495 1305752 1276410 1284491 1295739 1322758 1346463 1363719 1313355 1309669 1324951 1301909 1295792
16027 1295792 1302587 1286361 1273241 1286368 1266524 1294245 1296406 1306669 1299357 1269881 1263821 1274651
16015 1274651 1270095 1332861 1298832 1312196 1315665 1318821 1345871 1371092 1353292 1317833 1326458 1283838
$$ packed form
16099A217448N562m941j2514Q33M384L5933M151j5944m8385K3938M7742Q555l115
16086A263647j7193L6349k3863L6773M8073l3545Q255m7943k1325L3653J1740
16075A294621p773l5005M8184K2064J7255l155m4379m1482NN0135N2350J8187
16063A371007j5528k4588o3780O876J8747N771L2133j7142l614n72K1069q461
16051A321918l9439J1790J1249j547N796k1975J5308j683Q346j7040j013M2785
16039A334495k8743k9342Q081J1248K7019K3705J7256n0364l686J5282k3042o117
16027A295792O795j6226j3120J3127j9844K7721K161J0263p312k9476o060J0830
16015A274651m556O2766l4029J3364L469L156K7050K5221j7800l5459Q625m2620
$$ plain form
16003 1283838 1265462 1297196 1299191 1300481 1302929 1340888 1383772 1348608 1340644 1346563 1317516 1337290
15991 1337290 1337906 1324572 1290088 1315345 1299349 1351016 1315078 1237761 1253406 1259445 1312871 1307353
15979 1307353 1304828 1306000 1314886 1330776 1328983 1351311 1326805 1283051 1337762 1266825 1246019 1273891
15967 1273891 1270679 1260049 1283552 1264726 1289536 1290867 1270182 1262761 1304329 1294604 1305400 1335730
15955 1335730 1321345 1298376 1293844 1303427 1323306 1323940 1299424 1294962 1277633 1270517 1295120 1237020
15943 1237020 1274779 1324210 1307091 1338320 1325229 1304204 1275766 1294825 1294688 1293715 1257723 1340102
15931 1340102 1355037 1363510 1314999 1324953 1390297 1374032 1387650 1343048 1307280 1313685 1312605 1290811
15919 1290811 1302590 1319412 1334192 1341673 1342339 1310284 1359284 1399324 1360819 1320526 1293910 1336864
$$ packed form
16003A283838j8376L1734J995J290K448L7959M2884l5164p964N919k9047J9774
15991A337290O16j3334l4484K5257j5996N1667l5938p7317J5645O039N3426n518
15979A307353k525J172Q886J5890j793K2328k4506m3754N4711p0937k0806K7872
15967A273891l212j0630K3503j8826K4810J331k0685p421M1568r725J0796L0330
15955A335730j4385k2969m532R583J9879O34k4516m462j7329p116K4603n8100
15943A237020L7759M9431j7119L1229j3091k1025k8438J9059j37r73l5992Q2379
15931A340102J4935Q473m8511R954O5344j6265J3618m4602l5768O405j080k1794
15919A290811J1779J6822J4780P481O66l2055M9000M0040l8505m0293k6616M2954
$$ plain form
15907 1336864 1352968 1343001 1328427 1328279 1332708 1340360 1367407 1324495 1300755 1296552 1354570 1381406
15895 1381406 1347482 1304079 1315047 1301544 1281009 1290741 1285669 1250904 1310154 1268569 1265227 1310363
15883 1310363 1286325 1293285 1313281 1329554 1304341 1357840 1363708 1374611 1329190 1336136 1343080 1314855
15871 1314855 1259193 1288893 1349405 1378219 1418668 1406714 1350288 1346142 1349277 1356204 1340640 1287489
15859 1287489 1336585 1322701 1264633 1297096 1292941 1301981 1286335 1302664 1276676 1279164 1311919 1370039
15847 1370039 1380965 1342647 1283058 1315531 1302229 1281892 1337969 1362656 1362824 1377444 1341968 1338734
15835 1338734 1367087 1345645 1343790 1297872 1313960 1316547 1276724 1307117 1339487 1315658 1299743 1348345
$$ packed form
15907A336864J6104r967j4574j48M429P652K7047m2912k3740m203N8018K6836
15895A381406l3924m3403J0968j3503k0535R732n072l4765N9250m1585l342M5136
15883A310363k4038O960J9996J6273k5213N3499N868J0903m5421O946O944k8225
15871A314855n5662K9700O0512K8814M0449j1954n6426m146L135O927j5564n3151
15859A287489M9096j3884n8068L2463m155R040j5646J6329k5988K488L2755N8120
15847A370039J0926l8318n9589L2473j3302k0337N6077K4687J68J4620l5476l234
15835A338734K8353k1442j855m5918J6088K587l9823L0393L2370k3829j5915M8602
$$ [...]
##END NTUPLES=NMR SPECTRUM
##END=
