##TITLE=1H_EC-3288
 CDCl3
 8 sc, 
 17.1.2023
##JCAMPDX= 6.0         $$ Bruker NMR JCAMP-DX V2.0
##DATA TYPE= NMR SPECTRUM
##DATA CLASS= NTUPLES
##ORIGIN= UXNMR, Bruker Analytische Messtechnik GmbH
##OWNER= root
$$ XWIN-NMR		Version 3.5
$$ Tue Jan 17 14:13:33 2023 Russian Standard Time (UT+4h)  she@DPX200
##.OBSERVE FREQUENCY= 200.13135
##.OBSERVE NUCLEUS= ^1H
##.ACQUISITION MODE= SIMULTANEOUS
##.ACQUISITION SCHEME= undefined
##.AVERAGES= 8
##.DIGITISER RES= 18
##SPECTROMETER/DATA SYSTEM= spect
##.PULSE SEQUENCE= zg30
##.SOLVENT NAME= CDCl3
##.SHIFT REFERENCE= (INTERNAL, CDCl3, 0, 15.7711)
##AUDIT TRAIL= $$ (NUMBER, WHEN, WHO, WHERE, WHAT)
$$ ##TITLE= Audit trail, XWIN-NMR		Version 3.5
$$ ##JCAMPDX= 5.01
$$ ##ORIGIN= Bruker BioSpin GmbH
$$ ##OWNER= she
$$ F:/spectra/data/she/nmr/H-F/1/pdata/1/auditp.txt
$$ ##AUDIT TRAIL=  $$ (NUMBER, WHEN, WHO, WHERE, WHAT)
(   1,<2023-01-17 14:12:22.53 +0400>,<she>,<DPX200>,
      <created by zg, POWCHK disabled, PULCHK disabled
       configuration hash MD5:
       00 E9 B6 7A A2 85 ED C7 34 08 36 98 17 FE 4E 26
       data hash MD5: 16K
       C2 E9 A8 CF A6 35 04 E0 AB 7D 46 B3 67 DA AC 25>)
(   2,<2023-01-17 14:12:34.67 +0400>,<she>,<DPX200>,
      <Start of raw data processing
       efp BC_mod = 2 LB = 0.24 FT_mod = 6 PKNL = 1 PHC0 = -19112.85 PHC1 = 13.40073 SI = 16K 
       data hash MD5: 16K
       B8 C3 4F 6A 10 85 41 DD 72 5C 66 64 F7 E9 E3 D2>)
(   3,<2023-01-17 14:12:48.92 +0400>,<she>,<DPX200>,
      <pk PHC0 = 2.892843 PHC1 = -3.4 
       data hash MD5: 16K
       A9 38 33 5C 6C 1F 28 E3 EE A8 A4 3C 46 1B AE FE>)
(   4,<2023-01-17 14:12:52.34 +0400>,<she>,<DPX200>,
      <abs ABSG = 5 
       data hash MD5: 16K
       17 8E 1F BE A6 26 F7 69 B2 87 7D 65 42 ED 53 DF>)
$$ ##END=
$$ 
$$ hash MD5
$$ 56 0C 1B 7E 42 E1 28 35 DE 5D 26 44 F7 30 92 E2
##$RELAX= 
##$RELAX= 
##$RELAX= 
##$RELAX= 
##$RELAX= 
##$RELAX= 
$$ Bruker specific parameters
$$ --------------------------
##$DU= <F:/spectra>
##$EXPNO= 1
##$NAME= <H-F>
##$PROCNO= 1
##$TYPE= <nmr>
##$USER= <she>
##$AMP= (0..31)
100 100 100 100 100 100 100 100 100 100 100 100 100 100 100 100 100 100 
100 100 100 100 100 100 100 100 100 100 100 100 100 100 
##$AQSEQ= 0
##$AQ_mod= 1
##$AUNM= <au_zg>
##$AUTOPOS= <>
##$BF1= 200.13
##$BF2= 200.13
##$BF3= 200.13
##$BF4= 200.13
##$BF5= 200.13
##$BF6= 200.13
##$BF7= 200.13
##$BF8= 200.13
##$BYTORDA= 1
##$CFDGTYP= 0
##$CFRGTYP= 5
##$CHEMSTR= <none>
##$CNST= (0..31)
1 1 145 1 1 1 1 1 1 1 1 1 1 1 1 1 1 1 1 1 1 1 1 1 1 1 1 1 1 1 1 1 
##$CPDPRG= <>
##$CPDPRG1= <>
##$CPDPRG2= <>
##$CPDPRG3= <>
##$CPDPRG4= <mlev>
##$CPDPRG5= <mlev>
##$CPDPRG6= <mlev>
##$CPDPRG7= <mlev>
##$CPDPRG8= <mlev>
##$CPDPRGB= <>
##$CPDPRGT= <>
##$D= (0..31)
0 1.2 0 0 0 0 0 0 0 0.06 0 0.03 0 0 0 0 0.0002 0 0 0 0 0 0 0 0 0 0 0 0 
0 0 0 
##$DATE= 1673950341
##$DBL= (0..7)
120 120 120 120 120 120 120 120 
##$DBP= (0..7)
150 150 150 150 150 150 150 150 
##$DBP07= 0
##$DBPNAM0= <>
##$DBPNAM1= <>
##$DBPNAM2= <>
##$DBPNAM3= <>
##$DBPNAM4= <>
$$ [...]
##$SUBNAM3= <"">
##$SUBNAM4= <"">
##$SUBNAM5= <"">
##$SUBNAM6= <"">
##$SUBNAM7= <"">
##$SUBNAM8= <"">
##$SUBNAM9= <"">
##$SW= 18.05172834244
##$SWIBOX= (0..15)
0 0 2 0 0 0 0 0 0 0 0 0 0 0 0 0 
##$SW_h= 3612.71676300578
##$TD= 16384
##$TD0= 1
##$TE= 0
##$TE2= 300
##$TE3= 300
##$TEG= 300
##$TL= (0..7)
0 120 120 120 120 120 120 120 
##$TP= (0..7)
150 150 150 150 150 150 150 150 
##$TP07= 0
##$TPNAME0= <>
##$TPNAME1= <>
##$TPNAME2= <>
##$TPNAME3= <>
##$TPNAME4= <>
##$TPNAME5= <>
##$TPNAME6= <>
##$TPNAME7= <>
##$TPOAL= (0..7)
0.5 0.5 0.5 0.5 0.5 0.5 0.5 0.5 
##$TPOFFS= (0..7)
0 0 0 0 0 0 0 0 
##$TUNHIN= 0
##$TUNHOUT= 0
##$TUNXOUT= 0
##$USERA1= <user>
##$USERA2= <user>
##$USERA3= <user>
##$USERA4= <user>
##$USERA5= <user>
##$V9= 5
##$VALIST= <valist>
##$VCLIST= <CCCCCCCCCCCCCCC>
##$VD= 0
##$VDLIST= <DDDDDDDDDDDDDDD>
##$VPLIST= <PPPPPPPPPPPPPPP>
##$VTLIST= <TTTTTTTTTTTTTTT>
##$WBST= 1024
##$WBSW= 4
##$XGAIN= (0..3)
0 0 0 0 
##$XL= 0
##$YL= 0
##$YMAX_a= 266538
##$YMIN_a= -392659
##$ZGOPTNS= <>
##$ZL1= 120
##$ZL2= 120
##$ZL3= 120
##$ZL4= 120
##$ABSF1= 15.77002
##$ABSF2= -2.28183
##$ABSG= 5
##$ABSL= 3
##$ALPHA= 0
##$AQORDER= 0
##$ASSFAC= 0
##$ASSFACI= 0
##$ASSFACX= 0
##$ASSWID= 0
##$AUNMP= <proc_1d>
##$AZFE= 0.1
##$AZFW= 0.1
##$BCFW= 0
##$BC_mod= 2
##$BYTORDP= 0
##$COROFFS= 0
##$CY= -3
##$DATMOD= 1
##$DC= 0
##$DFILT= <>
##$DTYPP= 0
##$F1P= 0
##$F2P= 0
##$FCOR= 1
##$FTSIZE= 16384
##$FT_mod= 6
##$GAMMA= 0
##$GB= 0
##$INTBC= 1
##$INTSCL= 3.70164e-10
##$ISEN= 128
##$LB= 0.24
##$LEV0= 0
##$LPBIN= 0
##$MAXI= 10000
##$MC2= 0
##$MEAN= 0
##$ME_mod= 0
##$MI= 1.114404
##$NCOEF= 0
##$NC_proc= -6
##$NLEV= 6
##$NOISF1= 3.799351
##$NOISF2= 2.8
##$NSP= 0
##$NTH_PI= 0
##$NZP= 0
##$OFFSET= 15.77113
##$PC= 1
##$PHC0= -19109.96
##$PHC1= 10.00073
##$PH_mod= 1
##$PKNL= yes
##$PPARMOD= 0
##$PSCAL= 0
##$PSIGN= 0
##$REVERSE= no
##$SF= 200.130000081465
##$SI= 16384
##$SIGF1= 3
##$SIGF2= 2
##$SINO= 5.538805
##$SIOLD= 16384
##$SREGLST= <1H.CDCl3>
##$SSB= 0
##$STSI= 16384
##$STSR= 0
##$SW_p= 3612.71676300578
##$SYMM= 0
##$S_DEV= 0
##$TDeff= 16384
##$TDoff= 0
##$TI= <>
##$TILT= no
##$TM1= 0
##$TM2= 0
##$TOPLEV= 0
##$USERP1= <user>
##$USERP2= <user>
##$USERP3= <user>
##$USERP4= <user>
##$USERP5= <user>
##$WDW= 1
##$XDIM= 16384
##$YMAX_p= 453524210
##$YMIN_p= -582338
$$ End of Bruker specific parameters
$$ ---------------------------------
##NTUPLES= NMR SPECTRUM
##VAR_NAME=  FREQUENCY,     SPECTRUM/REAL,   SPECTRUM/IMAG
##SYMBOL=    X,             R,               I
##VAR_TYPE=  INDEPENDENT,   DEPENDENT,       DEPENDENT
##VAR_FORM=  AFFN,          ASDF,            ASDF
##VAR_DIM=   16384,         16384,           16384
##UNITS=     HZ,            ARBITRARY UNITS, ARBITRARY UNITS
##FACTOR=    0.220516191357247, 1,           1
##FIRST=     3156.27616976471, 0,            0
##LAST=      -456.440593241066, 0,           0
##MIN=       -456.440593241066, -582338,     0
##MAX=       3156.27616976471, 453524210,    0
$$ Real data points
##PAGE= N=1
##DATA TABLE= (X++(R..R)), XYDATA
$$ [...]
5891B507654N4676R0667J8728l7531N0156O9892J58687M8714J06022L0067l5061
5880C062671J85111K31842R0376l429J14197P9220M7651K37240K10753M7482Q4863
5869D387977K06461J35890J83669J88834K55356K38569J76747Q2403K05471K38556
5859F299933L01401K48506K42000K93419K35845K83623L20129M28900M81486L23156
5849I458398M89506N54989M48067N14305O74089P55986Q64914R34029R82323J150491
5839A6827097J258308J354775J449406J572385J726492J703773J460234J365218
5831B8717688J060813P75008N80059J00096j55006j60414k73477l61438l47686
5822B9935643k68866m49866o23682o11904o08102n57443n72826l20171j67726
$$ plain form
5891 2507654 2562330 2652997 2671725 2634194 2684350 2754242 2912929 2961643 3067665 3097732 3062671
5880 3062671 3247782 3479624 3570000 3566571 3680768 3759988 3807639 4044879 4255632 4303114 4387977
5869 4387977 4594438 4730328 4913997 5102831 5358187 5596756 5773503 5855906 6061377 6299933
5859 6299933 6601334 6849840 7091840 7385259 7621104 7904727 8224856 8653756 9135242 9458398
5849 9458398 9947904 10502893 10950960 11465265 12139354 12895340 13760254 14694283 15676606 16827097
5839 16827097 18085405 19440180 20889586 22461971 24188463 25892236 27352470 28717688
5831 28717688 29778501 30553509 31133568 31233664 31078658 30918244 30644767 30283329 29935643
5822 29935643 29666777 29216911 28593229 27981325 27373223 26815780 26242954 25922783 25755057
5813B5755057J6957K21547M50703M68232P88447J072888J225228J468463J550487
5804C3018009J774711J884153J874338J810703J561127J288580J103530P57541
5796D5072692Q12717Q59266Q71424J028672J017450P72096Q31803N52923L52946
5787E2171989J74253K83992L55466L54394K99380j01873m62724j084798j325302
5778E0664777j878594k203048k245106k285859k071732k000677j826503j423235
5770C4730023j100642p27065m18723j63255K0773L33933N02640O82088P80378
5761C4640150Q13606P38412P72567O36945O05614N49210N39035O65606M66429
5752D0427574L04262j33016m29093r17780j332876j808070k101426k259224k435799
$$ plain form
5813 25755057 25772014 25993561 26444264 26912496 27700943 28773831 29999059 31467522 33018009
5804 33018009 34792720 36676873 38551211 40361914 41923041 43211621 44315151 45072692
5796 45072692 45885409 46744675 47616099 48644771 49662221 50434317 51266120 51819043 52171989
5787 52171989 52346242 52630234 52985700 53340094 53639474 53537601 53074877 51990079 50664777
5778 50664777 48786183 46583135 44338029 42052170 39980438 37979761 36153258 34730023
5770 34730023 33629381 32902316 32483593 32320338 32341111 32675044 33177684 33859772 34640150
5761 34640150 35453756 36192168 36964735 37601680 38207294 38756504 39295539 39961145 40427574
5752 40427574 40731836 40598820 40169727 39251947 37919071 36111001 34009575 31750351 29314552
5743B9314552k363886k110310j915458j872741j697724j403163j242694j154730
5735A5553846q25754q89592p28955o21019n60090n65560n31880m23069l69641
5726A0038286m10743l14027k02197l67216l86574k79204q8537k52354j45798k27879
5716G363757k62256j61981p3171j44446j49793j14660l5452j12996j6649k07343
5706F085010n6774P5118K610m6407k23821l312l9943r0279N6364m9714L2809P3189
5694E814850L3434n9412O7268P3531J51169j19348j46503Q1474J55410J08939
5684F160812O0966P3810K2676m108K16839J65867P0386J53968N1442J51994J66997
5673G291649K74968J96165J55439J94167K45762J84657L41332K50192L04017L63973
$$ plain form
5743 29314552 26950666 24840356 22924898 21052157 19354433 17951270 16708576 15553846
5735 15553846 14728092 13838500 13109545 12488526 11928436 11362876 10830996 10407927 10038286
5726 10038286 9627543 9313516 9111319 8744103 8357529 8078325 7989788 7737434 7591636 7363757
5716 7363757 7101501 6939520 6866349 6721903 6572110 6457450 6421998 6309002 6292353 6085010
5706 6085010 6028236 6103354 6105964 6059557 5835736 5832424 5792481 5702202 5758566 5708852 5741661 5814850
5694 5814850 5848284 5788872 5856140 5929671 6080840 5961492 5814989 5896463 6051873 6160812
5684 6160812 6221778 6295588 6318264 6314156 6530995 6696862 6767248 6921216 6972658 7124652 7291649
5673 7291649 7566617 7762782 7918221 8112388 8358150 8542807 8884139 9134331 9438348 9802321
5663I802321L17928L46231L98127M00470M17388M15721N69918N97251N79927P17946
5653A4563228Q20550Q31288Q75931R03890J187877J368909J381325J620069J726206
5644B5279273J967345K174310K272904K497147K471852K369635K131454J755195
5636D2919115J190654P49737J63044l33027o13200o50014p60400p88083q36890
5627D1040936p23032o24721q20603q31376p53830n96315m60367k33722j18028
5618C5878942J26865M74118P61771J057888J233276J593777J836668J907891J984504
5609D6855700J720677J370999R32948O57887P3395k80566l47465n92503n20041
5600D9871031n21062n30857m18765m61260o46712o86575q72527q56746p94131
$$ plain form
5663 9802321 10120249 10466480 10864607 11265077 11682465 12098186 12668104 13265355 13845282 14563228
5653 14563228 15383778 16215066 17090997 17994887 19182764 20551673 21932998 23553067 25279273
5644 25279273 27246618 29420928 31693832 34190979 36662831 39032466 41163920 42919115
5636 42919115 44109769 44859506 45022550 44689523 44076323 43426309 42665909 41877826 41040936
5627 41040936 40317904 39693183 38872580 38041204 37287374 36691059 36230692 35996970 35878942
5618 35878942 36005807 36479925 37241696 38299584 39532860 41126637 42963305 44871196 46855700
5609 46855700 48576377 49947376 50880324 51538211 51611606 51331040 50983575 50391072 49871031
5600 49871031 49349969 48819112 48400347 47939087 47292375 46605800 45733273 44876527 44082396
5591D4082396n41255m78928m85979o70948o64034p60119j034232j380091j391230
5582C6675580j464465j645254j563972j516017j297902j039536p36830o81946
5574B6729658m55376k07430J2540J29031J58421K85491L02541L83036L39788K88068
5564B7965768M96957L74982L03771L87068J95834K492j86834n38087q69486j313078
5554B6819387j511242j741358j758816j767992j511083j463648j213147j129093
5546A4723008j048465q99106p78164o28914o92144o08704m61466m15277m08375
5537H782393m54633l00370k68752l09991m14003l65775j62204j84112k73137k73622
5527E775794j88389k01495j14428k59193k15622j67739r0514r7469j47539n5634
$$ plain form
5591 44082396 43541141 43062213 42576234 41905286 41241252 40481133 39446901 38066810 36675580
5582 36675580 35211115 33565861 32001889 30485872 29187970 28148434 27411604 26729658
5574 26729658 26274282 26066852 26079392 26208423 26366844 26652335 26954876 27337912 27677700 27965768
5564 27965768 28462725 28837707 29141478 29528546 29724380 29726872 29540038 29001951 28132465 26819387
5554 26819387 25308145 23566787 21807971 20039979 18528896 17065248 15852101 14723008
5546 14723008 13674543 12775437 11997273 11368359 10676215 10067511 9606045 9190768 8782393
5537 8782393 8327760 8027390 7758638 7448647 7034644 6668869 6506665 6322553 6049416 5775794
5527 5775794 5587405 5385910 5271482 5012289 4796667 4628928 4538414 4440945 4293406 4237772
5517D237772j48719j53013j99603q6294p3517o1552l7947j50408k08568q6515
5507C031636n5607j06028K9320n7663q4877p4468j45550n245o7670n3716J6924
5496B427056j22069l479k39718r125J00700l5473j81303n8508J9640q8844J21843
5485A930720N322j17729k3001j6743r8510K8405n692q8766q5144N7495P6159j64440
5473A498076j9678J33860K6573L3053J07980K199K1596O679j3670J66778J12687
5462B076133K72506K05853N8568n1077j27502k06542k25455m2402k12965j28691
5452A618426M2177j52771j12370M8190N4683M4102k7274j31922L5731R3386J5556
5441A527914J08198K47097J09398J07065J75931l4377q6524l2088j21948k28525
$$ plain form
5517 4237772 4089053 3936040 3736437 3650143 3576626 3515074 3477127 3326719 3118151 3031636
5507 3031636 2976029 2870001 2899321 2841658 2756781 2682313 2536763 2531518 2463848 2410132 2427056
5496 2427056 2304987 2301508 2061790 2052665 2153365 2117892 1936589 1878081 1897721 1808877 1930720
5485 1930720 1936042 1818313 1795312 1778569 1680059 1708464 1702772 1614006 1528862 1586357 1662516 1498076
5473 1498076 1478398 1612258 1638831 1671884 1779864 1782063 1803659 1810338 1796668 1963446 2076133
5462 2076133 2348639 2554492 2613060 2561983 2434481 2227939 2002484 1960082 1747117 1618426
5452 1618426 1660603 1507832 1395462 1443652 1498335 1542437 1515163 1383241 1418972 1512358 1527914
5441 1527914 1636112 1883209 1992607 2099672 2275603 2241226 2154702 2122614 2000666 1772141
5431A772141k82202n0809O591j17012j13461q8574j44350J3684J2007q3936n6959
5420H67120R011J74030j0926r8124q7471m3475j0101j6068k0049N3710m8577o4460
5408G04620J6138P000N1190K9005j9487j22270o09K7964P8159Q2082j6816j05282
5396G31694r7493M5782k314O0542j00082M2800j50376J9904n762p3773L1503p1129
5384D31296j8882p4405O2816j9538n5652N8618J17924J7155r8670M5439l6999
5373D29102j6115K571L6854L663n5244l4919P6289r28j06896K1549M2533K2161
5361D20620l6453p7376J46260k5687j30325P3418l3844j1542j02667P2759J59125
5350D54288n637O1752P4940l0385N588o1755k6517O0633J0963l5007l602j1043
$$ plain form
5431 1772141 1489939 1439130 1445721 1328709 1215248 1126674 982324 996008 1008015 924079 867120
5420 867120 876131 1050161 1039235 941111 853640 810165 800064 783996 763947 817657 769080 704620
5408 704620 720758 727758 778948 807953 788466 666196 665587 693551 771710 853792 836976 731694
5396 731694 634201 679983 677669 738211 638129 680929 530553 550457 544695 470922 502425 431296
5384 431296 412414 338009 400825 381287 325635 384253 502177 519332 420662 466101 429102
5373 429102 412987 415558 452412 456075 400831 365912 442201 441273 334377 355926 398459 420620
5361 420620 384167 306791 453051 427364 297039 370457 336613 325071 222404 295163 454288
5350 454288 448651 510403 585343 554958 560546 498791 472274 532907 543870 508863 505261 494218
5338D94218J12239R1014p8301Q5709J30417Q7325q4570M0620M0353N7159J22333
5327A098516L3256L0925K10740K11455K15601K15967J47983J88962J04796P5003
5317B533204n81Q0580N8216Q4120P1382L9922J8020Q1101J0445j17823l6347j8191
5305B804048j94481j6338o4149j25745n3467N4402L8433o0021O0623q9768n1909
5294B301628R2320M3618L2674k0912Q0797j52567l5385M6339j61666j8465m4702
5283B163679j67430j20249k41334j88627q3519r3880p4780j0266j59568j04132
5273I19894l2639r087j12443r846n404o6242j15210N9334N4009j22186l0283K2612
5261E52509o8643j2386K1794r5177O8494n6130n3481m9792K779n815o16k8311
$$ plain form
5338 494218 606457 697471 619170 704879 835296 922621 838051 878671 919024 976183 1098516
5327 1098516 1131772 1162697 1373437 1584892 1800493 2016460 2164443 2353405 2458201 2533204
5317 2533204 2532623 2613203 2671419 2755539 2826921 2866843 2884863 2965964 2976409 2858586 2822239 2804048
5305 2804048 2609567 2593229 2529080 2403335 2349868 2404270 2442703 2382682 2443305 2353537 2301628
5294 2301628 2393948 2437566 2470240 2449328 2530125 2377558 2342173 2388512 2226846 2208381 2163679
5283 2163679 1996249 1876000 1634666 1446039 1362520 1268640 1193860 1183594 1024026 919894
5273 919894 887255 878168 765725 755879 750475 684233 569023 628357 682366 560180 529897 552509
5261 552509 483866 471480 493274 398097 466591 410461 356980 307188 309967 304152 303536 275225
5249B75225m7358J7860k8865O2228J31148j12242q2770q247K6588m5287k04905
5238a6625K3107K9514j5732N5542k8709p0167o2004M6446l8506O0548o4229m35
5226h1250J45377r7270l3139M2951K0008k9646q7998o234Q4678j9602K0902L3677
5214g546j07215j78501J893P8502P1979m482J0251m0241r9813p9531J09226K2645
5202b22833O762O1495o5945k0465N7670J11989k02825j08859Q2524L3383p4103
5191c41207J4633N2469m8778k5683L6028o1302N6021j0009j6801M1781N9460l1440
5179b74828r371O286j2992j01298L2955n4454K0521J04347j11j00425K9308L2836
5167c27226O1934l8906J0402j16010l2012Q3336m8723j04796L5265R8970J8433
$$ plain form
5249 275225 227867 245727 216862 279090 410238 297996 215226 206979 233567 188280 -16625
5238 -16625 6482 35996 20264 75806 47097 -23070 -85074 -38628 -77134 -16586 -80815 -81250
5226 -81250 64127 -33143 -66282 -23331 -3323 -32969 -120967 -127201 -42523 -62125 -41223 -7546
5214 -7546 -114761 -293262 -291369 -212867 -140888 -145370 -135119 -175360 -275173 -354704 -245478 -222833
5202 -222833 -216071 -154576 -220521 -240986 -183316 -71327 -274152 -383011 -300487 -267104 -341207
5191 -341207 -326574 -274105 -322883 -348566 -312538 -373840 -317819 -327828 -344629 -302848 -243388 -274828
5179 -274828 -284199 -277913 -290905 -392203 -359248 -413702 -393181 -288834 -288945 -389370 -360062 -327226
5167 -327226 -265292 -304198 -293796 -409806 -441818 -358482 -407205 -512001 -476736 -377766 -359333
5156c59333P3665p272j18298Q4537m294j12367L1516P4061n5471M4608j0460j2663
5144c71771r997j48818J25287O9358j9730m7338J4961j94290O2544O2866R5596
5133c61332k2140L8059l4617Q6396k5390j74187P2771m2114p443P8861L7177k9678
5121c83637m0772m0143l7726M6040J04692O0200j12422l0258o0885l8837l1502
5110e65250L7685J04818L072k9865O6236p438l6041j0799m4594q5423P9580j0500
5098d98519j3701l3012K8851N5187Q6940O2331j7449P488j34664o8695M0466L7259
5086d47518o2373M082R2660l6670l6681M6371o9449q579O3697K2135k6303j5101
5074d73729j681M5657K5764J1801J4882o0306J2109j4368K888L7779N3560K2461
$$ plain form
5156 -359333 -285668 -292940 -411238 -326701 -330995 -443362 -411846 -337785 -393256 -348648 -359108 -371771
5144 -371771 -381768 -530586 -405299 -335941 -355671 -403009 -388048 -582338 -519794 -456928 -361332
5133 -361332 -383472 -345413 -380030 -293634 -319024 -493211 -420440 -462554 -469997 -391136 -353959 -383637
5121 -383637 -424409 -464552 -502278 -456238 -351546 -291346 -403768 -434026 -494911 -533748 -565250
5110 -565250 -527565 -422747 -419675 -449540 -383304 -390742 -426783 -437582 -482176 -567599 -488019 -498519
5098 -498519 -512220 -545232 -516381 -461194 -374254 -311923 -329372 -321884 -456548 -525243 -484777 -447518
5086 -447518 -509891 -505809 -413149 -449819 -486500 -440129 -509578 -518157 -454460 -432325 -458628 -473729
5074 -473729 -475410 -429753 -403989 -392188 -377306 -437612 -425503 -439871 -436983 -399204 -345644 -323183
5062c23183j1868n4857m803j3351o6282j0872J24493j3567q7883L8466k7669o1834
5050e13210P8303K9493o1133K6590P90p562R955J7135J595P9432N0801p6127o0417
5037d24355Q6932l9669q9784K3179J7062q2968o7730O4299P3573q0173N8645J12053
5025c48936K8891m7994l6518L9551m7550o0065N2899J24424n1596j15372Q500
5014d53766K5721Q5896r5300j861L0446Q0255m4139m4202K2913J03594m5432J8661
5002c17214o4768o0627J08639j25867k3255J28403J6320n6434P8098K5569N1479
4991b39657p1893r1803N2156m3702N1078K3253K4562R8651n5956O6713j8963l1073
4979b36634q6984K7527J05045K5186j4872l2289n6351k4086N3644N2062p407q8477
$$ plain form
5062 -323183 -335051 -389908 -394711 -408062 -474344 -485216 -360723 -374290 -462173 -423707 -451376 -513210
5050 -513210 -434907 -405414 -466547 -439957 -439167 -446729 -436774 -419639 -418044 -338612 -287811 -363938 -424355
5037 -424355 -337423 -377092 -466876 -443697 -426635 -509603 -577333 -513034 -439461 -519634 -460989 -348936
5025 -348936 -320045 -368039 -404557 -365006 -412556 -472621 -419722 -295298 -346894 -462266 -453766
5014 -453766 -428045 -342149 -437449 -439310 -408864 -328609 -372748 -416950 -394037 -290443 -335875 -317214
5002 -317214 -381982 -442609 -333970 -459837 -483092 -354689 -338369 -394803 -316705 -291136 -239657
4991 -239657 -311550 -403353 -351197 -394899 -343821 -320568 -296006 -197355 -253311 -186598 -205561 -236634
4979 -236634 -323618 -296091 -191046 -165860 -180732 -213021 -269372 -293458 -239814 -187752 -195159 -283636
4967b83636J7482q5042L8017k1142K3307O9785J8934J133k761j04189M456L4694
4955b88962J00729k4503L8990N0728j9736L5038k2803K7623q6609m2259r9026
4944c30790J30018l7744r4867N1832O8396r6463m2215M2323L3522j8486k9748
4933c24222J62985j2775l2786J4612O2886j2982o0501l0549O6550P115J01434
4922e8233Q201M9586K4261p818k3561N6521P5172O8674L5875j20066M2339n1894
4910I9057r9940Q2829P0462j95607J08378R3112j3670k39O3860j7951Q7143j68297
4898A09137j8648p1762k7708r0682Q2223M8755q0564J09399K0851N4649Q8232
4887B23882l8862q4166O2301k9614K8180o5856k0203m2849j11093p6851O8923
$$ plain form
4967 -283636 -266154 -351196 -313179 -334321 -311014 -241229 -222295 -221162 -223923 -328112 -323656 -288962
4955 -288962 -188233 -212736 -173746 -123018 -142754 -107716 -130519 -102896 -189505 -231764 -330790
4944 -330790 -200772 -238516 -333383 -281551 -213155 -309618 -351833 -309510 -275988 -294474 -324222
4933 -324222 -161237 -174012 -206798 -192186 -129300 -142282 -202783 -233332 -166782 -159667 -58233
4922 -58233 -50032 -446 23815 15997 -7564 48957 124129 192803 228678 108612 150951 99057
4910 99057 -883 81946 152408 -43199 65179 158291 144621 144382 208242 190291 277434 109137
4898 109137 90489 18727 -8981 -99663 -17440 31315 -49249 60150 81001 135650 223882
4887 223882 185020 100854 163155 133541 161721 95865 75662 32813 -78280 -155131 -86208
4876h6208J0615K5172k9623j04761l0207O1061m2410J52657J2864k09956M6484
4865a94312M2938P7394n0353J20663o7816j67807Q3868N2768m9528j0620n0434
4854b13239l2572J34569R6219N2979r670n4243n767Q4550L7313n9645p7158P6661
4842B9997N4114j956j2411j8997J38052M9042q2702j5043P220q8254k9509m146
4830B5407M8987J1198k8863j3956n8447J2193l5840J57961J37301n8397r0882
4819A06662n569L9654P3361N8050k9928l8294j16547l9325M4685M4581o7232J0241
4807H0339N8584J8879o7581r3293r9450j37564J18855O3529n5436p1495K720r4009
4795b75922m4338Q2677k4560M6777O9834K722l0136r1205O5686K5697M8863o62
$$ plain form
4876 -86208 -75593 -50421 -80044 -184805 -215012 -153951 -196361 -43704 -30840 -240796 -194312
4865 -194312 -151374 -73980 -124333 -3670 -71486 -239293 -155425 -102657 -152185 -162805 -213239
4854 -213239 -245811 -111242 -15023 37956 28286 -25957 -31724 52826 90139 30494 -46664 29997
4842 29997 84111 82155 69744 50747 188799 237841 155139 140096 147316 59062 29553 25407
4830 25407 74394 85592 56729 42773 -15674 -3481 -39321 118640 255941 197544 106662
4819 106662 101093 140747 214108 272158 242230 203936 87389 48064 92749 137330 70098 80339
4807 80339 138923 157802 90221 -3072 -102522 -240086 -121231 -57702 -113138 -184633 -181913 -275922
4795 -275922 -320260 -237583 -262143 -215366 -145532 -142810 -172946 -264151 -198465 -172768 -123905 -124567
4783a24567l8234l4975l2045K491J08977j00428J09634J62550p7828n3969l2060
4772a10454j00613L987K7633Q5580k7771M4439M2333l0603N7199j24261O76J1888
4760a19967N93j2421L4531l8318P77O2395O868n5401j35283J16591L7435n4451
4748a56651M7733j2064j05703q4397l3218J7823J75879L1334j23078q093J8610
4737b31825K8849j3619m2989O9226J6525Q0380K2100q4390q9253k7470O161R164
4725b57141p8744P376K62144M9447r1855j07057N2854K11235j37589j2612J2112
4714h9830k4997o4527N7096n118l2177m1311O0238O5132l1341J14011N9085n9307
4702F954O8879j3112M440M6678o3461P587J6692k3136O0154n3864p737p023N7082
$$ plain form
4783 -124567 -162801 -197776 -229821 -227330 -118353 -218781 -109147 53403 -24425 -78394 -110454
4772 -110454 -211067 -207080 -179447 -93867 -121638 -77199 -34866 -65469 -8270 -132531 -131855 -119967
4760 -119967 -119374 -131795 -97264 -135582 -134805 -72410 -65542 -120943 -256226 -139635 -102200 -156651
4748 -156651 -108918 -120982 -226685 -311082 -344300 -326477 -150598 -119264 -242342 -250435 -231825
4737 -231825 -202976 -216595 -259584 -190358 -173833 -93453 -71353 -155743 -244996 -272466 -266305 -257141
4725 -257141 -335885 -328509 -66365 -16918 -108773 -215830 -162976 48259 -89330 -101942 -89830
4714 -89830 -114827 -179354 -122258 -127376 -159553 -200864 -140626 -75494 -106835 7176 66261 6954
4702 6954 75833 62721 67161 113839 50378 57965 74657 51521 111675 57811 50074 43051 100133
4689A00133K4717j52995L9971J02981o3873l3714o4367n942j8363N419J3119m2065
4677i4979k6973M8702j06754j12550J32745k1641m9980J1660M8916L5327k9471
4666a64998r4866m9956J06315P7344o0876M3059N257Q940j38941J24510J4160
4655a30052o2161L8291M0998j4991m4862L8037N5956j6061K7154O4272J4883L6284
4643D7748N7145j7772N2125L6136k6501Q7112J16372k4350j55016K245o934K5210
4631A93520k1993L8372R4237k8326j00495j18961J60081O6267m9330n9013L6606
4620B10965m881n2412l9325L7457p2261q5761p1342L98k7054k5883M1510q5115
4608a73704K1191k4872L3137L1510k4541j50292L9529m589O0775j4248k2046J2713
$$ plain form
4689 100133 124850 -28145 11826 114807 50934 17220 -47147 -53089 -71452 -66033 -52914 -94979
4677 -94979 -121952 -73250 -180004 -292554 -159809 -181450 -231430 -219770 -170854 -135527 -164998
4666 -164998 -259864 -309820 -203505 -126161 -187037 -143978 -138721 -129781 -268722 -144212 -130052
4655 -130052 -192213 -153922 -112924 -127915 -172777 -134740 -78784 -94845 -67691 -3419 11464 47748
4643 47748 104893 87121 139246 175382 148881 235993 352365 328015 172999 175244 168310 193520
4631 193520 171527 209899 304136 275810 175315 56354 216435 282702 233372 174359 210965
4620 210965 206084 153672 114347 151804 79543 -6218 -77560 -77162 -104216 -130099 -88589 -173704
4608 -173704 -152513 -177385 -144248 -112738 -137279 -287571 -248042 -252631 -191856 -206104 -228150 -215437
4596b15437K8541N3059n9090o5681q2868J3788N2352J6100Q81k0318l9030P0654
4584b47049k4341j03726O0061k2753l6748J20435K6881o7132M7768M9898K8436
4573a68270j00130N8016l0211j11399M7940N2988n8423o9319o4002k0487J55350
4562c07947J9070N271J8166j13850m9333Q9015L1053m7857n8225M6874j7921k5507
4550d11191J4026M9629J27554j7697j32850j8042m0553J7727P8190N4358j003
4539b79852j78747J10429J57273j07420q1138L2615r1865M648K00407j65572K8288
4528c70934M8436P5294L136n8477P5061j6811K2448N4620j74331P1831Q0510M8217
4516a41000k6018o9534k6385n250J15300j3392k7703l4938p921M3499r9351P157
$$ plain form
4596 -215437 -186896 -133837 -192927 -258608 -341476 -327688 -275336 -259236 -258355 -278673 -317703 -247049
4584 -247049 -271390 -375116 -315055 -337808 -374556 -254121 -227240 -294372 -246604 -196706 -168270
4573 -168270 -268400 -210384 -240595 -351994 -304054 -251066 -309489 -378808 -442810 -463297 -307947
4562 -307947 -288877 -283606 -265440 -379290 -428623 -339608 -308555 -356412 -414637 -367763 -385684 -411191
4550 -411191 -397165 -347536 -219982 -237679 -370529 -388571 -429124 -411397 -333207 -278849 -279852
4539 -279852 -458599 -348170 -190897 -298317 -379455 -346840 -438705 -434057 -233650 -399222 -370934
4528 -370934 -322498 -247204 -244068 -302545 -227484 -244295 -221847 -167227 -341558 -269727 -189217 -141000
4516 -141000 -167018 -236552 -262937 -268187 -152887 -166279 -193982 -228920 -236841 -193342 -292693 -285536
4504b85536J38730q1708o3588J3976L3758L5894R153k3262J7943J04549M2431
4493e7660o7644k9882j5640M3787K1061J1654N653j73o7698J02465R1492L7162
4481G4577j10026J5082l3459L2988J4817M9628R7619j26223m5403R0515J8152
4470G8267j0553k8599N154R0332k0152j0879R8888M7939P9651J0975Q01K0662
4458C62486Q6213L5136q2514j7459M596K5563l608J0745r6028L2651N8995o5005
4446C51771m9622j28984q139O8678n9460p0943k3260N1465m2974J7737q9581J8747
4434C5435Q2162O1219n2754m8167o5996j90L667M9765N8498L1453J613l3913J3159
4421A35951N8781Q7845p1034j4077J9278M2474J03457J61273j272n0846O3027
$$ plain form
4504 -285536 -146806 -228514 -292102 -278126 -244368 -208474 -199321 -222583 -204640 -100091 -57660
4493 -57660 -125304 -155186 -170826 -127039 -105978 -94324 -88671 -88844 -156542 -54077 37415 74577
4481 74577 -35449 -20367 -53826 -20838 -6021 43607 141226 15003 -30400 60115 78267
4470 78267 67714 39115 44269 134601 114449 103570 202458 250397 330048 341023 341824 362486
4458 362486 448699 483835 401321 383862 388458 414021 410413 421158 325130 357781 416776 351771
4446 351771 302149 173165 165026 233704 174244 103301 80041 131506 88532 106269 16688 35435
4434 35435 117597 178816 126062 77895 11899 11709 15376 65141 123639 155092 156705 122792 135951
4421 135951 194732 282577 211543 197466 216744 259218 362675 523948 522676 471830 534857
4410E34857k2818P78K2859K939K6853K9846K9467l31L2217q5398n3492M3181o1893
4397D99065J3800k8561l5445n086L4313j7393j07384M1189O8699l1400j30291
4386C01506l8938m4854K328p8157q4713L9490J25205o4776N6240J3186m5005j35015
4374D6497M7688L2346M0014J7624J0087R0028O1452O9919l4976K4852J826P0686
4362D78043r5121j4058L440k1753O3211n9542l9681K3039J566K2808R5653J1952
4350D69557n8036k3828L6419J2561P242K2699k5333J5223n8063Q1570M4420p408
4338E17023n0143l0843o4940J3110j10508J3765J08157l9855J032j3200n2361
4327B91237Q8175K7909j22997k5337K8336p535O4691l1126L4600n2500P811k8091
$$ plain form
4410 534857 512039 512817 535676 538615 565468 595314 624781 624450 656667 571269 517777 560958 499065
4397 499065 512865 484304 448859 443773 478086 460693 353309 394498 463197 431797 301506
4386 301506 262568 217714 220042 141885 57172 96662 221867 157091 213331 226517 181512 46497
4374 46497 94185 126531 166545 184169 194256 284284 345736 415655 380679 405531 407357 478043
4362 478043 382922 368864 372304 350551 413762 354220 314539 337578 339144 361952 457605 469557
4350 469557 411521 387693 424112 436673 443915 466614 441281 456504 398441 480011 524431 517023
4338 517023 466880 436037 371097 384207 273699 287464 395621 355766 356798 343598 291237
4327 291237 379412 407321 284324 258987 287323 279788 344479 313353 347953 295453 303264 275173
4315B75173j4595k124K2204M6571q7594Q4543j4118l6855J6928R5204N6188l9924
4303D01601J6025k6809k3758P7391J21798k7154L8162J4770O0776K3615j07453
4292E68964K1933j34999m3061O5400Q0013k7497m2161P6939q3446l0462R4274
4281E45897M811K5069M0428N2032l9936N3930M4203n9155l4313L3772K9954J0343
4269G07035M5745L6440l8703k5983l1013J3492L0515n229O1989J32563L0510K6077
4257I83438k5916k576R1867K9264n3206j5310Q3609J59574n269M5669P5953M3458
4245A410555k349J2198J24782L1769J973L5835j6858R5473P9231J17002L1338
4234A920949k025K06256r584J1960O9361R5157R6447J35621J15718O5699j357
$$ plain form
4315 275173 260578 258454 280658 327229 239635 324178 310060 273205 290133 385337 441525 401601
4303 401601 417626 390817 367059 444450 566248 539094 577256 592026 652802 676417 568964
4292 568964 590897 455898 412837 478237 558250 530753 488592 565531 482085 451623 545897
4281 545897 550708 575777 616205 668237 628301 682231 726434 667279 632966 666738 696692 707035
4269 707035 752780 789220 750517 724534 693521 707013 737528 732299 794288 926851 957361 983438
4257 983438 957522 954946 1046813 1076077 1022871 1007561 1091170 1250744 1245475 1291144 1367097 1410555
4245 1410555 1408206 1420404 1545186 1576955 1578928 1614763 1597905 1693378 1772609 1889611 1920949
4234 1920949 1918924 2125180 2115596 2127556 2196917 2292074 2388521 2524142 2639860 2705559 2704202
4223B704202J0239J19016J04094J3587J53222J50724J26123J81223J25757K35643
4213C923830J18338J50980L36420J98167K51583J73619J72051L71696K86810L04553
4203F288047N02046K30822K74671M09713L53663M63506M45801N06537M55296N88975
4193A0519077O04110P23478O58623P44240P44001O31343P02316P52612P78290
4184A6858090O72659O51127O54908P40411Q06500R00341J042070R65651J211589
4175B4503346J102927R42516Q30222O74676N65725M53317K97745K88226L82722
4166C0041422L27538M91569O08902O79682O23476N79836N66458M14909J65638
4157C4499430j7989m29353n64964o65714o75079p40937m23523l78382l75088k99606
$$ plain form
4223 2704202 2714441 2833457 2937551 2951138 3104360 3255084 3381207 3562430 3688187 3923830
4213 3923830 4042168 4193148 4529568 4727735 4979318 5152937 5324988 5696684 5983494 6288047
4203 6288047 6790093 7020915 7295586 7705299 8058962 8522468 8968269 9474806 9930102 10519077
4193 10519077 11123187 11846665 12505288 13249528 13993529 14624872 15327188 16079800 16858090
4184 16858090 17530749 18181876 18836784 19577195 20383695 21284036 22326106 23291757 24503346
4175 24503346 25606273 26548789 27379011 28053687 28619412 29072729 29370474 29658700 30041422
4166 30041422 30368960 30860529 31469431 32149113 32772589 33352425 33918883 34333792 34499430
4157 34499430 34481441 34052088 33487124 32821410 32146331 31405394 30981871 30603489 30228401 29928795
4147B9928795l32401l35051m00471n36515p93124q40415r46747j219740j179755
4138B3344576j065811r28238r21717p73967o68395p63407o57105o68255o75921
4129A6221760p13917o73189q86118p24220p28098p59981o13486o54713n58478
4120I909560o20851m68560m09941m90330l94403l64179l55034k89454k87192k53370
4110E976246k71016k85771j14461k37391l40724k29100k12491l9301j86096j57686
4100C902209j57552j85377n4851p0741j92913j28031n1107j31207j20047j24757
4090B685626j1013n15q2802l0426j38527j27397o2468j60946n0685L3942j0749
4079B044040Q37o7712j32911o9783j28222r5169J2847Q7883k0585j9382k952q74
$$ plain form
4147 29928795 29596394 29261343 28860872 28324357 27531233 26690818 25744071 24524331 23344576
4138 23344576 22278765 21350527 20428810 19654843 18986448 18223041 17565936 16897681 16221760
4129 16221760 15507843 14834654 13948536 13224316 12496218 11736237 11122751 10468038 9909560
4120 9909560 9288709 8820149 8410208 7919878 7525475 7161296 6806262 6516808 6229616 5976246
4110 5976246 5705230 5419459 5304998 5067607 4726883 4497783 4285292 4245991 4059895 3902209
4100 3902209 3744657 3559280 3504429 3433688 3240775 3112744 3061637 2930430 2810383 2685626
4090 2685626 2674613 2674098 2591296 2560870 2422343 2294946 2232478 2071532 2020847 2054789 2044040
4079 2044040 2044877 1977165 1844254 1774471 1646249 1551080 1563927 1651810 1631225 1611843 1608891 1608017
4067A608017m9905q3250K3164P1167p588m3626k2926j1747j36028j1825l8261
4056A297192L5884o183K0345J12439o4113m7890m962K008k781L3055k9246L2071
4044A377819m1961J1249O4841j96192J3010Q7536p86J8908m3247q0333R2990N6990
4032A360824j48833N3242M2303n1691l0066L8279o7238K5728l1602p2096L5766
4021A154616m4015j5268M638j03346m4104J31598p2122n6979k3827K6921q7525
4010H70587j25169l5874O7068N957j11058k3626P2900J5289j847q7224j78339
3999D68664P970K5538M5353J4427j30627j1938r4157N1592l9116j5424L4120j3621
3987C42781l3947M316O2578k8133r685j6974J4663q9779R0884n4161l5108n804
$$ plain form
4067 1608017 1558112 1474862 1498026 1569193 1561605 1517979 1495053 1483306 1347278 1335453 1297192
4056 1297192 1333076 1326893 1347238 1459677 1395564 1347674 1342712 1344720 1341939 1374994 1345748 1377819
4044 1377819 1335858 1347107 1411948 1215756 1228766 1316302 1315516 1334424 1291177 1210844 1303834 1360824
4032 1360824 1211991 1265233 1307536 1255845 1225779 1264058 1196820 1222548 1190946 1118850 1154616
4021 1154616 1110601 1095333 1099971 996625 952521 1084119 1011997 955018 931191 958112 870587
4010 870587 745418 709544 776612 782569 671511 647885 720785 736074 734227 647003 468664
3999 468664 476634 502172 547525 561952 431325 419387 325230 376822 337706 322282 356402 342781
3987 342781 308834 313150 375728 347595 337910 320936 335599 245820 336704 282543 247435 241631
3975B41631o105M1449k2111l3172o9563o5656P5006k439L8044K3424L1558K531
3963B54597M6697O1761l426j20709L4620j03703K5083O469m8650Q7474k2588l2510
3951A85115l3527j4006l4498l828O3572J9563j20619O9117m9208o5545M9244O9841
3939A35221J06108l3941N836M3868O5773m7991M5521L4850j3074L446j08314n4852
3927A82451N8457P6560l0585L8890N8665J7849J9339N6614m2205l8591k1739L4045
3915D09750O0367M4431J6763Q7016J12245R0840P226J03289k5314l3513r3222
3904G79878r7537O7762L9513k8230J168n8588j25850j6557J13957l8703q5698
3893E51115J05322l4671k4188M6356K5839p3767J4953K777j35232J2189q046L0095
$$ plain form
3975 241631 235526 276975 254864 221692 152129 86473 161479 159040 197084 220508 252066 254597
3963 254597 301294 363055 359629 238920 273540 169837 194920 201389 152739 240213 217625 185115
3951 185115 151588 137582 103084 99256 162828 182391 61772 130889 81681 16136 65380 135221
3939 135221 241329 207388 213224 257092 322865 274874 320395 355245 342171 345617 237303 182451
3927 182451 240908 317468 286883 325773 384438 402287 421626 478240 436035 397444 375705 409750
3915 409750 470117 514548 531311 618327 730572 821412 828638 931927 906613 873100 779878
3904 779878 682341 750103 789616 761386 762554 703966 578116 561559 675516 636813 551115
3893 551115 656437 621766 597578 643934 669773 596006 610959 613736 478504 490693 482647 512742
3881E12742L7827o7531o4487q7934M1155k510L5119J11500R077o7177r0456N2412
3869D19737Q5832L7155j20228l0008K8628q0188P187N1762N8154O1643l1083J6846
3857E05437l49P5196O3J825N3440n6873n4265O2598k5754q2025O9413j7551j8154
3844E13001Q1462P1983m767J3834k9067n1973j7665K5331N6527r328m1739p5157
3832E32442l7091Q1798J21813L0792p5048l832n5140J155L4772O9715J10407N7906
3820H69689l571r4307K5779l9096k6577J06441j147j709N3683m6210o31J05939
3808I48283l9311N5221j26275P8583J05329N2947L4313n4159l2026P9734N8996
3797A161635j35577J5143J25120M1173O6131n1153l341k1525l8636J1839K3186
$$ plain form
3881 512742 550569 483038 418551 330617 371772 369262 404381 515881 524958 457781 367325 419737
3869 419737 505569 542724 422496 392488 421116 340928 348115 399877 458031 519674 488591 505437
3857 505437 505088 580284 580347 582172 635612 578739 524474 587072 561318 479293 548706 531155 513001
3844 513001 594463 666446 661679 675513 646446 594473 576808 602139 658666 649338 607599 532442
3832 532442 495351 577149 698962 729754 654706 650874 595734 596889 631661 701376 811783 869689
3820 869689 866118 771811 797590 758494 731917 838358 837211 835502 889185 842975 842344 948283
3808 948283 908972 964193 837918 916501 1021830 1074777 1109090 1054931 1022905 1102639 1161635
3797 1161635 1026058 1041201 1166321 1207494 1273625 1222472 1219131 1197606 1158970 1170809 1193995
3786A193995P0522J01868O8633Q4530J49117P866k8462n1461N2504O9527Q8999
3775A807638k2738Q5550L0582Q3052Q3344L0585J95639n6643r8059N1276Q0605
3764B270831L0980m24N8387L0810J4059O8956K966N997q936J4759Q2149r509o9790
3751B491235n5873L1214o636O133q2R773l0369p8455M2320J3272J4555O4075p8562
3738B422600N6574J4741q0648j1658J1660l7432J25190K7547K7556J4515n1944
3727B518701k5749p727J52365J34153P5333r202K8268P5629j00788N3151L6055
3716B930189N0838J94323M0283J2150J03557J07048k879O4218J14460Q5882J45982
3705C846051O9033R1091Q3845J00992J45236J97494J11913J5535O9522J10540
$$ plain form
3786 1193995 1264517 1366385 1435018 1519548 1668665 1676531 1648069 1596608 1649112 1718639 1807638
3775 1807638 1784900 1870450 1901032 1984084 2067428 2098013 2293652 2237009 2138950 2190226 2270831
3764 2270831 2301811 2301387 2359774 2390584 2404643 2473599 2476565 2482562 2473626 2488385 2570534 2561025 2491235
3751 2491235 2435362 2466576 2459940 2466073 2465991 2475764 2445395 2366940 2409260 2422532 2437087 2501162 2422600
3738 2422600 2479174 2493915 2413267 2401609 2413269 2375837 2501027 2528574 2556130 2570645 2518701
3727 2518701 2492952 2485225 2637590 2771743 2847076 2837874 2866142 2941771 2840983 2894134 2930189
3716 2930189 2981027 3175350 3215633 3227783 3331340 3438388 3435509 3499727 3614187 3700069 3846051
3705 3846051 3915084 4006175 4090020 4191012 4336248 4533742 4645655 4661190 4730712 4841252
3695D841252J86690J62781O6822J47287J51252J70085K1020J52512J45260K1218
3685F066179J39459L5809K3973J66195J46257P2286R4963K0796L25252P8914N0146
3674G220229J13786J92781J91053K11342R4915R2866J63433J76848K63514K25559
3664H946326K01519J24863J46339L87160K63559L36545K19626L22698L41268L08021
3654A1597924M21634L44924M83631M20577M94207N85760N21958M78078N57470
3645A5906163O57308P59471Q63585Q85277Q51366R22963J057230J094749J173730
3636B4171842J323068J431711J514966J807069J950761K069724K383586K627725
3628C9280452K851815L087140L506648L688682L989496M080109M234162M247786
$$ plain form
3695 4841252 5027942 5190723 5257545 5404832 5556084 5726169 5747189 5899701 6044961 6066179
3685 6066179 6205638 6241447 6265420 6431615 6577872 6650158 6745121 6765917 7091169 7170083 7220229
3674 7220229 7334015 7526796 7717849 7929191 8024106 8116972 8280405 8457253 8720767 8946326
3664 8946326 9147845 9272708 9419047 9806207 10069766 10406311 10625937 10948635 11289903 11597924
3654 11597924 12019558 12364482 12848113 13268690 13762897 14348657 14870615 15348693 15906163
3645 15906163 16563471 17322942 18186527 19071804 19923170 20846133 21903363 22998112 24171842
3636 24171842 25494910 26926621 28441587 30248656 32199417 34269141 36652727 39280452
3628 39280452 42132267 45219407 48726055 52414737 56404233 60484342 64718504 68966290
3620F8966290M005739L947146L464833K825668K112127J528086J019463K27186
3612H8096538r6550k93606k99903j93981k48949j56684r5402j73275l75204p30233
3602H5432751j099871j684980k282666k918398l384862l617487l995724m081217
3594F2367546m103374m083652l740856l471548l186950k911062k570415k420888
3586C5878801k170150j977025j858960j718537j446543j166638j128341j102165
3578B3310442j022823q93556q80393p21340o48736n61931o15845n57811m22021
3569A6985986m03119n05226m46969l74543m07469l15590k96760j78982l34197
3560A3723131l29318k11322j88357k10693j82038j94905j44381j37215j85761
$$ plain form
3620 68966290 72972029 76919175 80384008 83209676 85321803 86849889 87869352 88096538
3612 88096538 87999988 87706382 87406479 87212498 86963549 86806865 86711463 86538188 86162984 85432751
3602 85432751 84332880 82647900 80365234 77446836 74061974 70444487 66448763 62367546
3594 62367546 58264172 54180520 50439664 46968116 43781166 40870104 38299689 35878801
3586 35878801 33708651 31731626 29872666 28154129 26707586 25540948 24412607 23310442
3578 23310442 22287619 21394063 20513670 19792330 19143594 18581663 17965818 17408007 16985986
3569 16985986 16582867 16077641 15630672 15256129 14848660 14533070 14236310 14057328 13723131
3560 13723131 13393813 13182491 12994134 12783441 12601403 12406498 12262117 12124902 11939141
3551A1939141n9457k05714k61529p0029j38594j76685j82824k60250j67759n2748
3541A0363552j43336j32712j80734j34350n8733r9247j09949p4225l6535j68573
3531I225158p7903j20743R286p7095o1980K6195k5588r4761N0614Q9811k1159
3520H921835n2890J06767k1991q2262P7085N4899P8513J57536K7888J46293J3056
3509I426729l5147J42183R2766M2679P1458J00598J8361J07763P3942K10215J00201
3498A0351748J43075O5018K40796J34819K46216K54947J23110O6659J45907L79014
3488A2151309L04155L31448K12054K53686M80736L30507K44016L75196L78894
3479A5062001M84435M46241M54128O38532O67829O32183P47414P13485O00397
$$ plain form
3551 11939141 11879684 11673970 11412441 11342412 11203818 11027133 10844309 10584059 10416300 10363552
3541 10363552 10220216 10087504 9906770 9772420 9713687 9614440 9504491 9430266 9393731 9225158
3531 9225158 9147255 9026512 9035798 8958703 8896723 8922918 8897330 8802569 8853183 8942994 8921835
3520 8921835 8868945 8975712 8953721 8871459 8948544 9003443 9081956 9239492 9267380 9413673 9426729
3509 9426729 9391582 9533765 9626531 9669210 9740668 9841266 9859627 9967390 10041332 10251547 10351748
3498 10351748 10494823 10559841 10800637 10935456 11181672 11436619 11559729 11626388 11772295 12151309
3488 12151309 12455464 12786912 12998966 13252652 13733388 14063895 14307911 14683107 15062001
3479 15062001 15546436 15992677 16446805 17085337 17753166 18385349 19132763 19846248 20446645
3470B0446645Q26612R87164R59405J001530R42297R70861R83279P55480N92145
3461B8465418M48890K17591K12503k0793p4743l5012j81426p1851N3356J04389
3451B9118322l2533M8755J96339L69691K79125M53018N90984O07907O74821P01799
3441C3008228Q33583Q02139J022394J099769J264978J295649J497786J519037
3433D2343563J578331J774267K189803K257547K485102K541342K811410L228979
3425F1210344L485738L968277M331922M756889N414903O006696O411602P030790
3417A02617161P626868Q130652Q452078Q541606Q463682Q504861P919073P062999
3409A67318980O290983N203451M008594K847846J642471L33260r54443j895467
$$ plain form
3470 20446645 21273257 22260421 23219826 24221356 25163653 26134514 27117793 27873273 28465418
3461 28465418 28914308 29131899 29344402 29323609 29248866 29213854 29032428 28960577 29013933 29118322
3451 29118322 29085789 29134544 29330883 29700574 29979699 30432717 31023701 31631608 32306429 33008228
3441 33008228 33841811 34643950 35666344 36766113 38031091 39326740 40824526 42343563
3433 42343563 43921894 45696161 47885964 50143511 52628613 55169955 57981365 61210344
3425 61210344 64696082 68664359 72996281 77753170 83168073 89174769 95586371 102617161
3417 102617161 110244029 118374681 126826759 135368365 143832047 152336908 160255981 167318980
3409 167318980 173609963 178813414 182822008 185669854 187312325 187645585 186691142 184795675
3401A84795675k916736l823703m675770n252899n737303o340753o822432p011434
3393A42214645p177789p457974p318056p301245o990140o514083o176278n723100
3385H7555980n276405m793224m269445l812116l379363k987814k754022k297419
3377E7986172k013635j773846j650199j524938j352252j240384r96909q69855
3369D6564154q25627o69944n31143m48750m37046j75115k99073k03562K5728J07801
3359D3107423Q6616K24611K95152M04431O28995O38244Q26923Q81219J029104
3350D8122718J046845J094923J105770J094284J119277J114521J186058J066246
3342E6950642R83016R86556J068757J048538J069706J289362J373370J658835
$$ plain form
3401 184795675 181878939 178055236 173379466 168126567 162389264 156048511 149226079 142214645
3393 142214645 135036856 127578882 120260826 112959581 105969441 99455358 93279080 87555980
3385 87555980 82279575 77486351 73216906 69404790 66025427 63037613 60283591 57986172
3377 57986172 55972537 54198691 52548492 51023554 49671302 48430918 47434009 46564154
3369 46564154 45738527 45068583 44537440 44088690 43651644 43476529 43177456 42973894 42999622 43107423
3359 43107423 43194039 43418650 43713802 44118233 44747228 45385472 46212395 47093614 48122718
3350 48122718 49169563 50264486 51370256 52464540 53583817 54698338 55884396 56950642
3342 56950642 57933658 58920214 59988971 61037509 62107215 63396577 64769947 66428782
3334F6428782J977743K081461K409050K851506L237293L799033M244800M630945
3326I1660613N351021O282941O742353P480456Q091667Q519764Q677551Q584819
3318A51391185Q290914P608892O444241N194856L677052K206644J026496J08249
3310A85948529m10109q04740q10681n89134l97630m29074p00541j227325k044682
3301A78534613l175038m569820n860207o977983q228086q890934q915116q909777
3293A23007652q822199q310711p745607o988002o463357n837998n271864m800886
3285F8767028m174285l817815l412523l175375k792952k536040k272499k018094
3277D4567445j955315j682414j504769j295927j396918j218266j007836j029147
$$ plain form
3334 66428782 68406525 70487986 72897036 75748542 78985835 82784868 87029668 91660613
3326 91660613 97011634 103294575 110036928 117517384 125609051 134128815 142806366 151391185
3318 151391185 159682099 167290991 173735232 178930088 182607140 184813784 185840280 185948529
3310 185948529 185538420 184733680 183922999 183333865 182936235 182507161 181806620 180579295 178534613
3301 178534613 175359575 170789755 164929548 157951565 149723479 140832545 131917429 123007652
3293 123007652 114185453 105874742 98129135 91141133 84677776 78839778 73567914 68767028
3285 68767028 64592743 60774928 57362405 54187030 51394078 48858038 46585539 44567445
3277 44567445 42612130 40929716 39424947 38129020 36732102 35513836 34506000 33476853
3269C3476853r68537q47267o96879o32659n67929o99627m63623m51355l86267
3260B7762710l70430l73845k95422l20131j46676k16286j79886j61332k46584
3251B5452118j04442r5864r8304k7877Q9138M2131o323o20k4419m6350M117m4973
3239B5138332j66287r5172j66035n2710j74457q2504j4140r4199Q3477N3219n1558
3228B4377966J37369J43477J38765J59018J89372J05614J25072N9259q8765r9943
3218B5247204l04597k73369k79307m25792m45366l63499m11751k65392l87143
3209B2090988m13798k17260k63197j45927j72305k4334j08543m8904N3914J34600
3199B0885234J60493J86107L08339K75866K90986L97421M75965M47752M48009
$$ plain form
3269 33476853 32508316 31661049 30964170 30331511 29763582 29063955 28600332 28148977 27762710
3260 27762710 27392280 27018435 26723013 26402882 26256206 26039920 25860034 25698702 25452118
3251 25452118 25347676 25251812 25153508 25125631 25214769 25256900 25250577 25249957 25225538 25179188 25183305 25138332
3239 25138332 24972045 24876873 24710838 24658128 24483671 24401167 24387027 24292828 24376305 24429524 24377966
3228 24377966 24515335 24658812 24797577 24956595 25145967 25251581 25376653 25435912 25347147 25247204
3218 25247204 24942607 24669238 24389931 23964139 23518773 23155274 22743523 22478131 22090988
3209 22090988 21677190 21459930 21196733 21050806 20878501 20854167 20745624 20696720 20750634 20885234
3199 20885234 21045727 21231834 21540173 21816039 22107025 22504446 22980411 23428163 23876172
3190B3876172O24127N48408L32986N74730O23859N95060O31335Q22886R53095
3181B9582658P94690J069745J334432J284864J417198J724046K060187K130151
3173D1397971K463951K809891L110446L324267L751413M049811M378955M726048
3165G0012753M744905M961506M780067M607398M389619L890263L246048K583479
3157A03216038J864096J115710L65793o04075j226423k041335k595045l353329
3149I6741430m055422m508344m774373n059915n048048n152093m982218m758623
3141E8402394m410698m088711l740376l315690k829547k575628k397237k125953
3133C2918554j925585j651548j562530j342935j241644j152357j008217q30623
$$ plain form
3190 23876172 24500299 25048707 25381693 25956423 26580282 27175342 27806677 28629563 29582658
3181 29582658 30377348 31447093 32781525 34066389 35483587 37207633 39267820 41397971
3173 41397971 43861922 46671813 49782259 53106526 56857939 60907750 65286705 70012753
3165 70012753 74757658 79719164 84499231 89106629 93496248 97386511 100632559 103216038
3157 103216038 105080134 106195844 106561637 105957562 104731139 102689804 100094759 96741430
3149 96741430 92686008 88177664 83403291 78343376 73295328 68143235 63161017 58402394
3141 58402394 53991696 49902985 46162609 42846919 40017372 37441744 35044507 32918554
3133 32918554 30992969 29341421 27778891 26435956 25194312 24041955 23033738 22203115
3125B2203115p91078p89155q14356n67045m93766p28977o12873l72061n12403
3116A6521401l12205l36963l54318m42575k62586k56053k92529l35828k02787
3107A3725557o5091j50370j74329j90478L6044o2818o3900M5716Q4025P9302P4719
3096A3338377O5581j24342o2180j55185n8829j02466j35695k56097k36537k93104
3086A1979523k72668l57679k72549l31389l25082l09286k67089k69034p8689j21072
3076I374986k57703r7237r4081Q384j11099j52225j06314J8819l4719p2666o4281
3065H411864p03n2275O8125l3268j07074q6538j438j27840m4149j13433q2393
3054G830878j31389r5242k3886N5392j28904r5552K4259j37804M355l3799J1465
$$ plain form
3125 22203115 21412037 20622882 19808526 19241481 18747715 18018738 17405865 17033804 16521401
3116 16521401 16209196 15872233 15517915 15075340 14812754 14556701 14264172 13928344 13725557
3107 13725557 13660466 13510096 13335767 13145289 13181333 13118515 13054615 13100331 13184356 13263658 13338377
3096 13338377 13403958 13279616 13217436 13062251 13003422 12900956 12765261 12509164 12272627 11979523
3086 11979523 11706855 11349176 11076627 10745238 10420156 10110870 9843781 9574747 9496058 9374986
3076 9374986 9117283 9020046 8925965 8934349 8823250 8671025 8564711 8583530 8548811 8476145 8411864
3065 8411864 8411161 8358886 8427011 8393743 8286669 8200131 8198693 8070853 8026704 7913271 7830878
3054 7830878 7699489 7604247 7580361 7635753 7506849 7411297 7435556 7297752 7302107 7268308 7279773
3043G279773O9876O1022n683lp1491Q0621L0589n4241P1035J00873O2570M1846
3031G666787L1347L8408J12838O2584J00625J88613k5886m6284R8391P0760J08751
3020H406934J47996J06436J53186M5137M1998J55716Q6112J41133Q7197R9234
3010I471079J31929J34567P7968J31035Q2589J04978J98088J48516J43474O5205
3000A0689428J19177K21589J17796J04816J76879L37436L37905K30680K36000
2991A2571706L61452L16085K69600K54720L45914M09452K18005L88987M26261
2982A5562182L82907K25852K35351M32473K53760K59079L22549L57809L06896
2973A8338858K94429L65525L41854L61580M52877L74910K96344M04483M70139
$$ plain form
3043 7279773 7349649 7410671 7404988 7404985 7333494 7414115 7444704 7390463 7461498 7562371 7624941 7666787
3031 7666787 7698134 7736542 7849380 7911964 8012589 8201202 8175316 8129032 8227423 8298183 8406934
3020 8406934 8554930 8661366 8814552 8859689 8901687 9057403 9143515 9284648 9371845 9471079
3010 9471079 9603008 9737575 9815543 9946578 10029167 10134145 10332233 10480749 10624223 10689428
3000 10689428 10808605 11030194 11147990 11252806 11429685 11767121 12105026 12335706 12571706
2991 12571706 12933158 13249243 13518843 13773563 14119477 14528929 14746934 15135921 15562182
2982 15562182 15945089 16170941 16406292 16838765 17092525 17351604 17674153 18031962 18338858
2973 18338858 18633287 18998812 19340666 19702246 20155123 20530033 20826377 21230860 21700999
2964B1700999N04710M61842M54328N89676N23447O97809P17710O78158P85153
2955B7113832P99286Q54126J004757J010815J178314J177059J192776J321497
2947C5652462J383574J423299J544338J617369J666125J886423J933189K046923
2939D9153702K095582K309458K370861K585340K788291L121954L246608L681207
2931G1353003L874826M283609M798345M962718N484390N923080O582008P269250
2923A14531229Q244145R336863J0549385J1935563J3552669J5339370J7374037
2916B00863261J9930783K2947379K6597235L0609231L4080830L5798888L4352284
2909D05179891K8239353J7319419K785547j2142678k4276415l2224691l5920012
$$ plain form
2964 21700999 22205709 22667551 23121879 23711555 24235002 24932811 25650521 26328679 27113832
2955 27113832 27913118 28767244 29772001 30782816 31961130 33138189 34330965 35652462
2947 35652462 37036036 38459335 40003673 41621042 43287167 45173590 47106779 49153702
2939 49153702 51249284 53558742 55929603 58514943 61303234 64425188 67671796 71353003
2931 71353003 75227829 79511438 84309783 89272501 94756891 100679971 107261979 114531229
2923 114531229 122775374 132112237 142661622 154597185 168149854 183489224 200863261
2916 200863261 220794044 243741423 270338658 300947889 335028719 370827607 405179891
2909 405179891 433419244 450738663 453524210 441381532 417105117 384880426 348960414
2902C48960414l6149887l3702454l0139478k6246349k2504785j9156661j6349069
2895A64711731j4275993j2471286j0854471r463478q310983p349283o594272n783722
2887H9608243n062124m421329l970375l691881l277838k872022k723387k439711
2879F1149576k294091k239079k124848j871746j868179j717974j628479j613826
2871D5791354j491476j477933j340298j167589j161849j069306r34302q55200
2863C6293401q64088r56315q96437q96873r05646p08866o38294o44602m24861
2854B9357419l88376k97303j86407j15647J35590K48208L15174J58508r840k96204
2844B8921122n99092q71608r75999j175788j284554j259315j205008j049458j091213
$$ plain form
2902 348960414 312810527 279108073 248968595 222722246 200217461 181060800 164711731
2895 164711731 150435738 137964452 127109981 117646503 109335520 101986237 95391965 89608243
2887 89608243 84546119 80124790 76154415 72462534 69184696 66312674 63589287 61149576
2879 61149576 58855485 56616406 54491558 52619812 50751633 49033659 47405180 45791354
2871 45791354 44299878 42821945 41481647 40314058 39152209 38082903 37148601 36293401
2863 36293401 35429313 34472998 33576561 32679688 31774042 31065176 30426882 29782280 29357419
2854 29357419 28969043 28671740 28485333 28369686 28505276 28753484 29068658 29227166 29217326 28921122
2844 28921122 28322030 27450422 26474423 25298635 24014081 22754766 21549758 20500300 19409087
2835A9409087r51580j014612q09680q61844o05165o86707n25581n93539n43607
2826A2816772m36562m00467m54273m04732k95607l22282l83155l52942j73326
2817I593426k14468k03433k68370j85682k91092k63730k15162j20633k28100k22745
2807G380011r4854o0078j67535k63902j13206k3557j08756j35824j23269o7224
2797F221806k01243j16169j3364o8308k09733j30740r0582j87439o8174N16j22559
2786E014011j70448p7880n5552O3725j11518o7915j03895m2646L3011o9917k52473
2775D158503j23284j55567J30068n1575n7042L1727m7776n4877k8907J00091j88197
2764C713164j76000p24L4703j49242j11652l4244k4563n0385q0400p8786P2126
$$ plain form
2835 19409087 18457507 17442895 16633215 15771371 15166206 14479499 13953918 13360379 12816772
2826 12816772 12380210 11979743 11525470 11120738 10825131 10502849 10119694 9766752 9593426
2817 9593426 9378958 9175525 8907155 8721473 8430381 8166651 7951489 7830856 7602756 7380011
2807 7380011 7285157 7225079 7057544 6793642 6680436 6656879 6548123 6412299 6289030 6221806
2797 6221806 6020563 5904394 5891030 5822722 5612989 5482249 5391667 5204228 5136054 5136570 5014011
2786 5014011 4843563 4765683 4710131 4773856 4662338 4594423 4490528 4447882 4480893 4410976 4158503
2775 4158503 4035219 3879652 4009720 3958145 3901103 3932830 3885054 3830177 3801270 3901361 3713164
2764 3713164 3537164 3536440 3571143 3421901 3310249 3276005 3251442 3201057 3120657 3041871 3113997
2753C113997k9072k9414r6843k3897K232M0764L4269N7881j62688q87n6314o6262
2741B783766M4553m557m9091n7529n9378k21566r0720O3033j3519j01988n6462
2730B236542l5231j4300r115j5283q5806j13939k9530O4520k9643K9713j8806
2719A979122j08824o6607R429N3350p2618k1428J66362J8811j65133l6436j21709
2708A634319m8113l381m8336J83626N963k8749l7395j89578n3352M7941M9256
2697A512201L1332J22204k2046j93872J3229K5367k8908M4232j1259m4835j13083
2686A334562J2900N0692l7908q7123k5252J7389l4867l1032J3638M645m2194m6850
2674A128600r391J8314M3018o3258L1557J7663J2335N6474k289N5920N325J1979
$$ plain form
2753 3113997 3084925 3055511 2958668 2934771 2937003 2977767 3012036 3069917 2907229 2906342 2850028 2783766
2741 2783766 2828319 2823762 2774671 2717142 2657764 2436198 2345478 2408511 2394992 2293004 2236542
2730 2236542 2201311 2187011 2177896 2162613 2076807 1962868 1933338 1997858 1968215 1997928 1979122
2719 1979122 1870298 1803691 1813120 1866470 1793852 1772424 1938786 1957597 1792464 1756028 1634319
2708 1634319 1586206 1582825 1534489 1718115 1724078 1695329 1657934 1468356 1415004 1462945 1512201
2697 1512201 1543533 1665737 1643691 1449819 1463048 1488415 1459507 1503739 1492480 1447645 1334562
2686 1334562 1347462 1398154 1360246 1273123 1247871 1265260 1230393 1199361 1212999 1217644 1175450 1128600
2674 1128600 1119209 1137523 1180541 1117283 1148840 1166503 1178838 1235312 1233023 1288943 1294268 1306247
2662A306247j15914k6123J8393r9700k3978J7698l4083J46062M0769m9204J7611
2651A197778j665l5487L7062N0912Q64R1092K7547k9372p8129k9035R8192K9465
2639A359224m9691P1857J37032O2601L0148J1258P1943j2392J46689J67107J64624
2628B160400J5465K56304J89497j005J23973J4762K0511N173j23446r6339j15552
2617B449743k01609j44823j76740j44430j49178m5853j06452m4424J3151j79976
2607A269409m5130k2597M892k287j63250o9576J18274Q0486m8604j04274j38671
2596H78672l008m5615j9245l6555M5538n6475K637M3423j25515j07791J07169
2585F83235L8409q8428L5607l0564o3235L7851j0060L7621P0281n6059L0752m4637
$$ plain form
2662 1306247 1190333 1164210 1182603 1082903 1058925 1076623 1042540 1188602 1229371 1180167 1197778
2651 1197778 1196113 1160626 1197688 1248600 1249464 1340556 1368103 1338731 1260602 1231567 1329759 1359224
2639 1359224 1309533 1381390 1518422 1581023 1611171 1622429 1694372 1681980 1828669 1995776 2160400
2628 2160400 2175865 2432169 2621666 2620661 2744634 2759396 2779907 2785080 2661634 2565295 2449743
2617 2449743 2248134 2103311 1926571 1782141 1632963 1587110 1480658 1436234 1449385 1269409
2607 1269409 1224279 1201682 1206574 1204287 1041037 971461 1089735 1170221 1121617 1017343 878672
2596 878672 875664 830049 810804 774249 819787 763312 765949 809372 683857 576066 683235
2585 683235 721644 633216 668823 638259 575024 612875 602815 640436 710717 654658 685410 640773
2573F40773m0175n7619J4933R3211K1751M0948j58326r7524R5935K8087j0553
2562E71441M109j1332m2458q443Q849Q675N3908M8781r4426j06076k843p361M9668
2549D72492j07549K9952K5935k9040l7135N7125O7766j30161n5401q647J32181
2538D17518m1551n8810j942q462O2357m2414k7360n9105J0281R176K1433N1837
2526C32958R3602k6633r1816M5317L2146n0809J05485J8972p6407r8042q6709
2515A98064N7620K6318L6116m3186Q0743m3994l6922N0805N5109L5381K7422q2832
2503C60644n5790K3407P6824k9660r9723K071J709n0948M4737O950K0183j9274
2491B81130m6136L0396J8966n0922l6439O3519q0940J9242L7272Q085R7772l9437
$$ plain form
2573 640773 600598 542979 557912 651123 672874 713822 555496 457972 553907 581994 571441
2562 571441 575550 564218 521760 513317 522166 530841 584749 633530 539104 433028 430185 422824 472492
2549 472492 364943 394895 420830 391790 354655 411780 479546 349385 293984 285337 417518
2538 417518 375967 317157 315215 306753 369110 326696 299336 240231 250512 259688 281121 332958
2526 332958 426560 399927 308111 353428 385574 334765 440250 459222 382815 284773 198064
2515 198064 255684 282002 318118 274932 355675 311681 274759 325564 380673 416054 443476 360644
2503 360644 304854 328261 405085 375425 275702 277773 279482 228534 273271 280221 300404 281130
2491 281130 234994 265390 284356 233434 196995 260514 179574 198816 236088 244173 341945 302508
2479C02508J3930j16607J11677O39o9137L4809L341P2943j29731P5418p9841K7593
2467B47542K7359j31703l6447j3193M0177M3961L9316J3840o2838m475m8362J500
2455A16677l7437O0305J07364m2988j3129j26548N0959Q8239L7203l9544n6376
2444A44725N752j5825q277L4127J8817l8823N3438N5664j7162q3737O0345J4330
2432B23374k1123j00363M4191k3859n43L5022L402o9478l1069N986L1545O2598
2420A59683J7737k5003l7966k4670P9874M6326K0649O7309Q0090l124p9027K0074
2408C21952q0632q6205q7387R6031N4694k5473r752p2383l812P2081p5529o5944
2396C7641P4716N3112r5472P3947l362O93K2323J3125L9136P2835j53434j05214
$$ plain form
2479 302508 316438 199831 311508 312147 243010 277819 281160 354103 224372 299790 219949 247542
2467 247542 274901 143198 106751 93558 133735 177696 217012 230852 168014 163539 115177 116677
2455 116677 79240 139545 246909 203921 190792 64244 115203 203442 240645 201101 144725
2444 144725 150477 134652 126375 160502 179319 140496 193934 249598 232436 148699 209044 223374
2432 223374 202251 101888 146079 122220 121677 156699 160101 90623 59554 65540 97085 159683
2420 159683 177420 152417 114451 89781 169655 215981 236630 303939 384029 380905 301878 321952
2408 321952 241320 155115 67728 163759 218453 192980 183228 110845 107033 179114 103585 37641
2396 37641 112357 165469 69997 143944 140582 141275 163598 176723 215859 288694 135260 30046
2384C0046L1665J03907K7908r9885P3645J2997n4741m720L097n6387L933K6362
2372I7827K530R2232j03366j247J4417Q575o983o669J36017j85607m1456J44302
2360A50572p171o3053P3509k5141L3152j4239M417m1992J0013m2057J6755P4282
2348A69047J1383P2384l967J7845J7065L850l7535N3205J7100L5307P8105P1129
2336E04918m6968o9720k5834j37343n6262O0929n80R619m4997j3285r0949N3929
2324A43457J03868r9575o2382O7917Q883J6979J363r8754q76J07524j8548j94912
2312b5056J24580R7483j20014K3334O2954L0178o3243n6585k90J04304j9353Q394
2300A66686q1238j7712L3735k8639M4514Q689m9176J22787O112q5436L1892k0557
$$ plain form
2384 30046 61711 165618 193526 93641 167286 180283 125542 120822 123919 67532 71465 97827
2372 97827 100357 192589 89223 87976 102393 110968 103985 97316 233333 47726 6270 150572
2360 150572 143401 80348 153857 128716 161868 147629 152046 110054 120067 78010 94765 169047
2348 169047 180430 252814 248847 266692 283757 287607 250072 303277 320377 355684 433789 504918
2336 504918 457950 388230 362396 225053 168791 229720 229140 238759 193762 180477 89528 143457
2324 143457 247325 147750 85368 153285 162168 179147 180510 81756 80880 188404 169856 -25056
2312 -25056 99524 197007 76993 100327 163281 193459 130216 73631 73341 177645 158292 166686
2300 166686 85448 67736 101471 72832 117346 126035 76859 199646 205758 120322 152214 131657
2288A31657K0554L0383r9997o1673Q9680p5946J13041j7964m4401j1692r057n1556
2276A3029J56616q9254L4905K436p0194j2994K0008O244N5773O1203n9379K445
2264A20838m2544m1586R9936K2069j4574o3866Q5478Q305r1799k0713K0870K1327
2252A03741p9065J20746l0621M4823n7117j4179j9818Q7484j0309p8061k0217
2241D7407Q5239Q096l9729L5703j7194L0582J7586n8076j0033P0898k3131n8674
2229H8674K278n5605k9335J38456Q8459P948o8442r844M608L5097P1304N704p0252
2216B09050R835o065k2596J07445N3627m0667q7750J46243Q912q4131J36474q196
2204D22181j15890J5042n2224o2229J36045J3058j40385J3084O9908O6423k9265
$$ plain form
2288 131657 152211 182594 82597 20924 110604 34658 147699 129735 85334 73642 64585 13029
2276 13029 169645 80391 115296 117732 47538 34544 54552 60796 116569 177772 118393 120838
2264 120838 78294 36708 136644 158713 144139 80273 165751 174056 82257 61544 82414 103741
2252 103741 24676 145422 114801 159624 102507 88328 68510 155994 145685 67624 47407
2241 47407 132646 140742 101013 136716 119522 150104 167690 109614 99581 170479 147348 88674
2229 88674 90952 35347 6012 144468 232927 240875 172433 162589 167197 202294 273598 279302 209050
2216 209050 218885 212820 190224 297669 351296 310629 222879 369122 378034 293903 430377 422181
2204 422181 306291 321333 269109 206880 342925 355983 215598 228682 298590 365013 335748
2193C35748K33180q3494M6547l3627j40647L7337j0718J05091n4078P776l2370
2182D10745q3579m5297J4471K6410k1883P6011J02327n8741k7569N4647j0439
2171D37103M3837J58142K0755k3827k9370k6431l0397j25294Q4667L6470O7442
2160F13097J31182Q1766k4417j36931J53572L305R1146J4719j296N33m2329k4433
2148H59914M2450Q9127Q1950M2056K5457m382L7303N4015l5483M3292M8699N3020
2136A337418O5485p31J26166j19360j9282N0416M8146K0331l9734J20161K0769
2125A609785M4620K5372O0388k4168N0577r36Q1387R4646l1802L9267J67248q455
2113B107929J63344J50605J31429K31817R8399P6012O7919J12915J54927K09620
$$ plain form
2193 335748 568928 485434 531981 498354 357707 395044 384326 489417 435339 443115 410745
2182 410745 327166 281869 296340 322750 300867 376878 479205 420464 392895 447542 437103
2171 437103 480940 639082 659837 636010 606640 580209 549812 424518 509185 545655 613097
2160 613097 744279 826045 801628 664697 818269 821574 912720 927439 926143 926676 884347 859914
2148 859914 902364 991491 1073441 1115497 1140954 1136572 1173875 1227890 1192407 1235699 1284398 1337418
2136 1337418 1402903 1402172 1528338 1408978 1389696 1440112 1488258 1508589 1468855 1589016 1609785
2125 1609785 1654405 1679777 1740165 1715997 1766574 1765638 1847025 1941671 1909869 1949136 2116384 2107929
2113 2107929 2271273 2421878 2553307 2785124 2883523 2959535 3027454 3140369 3295296 3504916
2103C504916J31048J37334J94061J89987K04810K05779K55104J79469K80965M35793
2093E719266L03205M50850M71951M40494N78415M65248N80462O05572P01871P35977
2083A1053311P07800P92343J043250J267536J620033J852088K329965L166380
2075B3832706M268495N908181P000945P203716O569914L594282l370662o175181
2067D8832396n973680p103630o452347m859245l895111l146867k188733j696292
2059A3516491j354889j061446o57509o12237q05127p30957o64794o69069n84310
2050F376153m57995m52470k32867l81321k91332j85049j77434j72224k32644j14850
2040C677967j47238k25571k07762l6816j19354j56801r1633j24483o7540j81493
$$ plain form
2103 3504916 3635964 3773298 3967359 4157346 4362156 4567935 4823039 5002508 5283473 5719266
2093 5719266 6022471 6473321 6945272 7385766 7964181 8429429 9009891 9615463 10317334 11053311
2083 11053311 11761111 12553454 13596704 14864240 16484273 18336361 20666326 23832706
2075 23832706 28101201 34009382 41010327 48214043 54783957 58378239 55007577 48832396
2067 48832396 42858716 35755086 29302739 24443494 20548383 17401516 15212783 13516491
2059 13516491 12161602 11100156 10442647 9830410 9025283 8294326 7629532 6960463 6376153
2050 6376153 5918158 5465688 5232821 4851500 4560168 4375119 4197685 4025461 3792817 3677967
2040 3677967 3530729 3305158 3097396 3060580 2941226 2784425 2692792 2568309 2500769 2319276
2030B319276j6254O6584k61377j16218K638l4894r0309n1556L7925k1744j15235
2019A718836j35482k3683N2690j18214k14474n0874J09294o8260n8505l7103l840
2008A170385j8689P1234m3456o9123l4722k9384m7075j0761k9457m1231n4690
1997H63031L1506Q9619k0115j52230j04695J1509P1246j23490o9495j0923n7070
1986E28893m2388J19732N9451j06278K8650l2816l2392L8361l4863K6220Q48o1297
1974D92121l6600K1058j50147k4552N4252m5523M0710j8275J3548l542O3665l8605
1962C68110j06659j14417q630L7477J37210j2048n2833q9187Q0551M8241l3572
1951B54243p0870J9671J065l8205Q6116L3881Q8227m0712j21988l7038m2725K5314
$$ plain form
2030 2319276 2303022 2369606 2108229 1992011 1994649 1959755 1869446 1817890 1855815 1834071 1718836
2019 1718836 1583354 1559671 1612361 1494147 1279673 1228799 1338093 1269833 1211328 1174225 1170385
2008 1170385 1151696 1222930 1179474 1110351 1075629 1046245 999170 988409 958952 917721 863031
1997 863031 894537 984156 964041 811811 707116 718625 789871 666381 596886 585963 528893
1986 528893 486505 606237 665688 559410 588060 555244 522852 561213 526350 552570 553418 492121
1974 492121 455521 476579 326432 301880 356132 310609 351319 333044 346592 343050 406715 368110
1962 368110 261451 147034 138404 175881 313091 301043 248210 159023 239574 287815 254243
1951 254243 183373 203044 204109 165904 252020 285901 374128 333416 211428 174390 131665 156979
1939A56979p083j8878R7472N1478j01680N6506P6195k3517p2952n5060l3191m2887
1927H3382j3104Q728K8021P2260O8244o0638q4251J1691K6678J0939m0591r0192
1915B1167P4128M7910p9146m4184N8592m5183N4885K9554O7318M7262j19199K3478
1903A36582k687K0515j8326m8952J02958q5330Q648K1140r7514L8904K902l6052
1891D2788K2079M3037m8018j8411O8143K6488K4470k2013j05311l2093M8438L8076
1879H7673M1553M7181j40659q6173O299l1151N000n1316K4076Q372J8594J46055
1867G5504N0250k2501J7830K6281J9400n001j71698l0239N8729J7329l7596m774
1855f486Q023K5803o596K8332J7844L2935m7264l1498j2407O584Q4306k858q3288
$$ plain form
1939 156979 149896 131018 228490 279968 178288 234794 310989 287472 214520 159460 126269 83382
1927 83382 70278 79006 107027 179287 247531 186893 102642 114333 141011 151950 111359 21167
1915 21167 95295 143205 64059 19875 78467 33284 88169 117723 185041 232303 113104 136582
1903 136582 133895 154410 136084 87132 190090 104760 113408 134548 37034 75938 78840 42788
1891 42788 64867 107904 59886 41475 109618 136106 160576 138563 33252 1159 49597 87673
1879 87673 129226 176407 35748 -50425 -44126 -75277 -70277 -121593 -97517 -89145 -70551 75504
1867 75504 125754 103253 121083 147364 166764 161763 -9935 -40174 18555 35884 -1712 -6486
1855 -6486 1537 27340 20744 49076 66920 99855 52591 21093 8686 15270 99576 96718 13430
1842A3430L3266P821p8765J8425L7226N1287k3351l5024p2943J1429N431O7989
1830C6221n8797K2919q5906j1017M3708O9635M818L9277K4559q4583M9203k6250
1818B3787J6911k5930M4532o2162o8274Q1487J48038J29047j04263k2050J10625
1807B71748j10795j07090N3958J46178K4445p562p5769K6601P2842l6544K6626
1796B84638j9606j6353q5095J04763r1490r5877P9935j7259k8421K7962o6935
1785G6262k5967M1298j43478m3433L6789J6179j8126l3759j0776j3911Q2797N4087
1773A7962k5997P1639n1370j2495n8195K9293m6117J659L9457m1539Q716J44419
1761G7432J08028j22299O1202p4097q5472n6829N9035j0437j9285R5321M6003
$$ plain form
1842 13430 46696 54517 -24248 -5823 31403 82690 59339 24315 -48628 -37199 -31768 36221
1830 36221 -22576 343 -85563 -96580 -52872 16763 21581 60858 85417 834 50037 23787
1818 23787 40698 14768 59300 -2862 -71136 10351 158389 287436 183173 161123 271748
1807 271748 160953 53863 107821 253999 278444 270882 195113 221714 294556 258012 284638
1796 284638 265032 248679 163584 268347 176857 80980 160915 143656 115235 143197 76262
1785 76262 50295 91593 -51885 -95318 -58529 -42350 -60476 -94235 -105011 -118922 -36125 17962
1773 17962 -8035 63604 12234 -261 -58456 -29163 -75280 -73621 -34164 -75703 -66987 77432
1761 77432 185460 63161 124363 50266 -35206 -92035 -33000 -43437 -62722 32599 78602
1750G8602l0219l0928p5495k865k9469L8030n8903R5222k724j56612R2532N5673
1738b7156l2602L4125P0867K1992n4001j0824o829p0329L5144N9318j7829j06055
1726a04179J17996N6386q479n0113J1187R285m3521J122M212k5809J17679O4599
1714A50365p0934j01563N2925Q094L3353j7115P846o4338j05697K5868k94j5314
1702i6804Q323O0923o2132l4364L5033k1249M1864J14089K3876J8633l7685j00505
1690d9998M2116q9693M6214P4053Q394l1294n9035j5211p2548L4685L3425j6969
1678i5861O3775j781Q6718j305j58466R1656J4622L5252J2734o1063j0886N9193
1666C4588j33763o1550q773Q652M6635Q1687o5199J7228L6301J8432J5328K7482
$$ plain form
1750 78602 48383 17455 -58040 -60905 -90374 -52344 -111247 -16025 -18749 -175361 -82829 -27156
1738 -27156 -59758 -25633 45234 67226 13225 2401 -4428 -74757 -39613 19705 1876 -104179
1726 -104179 13817 70203 61724 11611 22798 32083 -11438 -10316 -6104 -31913 85766 150365
1714 150365 79431 -22132 30793 38887 72240 55125 62971 -1367 -107064 -81196 -81490 -96804
1702 -96804 -88481 -27558 -89690 -124054 -89021 -110270 -68406 45683 69559 88192 50507 -49998
1690 -49998 -7882 -97575 -51361 22692 31086 -208 -59243 -74454 -147002 -112317 -78892 -95861
1678 -95861 -32086 -33867 52851 51546 -106920 -15264 -642 34610 47344 -13719 -24605 34588
1666 34588 -99175 -160725 -169498 -160846 -114211 -32524 -97723 -80495 -44194 -25762 -10434 17048
1654A7048P0720o9248m9577n3399J36060q2100O9333m0047Q611m0327r453n072
1642d7451q3693J0143Q1273K8630r1238n0118K3524L0948l8255Q6439N2054L4718
1630C6974q7622J105M3162p7532l3190L1748j4770j0849J16679J29412o7088q496
1618E9533p8941p7430P454K7480L6010L4095O8242m2448k7292K2088J9067m060
1606D3798j0282l9934j2983K7231j44691N3703N2094Q645j2294j1498l9141R4425
1594I073j22549l1941J86759r734n6278J1136K1600L2176j01762l1617K8240N5191
1582i706N5878j04201o2337K0610J26677p8836k9897M4853K4552k8049P0924n4543
1570b4075o9627j5097j2418M9830J3685Q5531m0866l832J0322M0956k8110l76
$$ plain form
1654 17048 87768 18520 -31057 -84456 51604 -30496 38837 -1210 7401 -32926 -42379 -47451
1642 -47451 -131144 -121001 -39728 -11098 -102336 -152454 -128930 -97982 -136237 -49798 2256 36974
1630 36974 -50648 -49543 -6381 -83913 -117103 -85355 -100125 -110974 5705 135117 68029 59533
1618 59533 -19408 -96838 -89384 -61904 -25894 8201 76443 33995 6703 28791 47858 43798
1606 43798 33516 -6418 -19401 7830 -136861 -83158 -31064 -22419 -34713 -46211 -85352 9073
1594 9073 -113476 -145417 41342 31608 -24670 -13534 8066 40242 -61520 -93137 -64897 -9706
1582 -9706 46172 -58029 -120366 -99756 26921 -51915 -81812 -36959 -12407 -40456 30468 -24075
1570 -24075 -93702 -108799 -121217 -71387 -57702 27829 -13037 -16869 -6547 34409 6299 5923
1558E923O1280q3381M5584P3297q5459m1258O8342k3829j4827K5052k3077j15004
1546a07357m2705P5160O8096M2127r7847j1803M570O716K8352M7456l9885r3453
1534a20573l1670j8026J62826K7553k828K6258k638r656n58j65764k0206R0114
1522f5168m7385O016J65070m0350j5274k3995j11235J61387q5493J081J1048o8667
1510a12965J20338o4332l767J2188j3353j8078j8502L2166M9260j6234M274m9326
1498g8331k4432J5222J47453M300j32740P5293M8685p5797R55M8430k4893l1258
1486b7113l9933k3423m4870Q2291K0198L1537p035M0198q2719N6116O8360j31925
1474e8318J58394p4838M4004P2240j8458j58115j9875M4506J1766o5624p775n8875
$$ plain form
1558 5923 67203 -16178 29406 102703 17244 -24014 44328 20499 5672 30724 7647 -107357
1546 -107357 -150062 -74902 -6806 35321 -62526 -74329 -69759 -63043 -34691 12765 -27120 -120573
1534 -120573 -152243 -170269 -7443 20110 17282 43540 40902 31246 30688 -135076 -155282 -65168
1522 -65168 -112553 -106537 58533 18183 2909 -21086 -132321 29066 -56427 -55346 -44298 -112965
1510 -112965 7373 -56959 -60726 -48538 -61891 -79969 -98471 -66305 -17045 -33279 -29005 -78331
1498 -78331 -102763 -87541 59912 64212 -68528 6765 55450 -20347 -19392 29038 4145 -27113
1486 -27113 -67046 -90469 -135339 -53048 -32850 -1313 -8348 31850 -50869 5247 73607 -58318
1474 -58318 100076 25238 69242 141482 123024 -35091 -54966 -10460 1306 -64318 -72093 -130968
1462a30968M88P8592k2241J23162o5241L0612j04698K2598o4673K9458J114J6615
1450h5182Q710L8594q34l2415P8060l0179n3952J9375k2217M7582M7247j56039
1438a41250l2640M1160K3036j8461M3539K3996K945l1491O1415K6996R92J0351
1426A0588m9636j13195O0020Q8172K7613K6449l8568l1420q4493N0584o6392J71957
1414E1679P4593k6612p0923j79984K7527J4286K4027J0932M7737j6033j17872
1403a60643P5891P5682j29855j4412L8587K041k1821K8835J18666R47M020j25351
1391a07413r1002L3797N1270l4449R26Q173n072J23309L3588k0493m678N282P0850
1378F4088P655M520n9149j01294L5896P9236j61944r283m4J16571M6292m7566
$$ plain form
1462 -130968 -130480 -51888 -74129 49033 -16208 14404 -90294 -67696 -132369 -102911 -101797 -85182
1450 -85182 -76472 -37878 -38712 -71127 6933 -23246 -77198 -57823 -80040 -32458 14789 -141250
1438 -141250 -173890 -132730 -109694 -128155 -84616 -60620 -57675 -89166 -27751 -755 237 10588
1426 10588 -39048 -152243 -92223 -4051 23562 50011 11443 -19977 -104470 -53886 -120278 51679
1414 51679 126272 99660 28737 -151247 -123720 -109434 -85407 -74475 -26738 -42771 -160643
1403 -160643 -84752 -9070 -138925 -153337 -114750 -112709 -134530 -105695 12971 13918 17938 -107413
1391 -107413 -198415 -164618 -113348 -147797 -146871 -138698 -143770 -20461 13127 -7366 -12044 -6762 64088
1378 64088 71743 76263 17114 -84180 -48284 30952 -130992 -140275 -140319 -23748 22544 -25022
1366b5022q7079o4980J19804j3144l846q4046M6883j5966J9799l0738J3008p2934
1354a98261Q7558J07942R4729n8809N2135O2089l2153j80240j07706O9090N2730
1343e0896N1805K210l4893l4826m75J16951m4494m7261j9515k3329n6709q8956
1331b30388L9892R5042Q7769n171L3421M7423j8077r9604k8908L1585O7996m3678
1319b2698r3300R1526O3884j14400M0809j1010j4196k9603O6646k8212J5752q08
1307c5610M8862m0488k9743j7730q3386Q1548M9185j190j43189j1399P5779k9980
1295a37341R5463J80706m1299j29621m6476r142M6764M3672p7998q0748L0656
1284a25364K9325J04413Q2948j0973L7460j03550L9155l0287j01410M9119J1275
$$ plain form
1366 -25022 -112101 -177081 -57277 -70421 -74267 -158313 -111430 -127396 -107597 -138335 -125327 -198261
1354 -198261 -110703 -2761 91968 33159 85294 147383 115230 -65010 -172716 -103626 -50896
1343 -50896 909 3119 -31774 -66600 -67075 49876 5382 -41879 -61394 -84723 -141432 -230388
1331 -230388 -190496 -95454 -7685 -12856 20565 67988 49911 -49693 -78601 -47016 20980 -22698
1319 -22698 -115998 -24472 39412 -74988 -34179 -45189 -59385 -88988 -22342 -50554 -34802 -35610
1307 -35610 13252 -27236 -56979 -74709 -158095 -76547 -27362 -28552 -171741 -183140 -107361 -137341
1295 -137341 -41878 138828 97529 -32092 -78568 -87710 -40946 2726 -75272 -156020 -125364
1284 -125364 -96039 8374 91322 80349 117809 14259 53414 23127 -78283 -29164 -17889
1273a7889Q1256j11077n1711m7584Q4694n536n471J22491k5534j21028l103O5615
1261c4877k3869L6088k3129N0271j13232o025j0172q636l94p8656P3823m0820
1249a79628l2105N7413k536m969n494L7231l565l1299N421q374J55397Q0738p5109
1236f879q5419K1890L3726Q948l4478j9556o3705J0151O3028N0775p3794J2384
1224h2929J4922O7164Q3258l8089m3715j1925K4190j10953m9831o1029O8850J0466
1212a29621P0019P2945m8067M8637n9449J16872M9778j58839m1265J3880M4474
1201b0636n4633N5074K7743Q2189O0229o8957o2437j32778k0494Q2435N955L3710
1189a2600o2620j5347J9423J3062k186L2017p3255n8224R180J07201Q7458l0779
$$ plain form
1273 -17889 63367 -47710 -99421 -147005 -62311 -67847 -73318 49173 23639 -97389 -100492 -34877
1261 -34877 -58746 -22658 -45787 4484 -108748 -114773 -124945 -133581 -133975 -212631 -138808 -179628
1249 -179628 -211733 -154320 -156856 -161825 -167319 -130088 -133653 -164952 -159531 -167905 -12508 68230 -6879
1236 -6879 -92298 -70408 -36682 -27734 -62212 -81768 -145473 -135322 -72294 -21519 -95313 -82929
1224 -82929 -68007 -843 82415 44326 611 -11314 12876 -98077 -147908 -208937 -140087 -129621
1212 -129621 -59602 13343 -34724 13913 -45536 71336 121114 -37725 -78990 -65110 -20636
1201 -20636 -75269 -20195 7548 89737 149966 81009 18572 -114206 -134700 -52265 -46310 -12600
1189 -12600 -75220 -90567 -71144 -58082 -60268 -28251 -101506 -159730 -150550 -43349 44109 13330
1177A3330r9347l8611Q0570N4644N1706J0218M2991k8775O9418M5387j22609n6109
1165B2813L9095O668J700l4803p7837p4574j2687J9578L5155p5139P0204K9202
1153e0625J8731J03473n2778o3826J9610j1738m5113N1310m5581J8969j0080N0497
1141a7151q6445o418p383L7222Q890k4450J55137l8707R634r4442k3500O2557
1129b5056N5087P6066p3908j0938n3570K0526l478P9975p4404q6913N0522r6861
1117a42952O7277k1346J02900j03900o886J12620o9314L7812j3635r8286K021
1106a33689k2674P3974N2818q4828l8055P0964R1343M0857n722o7047o450j3287
1094d1796K0526r7783k4806O6094m7960J18902p3608r0555P6542R8847K4751o7780
$$ plain form
1177 13330 -86017 -124628 -44058 10586 62292 72510 115501 86726 156144 201531 78922 22813
1165 22813 61908 68576 70276 35473 -42364 -116938 -129625 -110047 -74892 -150031 -79827 -50625
1153 -50625 -31894 71579 18801 -45025 -25415 -37153 -82266 -30956 -76537 -57568 -67648 -17151
1141 -17151 -103596 -110014 -117397 -80175 -71285 -95735 59402 20695 30329 -64113 -87613 -25056
1129 -25056 30031 106097 32189 21251 -32319 -11793 -15271 64704 -9700 -96613 -46091 -142952
1117 -142952 -75675 -97021 5879 -98021 -104907 7713 -61601 -23789 -37424 -135710 -133689
1106 -133689 -156363 -82389 -29571 -114399 -152454 -81490 9853 50710 44988 -22059 -28509 -41796
1094 -41796 -21270 -119053 -143859 -77765 -125725 -6823 -80431 -170986 -94444 4403 29154 -38626
1082c8626N7969m0867j0769j09979p387J52168j0369r8390r78O5258K70M8677
1070F977p226l0669l8511R1281L0413j24268J904Q938J0388L4705K0045P2366
1058G6343o1371J5175j6866p354j31079L9398R2568n5959j0935m097J55058O1222
1046A52103j93645j3378K380M8115J135K9881N6881o9139O171l463j3255N2427
1034E6213M4005r4864M0694O180j1251o2562l2051p414m452l7947Q4330n1639
1022g0758O3521K7584l8737j4294j09617k2341J22063L5092J6686R7460j28016
1011b1357q1223k655M5684L4370L6171p0787j35096J03611O1763Q5579j8057r1464
999e3461k6926L1408J1477Q6432K5989m3457k5773p242k2598q384J996k7309j08301
$$ plain form
1082 -38626 19343 -21524 -32293 -142272 -149659 2509 -7860 -106250 -107228 -41970 -41700 6977
1070 6977 -249 -30918 -69429 21852 52265 -72003 -70099 -61161 -50773 -16068 3977 76343
1058 76343 14972 30147 13281 5927 -125152 -85754 6814 -49145 -60080 -64177 90881 152103
1046 152103 -41542 -54920 -52540 -4425 -3290 26591 83472 14333 20504 17041 3786 56213
1034 56213 100218 5354 46048 52228 40977 -21585 -53636 -61050 -65502 -103449 -19119 -70758
1022 -70758 -7237 20347 -18390 -32684 -142301 -164642 -42579 -7487 9199 106659 -21357
1011 -21357 -102580 -105235 -59551 -25181 10990 -59797 -194893 -91282 -29519 56060 38003 -53461
999 -53461 -80387 -48979 -37502 48930 74919 31462 5689 -1553 -24151 -32535 -30539 -57848 -166149
986a66149P2398P4011Q0589J1318o6366p5695j6294n6197L2047L0296o58q4465
974a65165j0002J18366j12727O1353j66229J03627Q7054o1903J25970l483k5757
963d8896l114n413n5063M598R9870m0415K7839m4320o8649j6890l04J02861j4121
950f2017j3242J33586n538j03849j4602K1112m4312M7587k4439N6911O5367n6298
938B66k0959M0006K7708j16800P968l267M9521O4629j35338O0913O6682q9988
926d8659p926j9751r786O541q0324l865L3310L3790O1999j02499J5666J09028
914a2476J6673L1747q1030q5646l6040P9310K8N4024L3914J8652k2024j8833p7563
901i9264r1374r092J48249O7884n8010l3175r125k240J3299L915l4531O1200L1366
$$ plain form
986 -166149 -93751 -19740 60849 72167 5801 -69894 -86188 -142385 -110338 -80042 -80700 -165165
974 -165165 -175167 -56801 -169528 -108175 -274404 -170777 -83723 -145626 -19656 -23139 -48896
963 -48896 -52010 -57423 -112486 -107888 -8018 -48433 -20594 -64914 -133563 -150453 -150757 -47896 -62017
950 -62017 -75259 58327 52789 -51060 -65662 -44550 -88862 -41275 -65714 -8803 56564 266
938 266 -20693 19313 47021 -69779 -61811 -65078 -15557 49072 -86266 -25353 41329 -48659
926 -48659 -56585 -76336 -86122 -79581 -159905 -163770 -130460 -96670 -34671 -137170 -121504 -12476
914 -12476 4197 35944 -45086 -130732 -166772 -87462 -87434 -33410 504 19156 -2868 -21701 -99264
901 -99264 -190638 -199730 -51481 16403 -41607 -74782 -83907 -86147 -72848 -68933 -103464 -42264 -10898
888a0898k0046k4803J1664L250m228j34K4416K9463J5606m6533q8492l6577l9
875a47351Q0755j5484j8607O2248O6017O9032o8780k3956j7227J304m9187o8724
863a29960N2682l1632Q1992J11241o675o2830q2994L9106o283k8521n0736j8653
851a33263r0620J40482J3511M0601K1553m462q4220k8955l2275Q0945j6433p919
839a01055L6463M1919J6814j880j4747l3533L6935n4046P4140q039n7438l013
827f7480K2273O434j3563j13542L182J8994L6483J22239p3429r088o6012J13763
815a9746J368k0739R847j18739Q2146K3920J11203K772M1416j49002L5532p8403
803g8425r7708J6455O1288M8449O4644P9832j20149n1935L4598j482J9763J08714
$$ plain form
888 -10898 -30944 -55747 -44083 -40833 -45061 -45195 -20779 8684 24290 -22243 -110735 -147312 -147351
875 -147351 -66596 -82080 -100687 -38439 27578 96610 27830 3874 -13353 -12049 -61236 -129960
863 -129960 -77278 -108910 -26918 84323 77648 14818 -68176 -29070 -35353 -63874 -114610 -133263
851 -133263 -223883 -83401 -69890 -29289 -7736 -12198 -96418 -125373 -157648 -76703 -93136 -101055
839 -101055 -64592 -22673 -5859 -7739 -22486 -56019 -19084 -73130 1010 -7029 -64467 -67480
827 -67480 -45207 -38773 -52336 -165878 -162696 -143702 -107219 15020 -58409 -67497 -133509 -19746
815 -19746 -18378 -39117 -29270 -148009 -65863 -41943 69260 72032 113448 -35554 -22 -78425
803 -78425 -176133 -159678 -98390 -49941 14703 94535 -25614 -77549 -42951 -44433 -24670 84044
791H4044m5564l2105J1596m4813N4083l9940K3459l3226K3474n3036k1284O0212
779a3100m7602J3390m7702Q0334N87J4753L5000j38141J11583l5358k4088R0900
767D0556O083n9140o2884J07318J6950k309m285r1969Q004J04695O149J0009j08767
754b9590P95k1867N2155l7931m3658L4229k0733N6214n753J5441L2982K6483j9433
741C9334o2014l8477o6887N4212p1013N7294P1218r3512K4379p7142K2157P8922
729f1529o5136L9400J21425R974q4909N958L7349m1177P5102m5712m6361N055
717e0561M412M4496j5810K6960l1101J4393k3294N4842j7562j4455L3882m3884
705a7682J47702j13958q0032N7733J2809o722l0849n243P7109q4913K1716p5458
$$ plain form
791 84044 38480 6375 17971 -26842 27241 -12699 10760 -22466 1008 -52028 -73312 -13100
779 -13100 -60702 -47312 -95014 -14680 -14093 660 35660 -102481 9102 -26256 -50344 40556
767 40556 46639 -12501 -75385 31933 48883 46574 42289 -49680 -41676 63019 69168 79177 -29590
754 -29590 -28795 -50662 1493 -36438 -80096 -45867 -66600 -10386 -16139 -698 32284 58767 39334
741 39334 -22680 -61157 -128044 -73832 -144845 -87551 -16333 -109845 -85466 -162608 -140451 -61529
729 -61529 -126665 -87265 34160 44134 -40775 -34817 2532 -38645 36457 -9255 -55616 -50561
717 -50561 -46149 -1653 -17463 9497 -21604 -7211 -30505 24337 6775 -7680 26202 -17682
705 -17682 130020 16062 -63970 -6237 6572 -150 -30999 -36242 40867 -44046 -22330 -97788
693i7788J0808N8239N3137P5681l4056K3134l860n7069o6564J55532l0656j49660
681f3122L5121R3453j2251j753J8628k5416l5298J9447M424k4724Q6560p5410
669A9659j03273M1910m8162N7862K7505J6474m7966M3132l5060N0079j0062o8026
657e5928j00715L9063R4758M8451j0219K1403K4375j6113p6939l7222M2636J3542
645a2908J50724j3245r6867j38555J16935R0553R775m4353p6941o4100Q2879P3693
633G7590p0634r3152k648L179j5279L6083l4707M5769N2396J8825m7122n6540
621h6240L9646J0637m6008j163k3473J00914k5557j10576J02999O5418m9033m980
609b7416L2230j9929k4583p527J3240M2313q4988r01R0911j17924Q9436O1250
$$ plain form
693 -97788 -86980 -28741 24396 100077 66021 89155 85295 28226 -38338 117194 86538 -63122
681 -63122 -28001 65452 53201 51448 70076 44660 9362 28809 33233 8509 95069 19659
669 19659 -83614 -41704 -89866 -32004 -4499 11975 -35991 7141 -27919 22160 12098 -55928
657 -55928 -156643 -117580 -22822 25629 15410 36813 61188 45075 -31864 -69086 -26450 -12908
645 -12908 137816 124571 27704 -110851 6084 96637 106412 62059 -14882 -78982 3897 77590
633 77590 6956 -86196 -88844 -85665 -100944 -64861 -99568 -53799 -1403 17422 -29700 -86240
621 -86240 -46594 -35957 -81965 -83128 -106601 -5687 -31244 -141820 -38821 26597 -22436 -27416
609 -27416 4814 -15115 -39698 -47225 -33985 8328 -76660 -77561 13350 -104574 -15138 46112
597D6112p823M6512n4351N1376K4794j03792m3700j1930m7076q6755J52639L4779
585G85p1154n8656M8553j0493K6876l8209O8683o1932l8798N1874j1886O0802
573c3555M0097l8977k7315O0816N5268K2180j03945N2223o2339p0871j7368K4568
561i9218N690J4034L8256k3933l2078N1663n8065L8631n9488O0383L23M3071J05534
548H4803m2945l1960j118m5841J4571N9545m14k7159k385l032j3242K3518k083
535A2258m4100K7724K1479n2387J4889L2875L806l6217O3869o9321n1588Q0842
523D129m5401N5812J6190m8609K1135J9701N7999l8770J0192L7120p1063m7561
511b9126P9399K4175j21665k0407J1463O1901J4466j1315q3924r5478J24681j8621
$$ plain form
597 46112 38289 84801 30450 81826 106620 2828 -40872 -52802 -99878 -186633 -33994 785
585 785 -70369 -129025 -80472 -90965 -64089 -102298 -33615 -95547 -134345 -82471 -94357 -33555
573 -33555 6542 -32435 -59750 1066 56334 78514 -25431 26792 -35547 -106418 -123786 -99218
561 -99218 -93528 -79494 -41238 -65171 -97249 -45586 -103651 -65020 -124508 -64125 -63802 -20731 84803
548 84803 41858 9898 8780 -37061 -22490 37055 36641 9482 7097 4065 -9177 14341 12258
535 12258 -31842 -4118 17361 -35026 -20137 12738 16544 -19673 44196 -25125 -76713 4129
523 4129 -41272 14540 30730 -17879 3256 22957 80956 42186 52378 89498 18435 -29126
511 -29126 50273 74448 -47217 -67624 -56161 5740 20206 8891 -75033 -170511 -45830 -64451
499f4451l0890N8610j3345p3508Q7039J09009j50792m2128P1935K1933J8047p6966
487h5507m0879N8517j018o4529m7374o302P1400R5506N4625j0455J1105k080k379
474C0630r3089j2424o514j835K9742Q995O5365L3507r4055N2221n7292o2046P2618
461c4177j9608L7186O6339L2412j4978n5696K5802L72q2138J7416j8232N9453
449A4151P7876k1935k3305k2918o0476l3127O5629O200M4802n4965l0519j5639
437e4226P1314q928j59385M4856O1550R3967m5283M9478q3128l3209p428K3059
425d7363j9502O2293J34976p1507m9748j16250P4450j1973q1845Q2048k8650O0114
413a2957N5587M9770N6624q9846R831N2307j1159k5362k4842N2163k3054K3134
$$ plain form
499 -64451 -95341 -36731 -50076 -123584 -36545 72464 -78328 -120456 -48521 -26588 -8541 -85507
487 -85507 -126386 -67869 -68887 -133416 -180790 -187092 -115692 -20186 34439 23984 35089 33009 30630
474 30630 -62459 -74883 -81397 -83232 -53490 -44495 20870 54377 -39678 12543 -44749 -106795 -34177
461 -34177 -53785 -16599 49740 82152 67174 11478 37280 37652 -44486 -27070 -45302 14151
449 14151 92027 70092 46787 23869 -36607 -69734 -4105 2095 46897 -8068 -38587 -54226
437 -54226 17088 8160 -151225 -106369 -44819 49148 3865 53343 -29785 -62994 -70422 -47363
425 -47363 -66865 -4572 130404 58897 9149 -107101 -32651 -44624 -126469 -44421 -73071 -12957
413 -12957 42630 92400 149024 59178 69009 121316 110157 84795 59953 112116 89062 112196
401A12196o3482L3043k6685l4788o1494P6872J6785Q831O3735n7502J4067r2286
389a0708m561N354J37058J401M2807j17249j0064k238N6785o4134l5619J3036
377A1868p019J45461k0421j5690R591m5793j06877o796O7831J37460j2008q5495
365G2112j17268r23q848K4916Q5699K6901j0771k3070J2844j7031j2907j4732
353A6922Q613N302L2720K229R581r915l5421Q9708k4464q7462p2268M5481J2478
340f496R3483m599n736K2064l8461j471m7681O0300N8940Q034p1173k4329o2885
327b0010J07844k9406N025o9812q660M0433M9769p2191j3951L3313r3034k7653
315i8333R7613P0762o624K9785K7847p1754N3640L3209r6627p3314O2695j0963
$$ plain form
401 112196 48714 81757 55072 20284 -41210 35662 52447 61278 125013 67511 81578 -10708
389 -10708 -15269 -9915 127143 128544 171351 54102 44038 41800 98585 34451 -1168 11868
377 11868 4849 150310 129889 114199 123790 77997 -28880 -35676 32155 169615 157607 72112
365 72112 -45156 -46079 -54927 -30011 55688 82589 71818 48748 61592 44561 31654 16922
353 16922 25535 30837 63557 65786 75367 65452 30031 119739 95275 7813 -64455 -18974 -6496
340 -6496 86987 82388 76652 98716 60255 58784 11103 71403 130343 138377 67204 42875 -20010
327 -20010 87834 58428 63453 -6359 -15019 25414 75183 2992 -10959 22354 -70680 -98333
315 -98333 -720 70042 63418 93203 121050 49296 102936 136145 39518 -33796 28899 17936
303A7936N2100p341m3520Q7659O0193j5747j27789O0631J1388k5604m8405N9284
291H0785Q3237J2768n8505P9862l2189q9080p5199R8469k1511K3582j15370q1101
279i4252Q8747M5368K8553j01219Q9575O4992n8483J18611j290o5065l4909N2756
267A33384l5467J6063N2206o4132j6750q6904N682Q1748o6072J00666l5635N8583
255A43372O0232n3296J2112m8771k2161k9990j4113j2414l5440K9494J15157o9289
243G4893p1300M4458J78P5249r2643k7390J5837J0492J3411M153M7738Q306n3647
230D9735o6850R3814m410P6949l0285q7417N6914j7027m6038P6483J6439l0202
218H8105j29060K3202j3586M8117m0399M255j3842J5868L8500L1833J409L8565
$$ plain form
303 17936 70036 62695 19175 106834 167027 151280 23491 84122 95510 69906 21501 80785
291 80785 164022 176790 118285 198147 165958 76878 1679 100148 78637 102219 -13151 -94252
279 -94252 -5505 39863 68416 -32803 56772 121764 63281 181892 180602 115537 80628 133384
267 133384 97917 113980 166186 102054 85304 -1600 4082 85830 19758 120424 84789 143372
255 143372 203604 150308 162420 113649 91488 61498 47385 34971 -469 29025 144182 74893
243 74893 3593 48051 48229 123478 30835 3445 19282 29774 43185 47338 95076 103382 49735
230 49735 -17115 76699 72289 149238 118953 31536 88450 71423 25385 101868 118307 88105
218 88105 -40955 -17753 -31339 16778 -23621 -19366 -33208 -17340 21160 52993 54402 92967
206I2967m9543m8430M6380J02892O2295n2719j14955N1555K93j51388J04027j9574
194B3800K412M5966j1875j431o1894K8598L3000j01p0207K3147K0133r2580J30392
181F9360P2422j07436l501k1066m9814q302N6476P1849K3291n2264l4994R2233
169A08254N835K6722p8436r3819O6250M5809r0597K0384N8228n2317l7779k8481
157d9947R2530J13062l0287l9949M1940p4903j6787K8454R9912q004m1698j19015
145d692q1366O1064K7646J15898l9583k6799J5700L2381J4381M616L4443K2563
133A76252p1687k6708j1721l0250r1233L0413J23927n1099l2833Q5790m6352m2378
121A2121K3007O2151k992M6577J7604l3577k2482j06963q685M4277P020n7326
$$ plain form
206 92967 43424 -5006 41374 144266 206561 153842 38887 90442 90735 -60653 43374 23800
194 23800 26212 72178 60303 58872 -3022 25576 58576 58475 -11732 11415 31548 -61032 69360
181 69360 141782 34346 30845 9779 -40035 -48337 8139 79988 103279 51015 16021 108254
169 108254 114089 140811 62375 -31444 34806 80615 -9982 10402 68630 16313 -21466 -49947
157 -49947 42583 155645 125358 85409 127349 52446 35659 64113 164025 156021 114323 -4692
145 -4692 -86058 -24994 2652 118550 78967 52168 67868 100249 114630 119246 153689 176252
133 176252 104565 77857 66136 35886 -55347 -24934 98993 47894 15061 100851 54499 12121
121 12121 35128 97279 94287 140864 158468 124891 102409 -4554 -13239 31038 38058 -19268
109a9268N8508o3125K6778K7246r0543j9546L0650L9499J53163R8353j07647n2043
97H2025o0425P9229J9034J485m1218k1513O2163j8291q9729L1131R9872K0189
85A63952M0653m9834q7990L7992j23437J2826J00137l4280N5347o7539l7287j1075
73e35o2887M7372J5166M6344J23115p1618K064K5049p7005J05986o7804j295p9793
60D159l2177L9181P6317q0795j5125N0119N951M1597L9360p5242l0744M7150L1177
47A00928Q635n1027j1788M9779K927j01719O8323l3660N3745j0545k5623k8739
35B1236L6706N1654k7782l8740M5924K3679l5685J5730K5397m5276J2911o7068
23A8686J3613l2417K7498l318j1290O4416k2431j4771L2799o31o3584K3971M3990
$$ plain form
109 -19268 39240 -23885 2893 30139 -60404 -79950 -49300 -9801 143362 241715 134068 82025
97 82025 21600 100829 119863 121348 80130 58617 120780 102489 12760 43891 143763 163952
85 163952 204605 154771 66781 104773 -18664 -5838 94299 60019 115366 47827 10540 -535
73 -535 -63422 -16050 -884 45460 168575 96957 99021 124070 47065 153051 85247 83952 4159
60 4159 -28018 11163 87480 6685 -8440 41679 47630 89227 128587 53345 22601 69751 100928
47 100928 109563 58536 46748 96527 99454 -2265 66058 32398 86143 75598 49975 21236
35 21236 57942 109596 81814 43074 88998 112677 76992 92722 118119 72843 85754 18686
23 18686 32299 -118 27380 24062 12772 77188 54757 39986 72785 72154 8570 32541 76531
10G6531o4335R634N045O2044L2725k7218m7190m1192L1566N4922
0I2532
$$ plain form
10 76531 12196 21830 26875 88919 121644 94426 47236 6044 37610 92532
0 92532
$$ Imaginary data points
##PAGE= N=2
##DATA TABLE= (X++(I..I)), XYDATA
16383a868773K2677k0014R9405R9979o682O58J9158k0869L145L6493K8949N2272
16371a553602L2564m6017K0337O7977N4482n9626K1699P0095N9453o951j3792
16360a353381J3310O5009n1086O3421R5821j1045K9249M0452J8426o233J5246
16349a080811n692N4509L8920n1500O451K4393q214Q1812K1558K9481O2236M884
16337h21973K6071M351O1145L8088l16J3832q898J4677J3946Q5493N4125N5698
16325d63761K3402n746N4580m2708k1535N3332P945P944K356O1441K7845R4940
16313a99965J8263k5529q35k2606L2565k8521l2385J29365J06147J4690j277j15844
16301a25932L4544N3731l2940J0401N6346R015L4018q2770J32269O9750p5523
$$ plain form
16383 -1868773 -1846096 -1866110 -1766705 -1666726 -1673408 -1672750 -1653592 -1674461 -1671316 -1634823 -1605874 -1553602
16371 -1553602 -1521038 -1567055 -1546718 -1478741 -1424259 -1483885 -1462186 -1392091 -1332638 -1339589 -1353381
16360 -1353381 -1340071 -1275062 -1326148 -1262727 -1166906 -1177951 -1148702 -1108250 -1089824 -1096057 -1080811
16349 -1080811 -1086503 -1031994 -993074 -1044574 -1038123 -1013730 -1021944 -940132 -918574 -889093 -826857 -821973
16337 -821973 -795902 -791551 -730406 -692318 -692634 -678802 -687700 -673023 -659077 -573584 -519459 -463761
16325 -463761 -440359 -446105 -391525 -434233 -455768 -402436 -394491 -386547 -384191 -322750 -294905 -199965
16313 -199965 -181702 -207231 -208066 -230672 -198107 -226628 -259013 -129648 -23501 -8811 -10088 -125932
16301 -125932 -91388 -37657 -70597 -60196 -3850 5165 39183 -43587 88682 158432 82909
16290H2909R6211O4840p2000R775R2629m1586K7220M2726k0666o0941L3526J72024
16278D26667N6933j39112N2875k765R5184j6276L5622Q1294M414J0114p8512m6509
16266D79929P395J4616J94922P0132j21765m5398j7181K8704N6848R1381R6364
16255H55947L9474p0992M3800q9086J1811k7090O5597M2610L1737o929l3992M9676
16243I12563r6380N4396N8200l3310l6138Q2214R891L5794N0768k2771J0450M6084
16231A071761k5237l5910q625N363P9613N7678m6936k6783K8440J18275L3494
16220A251133o4510N8082M9579N6279o4064r4776o5552L1874L7926o4766M0447
16209A171652L7197k9051N0506L547o41M7521J01291M3578o2933l2419K6803M2154
$$ plain form
16290 82909 179120 243960 171960 181735 274364 232778 259998 302724 282058 221117 254643 426667
16278 426667 483600 344488 397363 394598 489782 473506 509128 590422 594836 604950 526438 479929
16266 479929 487324 501940 696862 766994 645229 599831 582650 611354 668202 759583 855947
16255 855947 895421 824429 868229 779143 790954 763864 829461 872071 903808 896879 862887 912563
16243 912563 816183 870579 928779 895469 859331 941545 951436 987230 1037998 1015227 1025677 1071761
16231 1071761 1046524 1010614 1001989 1007352 1086965 1144643 1097707 1070924 1099364 1217639 1251133
16220 1251133 1186623 1244705 1294284 1350563 1286499 1191723 1126171 1158045 1195971 1131205 1171652
16209 1171652 1208849 1179798 1230304 1233851 1233210 1280731 1382022 1425600 1362667 1330248 1357051 1399205
16197A399205R1538r56K0115o6907k6490R4066M7497L2834j7249k3979n0533k3028
16185A476113j39242J03120R9959p1563m7515m676Q1896O067M8258j9777l8389
16174A494251Q7677p4201j9636J53709N2623m8860m5488P4939p6597O3401j2320
16163A649498p0675K0066n9473O4062j0595J4862O4957n7827N0839P7282k9255
16152A713741m1707k9554N1286J7067Q3046m6742k2959l7548l7365q7532l1300
16141A530433J24885O5460k9279P9989L7571l2214n4862n5613M4672M1530j02355
16130A650217m781M6273L6155O3055O6543r1910j8125K267O1223j6811o317P7658
16118A865447m4255j1569m7343M4187R63k2562L8710j7135p5965l828J38563J9312
$$ plain form
16197 1399205 1490743 1489787 1509902 1442995 1416505 1510571 1558068 1590902 1573653 1549674 1499141 1476113
16185 1476113 1336871 1439991 1539950 1468387 1420872 1416196 1498092 1504159 1552417 1532640 1494251
16174 1494251 1581928 1507727 1488091 1641800 1694423 1645563 1600075 1675014 1598417 1661818 1649498
16163 1649498 1578823 1598889 1539416 1603478 1592883 1607745 1672702 1614875 1665714 1742996 1713741
16152 1713741 1672034 1642480 1693766 1710833 1793879 1747137 1724178 1686630 1649265 1561733 1530433
16141 1530433 1655318 1720778 1691499 1771488 1809059 1776845 1721983 1666370 1711042 1752572 1650217
16130 1650217 1645436 1691709 1727864 1790919 1857462 1765552 1747427 1749694 1810917 1794106 1787789 1865447
16118 1865447 1821192 1809623 1762280 1806467 1807430 1784868 1823578 1806443 1730478 1726650 1865213 1884525
16106A884525k9126J5528n3588O785J77053k2266q0297l905r9076K684P9715J3504
16094A891536n1800M9251j45896J8094M5961j2777N7769j22238L1544O6174n7712
16083A769906J21780m2438n9476M8309Q1682j927o8854o0157R2069j7718p6149
16072A787027J16713j0089j1409R6000r7004k8332M2613l8714m760N0392j11895
16061A790542o6848K7425P5768m2811M7363J6204R4366M5016J1594o8328o2571
16050A867720K47L3741l447L7843L8424j39562N1424J6122j17509L5406k5083
16039A795326J5706n6159R888J7522J43122K1098j9850o515n1793J29817k4058
16028A974104j563n1129q5735J1120Q5571j27993N5250o6082P0986N7544m0428
$$ plain form
16106 1884525 1855399 1870927 1817339 1824124 2001177 1978911 1898614 1894709 1795633 1798317 1878032 1891536
16094 1891536 1839736 1888987 1743091 1761185 1807146 1794369 1852138 1729900 1761444 1827618 1769906
16083 1769906 1891686 1849248 1789772 1838081 1919763 1917836 1848982 1788825 1880894 1863176 1787027
16072 1787027 1903740 1893651 1882242 1978242 1881238 1852906 1895519 1856805 1852045 1902437 1790542
16061 1790542 1723694 1751119 1826887 1784076 1831439 1847643 1942009 1987025 1998619 1930291 1867720
16050 1867720 1867967 1901708 1898261 1936104 1974528 1834966 1886390 1902512 1785003 1820409 1795326
16039 1795326 1811032 1754873 1764761 1782283 1925405 1946503 1926653 1920138 1868345 1998162 1974104
16028 1974104 1972541 1921412 1835677 1846797 1932368 1804375 1859625 1793543 1864529 1922073 1881645
16017A881645J8778J1746n2664M9729r8620J8676M1462n9241K203M6796N889Q6197
16005A952596N4540l1708l4482j8230N6074P82p9631L3364L7534j16413m3735
$$ plain form
16017 1881645 1900423 1912169 1859505 1909234 1810614 1829290 1870752 1811511 1813714 1860510 1866399 1952596
16005 1952596 2007136 1975428 1940946 1922716 1978790 1979572 1899941 1933305 1970839 1854426 1810691
$$ [...]
##END NTUPLES=NMR SPECTRUM
##END=
