##TITLE=1H_EC-3288(II)oc
 CDCl3
 8 sc, 
 26.1.2023
##JCAMPDX= 6.0         $$ Bruker NMR JCAMP-DX V2.0
##DATA TYPE= NMR SPECTRUM
##DATA CLASS= NTUPLES
##ORIGIN= UXNMR, Bruker Analytische Messtechnik GmbH
##OWNER= root
$$ XWIN-NMR		Version 3.5
$$ Thu Jan 26 14:19:42 2023 Russian Standard Time (UT+4h)  she@DPX200
##.OBSERVE FREQUENCY= 200.13135
##.OBSERVE NUCLEUS= ^1H
##.ACQUISITION MODE= SIMULTANEOUS
##.ACQUISITION SCHEME= undefined
##.AVERAGES= 8
##.DIGITISER RES= 18
##SPECTROMETER/DATA SYSTEM= spect
##.PULSE SEQUENCE= zg30
##.SOLVENT NAME= CDCl3
##.SHIFT REFERENCE= (INTERNAL, CDCl3, 0, 15.7579)
##AUDIT TRAIL= $$ (NUMBER, WHEN, WHO, WHERE, WHAT)
$$ ##TITLE= Audit trail, XWIN-NMR		Version 3.5
$$ ##JCAMPDX= 5.01
$$ ##ORIGIN= Bruker BioSpin GmbH
$$ ##OWNER= she
$$ F:/spectra/data/she/nmr/H-F/1/pdata/1/auditp.txt
$$ ##AUDIT TRAIL=  $$ (NUMBER, WHEN, WHO, WHERE, WHAT)
(   1,<2023-01-26 14:18:30.04 +0400>,<she>,<DPX200>,
      <created by zg, POWCHK disabled, PULCHK disabled
       configuration hash MD5:
       00 E9 B6 7A A2 85 ED C7 34 08 36 98 17 FE 4E 26
       data hash MD5: 16K
       42 D3 59 69 A0 3B 9D F8 FA 07 3A 17 9C 5E 80 08>)
(   2,<2023-01-26 14:18:32.71 +0400>,<she>,<DPX200>,
      <Start of raw data processing
       efp BC_mod = 2 LB = 0.24 FT_mod = 6 PKNL = 1 PHC0 = -19184.56 PHC1 = 1.400789 SI = 16K 
       data hash MD5: 16K
       F1 5D 6F B5 DB F5 3C AC 2A 05 6E 36 11 E1 D2 30>)
(   3,<2023-01-26 14:18:49.01 +0400>,<she>,<DPX200>,
      <pk PHC0 = -5.272735 PHC1 = 8.799998 
       data hash MD5: 16K
       38 B4 EB BF 66 B2 81 DE CA 90 C7 B8 8F F4 8E A5>)
(   4,<2023-01-26 14:18:52.39 +0400>,<she>,<DPX200>,
      <abs ABSG = 5 
       data hash MD5: 16K
       1F 83 A1 0F 17 73 D0 48 3A 74 10 CF B4 20 CF 10>)
$$ ##END=
$$ 
$$ hash MD5
$$ C8 6F 5D F8 29 6F 91 12 F1 39 28 DE 31 4F 32 A1
##$RELAX= 
##$RELAX= 
##$RELAX= 
##$RELAX= 
##$RELAX= 
##$RELAX= 
$$ Bruker specific parameters
$$ --------------------------
##$DU= <F:/spectra>
##$EXPNO= 1
##$NAME= <H-F>
##$PROCNO= 1
##$TYPE= <nmr>
##$USER= <she>
##$AMP= (0..31)
100 100 100 100 100 100 100 100 100 100 100 100 100 100 100 100 100 100 
100 100 100 100 100 100 100 100 100 100 100 100 100 100 
##$AQSEQ= 0
##$AQ_mod= 1
##$AUNM= <au_zg>
##$AUTOPOS= <>
##$BF1= 200.13
##$BF2= 200.13
##$BF3= 200.13
##$BF4= 200.13
##$BF5= 200.13
##$BF6= 200.13
##$BF7= 200.13
##$BF8= 200.13
##$BYTORDA= 1
##$CFDGTYP= 0
##$CFRGTYP= 5
##$CHEMSTR= <none>
##$CNST= (0..31)
1 1 145 1 1 1 1 1 1 1 1 1 1 1 1 1 1 1 1 1 1 1 1 1 1 1 1 1 1 1 1 1 
##$CPDPRG= <>
##$CPDPRG1= <>
##$CPDPRG2= <>
##$CPDPRG3= <>
##$CPDPRG4= <mlev>
##$CPDPRG5= <mlev>
##$CPDPRG6= <mlev>
##$CPDPRG7= <mlev>
##$CPDPRG8= <mlev>
##$CPDPRGB= <>
##$CPDPRGT= <>
##$D= (0..31)
0 1.2 0 0 0 0 0 0 0 0.06 0 0.03 0 0 0 0 0.0002 0 0 0 0 0 0 0 0 0 0 0 0 
0 0 0 
##$DATE= 1674728309
##$DBL= (0..7)
120 120 120 120 120 120 120 120 
##$DBP= (0..7)
150 150 150 150 150 150 150 150 
##$DBP07= 0
##$DBPNAM0= <>
##$DBPNAM1= <>
##$DBPNAM2= <>
##$DBPNAM3= <>
##$DBPNAM4= <>
$$ [...]
##$SUBNAM3= <"">
##$SUBNAM4= <"">
##$SUBNAM5= <"">
##$SUBNAM6= <"">
##$SUBNAM7= <"">
##$SUBNAM8= <"">
##$SUBNAM9= <"">
##$SW= 18.05172834244
##$SWIBOX= (0..15)
0 0 2 0 0 0 0 0 0 0 0 0 0 0 0 0 
##$SW_h= 3612.71676300578
##$TD= 16384
##$TD0= 1
##$TE= 0
##$TE2= 300
##$TE3= 300
##$TEG= 300
##$TL= (0..7)
0 120 120 120 120 120 120 120 
##$TP= (0..7)
150 150 150 150 150 150 150 150 
##$TP07= 0
##$TPNAME0= <>
##$TPNAME1= <>
##$TPNAME2= <>
##$TPNAME3= <>
##$TPNAME4= <>
##$TPNAME5= <>
##$TPNAME6= <>
##$TPNAME7= <>
##$TPOAL= (0..7)
0.5 0.5 0.5 0.5 0.5 0.5 0.5 0.5 
##$TPOFFS= (0..7)
0 0 0 0 0 0 0 0 
##$TUNHIN= 0
##$TUNHOUT= 0
##$TUNXOUT= 0
##$USERA1= <user>
##$USERA2= <user>
##$USERA3= <user>
##$USERA4= <user>
##$USERA5= <user>
##$V9= 5
##$VALIST= <valist>
##$VCLIST= <CCCCCCCCCCCCCCC>
##$VD= 0
##$VDLIST= <DDDDDDDDDDDDDDD>
##$VPLIST= <PPPPPPPPPPPPPPP>
##$VTLIST= <TTTTTTTTTTTTTTT>
##$WBST= 1024
##$WBSW= 4
##$XGAIN= (0..3)
0 0 0 0 
##$XL= 0
##$YL= 0
##$YMAX_a= 11320
##$YMIN_a= -15048
##$ZGOPTNS= <>
##$ZL1= 120
##$ZL2= 120
##$ZL3= 120
##$ZL4= 120
##$ABSF1= 15.80088
##$ABSF2= -2.250971
##$ABSG= 5
##$ABSL= 3
##$ALPHA= 0
##$AQORDER= 0
##$ASSFAC= 0
##$ASSFACI= 0
##$ASSFACX= 0
##$ASSWID= 0
##$AUNMP= <proc_1d>
##$AZFE= 0.1
##$AZFW= 0.1
##$BCFW= 0
##$BC_mod= 2
##$BYTORDP= 0
##$COROFFS= 0
##$CY= -3
##$DATMOD= 1
##$DC= 0
##$DFILT= <>
##$DTYPP= 0
##$F1P= 0
##$F2P= 0
##$FCOR= 1
##$FTSIZE= 16384
##$FT_mod= 6
##$GAMMA= 0
##$GB= 0
##$INTBC= 1
##$INTSCL= 3.70164e-10
##$ISEN= 128
##$LB= 0.24
##$LEV0= 0
##$LPBIN= 0
##$MAXI= 10000
##$MC2= 0
##$MEAN= 0
##$ME_mod= 0
##$MI= 1.114404
##$NCOEF= 0
##$NC_proc= -11
##$NLEV= 6
##$NOISF1= 3.799351
##$NOISF2= 2.8
##$NSP= 0
##$NTH_PI= 0
##$NZP= 0
##$OFFSET= 15.75791
##$PC= 1
##$PHC0= -19189.83
##$PHC1= 10.20079
##$PH_mod= 1
##$PKNL= yes
##$PPARMOD= 0
##$PSCAL= 0
##$PSIGN= 0
##$REVERSE= no
##$SF= 200.130002728624
##$SI= 16384
##$SIGF1= 3
##$SIGF2= 2
##$SINO= 5.538805
##$SIOLD= 16384
##$SREGLST= <1H.CDCl3>
##$SSB= 0
##$STSI= 16384
##$STSR= 0
##$SW_p= 3612.71676300578
##$SYMM= 0
##$S_DEV= 0
##$TDeff= 16384
##$TDoff= 0
##$TI= <>
##$TILT= no
##$TM1= 0
##$TM2= 0
##$TOPLEV= 0
##$USERP1= <user>
##$USERP2= <user>
##$USERP3= <user>
##$USERP4= <user>
##$USERP5= <user>
##$WDW= 1
##$XDIM= 16384
##$YMAX_p= 505309721
##$YMIN_p= -5449300
$$ End of Bruker specific parameters
$$ ---------------------------------
##NTUPLES= NMR SPECTRUM
##VAR_NAME=  FREQUENCY,     SPECTRUM/REAL,   SPECTRUM/IMAG
##SYMBOL=    X,             R,               I
##VAR_TYPE=  INDEPENDENT,   DEPENDENT,       DEPENDENT
##VAR_FORM=  AFFN,          ASDF,            ASDF
##VAR_DIM=   16384,         16384,           16384
##UNITS=     HZ,            ARBITRARY UNITS, ARBITRARY UNITS
##FACTOR=    0.220516191357247, 1,           1
##FIRST=     3153.63052622419, 0,            0
##LAST=      -459.086236781593, 0,           0
##MIN=       -459.086236781593, -5449300,    0
##MAX=       3153.63052622419, 505309721,    0
$$ Real data points
##PAGE= N=1
##DATA TABLE= (X++(R..R)), XYDATA
$$ [...]
5799a68734J25947J94642l2830N201Q8038M2045k59288o0195j27466J01048J38264
$$ -168734 -42787 151855 119025 124226 212264 254309 -4979 -65174 -192640 -91592 46672
5788D6672j34647K7927J03800r9220P5797r9211n5585n1222J08836Q4706j78174
$$ 46672 -87975 -60048 43752 -55468 20329 -78882 -134467 -185689 -76853 7853 -170321
5777a70321j14301K37449J98838l9914L3136q6126J12641K0849Q9696m2222j61225
$$ -170321 -284622 -47173 151665 111751 144887 58761 171402 192251 281947 239725 78500
5766G8500M0872J11126M4078J39327j68749M9680j21592r453p2918m7484Q4010
$$ 78500 119372 230498 274576 413903 245154 294834 173242 163789 90871 43387 127397
5755A27397j32936N9986J31553j4297J16216p1188j88666k7858J50265k5738O6472
$$ 127397 -5539 54447 186000 171703 287919 216731 28065 207 150472 124734 191206
5744A91206O0986q284J54653R5701N2040K899k2712j47185K0439Q164l0390J03067
$$ 191206 252192 243908 398561 494262 546302 549201 526489 379304 399743 407907 377517 480584
5732D80584k38716N642J45000j03320M1579O9900o2048L37975j15148p681l1521
$$ 480584 241868 247510 392510 289190 330769 400669 338621 676596 561448 553767 522246
5721E22246K9988q7236Q3607P1580N469l956o7818J58392J0369p3051j75422j9299
$$ 522246 552234 464998 548605 620185 625654 621698 553880 712272 722641 649590 474168 454869
5709D54869K5143J77908P4987j13805J43387o7260R7110n8826J6037K39753N9577
$$ 454869 480012 657920 732907 619102 762489 695229 792339 733513 749550 989303 1048880
5698A048880R13243n20582o38559q3783n6109l470Q3605j67209J91529j04315
$$ 1048880 1962123 1441541 802982 719199 663090 659620 743225 576016 767545 663230
5688F63230l8018J50611r2005K02271R2L544J44768q8830o2473J40281r9522J14054
$$ 663230 625212 775823 683818 886089 886181 889725 1034493 945663 883190 1023471 923949 1038003
5676A038003j54538N0652m9728N3734r921O6953j28748N6702j57596J0876j0137
$$ 1038003 883465 934117 884389 938123 928202 995155 866407 923109 765513 776389 766252
5665G66252m9937L18203P1735O7671n6887l1495p436l0421n9643J33658m5417
$$ 766252 716315 1034518 1106253 1173924 1117037 1085542 1078106 1047685 988042 1121700 1076283
5654A076283j09195j91684P9407K21170o7214k7368o0089J70048o8518k8449j37492
$$ 1076283 967088 775404 854811 1075981 1008767 981399 921310 1091358 1022840 994391 856899
5643H56899j8674J65794N500R527j45844M7395j1459j08478J52742J53230L1472
$$ 856899 838225 1004019 1009519 1019046 873202 920597 909138 800660 953402 1106632 1138104
5632A138104m8252k37697j57923q128K24565j34130o284j85805J51180P0361O4164
$$ 1138104 1089852 852155 694232 686104 910669 776539 770255 584450 735630 805991 870155
5621H70155J03864l093k1199N7798J22180j44263j77509M0663j35485r0655J69987
$$ 870155 974019 970926 949727 1007525 1129705 985442 807933 848596 713111 622456 792443
5610G92443J08659l4771j42640N0494J29127K211Q7421r8243J06103j00349J46435
$$ 792443 901102 866331 723691 774185 903312 905523 992944 894701 1000804 900455 1046890
5599A046890J96134j49620j27901j38006R9470m7485J00264J15679j9311q572
$$ 1046890 1243024 1093404 965503 827497 926967 879482 979746 1095425 1076114 1067542
5589A067542k1778r36M3410M2888r1428m4579P0068o5770K7716O3608J90346r9808
$$ 1067542 1045764 1044828 1088238 1131126 1039698 995119 1065187 999417 1027133 1090741 1281087 1181279
5577A181279k07265K63555l987q2508R7949N8784k3726j07728m0340K9283M32509
$$ 1181279 974014 1237569 1233582 1151074 1249023 1307807 1284081 1176353 1136013 1165296 1597805
5566A597805j6432r9226j43615l519j11397P6553Q8660j17158Q4375J88005K68972
$$ 1597805 1581373 1482147 1338532 1335013 1223616 1300169 1388829 1271671 1356046 1544051 1813023
5555A813023j59284r9398J19164P91n7634O2249l3328J14592m1729j12587J07055
$$ 1813023 1653739 1554341 1673505 1674296 1616662 1678911 1645583 1760175 1718446 1605859 1712914
5544A712914j09081L2899q2768o9645J10580N0997o693J00695J4573K465J81625
$$ 1712914 1603833 1636732 1553964 1484319 1594899 1645896 1639203 1739898 1754471 1756936 1938561
5533A938561P5693r1359J39894L8287p6816n3398O4972R1834m0444J36139j65164
$$ 1938561 2014254 1922895 2062789 2101076 2024260 1970862 2035834 2127668 2087224 2223363 2058199
5522B058199j18060N9059J51345J69203J23900p6439j4072N9929n9623k1723R2317
$$ 2058199 1940139 1999198 2150543 2319746 2443646 2367207 2353135 2413064 2353441 2331718 2424035
5511B424035J84350k64082r7550Q7549J12472K85108R196q9816K95584j27060
$$ 2424035 2608385 2344303 2246753 2334302 2446774 2731882 2741078 2651262 2946846 2819786
5501B819786j08801N2395Q4677J29283N3865Q6962P5153O6535Q3997j52138J86557
$$ 2819786 2710985 2763380 2848057 2977340 3031205 3118167 3193320 3259855 3343852 3191714 3378271
5490C378271J55999N3682J55868J8277J7026J30827J22980J61881o6964J40356
$$ 3378271 3534270 3587952 3743820 3762097 3779123 3909950 4032930 4194811 4127847 4268203
5480D268203L05793j1027J37539J12010J36247J56297K2335P4794K44985R0793
$$ 4268203 4573996 4562969 4700508 4812518 4948765 5105062 5127397 5202191 5447176 5537969
5470E537969J79249O0985K65431K03167K23737M28660K59820K3253K67209L7996
$$ 5537969 5717218 5778203 6043634 6246801 6470538 6899198 7159018 7182271 7449480 7487476
5460G487476K65930L05710O22796L76595K39292K60584L02685M71403M11541N94909
$$ 7487476 7753406 8059116 8681912 9058507 9297799 9558383 9861068 10332471 10744012 11338921
5450A1338921N19082L40991M34968P05831M51768P57563J019997J165560J215764
$$ 11338921 11858003 12198994 12633962 13339793 13791561 14549124 15569121 16734681 17950445
5441A7950445J295532J698513J784126K014425K408448K517254K498670J859549
$$ 17950445 19245977 20944490 22728616 24743041 27151489 29668743 32167413 34026962
5433C4026962J471265J088276L84356l26217n10190m59201o74154m13563m51218
$$ 34026962 35498227 36586503 36970859 36644642 36134452 35675251 35001097 34587534 34136316
5424C4136316o45928p92914p84852q86961r05035q61827n75611j94279j0024L23675
$$ 34136316 33490388 32697474 31912622 31025661 30120626 29258799 28683188 28488909 28478885 28802560
5414B8802560N05520R22616J130279J602709J939203K247699K800355K912001
$$ 28802560 29308080 30230696 31360975 32963684 34902887 37150586 39950941 42862942
5406D2862942L195181L432394K915047K226821J818215J244646O81289L38638
$$ 42862942 46058123 49490517 52405564 54632385 56450600 57695246 58376535 58715173
5398E8715173K15295J40667K30891M75723L75751L00939k87223j068296k182944
$$ 58715173 58930468 59071135 59302026 59777749 60153500 60454439 60167216 59098920 56915976
5389E6915976l242021l498470l889314l585429l003190k927987k214878j634690
$$ 56915976 53673955 50175485 46286171 42700742 39697552 36769565 34554687 32919997
5381C2919997j385379q91686m63377L0030L95141L96859N09414Q41709J373297
$$ 32919997 31534618 30642932 30179555 30209585 30604726 31001585 31510999 32352708 33726005
5372C3726005J067010P63740Q02971N10990O13103M59537O58973P10415R57944
$$ 33726005 34793015 35556755 36359726 36870716 37483819 37943356 38602329 39312744 40270688
5363D0270688M36701l95524j059670k064017l014991k695483k987650k859161
$$ 40270688 40707389 40311865 39252195 37188178 34173187 31477704 28490054 25630893
5355B5630893k359398k356432j902021j580781j137970j183199j179765r01785
$$ 25630893 23271495 20915063 19013042 17432261 16294291 15111092 13931327 13029542
5347A3029542q00030q83033o31844n80098l65343m35317m35711k31310m73247
$$ 13029542 12229512 11346479 10714635 10134537 9769194 9333877 8898166 8666856 8193609
5338H193609m13891o9370k55375k77618j93423j27641j56904L6925J6692m32961
$$ 8193609 7779718 7710348 7454973 7177355 6983932 6856291 6699387 6736312 6753004 6320043
5328F320043k88278n2432k88139j00547j26369j94521k3416n6986m8895k01601
$$ 6320043 6031765 5979333 5691194 5590647 5464278 5269757 5246341 5189355 5140460 4938859
5318D938859j75525L7925j60351o8560K9418k24528j99725n2731J72759J28040
$$ 4938859 4763334 4801259 4640908 4572348 4601766 4377238 4177513 4124782 4297541 4425581
5308D425581j17870j53351L8094N7052M4201l565k38888k06703M6713j02911j7103
$$ 4425581 4307711 4154360 4192454 4249506 4293707 4290142 4051254 3844551 3891264 3788353 3771250
5297C771250j1920Q727J1006j08162j38251j05883j27181j99397K45724k6094
$$ 3771250 3759330 3768057 3779063 3670901 3532650 3426767 3299586 3100189 3345913 3319819
5287C319819j7392o8106q5622k17669l1570j9823O4493j65499m3122K06894Q47
$$ 3319819 3302427 3234321 3148699 2931030 2899460 2879637 2944130 2778631 2735509 2942403 2943250
5276B943250o5848j81222N7079m1512m6469J96681k29218j9772M9723J86144N3947
$$ 2943250 2877402 2696180 2753259 2711747 2665278 2861959 2632741 2612969 2662692 2848836 2902783
5265B902783J43314j64850k72683M5262O0734K7342O9470M9179j26581p4482j77852
$$ 2902783 3046097 2881247 2608564 2653826 2714560 2741902 2811372 2860551 2733970 2659488 2481636
5254B481636P9882J44681j77792l43711Q176J96511J5437L9125J97111L0494O09529
$$ 2481636 2561518 2706199 2528407 2184696 2192872 2389383 2404820 2443945 2641056 2671550 3281079
5243C281079j99530p7161r5303j19298o978K53805L11965J51624j70937k11591
$$ 3281079 3081549 3004388 2909085 2789787 2782809 3036614 3348579 3500203 3329266 3117675
5233C117675j13790K22679J84343J41112q941j45397q2847J40234J81696O8059
$$ 3117675 3003885 3226564 3410907 3552019 3543078 3397681 3314834 3455068 3636764 3704823
5223C704823o1849j05786K3178O7839K57186P8529J37254J19068J11640q7238
$$ 3704823 3642974 3537188 3560366 3628205 3885391 3963920 4101174 4220242 4331882 4244644
5213D244644K63758Q5766R94n1746k0861J67747M1053P6974J82738J33151J54553
$$ 4244644 4508402 4594168 4595162 4543416 4522555 4690302 4731355 4808329 4991067 5124218 5278771
5202E278771K83653K23710L712K0877L16635L92172J64527K4960J80323J91200
$$ 5278771 5562424 5786134 5789846 5810723 6127358 6519530 6684057 6709017 6889340 7080540
5192G080540K96745L11091L22435j2816M1340L60219K31004K14000L64615O27789
$$ 7080540 7377285 7688376 8010811 7997995 8039335 8399554 8630558 8844558 9209173 9836962
5182I836962K42520M89067O18270M41493O95005N72978O28076P26676N93484J074650
$$ 9836962 10079482 10568549 11186819 11628312 12323317 12896295 13524371 14251047 14844531 15919181
5172A5919181J203597J195066J381768J666147J615168K096582K530008K595018
$$ 15919181 17122778 18317844 19699612 21365759 22980927 25077509 27607517 30202535
5164C0202535K860613L039504L293588K731561J594067P58024J73761q41150j187334
$$ 30202535 33063148 36102652 39396240 42127801 43721868 44479892 44653653 43812503 42625169
5155D2625169j035564r22735q24354o69402o38007q54706p30304p66463j014156
$$ 42625169 41589605 40666870 39842516 39173114 38535107 37680401 36950097 36183634 35169478
5146C5169478p42773l89406r5525L73747O69044Q72033J572020J966725K259212
$$ 35169478 34426705 34037299 33941774 34315521 34984565 35856598 37428618 39395343 41654555
5137D1654555K572804L032828L026654K654259K271070J254888N67952J51804
$$ 41654555 44227359 47260187 50286841 52941100 55212170 56467058 57035010 57186814
5129E7186814j38661n71303k03492n41978o20013n30444q30719r72632p46652
$$ 57186814 57048153 56476850 56273358 55731380 55111367 54580923 53750204 52777572 52030920
5120E2030920o63844j152926j578836j892803k277798k909043k858582k722665
$$ 52030920 51367076 50214150 48635314 46742511 44464713 41555670 38697088 35974423
5112C5974423k280280j913069j543745j109139p56667n00338n1117J19984M18899
$$ 35974423 33694143 31781074 30237329 29128190 28371523 27871185 27820068 27940052 28358951
5103B8358951N93034L68745M11632N17501N93649L51379O15884M83014N15463
$$ 28358951 28951985 29320730 29732362 30249863 30843512 31194891 31810775 32293789 32809252
5094C2809252N83592K75791J8759o41072j615652k102231k314237k609079k549620
$$ 32809252 33392844 33668635 33687394 33046322 31430670 29328439 27014202 24405123 21855503
5085B1855503k266321j892771j556636j398680j099745j132292r10599p08193
$$ 21855503 19589182 17696411 16139775 14741095 13641350 12509058 11598459 10890266
5077A0890266p41617p04685n12121k43696m76176l86910j61445o08682m35528
$$ 10890266 10148649 9443964 8931843 8688147 8211971 7825061 7663616 7054934 6619406
5068F619406m8993k87349j78326m8513k45047l07179l59323j07770k36841l20644
$$ 6619406 6570413 6283064 6104738 6056225 5811178 5503999 5144676 5036906 4800065 4479421
5058D479421o2647j07286O0693j51204j23669k29046r701q7333r4183j32692r2085
$$ 4479421 4416774 4309488 4370181 4218977 4095308 3866262 3856561 3769228 3675045 3542353 3450268
5047C450268m4899j13047j05896k05905r8377j02349o6498k53047j10408o39J9596
$$ 3450268 3405369 3292322 3186426 2980521 2882144 2779795 2713297 2460250 2349842 2349203 2368799
5036B368799J14175l08514M9523L1274N5369O0392l43538q9875J29602k56854
$$ 2368799 2482974 2174460 2223983 2255257 2310626 2371018 2027480 1937605 2067207 1810353
5026A810353j09264M0606J7561P4575l983l9676j30653j88493J41284R573j21300
$$ 1810353 1701089 1741695 1759256 1833831 1829848 1790172 1659519 1471026 1612310 1621883 1500583
5015A500583j31907N6458N0314j57800J4462K8327r2708j03303N2272r0636j27099
$$ 1500583 1368676 1425134 1475448 1317648 1332110 1360437 1267729 1164426 1216698 1126062 998963
5004I98963k8280N7860q720j30018P3194J49082k23034n273j4650o2617J11278
$$ 998963 970683 1028543 1019823 889805 962999 1112081 889047 883774 869124 806507 917785
4993I17785N9302k67708j53877K42478J15511k19498p094J6768q957L0441m0438
$$ 917785 977087 709379 555502 797980 913491 693993 686899 703667 694710 725151 684713
4982F84713J7309l6050L0151M4592l6973j79437L7036J75790L2045K67882j16563
$$ 684713 702022 665972 696123 740715 703742 524305 561341 737131 769176 1037058 920495
4971I20495k04945l2674k15324k21507R7728o435K14528K7272K5043J39266j23514
$$ 920495 715550 682876 467552 246045 343773 337338 551866 579138 604181 743447 619933
4960F19933n0587J47557Q6138o1343k07353j867K27490j0354l3963o9830j13057
$$ 619933 569346 716903 803041 741698 534345 532478 759968 749614 715651 645821 532764
4949E32764m620J67417k8514q5000j13568N8676J47769N8173j68290j41303N7579
$$ 532764 528144 695561 667047 582047 468479 527155 674924 733097 564807 423504 481083
4938D81083J06208K5267r9239j14436P874K7846r5195K27708K4073K9939k36888
$$ 481083 587291 612558 513319 398883 406757 434603 339408 567116 591189 621128 384240
4927C84240n2638P3569j43716l157J15072J46365O3601l9586m0773m0147j95515
$$ 384240 331602 405171 261455 258298 373370 519735 583336 543750 502977 462830 267315
4916B67315P7098q660O8121Q1716o5229j4606M3895j40290p6060q1214J53875
$$ 267315 344413 335753 403874 485590 420361 405755 449650 309360 233300 152086 305961
4905C05961K10619o8815r2860O7782r5534J58548k73159j83695J14347Q078J03992
$$ 305961 516580 447765 354905 422687 327153 485701 212542 28847 143194 151272 255264
4894B55264J98579m2552k06773Q7957K07921n6720k98091J06713R4549O857l2613
$$ 255264 453843 411291 204518 292475 500396 443676 145585 252298 346847 353704 321091
4883C21091j97366J06921J10182P248J35263J01289q0975j29764q693n9340R6387
$$ 321091 123725 230646 340828 348076 483339 584628 503653 373889 365196 305856 402243
4872D02243k06858M1348M10969L5003j07707j72369P8245q1692l4270J07954j2181
$$ 402243 195385 236733 647702 682705 574998 402629 480874 399182 364912 472866 460685
4861D60685j15419o5122O8063K26825j3567q832K4875j33267m4976J9971P9133
$$ 460685 345266 280144 348207 575032 561465 552633 577508 444241 399265 419236 498369
4850D98369j33814J3868j60330J33355j81421l5275K25978j41475J35786N0731
$$ 498369 364555 378423 218093 351448 170027 134752 360730 219255 355041 405772
4840D05772k5637j1396J28946K6356j74590K21647j31834k13773J80232K5805
$$ 405772 380135 368739 497685 524041 349451 571098 439264 225491 405723 431528
4830D31528m9187Q2647O3165k44143o4839J65203N4188j68840k97532K06620k8314
$$ 431528 382341 464988 528153 284010 219171 384374 438562 269722 -27810 178810 150496
4819A50496J75601j11293j392Q0509K20246J01161k08630j37772r2635K34280
$$ 150496 326097 214804 213412 293921 514167 615328 406698 268926 176291 410571
4809D10571p6523r3637q6748o3000J83156N6848O0808J88738J01471o5181k90936
$$ 410571 334048 240411 153663 90663 273819 330667 391475 580213 681684 616503 325567
4798C25567n9079J77239K7280P8103j32235o9997P1210O0350P2603m22050M2616
$$ 325567 266488 443727 471007 549110 416875 346878 418088 478438 551041 128991 171607
4787A71607J18135O1602J3816p9539l4415L1752J6126Q497n9208J55130r0710
$$ 171607 289742 351344 365160 285621 251206 282958 299084 307581 248373 403503 312793
4776C12793p9300M6679r2970J02388J5850K160J51804p6292o4747L5471k3669
$$ 312793 233493 280172 187202 289590 305440 307600 459404 383112 318365 353836 330167
4765C30167Q1581P5760j70108n8549J19363j46085j67832q609K03676m5659j15966
$$ 330167 411748 487508 317400 258851 378214 232129 64297 55688 259364 213705 97739
4754I7739J26255K720j08470N8147j09487P5828j3766J3516j0440K08202J30445
$$ 97739 223994 226714 118244 176391 66904 142732 128966 142482 132042 340244 470689
4743D70689k64865K12578j38181q7705O2515K14763l2466k53489L2885Q0607n796
$$ 470689 205824 418402 280221 192516 255031 469794 437328 183839 216724 297331 291535
4732B91535N2199N4129M9314K0703P6923J16271J08265J12543m8811q3508J12879
$$ 291535 343734 397863 447177 467880 544803 661074 769339 881882 833071 749563 862442
4721H62442J27547J29721p0782J25588P2528M2216L822r1159K9048j05975P1974
$$ 862442 989989 1119710 1048928 1174516 1247044 1289260 1293082 1201923 1230971 1124996 1196970
4710A196970J32497k6519j12025J8278K89L6727N5360r7267M0216l6799O0718
$$ 1196970 1329467 1302948 1190923 1209201 1209490 1246217 1301577 1204310 1244526 1207727 1268445
4699A268445m8533M8973j07026o3744j310r975M3534l1829K4709k90636J0877
$$ 1268445 1219912 1268885 1161859 1098115 1096805 1086830 1130364 1098535 1123244 832608 843485
4688H43485J17913J74014j27124l08774j8357L31676R0193O4899J3873N6303L4480
$$ 843485 961398 1135412 1008288 699514 681157 1012833 1103026 1167925 1181798 1238101 1272581
4677A272581J22017K5959N6571L5894J07579j6469J66989J62040Q3105L5471R2360
$$ 1272581 1394598 1420557 1477128 1513022 1620601 1604132 1771121 1933161 2016266 2051737 2144097
4666B144097J16545l9876k7127N3176L2918R5666L9625j32551n347J14193k43578
$$ 2144097 2260642 2220766 2193639 2246815 2279733 2375399 2415024 2282473 2277126 2391319 2147741
4655B147741j1635K42517k20853k2421K40264q7931n5534K70639q3207j86110
$$ 2147741 2136106 2378623 2157770 2135349 2375613 2287682 2232148 2502787 2419580 2233470
4645B233470j09492p2314j24718j84739K6315j21853j05652J8679p5409p5671
$$ 2233470 2123978 2051664 1926946 1742207 1768522 1646669 1541017 1559696 1484287 1408616
4635A408616q8523j1981o5887k7767j33007R9189o4331J42616Q9346l35972l7069
$$ 1408616 1320093 1308112 1242225 1214458 1081451 1180640 1116309 1258925 1348271 1012299 975230
4624I75230o6906r2363k08692n1771K36766P3767O3592j46941j98474J36937N9676
$$ 975230 908324 815961 607269 555498 792264 866031 929623 782682 584208 721145 780821
4613G80821n5420L9387J77437j92933j5563P1931q0809J03486O0226k790j05146
$$ 780821 725401 764788 942225 749292 733729 805660 724851 828337 888563 885773 780627
4602G80627r806R0326J53783R9016j17375k02320J13640P4657N709J26486N9657
$$ 780627 770821 861147 1014930 1113946 996571 794251 907891 982548 988257 1114743 1174400
4591A174400J35680K47894k6998k0898J54569L18635k3884O755q265j6992j44344
$$ 1174400 1310080 1557974 1530976 1510078 1664647 1983282 1959398 1966153 1957888 1940896 1796552
4580A796552l8103j54844q1137p4121J05063o6172p1615N8354j66483k45606k0740
$$ 1796552 1758449 1603605 1522468 1448347 1553410 1487238 1415623 1473977 1307494 1061888 1041148
4569A041148P4732J18348L5682j3068j13330j694K53303k1251j48065O0677L89611
$$ 1041148 1115880 1234228 1269910 1256842 1143512 1141818 1395121 1373870 1225805 1286482 1676093
4558A676093q5565j04470l644O6315o1329J82662K01542J47904l5371O4467r9559
$$ 1676093 1590528 1486058 1482414 1548729 1487400 1670062 1871604 2019508 1984137 2048604 1949045
4547A949045k40870r306p677k00464q7588M8859j13303K5257N1968k6697j03042
$$ 1949045 1708175 1698869 1691192 1490728 1403140 1451999 1338696 1363953 1415921 1389224 1286182
4536A286182m3672J75080J05817j01209J11822K50508p2378j98903J58984r0799
$$ 1286182 1242510 1417590 1523407 1422198 1534020 1784528 1712150 1513247 1672231 1581432
4526A581432j29445j3420j37495J5061L3035j81711Q0230j58275l40186J03856
$$ 1581432 1451987 1438567 1301072 1316133 1349168 1167457 1247687 1089412 749226 853082
4516H53082L21954O6301q939J19631j28339L5888K7566J21039q1219P8630K62108
$$ 853082 1175036 1241337 1232398 1352029 1223690 1259578 1287144 1408183 1326964 1405594 1667702
4505A667702J74114L40871K51319K5637k9838j2483k81687J60534l9677o5430
$$ 1667702 1841816 2182687 2434006 2459643 2429805 2417322 2135635 2296169 2256492 2191062
4495B191062j90276k73574p4101j15195P1349q3712p4472m1523n641j31267j01767
$$ 2191062 2000786 1727212 1653111 1537916 1609265 1525553 1451081 1409558 1403917 1272650 1170883
4484A170883j89624K10445K30413j69178M6618K7296J99048J79780L7703O6802
$$ 1170883 981259 1191704 1422117 1252939 1299557 1326853 1525901 1705681 1743384 1810186
4474A810186M04017L80276M53047N02351N4179J99421m67402k38046l85493j70327
$$ 1810186 2214203 2594479 3047526 3549877 3604056 3803477 3336075 3098029 2712536 2542209
4464B542209p6270k13376m67564j54359m4935o6856j74124k22497N7605m4699
$$ 2542209 2465939 2252563 1784999 1630640 1585705 1518849 1344725 1122228 1179833 1135134
4454A135134k18M3554M8917l516q4225K9409K32387M3345m4287R8908L25499Q3183
$$ 1135134 1134916 1178470 1227387 1223871 1139646 1169055 1401442 1444787 1400500 1499408 1824907 1908090
4442A908090K34540K18731L36732L86795N46689J06990l90881q991l89593l85890
$$ 1908090 2142630 2361361 2698093 3084888 3631577 3738567 3347686 3338695 2949102 2563212
4432B563212k90874k88010k35157j67140j48468o0549l5788o1130j3695k08838
$$ 2563212 2272338 1984328 1749171 1582031 1433563 1373014 1337226 1276096 1262401 1053563
4422A053563j64623j9538J36152o6200j41335k7069K16462j1441J27345k8469
$$ 1053563 888940 869402 1005554 939354 798019 770950 987412 975971 1103316 1074847
4412A074847j50232J79766N1470J1629J61061P9520J48253K68960m4705k58454
$$ 1074847 924615 1104381 1155851 1167480 1328541 1408061 1556314 1825274 1780569 1522115
4402A522115J69605o1080n0114l13262k04333r9952j61409L1004J72714r1321
$$ 1522115 1691720 1630640 1580526 1267264 1062931 962979 801570 832574 1005288 913967
4392I13967J6995m9923p6237j14824k3946J18363j18235o1937J6928M5529p3842
$$ 913967 930962 881039 804802 689978 666032 784395 666160 604223 621151 666680 592838
4381E92838Q9925m6851Q9353K2988k2992j59205J11084P2961j34487J9653n0667
$$ 592838 682763 635912 725265 748253 725261 566056 677140 750101 615614 635267 584600
4370E84600K06193J52808k16170k71567m6604J61237J24240j25891j56717J01178
$$ 584600 790793 943601 727431 455864 409260 570497 694737 568846 412129 513307
4360E13307K03069o1545J32212n9269J09219p5999o4198L6403p6494j77529j96
$$ 513307 716376 654831 787043 727774 836993 760994 696796 733199 656705 479176 478980
4349D78980J13075j04015j01659J17516L6548K9780m8497m9605K15772m81456
$$ 478980 592055 488040 386381 503897 540445 570225 521728 472123 687895 206439
4339B06439M0271l0081o36O5385J8447J41277k99427M1201K29643j16164m8658
$$ 206439 246710 216629 215993 281378 299825 441102 141675 182876 412519 296355 247697
4328B47697K6404o7101L5655q366J14267L5409j3900j69723j21117J79884J15588
$$ 247697 274101 207000 242655 234289 348556 383965 370065 200342 79225 259109 374697
4317C74697Q2820p0367K9138N1866k1843j3607j18400q8782o7405o5066m5373
$$ 374697 457517 387150 416288 468154 446311 432704 314304 225522 158117 93051 47678
4306D7678l9219L45390j13409l1561M3716R6507R1658J7906l2861n8227m46j62952
$$ 47678 8459 353849 240440 208879 252595 349102 440760 458666 425805 367578 367132 204180
4294B04180l1656J47489q1128Q3161N922J8480P3135N086j9828n9077j48389p1724
$$ 204180 172524 320013 238885 322046 327968 346448 419583 424669 404841 345764 197375 125651
4282A25651p101J49109n1074n8607l3830R3138J78315j33050r4908K33653j3350
$$ 125651 118550 267659 216585 157978 124148 217286 395601 262551 167643 401296 387946
4271C87946j88695j02572j0672P6737k2965R2688K1789k7732O7100k3527p7278
$$ 387946 199251 96679 86007 162744 139779 232467 254256 226524 293624 270097 192819
4260A92819J32802j78512k2358P5391J85886m0033r1908j00589q938J72786M0209
$$ 192819 325621 147109 124751 200142 386028 345995 254087 153498 144560 317346 357555
4249C57555n9587n8941J17563m2116m5412L1201q6446J84869p1220j06453r7001
$$ 357555 297968 239027 356590 314474 269062 300263 213817 398686 327466 221013 124012
4238A24012Q3366J36194P0663l1279q802k5788K7985O7402K5229J9695P7097J06307
$$ 124012 207378 343572 414235 382956 374154 348366 376351 443753 468982 488677 565774 672081
4226F72081J01638k40306M6479J26248j48791M6828o3467q6785k5699K12515L4442
$$ 672081 773719 533413 579892 706140 557349 604177 540710 453925 428226 640741 675183
4215F75183q5585k1457k2951q1478J67418O3110j51901R5599R9398J93869N5780
$$ 675183 589598 568141 545190 463712 631130 694240 542339 637938 737336 931205 986985
4204I86985o0514n5708o4922l726j34367j04718J69129K86165R8927j27582j41449
$$ 986985 926471 870763 805841 802115 667748 563030 732159 1018324 1117251 989669 848220
4193H48220J13085j7118P6535J9110o9740P1279j7625j03897j1902J61842J00943
$$ 848220 961305 944187 1020722 1039832 970092 1041371 1023746 919849 907947 1069789 1170732
4182A170732j36242K9347N8080J20161P9598k08069J56781J44278L4422q5809
$$ 1170732 1034490 1063837 1121917 1242078 1321676 1113607 1270388 1414666 1449088 1363279
4172A363279N7562L9300J66384J6503k140j11531K03718N8970J02292j03274L6664
$$ 1363279 1420841 1460141 1626525 1643028 1640888 1529357 1733075 1792045 1894337 1791063 1827727
4161A827727J82552l57217m1015K9543J85820R9515K49438l856M02J22697J54235
$$ 1827727 2010279 1653062 1612047 1641590 1827410 1926925 2176363 2172507 2172909 2295606 2449841
4150B449841L1889J77780K7929J77545J00415j81236l3987M0274J78117J97453
$$ 2449841 2481730 2659510 2687439 2864984 2965399 2784163 2750176 2790450 2968567 3166020
4140C166020K32255J03763n3739j83820Q1469K45594J14220P7182K25207O5683
$$ 3166020 3398275 3502038 3448299 3264479 3345948 3591542 3705762 3782944 4008151 4073834
4130D073834R6463K69133l3847K27620K74198L45893J85366K82882J48813L67637
$$ 4073834 4170297 4439430 4405583 4633203 4907401 5253294 5438660 5721542 5870355 6237992
4120F237992J83738K91408L19723L21187M33777L83052M30143M87915O62402M88983
$$ 6237992 6421730 6713138 7032861 7354048 7787825 8170877 8601020 9088935 9751337 10240320
4110A0240320N78847N23692N29970P79912P69592N85599Q18322Q24945P45993
$$ 10240320 10819167 11342859 11872829 12652741 13422333 14007932 14826254 15651199 16397192
4101A6397192M81974N66962M77776O23749R16766R26753R38523J145180J134920
$$ 16397192 16879166 17446128 17923904 18547653 19464419 20391172 21329695 22474875 23609795
4092B3609795J211832J188918J074859Q00610N03595L31179M24682L93257K39845
$$ 23609795 24821627 26010545 27085404 27886014 28389609 28720788 29145470 29538727 29778572
4083B9778572M56276N38756P68507O35170Q62733Q70221P52814O30450L70949
$$ 29778572 30234848 30773604 31542111 32177281 33040014 33910235 34663049 35293499 35664448
4074C5664448J33425m88057l26468n46799p21046o80103n41987l31101k65750
$$ 35664448 35797873 35309816 34983348 34436549 33715503 33035400 32493413 32162312 31896562
4065C1896562j2680J5413N1762j18828k52101l89282q23504o77381r70230j260415
$$ 31896562 31883882 31899295 31951057 31832229 31580128 31190846 30367342 29689961 28719731 27459316
4055B7459316j202815j112468r51019q23469p02678o34762j72356m79515o07169
$$ 27459316 26256501 25144033 24193014 23369545 22666867 22032105 21859749 21380234 20773065
4046B0773065l83336l41696o11458n64509p90178o19818n41368r46514o69764
$$ 20773065 20389729 20048033 19436575 18872066 18081888 17462070 16920702 15974188 15304424
4037A5304424m14411l11686m13049l39094k21015Q3206p1620J85707o9618m55333
$$ 15304424 14890013 14578327 14165278 13826184 13605169 13688375 13616755 13802462 13732844 13277511
4027A3277511l91803l53019m27348l67207n88097k96027N2050J03024J17253J44611
$$ 13277511 12885708 12532689 12105341 11738134 11150037 10854010 10906060 11009084 11126337 11270948
4017A1270948J34122N1944p7284j51602r2073k69104m69933m29885k97752n68109
$$ 11270948 11405070 11457014 11379730 11228128 11136055 10866951 10397018 9967133 9669381 9101272
4007I101272j29416j03421J6431q6369j4923M3796J94736q7482o93141k80049
$$ 9101272 8971856 8868435 8884866 8798497 8783574 8827370 9022106 8934624 8241483 7961434
3997G961434k92813m63624k57507m77579l13916l36392k72320k706l0745N834
$$ 7961434 7668621 7204997 6947490 6469911 6155995 5819603 5547283 5544577 5513832 5519666
3987E519666r0999k68963j94663j65187m15957k08085k41474j67415j64638j49785
$$ 5519666 5428667 5159704 4965041 4799854 4383897 4175812 3934338 3766923 3602285 3452500
3977C452500J9409l87389j38096J00683j42654m8314R08j05919p5084k31059J317
$$ 3452500 3471909 3084520 2946424 3047107 2904453 2856139 2857047 2751128 2676044 2444985 2446302
3966B446302j61669k40441n6877l2310j19352k16837J9735j6591Q9609n5109p3519
$$ 2446302 2284633 2044192 1987315 1955005 1835653 1618816 1638551 1621960 1711569 1656460 1582941
3955A582941k2900j6303J86599l7181R4456j31673Q5220L8989l47295l5503J20896
$$ 1582941 1560041 1543738 1730337 1693156 1787612 1655939 1741159 1780148 1432853 1397350 1518246
3944A518246J65286J29053j06374j00545K65N6993L808K5825J5493j65816J76377
$$ 1518246 1683532 1812585 1706211 1605666 1605931 1662924 1666732 1692557 1708050 1542234 1718611
3933A718611K29769K44129O4570n5254R0598j0357K2150K31656K77626J62876
$$ 1718611 1948380 2192509 2257079 2201825 2292423 2282066 2304216 2535872 2813498 2976374
3923B976374J08477M06278O18921M54707Q68068R88896J252133J414393Q91492
$$ 2976374 3084851 3491129 4110050 4564757 5432825 6421721 7673854 9088247 9979739
3914I979739k04782j195657j211820j308730j018153q93763o72042o12526k89939
$$ 9979739 9774957 8579300 7367480 6058750 5040597 4146834 3474792 2862266 2572327
3905B572327k42343j21357j48059j54030k31787r129j95797O5103k57048j29413
$$ 2572327 2329984 2208627 2060568 1906538 1674751 1665622 1469825 1534928 1277880 1148467
3895A148467K18827q9200J03919L9844j73918q1163j22351M6269j22858o0585
$$ 1148467 1367294 1278094 1382013 1421857 1247939 1166776 1044425 1090694 967836 907251
3885I07251J54632J2893j18033j36207Q6332q1587K7135q9236l1280J630o5038
$$ 907251 1061883 1074776 956743 820536 906868 825281 852416 763180 731900 733530 668492
3874F68492j02287J05319J78008Q5868P2496j07484o4931j42652m7981K3614J10292
$$ 668492 566205 671524 849532 935400 1007896 900412 835481 692829 644848 668462 778754
3863G78754L7938j46007Q1953j05810J1173m1586J79844o026k00358J60560p9304
$$ 778754 816692 670685 752638 646828 658001 616415 796259 790233 589875 750435 671131
3852F71131j59340P1249L1639M0063l4765j77048J33036k0746P5843J01590k74932
$$ 671131 511791 583040 614679 654742 619977 442929 575965 555219 631062 732652 457720
3841D57720N0863K2068O7895k87942J7192O2005M0955J20455J36593k7770r9620
$$ 457720 508583 530651 598546 310604 327796 389801 430756 551211 687804 660034 560414
3830E60414P7571j53166k6310R930l8828j0934j914m1970j7832j23916j2836O4756
$$ 560414 637985 484819 458509 468439 429611 418677 416763 374793 356961 233045 220209 284965
3818B84965p9490J05185K5872L4100J1546Q8341j00252L1194k1792k508j62078
$$ 284965 205475 310660 336532 370632 382178 470519 370267 401461 379669 377161 215083
3807B15083P0416m2816J35657J52267K4510n789q7031n6265N7021j39026n1992
$$ 215083 285499 242683 378340 530607 555117 549328 462297 406032 463053 324027 272035
3796B72035N6063m8478P9731J49802N8540r7946N0435k92039l9509J39704J09090
$$ 272035 328098 279620 359351 509153 567693 469747 520182 228143 188634 328338 437428
3785D37428J82680J10183j18505j38750Q8368K5775J31984J04319k09384j9579
$$ 437428 620108 730291 611786 473036 561404 587179 719163 823482 614098 594519
3775E94519o6125J48048l2675k6796j60509n9834o6289Q0508P9029K13017j19532
$$ 594519 528394 676442 643767 616971 456462 396628 330339 410847 489876 702893 583361
3764E83361j47611J03615J04569m7746k2777l0569l9350M2312o4098r6710J12645
$$ 583361 435750 539365 643934 596188 573411 542842 503492 545804 481706 384996 497641
3753D97641J29573j39433J57590j1100j52319L5054O1080j01893K35640J19721
$$ 497641 627214 487781 645371 634271 481952 517006 578086 476193 711833 831554
3743H31554l9766j09863j54212K14497q2663q5935J06485n631j8837N3074P6845
$$ 831554 791788 681925 527713 742210 659547 573612 680097 674466 655629 708703 785548
3732G85548J18155j44161M5566R5466J2363M3552J90638p124L6013j5291m0760
$$ 785548 903703 759542 805108 900574 912937 956489 1147127 1140003 1176016 1160725 1119965
3721A119965Q9606j73881j11627K10048M4260j21594K2045J20897J4623P2653
$$ 1119965 1209571 1035690 924063 1134111 1178371 1056777 1078822 1199719 1214342 1286995
3711A286995N088q338K4286K41729n6311O6368K4816j7127m5722j24837j30871
$$ 1286995 1292083 1283745 1308031 1549760 1493449 1559817 1584633 1567506 1521784 1396947 1266076
3700A266076J916K03098m4437L6698j49101l5766m8150K6261n7919j3685p459
$$ 1266076 1267992 1471090 1426653 1463351 1314250 1278484 1230334 1256595 1198676 1184991 1177532
3689A177532O1908k7764K01727j27582J9232m1644j86996j24283Q1027j14406
$$ 1177532 1239440 1211676 1413403 1285821 1305053 1263409 1076413 952130 1033157 918751
3679I18751J05678j28361j40532J83044L3013j88498r0459j6736j89066J41345
$$ 918751 1024429 896068 755536 938580 971593 783095 692636 675900 486834 628179
3669F28179L21393k9373Q6072M2289k28624J35234q7701p297q3184j60535r1004
$$ 628179 949572 920199 1006271 1048560 819936 955170 867469 860172 776988 616453 525449
3658E25449p598O6035N9034O0912k4366O4493K13104M633k02043J20200J39962
$$ 525449 517851 583886 642920 703832 679466 743959 957063 961696 759653 879853 1019815
3647A019815J5873Q5704j67407P2983P9943K8102N1269q3871J94193j63048L4640
$$ 1019815 1035688 1121392 953985 1026968 1106911 1135013 1186282 1102411 1296604 1133556 1168196
3636A168196K10140k19161l1337J18177J29402m6737k04989K19128k1373q5737
$$ 1168196 1378336 1159175 1127838 1246015 1375417 1328680 1123691 1342819 1321446 1235709
3626A235709J35727K71981M2530k26822K30101n8944n8934j9187j21245M9194
$$ 1235709 1371436 1643417 1685947 1459125 1689226 1630282 1571348 1552161 1430916 1480110
3616A480110O3932j8538K2377l678J19083r8807J47725J4218P442L06054J35135
$$ 1480110 1544042 1525504 1547881 1544203 1663286 1564479 1712204 1726422 1733864 2039918 2175053
3605B175053p1005M5291O4344J27607r8578j05310J82509M9780J15352k01114
$$ 2175053 2104048 2149339 2213683 2341290 2242712 2137402 2319911 2369691 2485043 2283929
3595B283929P2692Q1789J93992P0978J32162N1541j32441N1273J49307j5597J79275
$$ 2283929 2356621 2438410 2632402 2703380 2835542 2887083 2754642 2805915 2955222 2939625 3118900
3584C118900R1497q8771n9745J37566j10915J18415K23745J31593L0222j77980
$$ 3118900 3210397 3121626 3061881 3199447 3088532 3206947 3430692 3562285 3592507 3414527
3574C414527j4800K92268J86993K72139M3015m9887O377Q626K15854n1472J32026
$$ 3414527 3399727 3691995 3878988 4151127 4194142 4144255 4150632 4159258 4375112 4323640 4455666
3563D455666J05980K36246K7731R7214J29844K54259N0741J25945n3327K72591
$$ 4455666 4561646 4797892 4825623 4922837 5052681 5306940 5357681 5483626 5430299 5702890
3553E702890L06207L52285J81949O7950J09041L53345J54350J77387L82727M21026
$$ 5702890 6009097 6361382 6543331 6611281 6720322 7073667 7228017 7405404 7788131 8209157
3543H209157P1869Q2805L31404L43622J2888j0054L63964J84045J17772L27263
$$ 8209157 8281026 8363831 8695235 9038857 9051745 9041691 9405655 9589700 9707472 10034735
3533A0034735J72011j27055J99126R6698R0530j14191j13211l0272j69815P3047
$$ 10034735 10206746 10079691 10278817 10375515 10466045 10351854 10238643 10208371 10038556 10111603
3523A0111603L2395k0216J25494j49887k198l5988J08452j07714j16688q7137
$$ 10111603 10143998 10123782 10249276 10099389 10097191 10061203 10169655 10061941 9945253 9858116
3513I858116k17307n4213n7237M3964N5720o4221j19226k25550J97622J98219
$$ 9858116 9640809 9586596 9529359 9573323 9629043 9564822 9445596 9220046 9417668 9615887
3503I615887k08985J33856K03797p1040J30368p3378J25739L0479J15947J40195
$$ 9615887 9406902 9540758 9744555 9673515 9803883 9730505 9856244 9886723 10002670 10142865
3493A0142865L8825P683o890J29776M5326J36186J12589K46573j1537Q6235K36404
$$ 10142865 10181690 10189373 10182483 10312259 10357585 10493771 10606360 10852933 10841396 10927631 11164035
3482A1164035L40153Q4430J21244M6439K5443L57949M06141K00K49262J81105
$$ 11164035 11504188 11588618 11709862 11756301 11781744 12139693 12545834 12546034 12795296 12976401
3472A2976401J74293L41251K29803K36417J97477N32895M33586J52757K12543
$$ 12976401 13150694 13491945 13721748 13958165 14155642 14688537 15122123 15274880 15487423
3463A5487423L78337M28758M93897M88551M33810L84105N06480O85594O20719
$$ 15487423 15865760 16294518 16788415 17276966 17710776 18094881 18601361 19286955 19907674
3454A9907674Q97909J061603N45892P75154R54130Q57829J170215J271338J308170
$$ 19907674 20805583 21867186 22413078 23188232 24142362 25000191 26170406 27441744 28749914
3445B8749914J384311J422962J786686J894197K305703K419358K777986L196053
$$ 28749914 30134225 31557187 33343873 35238070 37543773 39963131 42741117 45937170
3437D5937170L319736M002355M416176M810699N507864N688526O044623O204609
$$ 45937170 49256906 53259261 57675437 62486136 67994000 73682526 79727149 85931758
3429H5931758O232991N538208M616816L825193K969163J738760O89857k49981
$$ 85931758 92164749 97702957 102319773 106144966 109114129 110852889 111542746 111292765
3421A11292765q85560q16081r13381o00915o3873K39590O20921O80464N1016o03550
$$ 111292765 110407205 109591124 108677743 108076828 108012955 108252545 108873466 109553930 109604946 109001396
3411A09001396j183660k207444l291752m050828n046094n366833n694877o192180
$$ 109001396 107817736 105610292 102318540 98267712 93221618 87854785 82159908 75967728
3403G5967728n878940n406333n030611m489324l886555l670555l323231k662791
$$ 75967728 70088788 64682455 59651844 55162520 51275965 47605410 44282179 41619388
3395D1619388k288255k042681j905255j937684j309120j190295j217318j133905
$$ 41619388 39331133 37288452 35383197 33445513 32136393 30946098 29728780 28594875
3387B8594875r64653o78130m75899p27597m87497n03406n30867j67623l07939
$$ 28594875 27630222 26952092 26476193 25748596 25261099 24757693 24226826 24059203 23751264
3378B3751264l65175k71380l08711K1258o3704j47587Q0556j26000p4536K5638
$$ 23751264 23386089 23114709 22805998 22827256 22763552 22615965 22696521 22570521 22495985 22521623
3368B2521623L6220l6720K89094R5221J84547M2324K19059L48326K93552L5219
$$ 22521623 22557843 22521123 22810217 22905438 23089985 23132309 23351368 23699694 23993246 24028465
3358B4028465K23065O3314L33234Q9202L41830J25830K35275M90721J25743K25847
$$ 24028465 24251530 24314844 24648078 24737280 25079110 25204940 25440215 25930936 26056679 26282526
3348B6282526N64122M01497N66361M74279M65581L77220M76015M78034O31743
$$ 26282526 26846648 27248145 27814506 28288785 28754366 29131586 29607601 30085635 30717378
3339C0717378M49354L94701J07145N0661J77174k2853N7492J39476J17267j49948
$$ 30717378 31166732 31561433 31668578 31719239 31896413 31873560 31931052 32070528 32187795 32037847
3329C2037847O9086K45516K27105Q132N18237M23749M21990M74758L51738M67752
$$ 32037847 32106933 32352449 32579554 32587686 33105923 33529672 33951662 34426420 34778158 35245910
3319C5245910P60796O29199P33951N50293P24446P05107R01286P37259Q31683
$$ 35245910 36006706 36635905 37369856 37920149 38644595 39349702 40250988 40988247 41819930
3310D1819930R75930Q90868J175197J164233J202574J393256J069518J470859
$$ 41819930 42795860 43686728 44861925 46026158 47228732 48621988 49691506 51162365
3302E1162365J824200J782250J854279K215770K155530K206560K207911K592247
$$ 51162365 52986565 54768815 56623094 58838864 60994394 63200954 65408865 68001112
3294F8001112K989583L032244K992850L475660L720598M148170M536416M956391
$$ 68001112 70990695 74022939 77015789 80491449 84212047 88360217 92896633 97853024
3286I7853024N525808O167368O490206O999575P399174Q240345R183998R483950
$$ 97853024 103378832 109546200 116036406 123035981 130435155 138675500 147859498 157343448
3278A57343448R992679R923457J0183105R736665Q989197P671424N991669M483850
$$ 157343448 167336127 177259584 187442689 197179354 206168551 213839975 219831644 224315494
3270B24315494K803993J328355K16799k90280k34893J03153J113191K067641K598732
$$ 224315494 227119487 228447842 228664641 228374361 228139468 228242621 229355812 231423453 234022185
3261B34022185L070364L097075K528674P67789q63181k367242m471033n980835
$$ 234022185 237092549 240189624 242718298 243486087 242622906 240255664 235784631 229803796
3253B29803796p188722p568911p609673p102381o215291n267218l918204k738849
$$ 229803796 222615074 215046163 207436490 200334109 194118818 188851600 184933396 182194547
3245A82194547j835580j190627m70509J90693M67973Q60702J119648J360454J546419
$$ 182194547 180358967 179168340 178697831 178888524 179356497 180217199 181336847 182697301 184243720
3236A84243720J998378K489030L139710L695096M612699M863692M755501M908318
$$ 184243720 186242098 188731128 191870838 195565934 200178633 205042325 209797826 214706144
3228B14706144M596746M360105L859516K904086J959852P55455m30584j877740
$$ 214706144 219302890 223662995 227522511 230426597 232386449 233141904 232711320 230833580
3220B30833580l105602l826007m984498n574133o283852o555338o942844p475183
$$ 230833580 227727978 223901971 218917473 213343340 207059488 200504150 193561306 186086123
3212A86086123p446871p631318p827695q337655q255368q101528q141873p865663
$$ 186086123 178639252 171007934 163180239 154842584 146587216 138485688 130343815 122478152
3204A22478152p477206p352814p056022o194944n719205n138969m576116m275916
$$ 122478152 115000946 107648132 100592110 94397166 88677961 83538992 78962876 74686960
3196G4686960l868118l405903k924186k990772k833637k333046k050949j904499
$$ 74686960 70818842 67412939 64488753 61497981 58664344 56331298 54280349 52375850
3188E2375850j689169j254054j290493q04584m58212q59998p41283l80296L823
$$ 52375850 50686681 49432627 48142134 47337550 46879338 46019340 45278057 44897761 44901584
3179D4901584L7531L06519J12580K49495N1974J34565k76472J25830K36723J27140
$$ 44901584 44939115 45245634 45358214 45607709 45659683 45794248 45517776 45643606 45880329 46007469
3169D6007469J8209j90709p499j32977p3681k68303k78142l89724l33803m85152
$$ 46007469 46025678 45834969 45827470 45694493 45620812 45352509 45074367 44684643 44350840 43865688
3159D3865688j98965m07374m86598q15068p27936q66457q51667r96933r12087
$$ 43865688 43666723 43259349 42772751 41957683 41229747 40363290 39511623 38514690 37602603
3150C7602603j051963r23391r13503o78602m62225k38393l09702m06041r7758
$$ 37602603 36550640 35627249 34713746 34035144 33572919 33334526 33024824 32618783 32521025
3141C2521025K2868K28393P9539K42013L21836L41008N16325O52671Q93458J064431
$$ 32521025 32543893 32772286 32851825 33093838 33415674 33756682 34273007 34925678 35819136 36883567
3131C6883567J084269J170000J328411J858299J962029K309461K484913K710494
$$ 36883567 37967836 39137836 40466247 42324546 44286575 46596036 49080949 51791443
3123E1791443L018092L451406L687886L849562L754901L929751L575464L396756
$$ 51791443 54809535 58260941 61948827 65798389 69553290 73483041 77058505 80455261
3115H0455261L027225K566172K396869J730467J040320O98516Q3234m57098n85156
$$ 80455261 83482486 86048658 88445527 90175994 91216314 91914830 91998064 91540966 90955810
3106I0955810r17891p42621m62814j58230L61221O71571O70435O04185R77525
$$ 90955810 90037919 89295298 88832484 88674254 89035475 89707046 90377481 90981666 91959191
3097I1959191O52227R5190m51580j139507j932116k450146k461666k684764k896020
$$ 91959191 92611418 92706608 92255028 91115521 89183405 86733259 84271593 81586829 78690809
3088G8690809k892381k511866k340483k429958k376572k614955k600224k415250
$$ 78690809 75798428 73286562 70946079 68516121 66139549 63524594 60924370 58509120
3080E8509120k823865k870046l107870k979931k892673k724533k570963k315739
$$ 58509120 55685255 52815209 49707339 46727408 43834735 41110202 38539239 36223500
3072C6223500k110176j593014j477720j347813r81127q77107n41223k10803o1730
$$ 36223500 34113324 32520310 31042590 29694777 28713650 27836543 27295320 27084517 27022787
3063B7022787k0207l52497o78898j223008j241116j191042j078526j001108o32884
$$ 27022787 27002580 26650083 25971185 24748177 23507061 22316019 21237493 20236385 19603501
3054A9603501n24656m03544j29098j64865n5708p121k12379K49706K21108J02840
$$ 19603501 19078845 18675301 18546203 18381338 18325630 18318509 18106130 18355836 18576944 18679784
3044A8679784J66706L48209L41289K9551k2487j27081l1207j16992r7858l82773
$$ 18679784 18846490 19194699 19535988 19565539 19543052 19415971 19384764 19267772 19169914 18787141
3034A8787141j16552j36425m05883l06800l95985m80212o54506p44247p58660
$$ 18787141 18670589 18534164 18128281 17821481 17425496 16945284 16290778 15546531 14787871
3025A4787871p02990l47392k51875o13972n02802j62914l71570r4333j65480k07211
$$ 14787871 14084881 13737489 13485614 12871642 12368840 12205926 11834356 11740023 11574543 11367332
3015A1367332k90995N0119j16495j85759L0379q7026J23895j9600k02374M3064
$$ 11367332 11076337 11126456 11009961 10824202 10854581 10767555 10891450 10871850 10669476 10712540
3005A0712540N2589k34937K3463k9580j08104J10897j26637R7528k1234Q8123
$$ 10712540 10765129 10530192 10553655 10524075 10415971 10526868 10400231 10497759 10476525 10564648
2995A0564648J28699L0937j20810l6069K01319l8291K28520Q6378J28297J28896
$$ 10564648 10693347 10724284 10603474 10567405 10768724 10730433 10958953 11045331 11173628 11302524
2985A1302524k7501Q3629J16498J04048K23909J44618J53238J23514M2824K18059
$$ 11302524 11275023 11358652 11475150 11579198 11803107 11947725 12100963 12224477 12267301 12485360
2975A2485360P8067N0897O4455L13245J67355M66229Q7239Q2479K82323J90007
$$ 12485360 12563427 12614324 12678779 12992024 13159379 13625608 13712847 13795326 14077649 14267656
2965A4267656J64343K57814J67790L26376K95802K92281N2609L86749M29700K15730
$$ 14267656 14431999 14689813 14857603 15183979 15479781 15772062 15824671 16211420 16641120 16856850
2955A6856850J84610K07905L04111M19250L50367K62872L44841N57011N84705
$$ 16856850 17041460 17249365 17553476 17972726 18323093 18585965 18930806 19487817 20072522
2946B0072522K45261N16884L78391N18859O60657L73263M84767L83599K69956
$$ 20072522 20317783 20834667 21213058 21731917 22392574 22765837 23250604 23634203 23904159
2937B3904159L36986K31818L75005L31455N92600M8853K11032K49684M01880M37543
$$ 23904159 24241145 24472963 24847968 25179423 25772023 25820876 26031908 26281592 26683472 27121015
2927B7121015M65578N22784N68286O30890P62577N26423O96262O87581R20451
$$ 27121015 27586593 28109377 28677663 29308553 30071130 30597553 31293815 31981396 32901847
2918C2901847J004844J269264J006234J094190J273908J425257J314088J385272
$$ 32901847 33906691 35175955 36182189 37276379 38550287 39975544 41289632 42674904
2910D2674904J544574J521072J888086J944771K111934K082702K229057K407043
$$ 42674904 44219478 45740550 47628636 49573407 51685341 53768043 55997100 58404143
2902E8404143K515048K242311K797999L034563L190207L289634L735619L972808
$$ 58404143 60919191 63161502 65959501 68994064 72184271 75473905 79209524 83182332
2894H3182332M402133N288660N412814O154892P203354Q375108R499402J0950705
$$ 83182332 87584465 92873125 98285939 104440831 111644185 120019293 129518695 140469400
2886A40469400J2746223J4772080J6448686J8806385K1826244K5701586L0325025
$$ 140469400 153215623 167987703 184436389 203242774 225069018 250770604 281095629
2879B81095629L5223211M0476943M4615173M4453298L7269647K2020873J54947
$$ 281095629 316318840 356795783 401410956 445864254 483133901 505154774 505309721
2872E05309721k1859940l7031413m4110955m4129502l9596925l3517381k6971807
$$ 505309721 483449781 446418368 402307413 358177911 318580986 285063605 258091798
2865B58091798k1266320j6887428j4253046j1784063j1294708j0367336r141194
$$ 258091798 236825478 219938050 205685004 193900941 182606233 172238897 163097703
2858A63097703p933076o408891n028000l700214k185084m67960J466761L720894
$$ 163097703 155164627 148755736 143727736 140027522 137842438 137374478 138841239 142562133
2850A42562133O297960Q633904J0442501R518324N152779k719713j1184684j6103950
$$ 142562133 148860093 157493997 167936498 177454822 182607601 179887888 168703204 152599254
2842A52599254j7746494j6364189j3988067j1579515r140006p543330o061583
$$ 152599254 134852760 118488571 104500504 92920989 83780983 76237653 70176070
2835G0176070n076742m759345l898051l237488l231925k855156k479853k175330
$$ 70176070 65099328 60339983 56441932 53204444 49972519 47117363 44637510 42462180
2827D2462180k120502k032399j684009j588923j249938j347698j216791j082491
$$ 42462180 40341678 38309279 36625270 35036347 33786409 32438711 31221920 30139429
2819C0139429r25343j163026r66355j217462j110439o92627q03147q58237o98750
$$ 30139429 29214086 28051060 27084705 25867243 24756804 24064177 23261030 22402793 21704043
2810B1704043o65377p67486m38142m96229n67027n05890n46277o51260n67483
$$ 21704043 21038666 20271180 19833038 19336809 18769782 18263892 17717615 17066355 16498872
2801A6498872m31980l80970l41898l89136n30813m79410j62007m49517l63680
$$ 16498872 16066892 15685922 15344024 14954888 14424075 13944665 13782658 13333141 12969461
2792A2969461l22402n38171m48387m97509j72296k21532k28384n4452n7231k48306
$$ 12969461 12647059 12108888 11660501 11162992 10990696 10769164 10540780 10486328 10429097 10180791
2782A0180791n15959k69129k29974J65540k64407l26377k19195k57258J3302k45929
$$ 10180791 9664832 9395703 9165729 9331269 9066862 8740485 8521290 8264032 8277334 8031405
2772H031405k19751n9489k01550j93667P6519j22286j99182k71480j23408l7824
$$ 8031405 7811654 7752165 7550615 7356948 7433467 7311181 7111999 6840519 6717111 6679287
2762F679287k30979l09488l99356J1288j56730j48355j4470o7890l0512j09793
$$ 6679287 6448308 6138820 5739464 5750752 5594022 5445667 5431197 5363307 5332795 5223002
2752E223002l06425O8217R357j72365j23712k30434j21758m7909Q4068k1105k21109
$$ 5223002 4916577 4984794 4994151 4821786 4698074 4467640 4345882 4297973 4382041 4360936 4139827
2741D139827k4671k860n5603j8248j02054j17258j76617o3526j42048j2372k47110
$$ 4139827 4115156 4112296 4056693 4038445 3936391 3819133 3642516 3578990 3436942 3424570 3177460
2730C177460Q7315J16449k1471k75434o4703m1598m2295j41064o5194K7979r2150
$$ 3177460 3264775 3381224 3359753 3084319 3019616 2978018 2935723 2794659 2729465 2757444 2665294
2719B665294m8465j8939o5247Q796m8272p3434Q8246k20434j31667n0166q4306
$$ 2665294 2616829 2597890 2532643 2541439 2493167 2419733 2507979 2287545 2155878 2105712 2021406
2708B021406J61987R5983k4011j87115R8713K9736r41J32048m2327M8764J29961
$$ 2021406 2183393 2279376 2255365 2068250 2166963 2196699 2195758 2327806 2285479 2334243 2464204
2697B464204k77569o2855N3847J59477j12172k39936Q2244J30612j87503j31498
$$ 2464204 2186635 2123780 2177627 2337104 2224932 1984996 2067240 2197852 2010349 1878851
2687A878851J89325j29303j09916J44716k26228J61917R3830k81731K3519O6924
$$ 1878851 2068176 1938873 1828957 1973673 1747445 1909362 2003192 1721461 1744980 1811904
2677A811904K11756j10112J5402J93276j74935k1680O4817j65633J70912j3418
$$ 1811904 2023660 1913548 1928950 2122226 1947291 1925611 1990428 1824795 1995707 1982289
2667A982289l1016o8765j40691j62305N8613J63786k2400q6968Q7292l5990P3039
$$ 1982289 1951273 1882508 1741817 1579512 1638125 1801911 1779511 1692543 1779835 1743845 1816884
2656A816884k44103j44933k5037J59865k5467R4661J55827m2469j61992l85j09202
$$ 1816884 1572781 1427848 1402811 1562676 1537209 1631870 1787697 1745228 1583236 1582851 1473649
2645A473649L07044l8015l07258M1362n9240j7007M8556M6842j47443P6075l559
$$ 1473649 1780693 1742678 1435420 1476782 1417542 1400535 1449091 1495933 1348490 1424565 1421006
2634A421006R5242O0008q7670r7513Q209n2057m6446K34517k5548R118M0613R6556
$$ 1421006 1516248 1576256 1488586 1391073 1399282 1347225 1300779 1535296 1509748 1518866 1559479 1656035
2622A656035P8001p7452M5175k33631l5023J30093J6702k19177J15717K68195
$$ 1656035 1734036 1656584 1701759 1468128 1433105 1563198 1579900 1360723 1476440 1744635
2612A744635R3321j44551j42849j69455K35438J59556J19273L3276j18498l2372
$$ 1744635 1837956 1693405 1550556 1381101 1616539 1776095 1895368 1928644 1810146 1777774
2602A777774K51162L12605q1684J81084j221j31051L1945K30446p404K53313M87556
$$ 1777774 2028936 2341541 2259857 2440941 2439720 2308669 2340614 2571060 2563656 2816969 3304525
2591C304525K94405J05794P867l7391j96693m47267j59882k6374j00534k40330
$$ 3304525 3598930 3704724 3712591 3675200 3478507 3031240 2871358 2844984 2744450 2504120
2581B504120j62391j33425k08982r4552o8267K8787O0370j36556J29719M0960
$$ 2504120 2341729 2208304 1999322 1904770 1836503 1865290 1925660 1789104 1918823 1959783
2571A959783j25167j0119j46692p1794J9570P0071K30564L1194p6531J07728O5489
$$ 1959783 1834616 1824497 1677805 1606011 1625581 1695652 1926216 1957410 1880879 1988607 2054096
2560B054096k98486Q3700J38222k64718j45667r2763j40408j99844m8172J75139
$$ 2054096 1755610 1839310 1977532 1712814 1567147 1474384 1333976 1134132 1085960 1261099
2550A261099l0130j65639J08266k1031J59220j25959m0183O3613l16500j54011
$$ 1261099 1230969 1065330 1173596 1152565 1311785 1185826 1145643 1209256 892756 738745
2540G38745L21565J0319J5223j97340j94334m5953J8169k6469m6489r4997M7534
$$ 738745 1060310 1070629 1085852 888512 694178 648225 666394 639925 593436 498439 545973
2529E45973O4041K5890o7616R7176P4202j27905j90461N7694m9321J72714n2741
$$ 545973 610014 635904 568288 665464 739666 611761 421300 478994 429673 602387 549646
2518E49646j42436k1955j29504j3009J53237P6701j46850J0323L0308K9040n8973
$$ 549646 407210 385255 255751 242742 395979 472680 325830 336153 366461 395501 336528
2507C36528k4926J920j6089K1055r6110j1500J5327n5105j43401j60927R4688
$$ 336528 311602 313522 297433 318488 222378 210878 226205 171100 27699 -133228 -38540
2496c8540l3726K9771J41229k29356M1120Q1514O2229K8485j30974j60730j85496
$$ -38540 -72266 -42495 98734 -130622 -89502 -7988 54241 82726 -48248 -208978 -394474
2485c94474J06656J88277L6104Q6037j82485k18052m1394O7255J45708l6398O8726
$$ -394474 -287818 -99541 -63437 22600 -159885 -377937 -419331 -352076 -206368 -242766 -174040
2474a74040m3441N2460J80390j18769r4106o2581q5875O3945p6087K34610K20895
$$ -174040 -217481 -165021 15369 -103400 -197506 -260087 -345962 -282017 -358104 -123494 97401
2463I7401J2780j95290J84279J5029j00566j73011k1533J02344J46786M769J6019
$$ 97401 110181 -85109 99170 114199 13633 -159378 -180911 -78567 68219 72988 89007
2452H9007J32464M8696j2629l4019k9254R555j18106k3770R1661k25863j23048
$$ 89007 221471 270167 257538 223519 194265 203820 85714 61944 153605 -72258 -195306
2441a95306L11260l0222N1043J4286L6883j77591M7521j50462o5886j5878j7816
$$ -195306 115954 85732 136775 151061 187944 10353 57874 -92588 -158474 -174352 -192168
2430a92168J17250N84J36644J1487n5928m492M2077Q7226m1309j87834N2966J46091
$$ -192168 -74918 -74334 62310 73797 17869 13377 55454 142680 101371 -86463 -33497 112594
2418A12594L5452K08886m6217j80496J38325q7000q9143O386q0251J56803P6989
$$ 112594 148046 356932 310715 130219 268544 181544 92401 98787 18536 175339 252328
2407B52328j51754O4119j5523j00471j18002R7416J18746q7716m0448j17707N9689
$$ 252328 100574 164693 149170 48699 -69303 28113 146859 59143 18695 -99012 -39323
2396c9323J94538j02424m5867j16430J06219J0797L2793K41585P8129j24755N357
$$ -39323 155215 52791 6924 -109506 -3287 7510 40303 281888 360017 235262 240619
2385B40619j18497j68638j25058L6338J770K17379J42053P0739R8178j34359n5981
$$ 240619 122122 -46516 -171574 -135236 -133466 83913 225966 296705 394883 260524 204543
2374B04543l26l854q0906J26759J8522o170j18820N0924J48755o3947P919l1778
$$ 204543 204217 200363 119457 246216 264738 258568 139748 190672 339427 275480 283399 251621
2362B51621l645j15071J32277L1086N5534m5870J38558Q5340j02455K18207Q2138
$$ 251621 247976 132905 265182 296268 351802 305932 444490 529830 427375 645582 727720
2351G27720l5704j70183j5397J18018j36926j56621r9555r6374K4447J7587j0014
$$ 727720 692016 521833 506436 624454 487528 330907 231352 134978 159425 177012 166998
2340A66998J33461j01622K1425m0832k14486N954Q8158j20780q8864K10678n873
$$ 166998 300459 198837 220262 179430 -35056 -29102 59056 -61724 -150588 60090 54217
2329E4217k47893q4164q5182K57617l1372J29295J46924M64J19890l5192j68329
$$ 54217 -193676 -277840 -363022 -105405 -136777 -7482 139442 139906 259796 224604 56275
2318E6275k03449J18224J80802k58119k20680M4654K39091J72738r9680R21Q3749
$$ 56275 -147174 -28950 151852 -106267 -326947 -282293 -43202 129536 29856 30777 114526
2307A14526K6724j65549P5488N6065k43390l7784K32916Q6330K8064R8083j31940
$$ 114526 141250 -24299 51189 107254 -136136 -173920 58996 145326 173390 271473 139533
2296A39533m1396j926M4882n0417P926j90781k750J13725J90139K3191j42480
$$ 139533 98137 96211 141093 90676 98602 -92179 -94929 18796 208935 232126 89646
2285H9646Q355j14143J87184k8718K9877J68157r0546k63638J65713P1431m9107
$$ 89646 98001 -16142 171042 142324 172201 340358 249812 -13826 151887 223318 174211
2274A74211l2211J22560J3709p3958m0183K16761k4240L2299r0179j37922K4978
$$ 174211 142000 264560 278269 204311 164128 380889 356649 388948 298769 160847 185825
2263A85825M3544L771m8118r2975J25777Q1598l7449L0371m8255K5105R1813j08442
$$ 185825 229369 233140 185022 92047 217824 299422 261973 292344 244089 269194 361007 252565
2251B52565n1091j67101J10361J10127N5613J81271o0979k58646p4866K1755J78676
$$ 252565 201474 34373 144734 254861 310474 491745 430766 172120 97254 119009 297685
2240B97685m2656r9252N8328K47231k1763k41783k28829q6775K19309j13181n7609
$$ 297685 255029 155777 214105 461336 439573 197790 -31039 -117814 101495 -11686 -69295
2229f9295K77510L9741L3122n6655j73819K12976J7594J61483m5391p4117K5704
$$ -69295 208215 247956 281078 224423 50604 263580 281174 442657 397266 323149 348853
2218C48853K27854m7184j51615j43894P0269J16988k45381J39531J09637n4670
$$ 348853 576707 529523 377908 234014 304283 421271 175890 315421 425058 370388
2208C70388P4809r2146p6756P0293J02436O5857M4194k14118J8753k5874R2017
$$ 370388 445197 353051 276295 346588 449024 514881 559075 344957 363710 337836 429853
2197D29853L4540k94616j12336K81758M8934j97966K6839K91987L60945j5110
$$ 429853 464393 169777 57441 339199 388133 190167 217006 508993 869938 854828
2187H54828l9084n0914r4835J1808j56921p863J9394n8711J25733P4621j605M6800
$$ 854828 815744 764830 669995 681803 524882 517019 536413 477702 603435 678056 676451 723251
2175G23251J9318m6641J4687J89288J4090L6949Q2502j4101Q4440J6515J16894
$$ 723251 742569 695928 710615 899903 913993 950942 1033444 1019343 1103783 1120298 1237192
2164A237192j05915o3562J45197j19119M5284Q7206o8983k9909K10404L1328j03077
$$ 1237192 1131277 1067715 1212912 1093793 1139077 1226283 1157300 1127391 1337795 1369123 1266046
2153A266046k9094r180J09610L1190M393N8828m0873O6770K35014J78385N7211
$$ 1266046 1236952 1227772 1337382 1368572 1372965 1431793 1390920 1457690 1692704 1871089 1928300
2142A928300j46246r6197j22796J11566J48868m2451m0264Q6302J66716j5789
$$ 1928300 1782054 1685857 1563061 1674627 1823495 1781044 1740780 1827082 1993798 1978009
2132A978009J60842J15455j17721L3082K15267J73948L3222N3086K28137J27296
$$ 1978009 2138851 2254306 2136585 2169667 2384934 2558882 2592104 2645190 2873327 3000623
2122C000623k2419J84724J0530M2059K30158k1232l0792L44437K53939K08541
$$ 3000623 2978204 3162928 3173458 3215517 3445675 3424443 3393651 3738088 3992027 4200568
2112D200568K11920K02927J56164L97309J42085M02168N33981L53125J94930M12873
$$ 4200568 4412488 4615415 4771579 5168888 5310973 5713141 6247122 6600247 6795177 7208050
2102G208050M69276M81885P28369O15589R42153P17523Q06526R66462Q06874J316043
$$ 7208050 7677326 8159211 8887580 9503169 10445322 11162845 11969371 12935833 13742707 15058750
2092A5058750J597259J851945K587370L236441M007382N595009O754404Q630232
$$ 15058750 16656009 18507954 21095324 24331765 28339147 33934156 40688560 49318792
2084D9318792R837208P834075J595233p074640r829173r269918q523862o315816
$$ 49318792 59156000 66990075 68585308 61510668 51681495 42411577 33887715 27571899
2076B7571899m793277l458193k495682k004613j522252j260215q55681p17459
$$ 27571899 22778622 19320429 16824747 14820134 13297882 12037667 11181986 10464527
2068A0464527m46388o17434q32990q25036p40621m91570o30940m98783k83394
$$ 10464527 10018139 9400705 8567715 7742679 7002058 6510488 5879548 5380765 5097371
2059E097371l70628j18745l29804j88803k52753k51125l76075j43052O1764k98586
$$ 5097371 4726743 4607998 4278194 4089391 3836638 3585513 3209438 3066386 3128150 2829564
2049B829564k78021j62458M9770o6281l4861j56021j61500k08716j91278R0758
$$ 2829564 2551543 2389085 2438855 2372574 2337713 2181692 2020192 1811476 1620198 1710956
2039A710956j66423J89073m6966K2233J37495k32873k60666o9462p8291J14082
$$ 1710956 1544533 1733606 1686640 1708873 1846368 1613495 1352829 1283367 1205076 1319158
2029A319158N8726l40542o0550J51770q9841J63169J2614k38209l566j21133j25161
$$ 1319158 1377884 1037342 976792 1128562 1038721 1201890 1214504 976295 972729 851596 726435
2018G26435l5835J17426J21169k43744l8481J70703j11163O4081q4035j42850
$$ 726435 690600 808026 929195 685451 646970 817673 706510 770591 686556 543706
2008E43706k36755K643K05946O2410n4549M5360j04027M3498k94145Q3307J30786
$$ 543706 306951 309594 515540 577950 523401 568761 464734 508232 214087 297394 428180
1997D28180K0990j70476P9713N4645j08879J6637R7105q3374p1167J13215n9472
$$ 428180 449170 278694 358407 413052 304173 320810 417915 334541 263374 376589 317117
1986C17117L8532j3142n4040J5922Q5222L8986J1698j89835n9525j77700R5003
$$ 317117 355649 342507 288467 304389 389611 428597 440295 250460 190935 13235 108238
1975A08238P9176j25233L3178R5984J13818j39744j03489K02878M6273k07751
$$ 108238 187414 62181 95359 191343 305161 165417 61928 264806 311079 103328
1965A03328N4551J55497M2982j69653k3021L3289r2641J8638K7160o0264K8378
$$ 103328 157879 313376 356358 186705 163684 196973 104332 122970 150130 89866 118244
1954A18244j6979K0211l2366n4692J48758L1796Q8877j23545L7929m9022j41281
$$ 118244 101265 121476 89110 34418 183176 214972 303849 180304 218233 169211 27930
1943B7930j8549L4524J07879l5673K1514q0168j39166Q8663J56273q3391j78483
$$ 27930 9381 43905 151784 116111 137625 57457 -81709 6954 163227 79836 -98647
1932i8647K16839K3666K1939n3185j6762N5209L8034q8665k41384J12622P298
$$ -98647 118192 141858 163797 110612 93850 149059 187093 98428 -142956 -30334 -23036
1921b3036K5147J44405N7274p7441j29863l7668K16543j80262k1279N5401n410
$$ -23036 2111 146516 203790 126349 -3514 -41182 175361 -4901 -26180 29221 23811
1910B3811m2126Q1508K81579j15724o5864j60450J11778P4587l20020J85401j5082
$$ 23811 -18315 63193 344772 229048 163184 2734 114512 189099 -130921 54480 39398
1899C9398q105q9577k36083J71288p6329J15361Q3739j2391R7677j15686j63550
$$ 39398 31293 -58284 -294367 -123079 -199408 -84047 -308 -12699 84978 -30708 -194258
1888a94258J07394J01120J8327O337R6179p7302p5923n745o7937n8257J20142
$$ -194258 -86864 14256 32583 38920 135099 57797 -18126 -23871 -91808 -150065 -29923
1877b9923N2325j75401J6762K4256k20623K93394j4612j2344o091k17660J01937
$$ -29923 22402 -152999 -136237 -111981 -332604 -39210 -53822 -66166 -72257 -289917 -187980
1866a87980q2128l6115O751N2626J19936J45433j30823k22257K50528R1665L174
$$ -187980 -270108 -306223 -299472 -246846 -126910 18523 -112300 -334557 -84029 7636 10810
1855A0810j15603Q3782Q0353o2655R8753j15330j13276r7622J09446L0726N9200
$$ 10810 -104793 -21011 59342 -3313 95440 -19890 -133166 -230788 -121342 -90616 -31416
1844c1416j3482q1314J03651J5263M3831m9886Q0948k9078Q9515M693k10938J70181
$$ -31416 -44898 -126212 -22561 -7298 36533 -13353 67595 38517 128032 132725 -78213 91968
1832I1968p9968k2618j21152j44204p7786N3137J38661J20714J30951j21550M0777
$$ 91968 12000 -10618 -131770 -275974 -353760 -300623 -161962 -41248 89703 -31847 8930
1821H930M8817l9052J70028k19016P7274J02132K31592K7947k78114n4036J79264
$$ 8930 57747 18695 188723 -30293 46981 149113 380705 408652 130538 76502 255766
1810B55766N4468j57444j17475p0966R1606j82892k0256J27594K9988j64725n7103
$$ 255766 310234 152790 35315 -35651 55955 -126937 -147193 -19599 10389 -154336 -211439
1799b11439K6533K61505k02110j08902M3601J30712N3806J1059J61082k16168
$$ -211439 -184906 76599 -125511 -234413 -190812 -60100 -6294 4765 165847 -50321
1789e0321O1868K27135j49879o2741K69983l39530j30772r7442P9678L0508K9815
$$ -50321 11547 238682 88803 26062 296045 -43485 -174257 -271699 -192021 -161513 -131698
1778a31698Q9313n7601N8388J20611m3381r6597J58214M1165J9119J44791J9834
$$ -131698 -42385 -99986 -41598 79013 35632 -60965 97249 138414 157533 302324 322158
1767C22158k33461p5610m9234Q3765J65283j67110m8002k08255J20753M0662J56309
$$ 322158 88697 13087 -36147 47618 212901 45791 -2211 -210466 -89713 -49051 107258
1756A07258N3873j15349J33860j58233n7807M0325L5814p3637j08157j66127j2384
$$ 107258 161131 45782 179642 21409 -36398 3927 39741 -33896 -142053 -308180 -320564
1745c20564Q1088J40033j51937K5347P7232m6947n8015J37641J73998o1534j25061
$$ -320564 -239476 -99443 -251380 -226033 -148801 -195748 -253763 -116122 57876 -3658 -128719
1734a28719J52261j11389Q7723J44j74356p5476P5535J48841j83772j03123K13850
$$ -128719 23542 -87847 -124 20 -174336 -249812 -174277 -25436 -209208 -312331 -98481
1723i8481o4875l02539M5619K57787L5618k6358L7687j13657o0194J07307M9111
$$ -98481 -163356 -465895 -420276 -162489 -126871 -153229 -115542 -229199 -289393 -182086 -132975
1712a32975j58211Q9202j16904m4930J78203l2901J00828N0431j97409O4744J12682
$$ -132975 -291186 -201984 -318888 -363818 -185615 -218516 -117688 -67257 -264666 -199922 -87240
1701h7240J35042j11414j39756j3785j23303Q4878Q5682j33516P5701K6790R3701
$$ -87240 47802 -63612 -203368 -217153 -340456 -255578 -169896 -303412 -227711 -200921 -107220
1690a07220J27257J6365M2803j77006n675j58644n4554R4040j39437J35312R6463
$$ -107220 20037 36402 79205 -97801 -103476 -262120 -316674 -222634 -362071 -226759 -130296
1679a30296O3537m480K5842k6906P783O7421O8676j05617j07688l46R582N2331
$$ -130296 -66759 -71239 -45397 -72303 -64520 2901 71577 -34040 -141728 -142074 -132492 -80161
1667h0161J71479j38909m2422m6909l0901R4444J82684o6403j17989j71853R9008
$$ -80161 91318 -47591 -90013 -136922 -167823 -73379 109305 42902 -75087 -246940 -147932
1656a47932N207R4499K20697k12871p3196k54726K56075M9961J3369j40722j2305
$$ -147932 -142725 -48226 172471 -40400 -113596 -368322 -112247 -62286 -48917 -189639 -201944
1645b01944M1100K6057J68756n7956j24109Q9195j22578m7993J93759n901L8652
$$ -201944 -160844 -134787 33969 -23987 -148096 -58901 -181479 -229472 -35713 -41614 -2962
1634b962L1647q6331K4671r9356J16120P2250O0751j44152o2647O5979n6116Q5478
$$ -2962 28685 -57646 -32975 -132331 -16211 56039 116790 -27362 -90009 -24030 -80146 5332
1622E332k15980J16670L9116n9756k0629J2469L9816k22867L8045p313R8528J4212
$$ 5332 -210648 -93978 -54862 -114618 -135247 -122778 -82962 -305829 -267784 -275097 -176569 -162357
1610a62357j23592k2735J68666J97428J0914k55946K5253R2864j7727j32151q1005
$$ -162357 -285949 -308684 -140018 57410 68324 -187622 -162369 -69505 -87232 -219383 -300388
1599c00388O3025K16205m868j7688o5719j06093p9000K0557K47282j04193j09568
$$ -300388 -237363 -21158 -26026 -43714 -109433 -215526 -294526 -273969 -26687 -130880 -240448
1588b40448j40819J44564J4717m3166p9695J03072K2554o3007k0746J35276J57187
$$ -240448 -381267 -236703 -221986 -265152 -344847 -241775 -219221 -282228 -302974 -167698 -10511
1577a0511M5316p6393j14097R9649k15200l4287J15691p3729j09829r032L23674
$$ -10511 34805 -41588 -155685 -56036 -271236 -305523 -189832 -263561 -373390 -382422 -58748
1566e8748M9127j48881j31577J47279R0962p4912r6159m0231J31866J03772M3671
$$ -58748 -9621 -158502 -290079 -142800 -51838 -126750 -222909 -263140 -131274 -27502 16169
1555A6169K668j50363M3800M4391N4081j57181J07884Q9450j26107q5279Q8579
$$ 16169 18837 -131526 -87726 -43335 10746 -146435 -38551 50899 -75208 -160487 -71908
1544g1908j4908n3749M499o6397J26564N4119l21590N3901K05743j52536J11725
$$ -71908 -86816 -140565 -136066 -202463 -75899 -21780 -343370 -289469 -83726 -236262 -124537
1533a24537j64993M2206J77395l0114L5823K19744P4917r0410k37732O3257L6325
$$ -124537 -289530 -247324 -69929 -100043 -64220 155524 230441 140031 -97701 -34444 1881
1522A881j29331L0574n1348p6013j416O6190P5944j24145K53788q0324j21940
$$ 1881 -127450 -96876 -148224 -224237 -225653 -159463 -83519 -207664 46124 -34200 -156140
1511a56140J97636K127j59630J9673K7511j716k7982k1141j898k771M4958p289
$$ -156140 41496 43623 -116007 -96334 -68823 -70539 -98521 -119662 -121560 -124331 -79373 -86662
1499h6662k3715r5015L5220K09291R2594R7385k17500j57473K70773l2204j01358
$$ -86662 -110377 -205392 -170172 39119 131713 229098 11598 -145875 124898 92694 -8664
1488h664r2159K61098Q1965l1698k55182r1682J63694L1475k0765J48309q7171
$$ -8664 -100823 160275 242240 210542 -44640 -136322 27372 58847 38082 186391 99220
1477I9220k3788K25644p9647j31082o4944j26328j28842P0114K41544k10854q2056
$$ 99220 75432 301076 221429 90347 25403 -100925 -229767 -159653 81891 -128963 -211019
1466b11019J08937N6469J10855n8773J06487k3246j31297M6563M1048J7389j38815
$$ -211019 -102082 -45613 65242 6469 112956 89710 -41587 4976 46024 63413 -75402
1455g5402J4412m4889m1735J39408Q9076o1738L1143Q5531o9585n6937p0811K2330
$$ -75402 -60990 -105879 -147614 -8206 80870 19132 50275 135806 66221 9284 -61527 -39197
1443c9197K56717N9019k58008q3067N8874o0327P3435p0716j72827R1411m0833
$$ -39197 217520 276539 18531 -64536 -5662 -65989 7446 -63270 -236097 -144686 -185519
1432a85519j17122o429J14788j30169J17466R2507Q8287M7435J4504O2602j61825
$$ -185519 -302641 -309070 -194282 -324451 -206985 -114478 -26191 21244 35748 98350 -63475
1421f3475k72567J44221M2537J96760k038j06565K54541k16400L3168J4024k16117
$$ -63475 -336042 -191821 -149284 47476 45438 -61127 193414 -22986 10182 24206 -191911
1410a91911p7167J4196K05530l5182J17155O1985j44161o0386o9101j07550j08667
$$ -191911 -269078 -254882 -49352 -84534 32621 94606 -49555 -109941 -179042 -286592 -395259
1399c95259J12972J17927N3617P1124J39316K3859j78720q6217K28636n3722j14362
$$ -395259 -282287 -164360 -110743 -39619 99697 123556 -55164 -141381 87255 33533 -80829
1388h0829j46183L1635J37306P9210j45101j41146K22578o3338r3295j70063J9550
$$ -80829 -227012 -195377 -58071 21139 -123962 -265108 -42530 -105868 -199163 -369226 -349676
1377c49676J6981R5238N0647J3526J05786M6069j3968J12068r0393n2557k27383
$$ -349676 -332695 -237457 -186810 -173284 -67498 -21429 -35397 76671 -13722 -66279 -293662
1366b93662J25342K31954j85381m1657J04817l14K49813n1455l65742M0776J29032
$$ -293662 -168320 63634 -121747 -163404 -58587 -58901 190912 139457 -226285 -185509 -56477
1355e6477r714p1830J4578P9498j284l45917M9416J56875K8778Q1315P919j00087
$$ -56477 -66191 -138021 -123443 -43945 -45229 -391146 -341730 -184855 -156077 -74762 -66843 -166930
1343a66930j4321J14946Q5327N4794j75690p9615J29992L1700j2480j80694K8173
$$ -166930 -181251 -66305 19022 73816 -101874 -181489 -51497 -19797 -32277 -212971 -184798
1332a84798J8992J23070M4050r5228n2144N9128J99987Q2689k51853J68969n4044
$$ -184798 -165806 -42736 1314 -93914 -146058 -86930 113057 195746 -56107 112862 58818
1321E8818k95695P2978J37394J07598N3744j81390k39153J34835K79090R957k20139
$$ 58818 -236877 -163899 -26505 81093 134837 -46553 -285706 -150871 128219 138176 -81963
1310h1963J35071k3737j01404K38095n0339j91186J13758n4888J89291L6303k63520
$$ -81963 53108 29371 -72033 166062 115723 -75463 38295 -16593 172698 209001 -54519
1299e4519k3866l0856J77684N7697j54296J19560J8683o0459J57126j85331J2035
$$ -54519 -78385 -109241 68443 126140 -28156 91404 110087 49628 206754 21423 33458
1288C3458j36663R0599m1477m4116J71691p5587J18916J3047j55321j71522J27294
$$ 33458 -103205 -12606 -54083 -98199 73492 -2095 116821 129868 -25453 -196975 -69681
1277f9681K4028j12915L7374j1412K0957k9871j61087J67536K34706m3105o9780
$$ -69681 -45653 -158568 -121194 -132606 -111649 -141520 -302607 -135071 99635 56530 -13250
1266a3250k11375J62195M0206k47187J0854J92852m3995j868p8398J10053L1464
$$ -13250 -224625 -62430 -22224 -269411 -258557 -65705 -109700 -111568 -189966 -79913 -48449
1255d8449j4990M8574J72057M8804j72059j26991j13572k9293j1415k4459Q613
$$ -48449 -63439 -14865 157192 205996 33937 -93054 -206626 -235919 -247334 -271793 -263180
1244b63180R4138J49134N6838j19088M1504j45731l2190J47839M1710K2542J72817
$$ -263180 -169042 -19908 36930 -82158 -40654 -186385 -218575 -70736 -29026 -6484 166333
1233A66333k7716j65381J48909N1749q962r6201j95597J68175l4071o5797j29760
$$ 166333 138617 -26764 122145 173894 164932 68731 -126866 41309 7238 -58559 -188319
1222a88319K74810q1239j35604O4820Q7739K4767j64134j77896J41031N7466J73185
$$ -188319 86491 5252 -130352 -65532 22207 46974 -117160 -295056 -154025 -96559 76626
1211G6626K7972l0872j39587R7595j33650j5299L0080O7590J61969J10259L8658
$$ 76626 104598 73726 -65861 31734 -101916 -117215 -87135 -19545 142424 252683 291341
1200B91341j25612Q3006j29464P8306J9451J268J04971j23274K7049j8213j98888
$$ 291341 165729 248735 119271 197577 217028 218296 323267 199993 227042 208829 9941
1189I941j66144l5235J07786q7941J97566N0174j16107Q5796J17521j16592p5049
$$ 9941 -156203 -191438 -83652 -171593 25973 76147 -39960 45836 163357 46765 -28284
1178b8284j01819J16527J94312N0191J19749j17112j36839j60119k8798J58140
$$ -28284 -130103 -13576 180736 230927 350676 233564 96725 -63394 -92192 65948
1168F5948q2424o0877j67072K14936N2844o6114j40729R0627J30416O8816N6646
$$ 65948 -16476 -77353 -244425 -29489 23355 -42759 -183488 -92861 37555 106371 163017
1157A63017k4581o2094r0413l2288k8099Q8410J114Q5187j06611m6883m6039J98439
$$ 163017 138436 76342 -14071 -46359 -74458 13952 15066 100253 -6358 -53241 -99280 99159
1145I9159Q9414k16816n0982l5603J00060L6522m4782l8989K99820J35679k70609
$$ 99159 188573 -28243 -79225 -114828 -14768 21754 -23028 -62017 237803 373482 102873
1134A02873j4114O8648n9007K23248n7310k29046P3791j85697P7939Q1184k19631
$$ 102873 88759 157407 98400 321648 264338 35292 109083 -76614 1325 82509 -137122
1123a37122J83441J30818r7038j46056J11009N8639q5920k1335q2933K69454r4191
$$ -137122 46319 177137 80099 -65957 45052 103691 17771 -3564 -86497 182957 88766
1112H8766j60308r927n0883M6241M4138J22750N408l1251J34736k7701k28519
$$ 88766 -71542 -81469 -132352 -86111 -41973 80777 86185 54934 189670 161969 -66550
1101f6550Q0853Q7174l4418J85468q9399j2963M098k54835l0966N7389k981O5341
$$ -66550 14303 101477 67059 252527 163128 150165 154263 -100572 -131538 -74149 -77130 -11789
1089a1789P4290j53130K7505j39010J55581J69975J44147j7644j0334n8155l6053
$$ -11789 62501 -90629 -63124 -202134 -46553 123422 267569 249925 239591 181436 145383
1078A45383Q7711j48897j20535j41592J1689J33434j7183j43021O9788J7305Q7812
$$ 145383 233094 84197 -36338 -177930 -166241 -32807 -49990 -193011 -123223 -105918 -18106
1067a8106l5483J5151j44326Q7167Q7315p5245j09354n5268K02059Q0367j05466
$$ -18106 -53589 -38438 -182764 -95597 -8282 -83527 -192881 -248149 -46090 34277 -71189
1056g1189l6147p0350O1153q3548q2118L8276k8288Q0370q0801j35907O3874K78663
$$ -71189 -107336 -177686 -116533 -200081 -282199 -243923 -272211 -191841 -272642 -408549 -344675 -66012
1044f6012P1439J53651k67949J26188n2574p6609J53149k4591l1908J29390R7720
$$ -66012 5427 159078 -108871 17317 -35257 -111866 41283 16692 -15216 114174 211894
1033B11894k26534j77602o2577O6785J3991J33427k06643o5737j23900j47478
$$ 211894 -14640 -192242 -254819 -188034 -174043 -40616 -247259 -312996 -436896 -584374
1023e84374K23019q6561l754L85625l803k32641M09J71462o0611J1588j27816
$$ -584374 -361355 -447916 -451670 -66045 -69848 -302489 -302080 -130618 -191229 -179641 -307457
1012c07457j6942j8813J04534J9607j35052k02509J01967K8040J0465J28382k7157
$$ -307457 -324399 -343212 -238678 -219071 -354123 -556632 -454665 -426625 -416160 -287778 -314935
1001c14935J12364k886K5747k10956j88284J15934J73787O2068J50315q5619M0505
$$ -314935 -202571 -205457 -179710 -390666 -578950 -463016 -289229 -227161 -76846 -162465 -121960
990a21960p7471M0661o0693j3991L7619J49550M1197j95359Q3777l30748Q1794
$$ -121960 -199431 -158770 -219463 -233454 -195835 -46285 -5088 -200447 -116670 -447418 -365624
979c65624J76304r747m668O4704K1139r0617o9775J04243J70117j62177Q164L5085
$$ -365624 -189320 -199067 -203735 -139031 -117892 -208509 -278284 -174041 -3924 -166101 -157937 -122852
967a22852J46826q5023k07447j9320J00853n6458K1680J74272o9809j9300P7786
$$ -122852 23974 -61049 -268496 -287816 -186963 -243421 -221741 -47469 -117278 -136578 -58792
956e8792L703q6129N4439J84588p3294k0083M4851k75013N0884k35734J61014
$$ -58792 -55089 -141218 -86779 97809 24515 4432 49283 -225730 -174846 -410580 -249566
945b49566N942q7767N0388o5752J09354l2993J06513R7624j09873J27360j11304
$$ -249566 -243624 -331391 -281003 -346755 -237401 -270394 -163881 -66257 -176130 -48770 -160074
934a60074j02835K06755r4632J01287K5505j58916r1285J29187N8354K0018j8724
$$ -160074 -262909 -56154 -150786 -49499 -23994 -182910 -274195 -145008 -86654 -66636 -85360
923h5360j44495J54812O8848j4282j73188l1470J50480m5281N7088K8104R1014
$$ -85360 -229855 -75043 -6195 -20477 -193665 -225135 -74655 -119936 -62848 -34744 56270
912E6270L1675J38593p3196j96704k31260J34647Q3728p0363L8967r4744j897
$$ 56270 87945 226538 153342 -43362 -274622 -139975 -56247 -126610 -87643 -182387 -184284
901a84284K71524m5501j47725J51742n4825K41Q0253l0525J51847r8521N8735
$$ -184284 87240 41739 -105986 45756 -9069 -8828 71425 40900 192747 94226 152961
890A52961k26757m2903J6781J22907K26306j99030l3804n9328j20358J07908K13063
$$ 152961 -73796 -116699 -99918 22989 249295 50265 16461 -42867 -163225 -55317 157746
879A57746j49634P9231Q3593R839o8475J01522l0073Q7029K4762k36338L022K91090
$$ 157746 8112 87343 170936 180775 112300 213822 183749 270778 295540 59202 62224 353314
867C53314N5346q4179k38866p9408J54584j52480j22988O8900R0914r3055j09634
$$ 353314 408660 324481 85615 6207 160791 8311 -114677 -45777 45137 -47918 -157552
856a57552O5809K56047J88365j55409j5568J22311k06548N5477m8656j28608R6263
$$ -157552 -91743 164304 352669 197260 181692 304003 97455 152932 104276 -24332 71931
845G1931J86917o5692j5728M5409L8364M7783J24593k34760l9234M0834J3785
$$ 71931 258848 193156 177428 222837 261201 308984 433577 198817 159583 200417 214202
834B14202j3327L7165J2163O0476j16996j73651O8347q0003k4334N4319L1955
$$ 214202 200875 238040 250203 310679 193683 20032 88379 8376 -15958 38361 70316
823G0316j75346K18445j01494J37200m8743k9422j5005j54352K9026J81834O5417
$$ 70316 -105030 113415 11921 149121 100378 70956 55951 -98401 -69375 112459 177876
812A77876n2241p1347L13224q5132L5476P2178k21226N8465j21736n9446M0543
$$ 177876 125635 54288 367512 282380 317856 390034 168808 227273 105537 46091 86634
801H6634r1197J94354J60072j06493M8023P9899L8439o4956j15718j26258O1598
$$ 86634 -4563 189791 349863 243370 291393 371292 409731 344775 229057 102799 164397
790A64397M197J24525J9274J11015j22134m5974j71182n9941j5321J08071n9586
$$ 164397 168594 293119 312393 423408 301274 255300 84118 24177 8856 116927 57341
779E7341J0948K04421j94909k7647Q5816M4618J6925j36290j8085k1274j45851
$$ 57341 68289 272710 77801 50154 135970 180588 197513 61223 43138 21864 -123987
768a23987J58653Q5400K03044j45980J7927j68931J55737J02353j04481k1978
$$ -123987 34666 120066 323110 177130 195057 26126 181863 284216 179735 157757
758A57757l7492q8327J24668J81190k06595k8061L22880m9386j96378q0864K6708
$$ 157757 120265 31938 156606 337796 131201 103140 426020 376634 180256 99392 126100
747A26100n167m362j07946k36585O5804M4165J63521q4593k6046K03533n3670
$$ 126100 120933 116571 8625 -227960 -162156 -117991 45530 -39063 -65109 138424 84754
736H4754q174j00975j24969J70842J9219l487k6922J55042j55148j37334J4401
$$ 84754 76580 -24395 -149364 21478 40697 37210 10288 165330 10182 -127152 -112751
725a12751Q2384p4662J52676N8321J22599k96361j89677J69145M3383J17398R2567
$$ -112751 -30367 -105029 47647 105968 228567 -67794 -257471 -88326 -44943 72455 165022
714A65022j42085O0987L6569k0143j00864k5923K3699r3494l5484L06690Q0435
$$ 165022 22937 83924 120493 100350 -514 -26437 -2738 -96232 -131716 174974 255409
703B55409k04318p9854L8522J42395M5036j03357L1575M6749l7267j40595q4259
$$ 255409 51091 -28763 9759 152154 197190 93833 125408 172157 134890 -5705 -89964
692h9964J48232m5990j48808o7533J48037J48910q8995r9932P7182K3745R9262
$$ -89964 58268 12278 -136530 -204063 -56026 92884 3889 -96043 -18861 4884 104146
681A04146j34202k22322Q0539N7955K01135M0766j17275J15444k20857P5804j09083
$$ 104146 -30056 -252378 -171839 -113884 87251 128017 10742 126186 -94671 -18867 -127950
670a27950j74K05454J70094j01371j85163J27216O6769n4219j67009O4829O5726
$$ -127950 -128124 77330 247424 146053 -39110 88106 154875 100656 -66353 -1524 64202
659F4202k65582K15130o4000M5622n1713J29713q1926J00421J86415l20703K13410
$$ 64202 -201380 13750 -50250 -4628 -56341 73372 -8554 91867 278282 -42421 170989
648A70989m704l9536q5647j23216M0079K34895J61278k5714P4969j04106j17922
$$ 170989 166285 126749 41102 -82114 -42035 192860 354138 328424 403393 299287 181365
637A81365M1987o6995r8697o943l2763J34966j7715j94463l3691P7247q0387q426
$$ 181365 223352 156357 57660 50717 17954 152920 135205 -59258 -92949 -15702 -96089 -104515
625a04515J67904O4209j85358J25841M3628l65074J43731Q3121Q6875K1752J76061
$$ -104515 63389 127598 -57760 68081 111709 -253365 -109634 -26513 60362 82114 258175
614B58175j78894r095M9310q9544J68818q6081m9460j02730k1497j17484R3470
$$ 258175 79281 70186 119496 29952 198770 112689 63229 -39501 -60998 -178482 -85012
603h5012n8794N4708J6099Q6779K37069j27503p7312j04332K21125P5785k12419
$$ -85012 -143806 -89098 -72999 13780 250849 123346 46034 -58298 162827 238612 26193
592B6193l8709m6279P1082o0353N3057k21807l6854J50219R7795l9996J08238
$$ 26193 -12516 -58795 12287 -48066 4991 -216816 -253670 -103451 -5656 -45652 62586
581F2586L7602J25278N2846p327J29932k76463j04172M2044J61706O3482j10841
$$ 62586 100188 225466 278312 270985 400917 124454 20282 62326 224032 287514 176673
570A76673j11872j17999P7379L7333r7779N9738o2813q2815J74978J90164j04200
$$ 176673 64801 -53198 24181 61514 -36265 23473 -39340 -122155 52823 242987 138787
559A38787j2155j07972Q9098Q2364L5382j69547L3398k17942J96226o6651j08411
$$ 138787 126632 18660 107758 190122 225504 55957 89355 -128587 67639 988 -107423
548a07423J31902J01552J96930k28867N8637p5241O4005k26822l8602K77330R3532
$$ -107423 24479 126031 322961 94094 152731 77490 141495 -85327 -123929 153401 246933
537B46933p5161q8933O9888n0825J9580n054Q9130j71871k02322O6322J24136
$$ 246933 171772 82839 152727 101902 121482 116428 205558 33687 -168635 -102313 21823
526B1823J325J18646p9871N1918J42085j782q9135K51781l4173j7699j96442j66948
$$ 21823 23148 141794 61923 113841 255926 254144 165009 416790 382617 364918 168476 1528
514A528J28882L83277L4011l47723j15780j05804J34263j16438J42879J14992
$$ 1528 130410 513687 547698 199975 84195 -21609 112654 -3784 139095 254087
504B54087j1513n0970j83473n9661K5148J53601l7259l4686j19537R2272o6137
$$ 254087 242574 191604 8131 -51530 -26382 127219 89960 55274 -64263 28009 -38128
493c8128K0519J36222K8649R8839o1744k077m6099p5982Q9015M3538k80938J60071
$$ -38128 -17609 118613 147262 246101 184357 182280 136181 60199 149214 192752 -88186 71885
481G1885K56136r3626j28059j0860L7690L9539k1467L1947n9392n4695j49063
$$ 71885 328021 234395 106336 95476 133166 172705 151238 183185 123793 69098 -79965
470g9965M7472J17732j00208n9782J96460q8468n0036R7148L8491n2152k598o4397
$$ -79965 -32493 85239 -14969 -74751 121709 33241 -16795 80353 118844 66692 64094 -303
458c03k42789K18816N4449K7525K63267j64511k47185p4966L04633O877R634k6513
$$ -303 -243092 -24276 30173 57698 320965 156454 -90731 -165697 138936 145813 155447 128934
446A28934n2331R14P6247j27387N0501r302J6433r2071O3290Q6899m930j77458
$$ 128934 76603 77517 153764 26377 76878 67576 84009 -8062 55228 142127 137197 -40261
434d0261R3525p7785J1898J66995q3157k28684J95029j3507J00633P1206j4182
$$ -40261 53264 -24521 -12623 154372 71215 -157469 37560 24053 124686 195892 181710
423A81710Q0955j32217o3280P9957k4301O1106k2376k00492k4936j76899j7921
$$ 181710 262665 130448 67168 147125 122824 183930 161554 -38938 -63874 -240773 -258694
412b58694J36109J03272O0757k1123m0186J22614p1331O0864o3916L3470q1828
$$ -258694 -122585 -19313 41444 20321 -19865 102749 31418 92282 28366 61836 -19992
401a9992O4108j33204M6167N7970Q3451q0128N8362q4262r8576K17168m8826q4533
$$ -19992 44116 -89088 -42921 15049 98500 18372 76734 -7528 -106104 111064 62238 -22295
389b2295j6102N7775M2116p4929Q7387o3446J81869K0335k01778p4718K74274
$$ -22295 -38397 19378 61494 -13435 73952 10506 192375 212710 10932 -63786 210488
378B10488m6527j94535J10304J23579M6082M4467m3617l2641M9706k00956J07737
$$ 210488 163961 -30574 79730 203309 249391 293858 250241 217600 267306 66350 174087
367A74087n4027k25286o0226M6320J82584n2871k02394Q350L83306r4968k8716
$$ 174087 120060 -105226 -165452 -119132 63452 10581 -191813 -183463 199843 104875 76159
356G6159J32256k34263j78777J94773l7563p496K0952j23672m3026J52449J01430
$$ 76159 208415 -25848 -204625 -9852 -47415 -54911 -33959 -157631 -200657 -48208 53222
345E3222J25334J3379R452L9263j87047o0341n5298O8817J76424k74717j59969
$$ 53222 178556 191935 201387 240650 53603 -6738 -62036 6781 183205 -91512 -251481
334b51481L09041P8244j15922O8269O0820J4896N1620j16086j54139j2861J45992
$$ -251481 57560 135804 19882 88151 148971 163867 215487 99401 -54738 -67599 78393
323G8393K754p4004q1815J27731J99541k31911l2261N8497J6452P6662r1029j2669
$$ 78393 81147 7143 -74672 53059 252600 20689 -11572 46925 63377 140039 49010 36341
311C6341j60720j37441j09325K05860Q9916l8541J0405o70L05281j2606r6928
$$ 36341 -124379 -261820 -371145 -165285 -75369 -113910 -103505 -104175 201106 188500 91572
300I1572L3988J06402k7444N1095N976j68511j21387L3064J27475q9441M5162
$$ 91572 125560 231962 204518 255613 261589 93078 -28309 4755 132230 42789 87951
289H7951N1288M0390n0070L4701j10745j21300M3498K160M7188q0666Q9297Q9362
$$ 87951 139239 179629 129559 164260 53515 -67785 -24287 -22127 25061 -55605 33692 123054
277A23054q2316J47435n6749l3494q5232k98935o6851J87430P9924J21865K0799
$$ 123054 40738 188173 131424 97930 12698 -286237 -353088 -165658 -85734 36131 56930
266E6930K84762j81360j96441p0441l4855Q5238o2196L8968k04576N0866j7722
$$ 56930 341692 160332 -36109 -106550 -141405 -56167 -118363 -79395 -283971 -233105 -250827
255b50827K0000N331K59864P6689q0654K57895j30859J28663n2686j10466r2871
$$ -250827 -230827 -225496 34368 111057 30403 288298 157439 286102 233416 122950 30079
244C0079M6319J13097p6471N603J98725j64889L5521M3841o4526M6903k8084l07564
$$ 30079 76398 189495 113024 118627 317352 152463 187984 231825 167299 214202 186118 -121446
232a21446L1721O5491J18582K17692j08475j13911k7256l4904n9773J36837r3839
$$ -121446 -89725 -24234 94348 312040 203565 89654 62398 27494 -32279 104558 10719
221A0719J7812L9082J2607O0820L0032j34788n5175m384j4892n3759J57483R8034
$$ 10719 28531 67613 80220 141040 171072 36284 -18891 -23275 -38167 -91926 65557 163591
209A63591M979l5569j14806M4520l8312K3639o210j5085K0552P7711j18808J61763
$$ 163591 168570 133001 18195 62715 24403 48042 41832 26747 47299 125010 6202 167965
197A67965K849l9663P79j44417M067r3676n7884J88689O3768j35664K30420J49719
$$ 167965 170814 131151 131930 -12487 -8420 -102096 -159980 28709 92477 -43187 187233 336952
185C36952j30751j16141r6K3240j40888l3550J54115O2832r0058k2516Q4179j06089
$$ 336952 206201 90060 89964 113204 -27684 -61234 92881 155713 65655 43139 127318 21229
173B1229P9195j75120J46500L9783p9559M9673m4827j56052M5434R3578R927r7766
$$ 21229 100424 -74696 71804 111587 32028 81701 36874 -119178 -73744 19834 29761 -68005
161f8005N2808P7592o6250j1544J3839J71652j36492l511P1744l3077p7444j03525
$$ -68005 -15197 62395 -3855 -15399 -1560 170092 33600 30089 101833 68756 -8688 -112213
149a12213K81759l3412j55112M687J01508j00651L9791q9431Q0913J0589k0904
$$ -112213 169546 136134 -18978 -14291 87217 -13434 26357 -63074 17839 28428 7524
138G524O8053j06032M5536J53815k7526J29508j24816j43823L5745l1241P4376
$$ 7524 75577 -30455 15081 168896 141370 270878 146062 2239 37984 6743 81119
127H1119n0931j19876N0148J85225J52178p159n4304j18637j68567k7937J43184
$$ 81119 30188 -89688 -39540 145685 297863 290704 236400 117763 -50804 -78741 64443
116F4443p1459Q5671m9621r1164R8114r2022r2948Q1190K3404Q1190O3972J3268
$$ 64443 -7016 78655 29034 -62130 35984 -56038 -148986 -67796 -44392 36798 100770 114038
104A14038o9752j74670P5410J00584R2055j64731r3966L3013M2661L9917K25842
$$ 114038 44286 -130384 -54974 45610 137665 -27066 -121032 -88019 -45358 -5441 220401
93B20401j428j15823q8815J04152j82668O1106Q185l1621n4760L2391P1917N5376
$$ 220401 218973 103150 14335 118487 -64181 -3075 5110 -26511 -81271 -48880 23037 78413
81G8413L6036J14308l1499j42240j05114J5080J17023J10731k4309j33057j94609
$$ 78413 114449 228757 197258 55018 -50096 -35016 82007 192738 168429 35372 -159237
70a59237j70074K53080K07189K3019j5310n8744j4717O5450j2926q1644R9729
$$ -159237 -329311 -76231 130958 153977 138667 79923 65206 130656 117730 36086 135815
59A35815K5270o0543l6934p0199L4897P4823P3782l8275o4088m9506m2082P0467
$$ 135815 161085 100542 63608 -6591 28306 103129 176911 138636 74548 25042 -17040 53427
47E3427Q0055k2821J44001j35267j87080J09827J10334p848p6384j5344k4573
$$ 53427 133482 110661 254662 119395 -67685 42142 152476 144628 68244 52900 28327
36B8327Q5728Q0782l5368j94506N4410o2144O8487n502M4744J6227M9287m284
$$ 28327 114055 194837 159469 -35037 19373 -42771 25716 20214 64958 81185 130472 126188
24A26188r7128P1961J164p9863J25752l7681j13254M7112K37900m3045r6999j18291
$$ 126188 29060 101021 102185 22322 148074 110393 -2861 44251 282151 239106 142107 23816
12B3816p8622m2905m2740J63584K7696r3121j8329O2614l4504K9644O2144N0087
$$ 23816 -54806 -97711 -140451 23133 50829 -42292 -60621 1993 -32511 -2867 59277 109364
0A09364
$$ 109364
$$ Imaginary data points
##PAGE= N=2
##DATA TABLE= (X++(I..I)), XYDATA
16383b367789Q253J03682j2295k2643K7456R3522P8109j00457o8763K5227J75962
$$ -2367789 -2359536 -2255854 -2268149 -2290792 -2263336 -2169814 -2091705 -2192162 -2260925 -2235698 -2059736
16372b059736J45951k437R789M7528l4354q9869M2557Q6698O4781k4986P6469
$$ -2059736 -1913785 -1916222 -1906433 -1858905 -1893259 -1983128 -1940571 -1853873 -1789092 -1814078 -1737609
16361a737609J1305O2363N4152r668m9764k8520m9538J17742J53766o9050J42569
$$ -1737609 -1726304 -1663941 -1609789 -1619457 -1669221 -1697741 -1747279 -1629537 -1475771 -1544821 -1402252
16350a402252J0842R1468M0747j62651O6110m5796O2481Q1881j7984J33377l7508
$$ -1402252 -1391410 -1299942 -1259195 -1421846 -1355736 -1401532 -1339051 -1257170 -1275154 -1141777 -1179285
16339a179285K70514K6913j71570q928m6358j5501Q7753R4553K9983J30587J14389
$$ -1179285 -908771 -881858 -1053428 -1062356 -1108714 -1124215 -1036462 -941909 -911926 -781339 -666950
16328f66950n8172p4395p0756m1283J43567n419J48671N3379j6927P9090j10042
$$ -666950 -725122 -799517 -870273 -911556 -767989 -773408 -624737 -571358 -588285 -509195 -619237
16317f19237J20372m3336j84409J74559R4536J8890P1634j02002J5760R0881L5167
$$ -619237 -498865 -542201 -726610 -552051 -457515 -438625 -366991 -468993 -453233 -362352 -327185
16306c27185j230j3423J53312m5007j82215R3965J80813n3308M5457J57229r0763
$$ -327185 -328415 -341838 -188526 -233533 -415748 -321783 -140970 -194278 -148821 8408 -82355
16295h2355J4850L1322N5069l8872j20913o2183n965P6901J60568J32287J91559
$$ -82355 -67505 -36183 18886 -19986 -140899 -203082 -209047 -132146 28422 160709 352268
16284C52268j98364j8594j57838J45797J62375o2156j0728J22842j3743J25106
$$ 352268 153904 135310 -22528 123269 285644 223488 212760 335602 321859 446965
16274D46965r3258l6754J38343n8202M2624M7459J79912j77049j3584J6970j24494
$$ 446965 353707 316953 455296 397094 439718 487177 667089 490040 476456 493426 368932
16263C68932J64029J32361q7722j36943p485J4925q8526J27299Q7611r006k3477
$$ 368932 532961 665322 577600 440657 433172 448097 359571 486870 574481 565475 541998
16252E41998J54721r0460Q8764k0898J3512l6311P5856N4628j89265J80750l4145
$$ 541998 696719 606259 695023 674125 687637 651326 727182 781810 592545 773295 739150
16241G39150N13n9535J56660o5292j19921K43072O2930M522J70701l686j32554
$$ 739150 739663 680128 836788 771496 651575 894647 957577 962099 1132800 1129114 996560
16230I96560j08062m5504P9737J76192J70567m8620M1062j96731r5171N6665k4486
$$ 996560 888498 842994 922731 1098923 1269490 1220870 1261932 1065201 970030 1026695 1002209
16219A002209M0849P876J57208k3781p117q0518J15336Q2788j65290o2449Q1310
$$ 1002209 1043058 1050934 1208142 1184361 1177244 1096726 1212062 1294850 1129560 1067111 1148421
16208A148421J36020m1959R5605j5440M1332J21852L7698P6448k12057L629J58305
$$ 1148421 1284441 1242482 1338087 1322647 1363979 1485831 1523529 1599977 1387920 1391549 1549854
16197A549854Q4153r6754K7802r2696j19024J07018P1184J54639l30738M0690
$$ 1549854 1634007 1537253 1565055 1472359 1353335 1460353 1531537 1686176 1355438 1396128
16187A396128K7902o1265Q9819J17307L6439Q69K0813j44695P1404m4746m0606
$$ 1396128 1424030 1362765 1452584 1569891 1606330 1607199 1628012 1483317 1554721 1509975 1469369
16176A469369r02O4347k6760n4112K61956o5351K6936J63335q4138j02753J3148
$$ 1469369 1468467 1532814 1506054 1451942 1713898 1648547 1675483 1838818 1754680 1651927 1665075
16165A665075j61991J56431J39076O1994r5973j71450q1564N8471O5345J1340
$$ 1665075 1503084 1659515 1798591 1860585 1764612 1593162 1511598 1570069 1635414 1646754
16155A646754P8019n468j11575N2876J55884k55563k6551J93758l8987J08014
$$ 1646754 1724773 1719305 1607730 1660606 1816490 1560927 1534376 1728134 1689147 1797161
16145A797161N8016p4778k05700J71176J45403j88743m967j7009R6679j06727
$$ 1797161 1855177 1780399 1574699 1745875 1891278 1702535 1697568 1680559 1777238 1670511
16135A670511J9648K14080L9753j74019m8568K344q1321J2423o8478j53799K07387
$$ 1670511 1690159 1904239 1943992 1769973 1721405 1723749 1642428 1654851 1586373 1432574 1639961
16124A639961K09098J40509j24124p1209k7317P055l13J03270N5493j79325R1562
$$ 1639961 1849059 1989568 1865444 1794235 1766918 1773973 1773660 1876930 1932423 1753098 1844660
$$ [...]
##END NTUPLES=NMR SPECTRUM
##END=
