##TITLE=1H_EC-3288(II)f
 CDCl3
 8 sc, 
 26.1.2023
##JCAMPDX= 6.0         $$ Bruker NMR JCAMP-DX V2.0
##DATA TYPE= NMR SPECTRUM
##DATA CLASS= NTUPLES
##ORIGIN= UXNMR, Bruker Analytische Messtechnik GmbH
##OWNER= root
$$ XWIN-NMR		Version 3.5
$$ Thu Jan 26 14:14:34 2023 Russian Standard Time (UT+4h)  she@DPX200
##.OBSERVE FREQUENCY= 200.13135
##.OBSERVE NUCLEUS= ^1H
##.ACQUISITION MODE= SIMULTANEOUS
##.ACQUISITION SCHEME= undefined
##.AVERAGES= 8
##.DIGITISER RES= 18
##SPECTROMETER/DATA SYSTEM= spect
##.PULSE SEQUENCE= zg30
##.SOLVENT NAME= CDCl3
##.SHIFT REFERENCE= (INTERNAL, CDCl3, 0, 15.8009)
##AUDIT TRAIL= $$ (NUMBER, WHEN, WHO, WHERE, WHAT)
$$ ##TITLE= Audit trail, XWIN-NMR		Version 3.5
$$ ##JCAMPDX= 5.01
$$ ##ORIGIN= Bruker BioSpin GmbH
$$ ##OWNER= she
$$ F:/spectra/data/she/nmr/H-F/1/pdata/1/auditp.txt
$$ ##AUDIT TRAIL=  $$ (NUMBER, WHEN, WHO, WHERE, WHAT)
(   1,<2023-01-26 14:12:00.92 +0400>,<she>,<DPX200>,
      <created by zg, POWCHK disabled, PULCHK disabled
       configuration hash MD5:
       00 E9 B6 7A A2 85 ED C7 34 08 36 98 17 FE 4E 26
       data hash MD5: 16K
       4A D3 19 B4 C0 17 BB 7E C4 E4 D4 E5 A6 A5 61 28>)
(   2,<2023-01-26 14:12:03.48 +0400>,<she>,<DPX200>,
      <Start of raw data processing
       efp BC_mod = 2 LB = 0.24 FT_mod = 6 PKNL = 1 PHC0 = -19268.29 PHC1 = 7.20079 SI = 16K 
       data hash MD5: 16K
       30 F9 07 8D CF 03 84 02 4B 31 5F D4 EB FE 36 24>)
(   3,<2023-01-26 14:12:24.23 +0400>,<she>,<DPX200>,
      <pk PHC0 = 80.15043 PHC1 = 0 
       data hash MD5: 16K
       7D DC 8B E2 58 46 C9 0D 78 AC 1F 36 CE 36 68 C2>)
(   4,<2023-01-26 14:12:27.67 +0400>,<she>,<DPX200>,
      <abs ABSG = 5 
       data hash MD5: 16K
       B4 B3 3C BA 69 9B B6 D1 A5 4C FB DB 3A E4 74 A0>)
(   5,<2023-01-26 14:12:46.51 +0400>,<she>,<DPX200>,
      <pk PHC0 = 3.58083 PHC1 = -5.800001 
       data hash MD5: 16K
       5E 4C DA B4 69 7D 79 39 60 A2 67 C2 1A A6 C1 83>)
(   6,<2023-01-26 14:12:49.35 +0400>,<she>,<DPX200>,
      <abs ABSG = 5 
       data hash MD5: 16K
       BE 61 73 64 4B 80 02 54 CA D3 6F 35 2B 25 4D 84>)
$$ ##END=
$$ 
$$ hash MD5
$$ BD 31 66 0D E2 DD 94 D7 8E 4B 9C D1 11 01 DE 40
##$RELAX= 
##$RELAX= 
##$RELAX= 
##$RELAX= 
##$RELAX= 
##$RELAX= 
$$ Bruker specific parameters
$$ --------------------------
##$DU= <F:/spectra>
##$EXPNO= 1
##$NAME= <H-F>
##$PROCNO= 1
##$TYPE= <nmr>
##$USER= <she>
##$AMP= (0..31)
100 100 100 100 100 100 100 100 100 100 100 100 100 100 100 100 100 100 
100 100 100 100 100 100 100 100 100 100 100 100 100 100 
##$AQSEQ= 0
##$AQ_mod= 1
##$AUNM= <au_zg>
##$AUTOPOS= <>
##$BF1= 200.13
##$BF2= 200.13
##$BF3= 200.13
##$BF4= 200.13
##$BF5= 200.13
##$BF6= 200.13
##$BF7= 200.13
##$BF8= 200.13
##$BYTORDA= 1
##$CFDGTYP= 0
##$CFRGTYP= 5
##$CHEMSTR= <none>
##$CNST= (0..31)
1 1 145 1 1 1 1 1 1 1 1 1 1 1 1 1 1 1 1 1 1 1 1 1 1 1 1 1 1 1 1 1 
##$CPDPRG= <>
##$CPDPRG1= <>
##$CPDPRG2= <>
##$CPDPRG3= <>
##$CPDPRG4= <mlev>
##$CPDPRG5= <mlev>
##$CPDPRG6= <mlev>
##$CPDPRG7= <mlev>
##$CPDPRG8= <mlev>
$$ [...]
##$SUBNAM3= <"">
##$SUBNAM4= <"">
##$SUBNAM5= <"">
##$SUBNAM6= <"">
##$SUBNAM7= <"">
##$SUBNAM8= <"">
##$SUBNAM9= <"">
##$SW= 18.05172834244
##$SWIBOX= (0..15)
0 0 2 0 0 0 0 0 0 0 0 0 0 0 0 0 
##$SW_h= 3612.71676300578
##$TD= 16384
##$TD0= 1
##$TE= 0
##$TE2= 300
##$TE3= 300
##$TEG= 300
##$TL= (0..7)
0 120 120 120 120 120 120 120 
##$TP= (0..7)
150 150 150 150 150 150 150 150 
##$TP07= 0
##$TPNAME0= <>
##$TPNAME1= <>
##$TPNAME2= <>
##$TPNAME3= <>
##$TPNAME4= <>
##$TPNAME5= <>
##$TPNAME6= <>
##$TPNAME7= <>
##$TPOAL= (0..7)
0.5 0.5 0.5 0.5 0.5 0.5 0.5 0.5 
##$TPOFFS= (0..7)
0 0 0 0 0 0 0 0 
##$TUNHIN= 0
##$TUNHOUT= 0
##$TUNXOUT= 0
##$USERA1= <user>
##$USERA2= <user>
##$USERA3= <user>
##$USERA4= <user>
##$USERA5= <user>
##$V9= 5
##$VALIST= <valist>
##$VCLIST= <CCCCCCCCCCCCCCC>
##$VD= 0
##$VDLIST= <DDDDDDDDDDDDDDD>
##$VPLIST= <PPPPPPPPPPPPPPP>
##$VTLIST= <TTTTTTTTTTTTTTT>
##$WBST= 1024
##$WBSW= 4
##$XGAIN= (0..3)
0 0 0 0 
##$XL= 0
##$YL= 0
##$YMAX_a= 16960
##$YMIN_a= -21480
##$ZGOPTNS= <>
##$ZL1= 120
##$ZL2= 120
##$ZL3= 120
##$ZL4= 120
##$ABSF1= 15.73918
##$ABSF2= -2.31267
##$ABSG= 5
##$ABSL= 3
##$ALPHA= 0
##$AQORDER= 0
##$ASSFAC= 0
##$ASSFACI= 0
##$ASSFACX= 0
##$ASSWID= 0
##$AUNMP= <proc_1d>
##$AZFE= 0.1
##$AZFW= 0.1
##$BCFW= 0
##$BC_mod= 2
##$BYTORDP= 0
##$COROFFS= 0
##$CY= -3
##$DATMOD= 1
##$DC= 0
##$DFILT= <>
##$DTYPP= 0
##$F1P= 0
##$F2P= 0
##$FCOR= 1
##$FTSIZE= 16384
##$FT_mod= 6
##$GAMMA= 0
##$GB= 0
##$INTBC= 1
##$INTSCL= 3.70164e-10
##$ISEN= 128
##$LB= 0.24
##$LEV0= 0
##$LPBIN= 0
##$MAXI= 10000
##$MC2= 0
##$MEAN= 0
##$ME_mod= 0
##$MI= 1.114404
##$NCOEF= 0
##$NC_proc= -11
##$NLEV= 6
##$NOISF1= 3.799351
##$NOISF2= 2.8
##$NSP= 0
##$NTH_PI= 0
##$NZP= 0
##$OFFSET= 15.80088
##$PC= 1
##$PHC0= -19184.56
##$PHC1= 1.400789
##$PH_mod= 1
##$PKNL= yes
##$PPARMOD= 0
##$PSCAL= 0
##$PSIGN= 0
##$REVERSE= no
##$SF= 200.129994128591
##$SI= 16384
##$SIGF1= 3
##$SIGF2= 2
##$SINO= 5.538805
##$SIOLD= 16384
##$SREGLST= <1H.CDCl3>
##$SSB= 0
##$STSI= 16384
##$STSR= 0
##$SW_p= 3612.71676300578
##$SYMM= 0
##$S_DEV= 0
##$TDeff= 16384
##$TDoff= 0
##$TI= <>
##$TILT= no
##$TM1= 0
##$TM2= 0
##$TOPLEV= 0
##$USERP1= <user>
##$USERP2= <user>
##$USERP3= <user>
##$USERP4= <user>
##$USERP5= <user>
##$WDW= 1
##$XDIM= 16384
##$YMAX_p= 495637632
##$YMIN_p= -3831304
$$ End of Bruker specific parameters
$$ ---------------------------------
##NTUPLES= NMR SPECTRUM
##VAR_NAME=  FREQUENCY,     SPECTRUM/REAL,   SPECTRUM/IMAG
##SYMBOL=    X,             R,               I
##VAR_TYPE=  INDEPENDENT,   DEPENDENT,       DEPENDENT
##VAR_FORM=  AFFN,          ASDF,            ASDF
##VAR_DIM=   16384,         16384,           16384
##UNITS=     HZ,            ARBITRARY UNITS, ARBITRARY UNITS
##FACTOR=    0.220516191357247, 1,           1
##FIRST=     3162.23010810853, 0,            0
##LAST=      -450.486654897254, 0,           0
##MIN=       -450.486654897254, -3831304,    0
##MAX=       3162.23010810853, 495637632,    0
$$ Real data points
##PAGE= N=1
##DATA TABLE= (X++(R..R)), XYDATA
$$ [...]
5676H937976J42165R5718J72701K12692J48750K75179K31630J21114K35261L65842
$$ 8937976 9080141 9175859 9348560 9561252 9710002 9985181 10216811 10337925 10573186 10939028
5666A0939028K48028O9238L41104L43638M30920L85467N31841N78893K31348N48659
$$ 10939028 11187056 11256294 11597398 11941036 12371956 12757423 13289264 13868157 14099505 14648164
5656A4648164O55604M53901N44689Q08408R76945J292621Q09162J033745J378100
$$ 14648164 15303768 15757669 16302358 17110766 18087711 19380332 20189494 21223239 22601339
5647B2601339J359369J564733J712113J920595K124154J971593K106186K466398
$$ 22601339 23960708 25525441 27237554 29158149 31282303 33253896 35360082 37826480
5639C7826480K262139K464440J923902J523830Q77303O81726K40654k63079o57678
$$ 37826480 40088619 42553059 44476961 46000791 46878094 47559820 47800474 47537395 46879717
5630D6879717p95584o39629p21860r28300o65290q52652o83786m97508o24253
$$ 46879717 46084133 45444504 44722644 43794344 43129054 42276402 41592616 41095108 40470855
5621D0470855o95429l83018J38866j94811K08339N38788R12331J230572J249873
$$ 40470855 39775426 39392408 39531274 39336463 39544802 40083590 40995921 42226493 43476366
5612D3476366J533165J770823J771879J812214J638552J305771R43173N32599
$$ 43476366 45009531 46780354 48552233 50364447 52002999 53308770 54251943 54784542
5604E4784542J73790p2077n58359o53471o44452q11628o15234n21523k81444m42616
$$ 54784542 54958332 54886255 54327896 53674425 53029973 52218345 51603111 51081588 50800144 50357528
5594E0357528p37138p96657p41600o73597n12469n77792o72556p89247o49045
$$ 50357528 49620390 48823733 48082133 47408536 46896067 46318275 45645719 44856472 44207427
5585D4207427q34035j154690j259522j428466j688193j578482j688581j334795
$$ 44207427 43373392 42218702 40959180 39530714 37842521 36264039 34575458 33240663
5577C3240663j331689j091232p39755o84142n07900l34428p9941K04778L33207
$$ 33240663 31908974 30817742 30077987 29393845 28885945 28551517 28471576 28676354 29009561
5568B9009561K87800K15157K36436M65398J78305L97626M50148K06783J73240
$$ 29009561 29297361 29512518 29748954 30214352 30392657 30790283 31240431 31447214 31620454
5559C1620454k4131j11599k23386o27793r20848j028331j598225j749699j687571
$$ 31620454 31596323 31484724 31261338 30633545 29712697 28684366 27086141 25336442 23648871
5550B3648871j602263j338437j474155j402107j108068j112619p65421p06438
$$ 23648871 22046608 20708171 19234016 17831909 16723841 15611222 14845801 14139363
5542A4139363p03758q58465n29881n16477m67624n62339o07073m82289m21359
$$ 14139363 13435605 12577140 12047259 11530782 11063158 10500819 9893746 9411457 8990098
5533H990098k90386o70725j96055p1443l31268j84827l00801p7577j85689k81762
$$ 8990098 8699712 8028987 7832932 7761489 7430221 7245394 6944593 6867016 6681327 6399565
5523F399565j50766k50277k31533m01565m6363n0791J2484j78307q3261j05205
$$ 6399565 6248799 5998522 5766989 5365424 5319061 5268270 5280754 5102447 5019186 4913981
5513D913981L2869m34685k38082n2508L536J83272j49005k21971j70531Q470j44619
$$ 4913981 4946850 4512165 4274083 4221575 4225111 4408383 4259378 4037407 3866876 3875346 3730727
5502C730727j90288k27522L78946k12531j53130J96423l16886j92930M6716K6628
$$ 3730727 3540439 3312917 3691863 3479332 3326202 3522625 3205739 3012809 3059525 3086153
5492C086153Q4035j9735j35537j26954j25825Q4076r758n394j41654J20133j03616
$$ 3086153 3170188 3150453 3014916 2887962 2762137 2846213 2836455 2831061 2689407 2809540 2705924
5481B705924j06317n0205n401J11499N112J04231j59355k07052k8637Q7309M9633
$$ 2705924 2599607 2549402 2544001 2655500 2660612 2764843 2605488 2398436 2369799 2457108 2506741
5470B506741P6298j69949q7722K86966K35256J81330j05099j9676N5577Q988R2212
$$ 2506741 2583039 2413090 2325368 2612334 2847590 3028920 2923821 2904145 2959722 2968710 3060922
5459C060922l4764p7180n9342O3948L0048k9607L19332J64755K08015L9463J04879
$$ 3060922 3026158 2948978 2889636 2953584 2983632 2954025 3273357 3438112 3646127 3685590 3790469
5448C790469K15878J74752N34517N37196K72423O77120N02761Q38448N32973M39596
$$ 3790469 4006347 4181099 4715616 5252812 5525235 6202355 6705116 7543564 8076537 8516133
5438H516133J5616o95616o11282o35577o46570m67572m79690l22309k40078l36074
$$ 8516133 8531749 7836133 7224851 6589274 5942704 5475132 4995442 4673133 4433055 4096981
5428D096981P4624R7061L0601K21599M9955L71369K77074K77856L76778M20193
$$ 4096981 4171605 4268666 4299267 4520866 4570821 4942190 5219264 5497120 5873898 6294091
5418F294091O22182P74661M26402K27423j59970j29985l50160p15927o81791m42425
$$ 6294091 6916273 7690934 8117336 8344759 8184789 8054804 7704644 6988717 6306926 5864501
5408E864501k45424l78367j81246l91075j98360k62987M5744J8186j73971L0297
$$ 5864501 5619077 5240710 5059464 4668389 4470029 4207042 4252786 4270972 4097001 4127298
5398D127298J57307j1565M30387M3452j8015J07372j35487M3795j75180l59080
$$ 4127298 4284605 4273040 4703427 4746879 4728864 4836236 4700749 4744544 4569364 4210284
5388D210284o8990k12211j57641k71173j18799o9256P356p5277o7926R665j42738
$$ 4210284 4141294 3929083 3771442 3500269 3381470 3312214 3319570 3244293 3176367 3186032 3043294
5377C043294j14109N916L9420J30267M242K03701j07206j01088j17863M4286J73181
$$ 3043294 2929185 2935101 2974521 3104788 3109030 3312731 3205525 3104437 2986574 3030860 3204041
5366C204041k9281j82131K48023j59901r890k17997j88213q0964Q0229k17485
$$ 3204041 3174760 2992629 3240652 3080751 3070861 2852864 2664651 2583687 2663916 2446431
5356B446431p8741j11703r0245J45713K04935J00058Q7752l116n3089P565J7949
$$ 2446431 2367690 2255987 2165742 2311455 2516390 2616448 2704200 2701084 2647995 2655560 2673509
5345B673509N9540n6968k8977j91383J54448L8434O2070k15103p4602J9370J22986
$$ 2673509 2733049 2676081 2647104 2455721 2610169 2648603 2710673 2495570 2420968 2440338 2563324
5334B563324k490j4297R5707Q6912J4125K24932J65606j42952J9326J44241J26978
$$ 2563324 2560834 2546537 2642244 2729156 2743281 2968213 3133819 2990867 3010193 3154434 3281412
5323C281412J47213J57511K38310j30871J84838J96896N9650J04237J92037O3499
$$ 3281412 3428625 3586136 3824446 3693575 3878413 4075309 4134959 4239196 4431233 4494732
5313D494732L26536L48847J85632K80231M45997M83988M56260L13370L09579O93381
$$ 4494732 4821268 5170115 5355747 5635978 6081975 6565963 7022223 7335593 7645172 8338553
5303H338553O30437L87479J49550j6500j92587j91972j85130k45445J09343k2173
$$ 8338553 8968990 9356469 9506019 9489519 9296932 9104960 8919830 8674385 8783728 8761555
5293H761555J48748L10223L46376J61148J99340Q7988j53219l03882o1556r5047
$$ 8761555 8910303 9220526 9566902 9728050 9927390 10015378 9862159 9558277 9496721 9401674
5283I401674n9023R6745Q9898L8846J47741r6064l7995o1346n55863l99130l34773
$$ 9401674 9342651 9439396 9529294 9568140 9715881 9619817 9581822 9520476 8964613 8565483 8230710
5272H230710j21471j95536j69612p9276p1963K31347J25734j62400k87088j22689
$$ 8230710 8109239 7913703 7744091 7664815 7592852 7824199 7949933 7787533 7500445 7377756
5262G377756l87986n56232m65505k68528k20908j52611l34270m47737r0207J15052
$$ 7377756 6989770 6433538 5968033 5699505 5478597 5325986 4991716 4543979 4453772 4568824
5252D568824m30976k46332r3829j41596K9518j00727k75238o4042j36215j07972
$$ 4568824 4137848 3891516 3797687 3656091 3685609 3584882 3309644 3245602 3109387 3001415
5242C001415j3760J01953n2531K5518n9644l0777J15651j96125k35859O8141j7021
$$ 3001415 2987655 3089608 3037077 3062595 3002951 2972174 3087825 2891700 2655841 2723982 2706961
5231B706961k25140r3541j54099j82827n2782J44411j80915j83573K07781K45066
$$ 2706961 2481821 2388280 2234181 2051354 1998572 2142983 1962068 1778495 1986276 2231342
5221B231342l08884j37268j70304k8391q8106J9213N89J69731l4070m661j10799
$$ 2231342 1922458 1785190 1614886 1586495 1498389 1517602 1518191 1687922 1653852 1649191 1538392
5210A538392k6570m1080O7221J31222j5966j73357j50453O6635O0456j65749J24356
$$ 1538392 1511822 1470742 1537963 1669185 1653219 1479862 1329409 1396044 1456500 1290751 1415107
5199A415107j83085j87154m4083J26276l2145p8627J87707j50653j53810j15929
$$ 1415107 1232022 1044868 1000785 1127061 1094916 1016289 1203996 1053343 899533 783604
5189G83604J03839J62367n5440j9163j51969O2382p5920P8432R5658j9328J9252
$$ 783604 887443 1049810 994370 975207 823238 885620 809700 888132 983790 964462 983714
5178I83714r151R2149r6459N5301K22182j87024j67056N1576J9844j6028m9229
$$ 983714 974563 1066712 970253 1025554 1247736 1060712 893656 945232 965076 949048 899819
5167H99819N5321j8459j02892k20490J73513J5987j10595L1570J1766N4698R5514
$$ 899819 955140 936681 833789 613299 786812 802799 692204 723774 735540 790238 885752
5156H85752k47675J61460K02253j88119j01230J4491l5074J1829O8599m5964p0743
$$ 885752 638077 799537 1001790 813671 712441 726932 691858 703687 772286 726322 655579
5145F55579P4237r2248n2585L8650n6470J52426K31877k8072N8642P7799j36217
$$ 655579 729816 637568 584983 623633 567163 719589 951466 923394 982036 1059835 923618
5134I23618m6377j70145P9301L5063k4437j7882k328J08066k4762k78045L0311
$$ 923618 877241 707096 786397 821460 797023 779141 776813 884879 860117 582072 612383
5123F12383O0096N7801J53945K3007J6854q6448j66203J38372P8941p9240J90611
$$ 612383 672479 730280 884225 907232 924086 837638 671435 809807 888748 809508 1000119
5112A000119j1272l649j15471N8976j20174J27516n587J2188J00780J80593p5761
$$ 1000119 988847 985198 869727 928703 808529 936045 930458 942646 1043426 1224019 1148258
5101A148258N583n9837M2J39466J27033J1981L8072q7351J1840J02873J8742n0346
$$ 1148258 1153841 1094004 1094046 1233512 1360545 1372526 1410598 1323247 1335087 1437960 1456702 1406356
5089A406356l4303K2703m8467L7010j67220J01089M1679K04593m9707m7654J31930
$$ 1406356 1372053 1394756 1346289 1383299 1216079 1317168 1358847 1563440 1513733 1466079 1598009
5078A598009O4191K79118k8203K0860J16742q0947J0113J55443J65479j61178
$$ 1598009 1662200 1941318 1913115 1933975 2050717 1969770 1979883 2135326 2300805 2139627
5068B139627J81126K26604P4276J19924O9775K24778l3465j02153Q1562J81131
$$ 2139627 2320753 2547357 2621633 2741557 2811332 3036110 3002645 2900492 2982054 3163185
5058C163185L39527p1020o1307K2724L18736O0705J53404l8135O8263R2167L9505
$$ 3163185 3502712 3431692 3370385 3393109 3711845 3772550 3925954 3887819 3956082 4048249 4087754
5047D087754J72472m5517n0700k01161J25811N6013K68792J555P2272K7740J9609
$$ 4087754 4260226 4214709 4164009 3962848 4088659 4144672 4413464 4415019 4487291 4515031 4534640
5036D534640o053k3722l1890K6580j32034k15201Q3746J73236M8490p5103M1090
$$ 4534640 4528587 4504865 4472975 4499555 4367521 4152320 4236066 4409302 4457792 4382689 4423779
5025D423779m2703K59026J004j57303K01461L47239M387J94617q8042m9386L3382
$$ 4423779 4381076 4640102 4641106 4483803 4685264 5032503 5036890 5231507 5143465 5094079 5127461
5014E127461j7638L41349K71254L06002K54113J5605K16462K89818J80827J66507
$$ 5127461 5109823 5451172 5722426 6028428 6282541 6298146 6514608 6804426 6985253 7151760
5004G151760Q6659J07412L49833M32625J16043K20492J47220J57162L70767Q7206
$$ 7151760 7238419 7345831 7695664 8128289 8244332 8464824 8612044 8769206 9139973 9227179
4994I227179J84264N8453n4911J24529n0410J60509K83024o1089P4291J16807
$$ 9227179 9411443 9469896 9414985 9539514 9489104 9649613 9932637 9871548 9945839 10062646
4984A0062646K35541M3231R443J24029K00116K02996o3847K62514J49463O8436
$$ 10062646 10298187 10341418 10350861 10474890 10675006 10878002 10814155 11076669 11226132 11294568
4974A1294568J6030L18943J96869J90559N17355N25500M18049M89743L60927N50293
$$ 11294568 11310598 11629541 11826410 12016969 12534324 13059824 13477873 13967616 14328543 14878836
4964A4878836P63636P16021J131435J216091J173108J491973J704477K100272
$$ 14878836 15642472 16358493 17489928 18706019 19879127 21371100 23075577 25175849
4956B5175849K303023K821480L180488K560481J795031J208971j66410j477017
$$ 25175849 27478872 30300352 33480840 36041321 37836352 39045323 38878913 37401896
4948C7401896j989563k368301k003905j832499j530376r27945o71595m95685k60143
$$ 37401896 35412333 33044032 31040127 29207628 27677252 26749307 26077712 25582027 25321884
4939B5321884J59835J53065O9744L47358O06313P49602R26236J346413J790008
$$ 25321884 25481719 25634784 25704528 26051886 26658199 27407801 28334037 29680450 31470458
4930C1470458J969299K404500K965735L216977L870184M575251N143243O410542
$$ 31470458 33439757 35844257 38809992 42026969 45897153 50472404 55615647 62026189
4922F2026189P584853Q679630Q687389P183507L798794j097698n415007q257515
$$ 62026189 69611042 78290672 86978061 94161568 97960362 96862664 91447657 83190142
4914H3190142r182227q575860p494448o161862m654336l681333l040773k231246
$$ 83190142 74007915 65432055 57937607 51775745 47121409 43440076 40399303 38168057
4906C8168057j689687j338805p36960m25169o5847R0043N27117P60808J108907
$$ 38168057 36478370 35139565 34402605 33977436 33911589 34001632 34528749 35289557 36398464
4897C6398464J612202J895142K483611K823730L363194M015817M826158N785329
$$ 36398464 38010666 39905808 42389419 45213149 48576343 52592160 57418318 63203647
4889F3203647P192758Q365586Q528009P287682M038192j86106n113365q464037
$$ 63203647 70396405 78761991 87290000 94577682 98615874 98429768 93316403 84852366
4881H4852366j0083548r973514q658394p084380n613488m527414l524280k767749
$$ 84852366 74768818 64795304 56136910 49052530 43439042 38911628 35387348 32619599
4873C2619599k371182j934979j555385j170356r60678o08234o89899m60277j18345
$$ 32619599 30248417 28313438 26758053 25587697 24627019 24018785 23328886 22868609 22750264
4864B2750264m538R6196L32037P25891P91945J014833J373800J491383K071881
$$ 22750264 22745726 22841922 23173959 23899850 24691795 25706628 27080428 28571811 30643692
4855C0643692K570496K451942K153053J147084k77746j603659k619771l257362
$$ 30643692 33214188 35666130 37819183 38966267 38688521 37084862 34465091 31207729
4847C1207729l186389k957731k566297k059680j936391j618977j126751p50098
$$ 31207729 28021340 25063609 22497312 20437632 18501241 16882264 15755513 15005415
4839A5005415p85214r34353n96278o21654m04469l71105l32836l87134j28368
$$ 15005415 14220201 13285848 12689570 12067916 11663447 11292342 10959506 10572372 10444004
4830A0444004k25317j30942k69989l25850k90816j05455j02417k36670k82829
$$ 10444004 10218687 10087745 9817756 9491906 9201090 9095635 8993218 8756548 8473719
4821H473719m02453k58560j95583o3963l56967j61628N8881j72811l0283j73902
$$ 8473719 8071266 7812706 7617123 7553160 7196193 7034565 7093446 6920635 6890352 6716450
4811F716450j02747P1474k00047L3807l10013O9973L0953l2893J13897m21461
$$ 6716450 6613703 6685177 6485130 6518937 6208924 6278897 6309850 6276957 6390854 5969393
4801E969393k8808k54288n8883K15622j10652j94203k48257Q1906k9840J3062
$$ 5969393 5940585 5686297 5627414 5843036 5732384 5538181 5289924 5371830 5341990 5355052
4791E355052P4356r0115l0884J79854Q6584j63925Q272p152p3035l1748o3212
$$ 5355052 5429408 5339293 5308409 5488263 5574847 5410922 5419194 5412042 5339007 5307259 5244047
4780E244047p8822K38134k04972l10548j56571k2447K3492j03892J79471J41344
$$ 5244047 5165225 5403359 5198387 4887839 4731268 4708821 4732313 4628421 4807892 4949236
4770D949236P478j71634J85930J11184L9917j98134j74080j05550j39183R0180
$$ 4949236 4956714 4785080 4971010 5082194 5122111 4923977 4749897 4644347 4505164 4595344
4760D595344K6103q3187J13997J25464k73845j49330j4228m3384j60763j525l1591
$$ 4595344 4621447 4538260 4652257 4777721 4503876 4354546 4340318 4296934 4136171 4134646 4103055
4749D103055n9311k9225L4373N8361j15723j85930n0355q2129j95913j10972J29338
$$ 4103055 4043744 4014519 4048892 4107253 3991530 3805600 3755245 3673116 3477203 3366231 3495569
4738C495569j8966j0032k19061J33424J62331m4087P8786J52743j938k13096o8285
$$ 3495569 3476603 3466571 3247510 3380934 3543265 3499178 3577964 3730707 3728769 3515673 3447388
4727C447388M0962N6118j56474J33287K66511J00181Q3457P25j85630n9425l7154
$$ 3447388 3488350 3544468 3387994 3521281 3787792 3887973 3971430 3972155 3786525 3727100 3689946
4716C689946p0303j28089J09571l2380J3323O5601l1825J05024j45213n6569j01073
$$ 3689946 3619643 3491554 3601125 3568745 3582068 3647669 3615844 3720868 3575655 3519086 3418013
4705C418013p1289L0998k51570j59194j75266O8025M5393n0878k36106j67105
$$ 3418013 3346724 3377722 3126152 2966958 2791692 2859717 2905110 2854232 2618126 2451021
4695B451021j94897J38869j91046j62509K5109m3730J4648j28624j55742J07207
$$ 2451021 2256124 2394993 2203947 2041438 2066547 2022817 2037465 1908841 1753099 1860306
4685A860306Q0012j94867j93157J66329J02677m6177J62629j51478k29468j17030
$$ 1860306 1940318 1745451 1552294 1718623 1821300 1775123 1937752 1786274 1556806 1439776
4675A439776L08856o5790J66097Q4449l1115j71125J17486L7052K6813Q3043K46574
$$ 1439776 1748632 1682842 1848939 1933388 1902273 1731148 1848634 1885686 1912499 1995542 2242116
4664B242116L1104P0061l1993P6583J18354M3879K24950M3630K30123p5684j618
$$ 2242116 2273220 2343281 2311288 2387871 2506225 2550104 2775054 2818684 3048807 2973123 2971505
4653B971505j05082K2806k27547O3976J03188j0284j65918n8926P5247k3040O1011
$$ 2971505 2866423 2889229 2661682 2725658 2828846 2818562 2652644 2593718 2668965 2645925 2706936
4642B706936n5531r3836J80853k08880j74898J6977o4917j16666j07962j21452
$$ 2706936 2651405 2557569 2738422 2529542 2354644 2371621 2306704 2190038 2082076 1960624
4632A960624j78012O5085j51810N7792n3936J176O547l56048q0968J26848j5649
$$ 1960624 1782612 1847697 1695887 1753679 1699743 1700919 1707466 1351418 1270450 1397298 1381649
4621A381649L065m8065l4554J35500m6314O4432j60346n5589P5417M0167Q6562
$$ 1381649 1384714 1336649 1302095 1437595 1391281 1455713 1295367 1239778 1315195 1355362 1441924
4610A441924p3473j2369j27030r987q9697L1652J55220j58576J37783k6620M5769
$$ 1441924 1368451 1356082 1229052 1219065 1129368 1161020 1316240 1157664 1295447 1268827 1314596
4599A314596n3925l3888K92816N4496j74514L7159J19993j51838q2106K6159j2075
$$ 1314596 1260671 1226783 1519599 1574095 1399581 1436740 1556733 1404895 1322789 1348948 1336873
4588A336873o4399r782j53533K6317l0461M9341j04524J05032J2934o5549Q4506
$$ 1336873 1272474 1262692 1109159 1135476 1105015 1154356 1049832 1154864 1167798 1102249 1186755
4577A186755J62464j53564j1633k9097N476j0708r8357j564p6705j1441M17121
$$ 1186755 1349219 1195655 1184022 1154925 1160401 1149693 1051336 1049772 973067 961626 1378747
4566A378747J42553M0306J63618m2981L455k2679r4731k00248Q0890j5360j6903
$$ 1378747 1521300 1561606 1725224 1682243 1685698 1663019 1568288 1368040 1448930 1433570 1416667
4555A416667j1303q532p5965l3142M784J11190j12942k41342o8987J34015K00976
$$ 1416667 1405364 1396832 1320867 1287725 1292509 1403699 1290757 1049415 980428 1114443 1315419
4544A315419k09542o8224j71824m6204O2042p8179J64855l9886j9318K23410K9104
$$ 1315419 1105877 1037653 865829 819625 881667 803488 968343 928457 909139 1132549 1161653
4533A161653j30679o8124L2439J85374q5668l5276K1824J52572L490j23841J35502
$$ 1161653 1030974 962850 995289 1180663 1094995 1059719 1081543 1234115 1237605 1113764 1249266
4522A249266P5313j40084j06581K62270q0917k25676O987L716J12882R2638k8499
$$ 1249266 1324579 1184495 1077914 1340184 1259267 1033591 1040578 1044294 1157176 1249814 1221315
4511A221315q9249M0103L2774J03444K7794j6967o5716j03376j3160J98657R80
$$ 1221315 1132066 1172169 1204943 1308387 1336181 1319214 1253498 1150122 1136962 1335619 1336599
4500A336599j46258o5231q576M8866l838R6895M516j45503J68363j0624o3090
$$ 1336599 1190341 1125110 1116534 1165400 1161562 1258457 1262973 1117470 1285833 1275209 1212119
4489A212119J02398L6176L9785N1912L9265j22925r1905J77303l0858L2588J58750
$$ 1212119 1314517 1350693 1390478 1442390 1481655 1358730 1266825 1444128 1413270 1445858 1604608
4478A604608P9508P9202K9029M6609K0214J11841J06968J9561o3815K28082N6166
$$ 1604608 1684116 1763318 1792347 1838956 1859170 1971011 2077979 2097540 2033725 2261807 2317973
4467B317973j40226j95547K54911M5147j41588m9410j48838l9205j43893p5002
$$ 2317973 2177747 1982200 2237111 2282258 2140670 2091260 1942422 1903217 1759324 1684322
4457A684322R8437M6422o2405n3304P8002J27958j63456N7583k2352k20049J8202
$$ 1684322 1782759 1829181 1766776 1713472 1791474 1919432 1755976 1813559 1791207 1571158 1589360
4446A589360j5431j69964K96158m0919j34651N6451m3110j79328Q2282K05208
$$ 1589360 1573929 1403965 1700123 1659204 1524553 1581004 1537894 1358566 1440848 1646056
4436A646056J97282J5619r1504Q797O9563J60885J61688L61227n9984K6035O0431
$$ 1646056 1843338 1858957 1767453 1776250 1845813 2006698 2168386 2529613 2469629 2495664 2556095
4425B556095j8353o9079O3319q5937k5979r722o3634P8187q9844J1044J8287M7010
$$ 2556095 2537742 2468663 2531982 2446045 2420066 2410344 2346710 2424897 2335053 2346097 2364384 2411394
4413B411394L4499J35570P1943j22232K9792K39013L32555O7592j07036k93040
$$ 2411394 2445893 2581463 2653406 2531174 2560966 2799979 3132534 3200126 3093090 2800050
4403B800050q794N1261r9394l57577j33842j18671j88575O354k41801p8727K4777
$$ 2800050 2791256 2842517 2743123 2385546 2251704 2133033 1944458 1950812 1709011 1630284 1655061
4392A655061Q0664m3255p2417L2763K42088j70545L2573p6677r1985O7127j11326
$$ 1655061 1735725 1692470 1620053 1652816 1894904 1724359 1756932 1680255 1588270 1655397 1544071
4381A544071J06412K3286M8978Q6518J72562k25654j2549K55782K09453o0064
$$ 1544071 1650483 1673769 1722747 1809265 1981827 1756173 1743624 1999406 2208859 2148795
4371B148795p7326j6111J47516K28571J01833J8631J30522L2129J49065j55359
$$ 2148795 2071469 2055358 2202874 2431445 2533278 2551909 2682431 2714560 2863625 2708266
4361B708266j39262k6943k22969P8279j98848q5127j62789o2319J27579J03605
$$ 2708266 2569004 2542061 2319092 2397371 2198523 2113396 1950607 1888288 2015867 2119472
4351B119472k09003j91861J6488N0057J06219o3634j12067Q7784Q8643J2761n1604
$$ 2119472 1910469 1718608 1735096 1785153 1891372 1827738 1715671 1803455 1892098 1904859 1853255
4340A853255M3739J063m6095J16703j34982m6955r4489p5765m6709N5134P1781
$$ 1853255 1896994 1898057 1851962 1968665 1833683 1786728 1692239 1616474 1569765 1624899 1696680
4329A696680k16331j54741j4466L3179l8807K30326j85312M6962J07372k7659
$$ 1696680 1480349 1325608 1311142 1344321 1305514 1535840 1350528 1397490 1504862 1477203
4319A477203p7727M3053J67914r1538J96962J17416Q4710k02895j21672M6171
$$ 1477203 1399476 1442529 1610443 1518905 1715867 1833283 1917993 1715098 1593426 1639597
4309A639597K2360J10504j4302K8995n1291J67146J77324j51569j9397l4918P1867
$$ 1639597 1661957 1772461 1758159 1787154 1735863 1903009 2080333 1928764 1909367 1874449 1946316
4298A946316l6692j79644O7343o9073K9459l5032m7185o2194K2277j56516o9476
$$ 1946316 1909624 1729980 1797323 1728250 1757709 1722677 1675492 1613298 1635575 1479059 1409583
4287A409583P0361J30315K49163j92355j64181J445J23262L2722j23648k3966
$$ 1409583 1479944 1610259 1859422 1667067 1502886 1504331 1627593 1660315 1536667 1512701
4277A512701J40471j5087p0665L1894K42392k07199j6185p3058j28996K00966
$$ 1512701 1653172 1638085 1567420 1599314 1841706 1634507 1618322 1545264 1416268 1617234
4267A617234j16681J9619J41495L24509j69178L6996J60441l24904L305o266Q2340
$$ 1617234 1500553 1520172 1661667 1986176 1816998 1853994 2014435 1689531 1692836 1686570 1768910
4256A768910P0658J51420o1179j3071j97022K38096L0040l2479J4697j09199J13903
$$ 1768910 1839568 1990988 1929809 1916738 1719716 1957812 1987852 1955373 1970070 1860871 1974774
4245A974774j30014J40912J41956O0852J10776K60301M9686j84901m6919M3512
$$ 1974774 1844760 1985672 2127628 2188480 2299256 2559557 2609243 2424342 2377423 2420935
4235B420935j13092K29132Q8368l646J1047j22831J22296J86781k1640j74928
$$ 2420935 2307843 2536975 2625343 2621697 2632744 2509913 2632209 2818990 2797350 2622422
4225B622422J31694J36763j77402Q4557p1384L1678K8895K4935K55760J98854
$$ 2622422 2754116 2890879 2713477 2798034 2726650 2758328 2787223 2812158 3067918 3266772
4215C266772k199J36227N4812j4271K778K93939N3652M5062J91488m6270J86631
$$ 3266772 3264573 3400800 3455612 3441341 3444119 3738058 3791710 3836772 4028260 3981990 4168621
4204D168621N8624J06856o4562l1399L50063j41011J72638L42043J3212N5768
$$ 4168621 4227245 4334101 4269539 4238140 4588203 4447192 4619830 4961873 4975085 5030853
4194E030853R0112M09251J45124K902J84911K20963J27055J79563L92351J99298
$$ 5030853 5120965 5530216 5675340 5678242 5863153 6084116 6211171 6390734 6783085 6982383
4184F982383M4069M69456N4481M07124N75142J57849M96795L00942J29090L64625
$$ 6982383 7026452 7495908 7550389 7957513 8532655 8690504 9187299 9488241 9617331 9981956
4174I981956O45229N99527O76071M61745M47702M41765N49973Q14128N45289P87370
$$ 9981956 10627185 11226712 11902783 12364528 12812230 13253995 13803968 14618096 15163385 15950755
4164A5950755O94047N78979Q50736Q99302P26337N93000Q42119J055777P71481
$$ 15950755 16644802 17223781 18074517 18973819 19700156 20293156 21135275 22191052 22962533
4155B2962533P89887R20355R81501J296757Q77030R88888J040236Q49369Q61309
$$ 22962533 23752420 24672775 25654276 26951033 27828063 28816951 29857187 30706556 31567865
4146C1567865M56593M74054N77859L34209N62317N54805O39062N14333L57882
$$ 31567865 32024458 32498512 33076371 33410580 33972897 34527702 35166764 35681097 36038979
4137C6038979N98967N21196P57642N06682P0363j05135k20925o38414n66417m85582
$$ 36038979 36637946 37159142 37916784 38423466 38493829 38388694 38167769 37529355 36962938 36477356
4127C6477356n41656l89345l45785k84559l3349m98660m22920m97817n07525m68992
$$ 36477356 35935700 35546355 35200570 34916011 34882662 34384002 33961082 33463265 32955740 32486748
4117C2486748p50938r69409j003912r58256q10932q47718q66020q26130o29268
$$ 32486748 31735810 30766401 29762489 28804233 27993301 27145583 26279563 25453433 24824165
4108B4824165n69683n87004n17983n62902o93763o08570m67526n32631o93447
$$ 24824165 24254482 23667478 23149495 22586593 21892830 21284260 20816734 20284103 19590656
4099A9590656o46978o94971o31126k91981o02152m32399m58740l31855k13642
$$ 19590656 18943678 18248707 17617581 17325600 16723448 16291049 15832309 15500454 15286812
4090A5286812m02250l20369m80276k17350j79862l01862j29870n42815l86008
$$ 15286812 14884562 14564193 14083917 13866567 13686705 13384843 13254973 12712158 12326150
4081A2326150k39058r6383j24286k71756l73423j42583j61744k06604j66406N66
$$ 12326150 12087092 11990709 11866423 11594667 11221244 11078661 10916917 10710313 10543907 10544473
4071A0544473k13194l28979l02229j90369n6849P9970k62203q2120j16944k52625
$$ 10544473 10331279 10002300 9700071 9509702 9452853 9532823 9270620 9188500 9071556 8818931
4061H818931P7456r7936p072k6922j08370k02893j13599J92679k30530k60902
$$ 8818931 8896387 8798451 8791379 8764457 8656087 8453194 8339595 8532274 8301744 8040842
4051H040842J6989R2087L3117j0323j7908P249J67414k058k3545k7410j5365r4952
$$ 8040842 8057831 8149918 8183035 8172712 8154804 8162053 8329467 8327409 8303864 8276454 8261089 8166137
4039H166137n9485j41824J38903j63957N0492N9116l3475l8964k11110j66924
$$ 8166137 8106652 7964828 8103731 7939774 7990266 8049382 8015907 7976943 7765833 7598909
4029G598909j82381Q4020N0756n0270P6009L8314j21737p5930k84447m8145P8613
$$ 7598909 7416528 7500548 7551304 7501034 7577043 7615357 7493620 7417690 7133243 7085098 7163711
4018G163711n4725k37279j96680J93360j97062j74819j34108o4267j08549j13540
$$ 7163711 7108986 6871707 6675027 6868387 6671325 6496506 6362398 6298131 6189582 6076042
4008F076042q8839j52254M3230k9047l12431j71850N7037j28311k03758l6129
$$ 6076042 5987203 5834949 5878179 5849132 5536701 5364851 5421888 5293577 5089819 5053690
3998E053690J33728j92312k2696r2859j00007p0925l0449o2926j0642j50684m20313
$$ 5053690 5187418 4995106 4972410 4879551 4779544 4708619 4678170 4615244 4604602 4453918 4033605
3987D033605Q8649O5516j87577j06825J3170n3646n1825k76058m7414k1343j01036
$$ 4033605 4122254 4187770 4000193 3893368 3906538 3852892 3801067 3525009 3477595 3456252 3355216
3976C355216P8058L7790p4687j49466K24082j21453j2438p0123M2426J0208l7037
$$ 3355216 3433274 3471064 3396377 3246911 3470993 3349540 3337102 3266979 3309405 3319613 3282576
3965C282576j57699j24303K08586p6522m2557k03837k5185L51149j50404j69334
$$ 3282576 3124877 3000574 3209160 3132638 3090081 2886244 2861059 3212208 3061804 2892470
3955B892470m6764n4999K36470L4501J55731R4519O7562p45l0305r0952Q0044
$$ 2892470 2845706 2790707 3027177 3061678 3217409 3311928 3379490 3378745 3348440 3257488 3337532
3944C337532Q2789O3615J2477k41381J20511J62623N1754m1153J47556m937Q8206
$$ 3337532 3420321 3483936 3496413 3255032 3375543 3538166 3589920 3548767 3696323 3691386 3779592
3933C779592M7172l6310Q1254q441j12375N6330R2531j0913j102K16432K30721
$$ 3779592 3826764 3790454 3871708 3863267 3750892 3807222 3899753 3888840 3887738 4104170 4334891
3922D334891l32544J29348K06892J35048R6863J36345J55947P6752K4424K68928
$$ 4334891 4002347 4131695 4338587 4473635 4570498 4706843 4862790 4939542 4963966 5232894
3912E232894J01834P1279K97686J59802L4798J08780K97541J50946J00464L40775
$$ 5232894 5334728 5406007 5703693 5863495 5898293 6007073 6304614 6455560 6556024 6896799
3902F896799K01300K78028L20182P26243P63194P31534J055220J018376Q08835
$$ 6896799 7098099 7376127 7696309 8422552 9185746 9917280 10972500 11990876 12799711
3893A2799711J502681J630340J847370K910209L607289K935907K273060M60273
$$ 12799711 14302392 15932732 17780102 20690311 24297600 27233507 29506567 29966840
3885B9966840j627088k769989l265686l157655l149991k066988j475840j206677
$$ 29966840 28339752 25569763 22304077 19146422 15996431 13929443 12453603 11246926
3877A1246926q47213o92327m37650j88577o09661m72517k47179J19920o6817j72695
$$ 11246926 10399713 9707386 9269736 9081159 8471498 7998981 7751802 7871722 7804905 7632210
3867G632210J164K9901J1199k69784l24895j07480l16866P0455k4959J43638m0807
$$ 7632210 7633374 7663275 7674474 7404690 7079795 6972315 6655449 6725904 6700945 6844583 6803776
3856F803776k141r7460K580J94015k0108J31712P071j26941M2583O087J92745
$$ 6803776 6801635 6704175 6706755 6900770 6880662 7012374 7019445 6892504 6935087 6941174 7133919
3845G133919r4310J51312J48841J9920L86741P1721K59098O1831j9538L63847
$$ 7133919 7039609 7190921 7339762 7359682 7746423 7818144 8077242 8139073 8119535 8483382
3835H483382K06982J61516J18259J73773K01845J76162J93985J97201K40737j09307
$$ 8483382 8690364 8851880 8970139 9143912 9345757 9521919 9715904 9913105 10153842 10044535
3825A0044535K42963L0532M40298J85125J40252K37112J81352K73475J20213J51197
$$ 10044535 10287498 10318030 10758328 10943453 11083705 11320817 11502169 11775644 11895857 12047054
3815A2047054K01173K14230K57733K38215M15730L96616L04507J98639K62510
$$ 12047054 12248227 12462457 12720190 12958405 13374135 13770751 14075258 14273897 14536407
3806A4536407L25760K71440N00719L51671M31839K89416J05256J44056L40636
$$ 14536407 14862167 15133607 15634326 15985997 16417836 16707252 16812508 16956564 17297200
3797A7297200L40543K35084K08213J94715L007K3423n2355O1382j89978J29320
$$ 17297200 17637743 17872827 18081040 18275755 18278762 18302185 18249830 18311212 18121234 18250554
3787A8250554J35542o5334q0288o2541j11811l34130j50019k88976l53216l25316
$$ 18250554 18386096 18320762 18240474 18177933 18066122 17731992 17581973 17292997 16939781 16614465
3777A6614465m86478l72792j72946m12991m10380m55511l16761l94821n12131
$$ 16614465 16127987 15755195 15582249 15169258 14758878 14303367 13986606 13591785 13079654
3768A3079654l68170k45006k24816j83505j19600k88463k92857k55492j25518
$$ 13079654 12711484 12466478 12241662 12058157 11938557 11650094 11357237 11101745 10976227
3759A0976227l23474p5368j509k90641k09636k62817l62060k18671n5208k6041
$$ 10976227 10652753 10577385 10575876 10285235 10075599 9812782 9450722 9232051 9176843 9150802
3749I150802k00432r3356J40531j51241j14869P396q297j24079o3116M3796r0054
$$ 9150802 8950370 8857014 8997545 8846304 8731435 8738831 8730534 8606455 8543339 8587135 8497081
3738H497081o9573J20583K0151K11687j8662J57416j37487k9730K02295J7660
$$ 8497081 8427508 8548091 8568242 8779929 8761267 8918683 8781196 8751466 8953761 8971421
3728H971421j33995J06564k9061R3724J34856J67479M5552K9286p361j1007K51651
$$ 8971421 8837426 8943990 8914929 9008653 9143509 9310988 9356540 9385826 9378465 9367458 9619109
3717I619109q8586J5982K14006J48720m8711p72J54138J97127j74727R4929K51381
$$ 9619109 9530523 9546505 9760511 9909231 9860520 9859748 10013886 10211013 10036286 10131215 10382596
3706A0382596K17862J74533M0003J85068R1064J05119J53903J71191K70584Q5126
$$ 10382596 10600458 10774991 10814994 11000062 11091126 11196245 11350148 11521339 11791923 11877049
3696A1877049J57802J15347K04163J75643K89261R7247J28456j48599K94102K23515
$$ 11877049 12034851 12150198 12354361 12530004 12819265 12916512 13044968 12896369 13190471 13413986
3686A3413986k8777M06203L84999K00261L02355K74141K17463K99060J68287L53419
$$ 13413986 13385209 13791412 14176411 14376672 14679027 14953168 15170631 15469691 15637978 15991397
3676A5991397P4389L45844J95106K60764K63461L13841N37621J76978L17082K20785
$$ 15991397 16065786 16411630 16606736 16867500 17130961 17444802 17982423 18159401 18476483 18697268
3666A8697268J38471J37035J25222L72521J85010J60753M45986L51873Q281K05593
$$ 18697268 18835739 18972774 19097996 19470517 19655527 19816280 20262266 20614139 20622420 20828013
3656B0828013O79091M28976L76092M91417L66373N34046N17186N25040L54031
$$ 20828013 21507104 21936080 22312172 22803589 23169962 23704008 24221194 24746234 25100265
3647B5100265N69508P36698N54353M58113N26788N89253N88169N67896Q67366
$$ 25100265 25669773 26406471 26960824 27418937 27945725 28534978 29123147 29691043 30558409
3638C0558409R25646P47324P43310Q98055R63437R29386J186468J219315J308172
$$ 30558409 31484055 32231379 32974689 33872744 34836181 35765567 36952035 38171350 39479522
3629C9479522J411196J597343J629080K001191J922980J972771K240803K332691
$$ 39479522 40890718 42488061 44117141 46118332 48041312 50014083 52254886 54587577
3621E4587577K441837K912807L187934L149438L120784L513929L894988L905368
$$ 54587577 57029414 59942221 63130155 66279593 69400377 72914306 76809294 80714662
3613H0714662M106219M099995M234095M376348M410011M244810L768705L718015
$$ 80714662 84820881 88920876 93154971 97531319 101941330 106186140 109954845 113672860
3605A13672860K882515K309287J982040J138603K68659k3188l82399o04795o48248
$$ 113672860 116555375 118864662 120846702 121985305 122253964 122230776 121848377 121243582 120595334
3596A20595334q81417q47911q81243q39571j179956j626032j876639k489528l003792
$$ 120595334 119713917 118866006 117984763 117145192 115965236 114339204 112462565 109973037 106969245
3587A06969245l639638m163063m372196m674959m928995m796767m653802m616901
$$ 106969245 103329607 99166544 94794348 90119389 85190394 80393627 75739825 71122924
3579G1122924m082899l765919l637882l390258k832698k639542k431371k173364
$$ 71122924 67040025 63274106 59636224 56245966 53413268 50773726 48342355 46168991
3571D6168991j915734j926355j691680j440880j290859j161597j004305j091405
$$ 46168991 44253257 42326902 40635222 39194342 37903483 36741886 35737581 34646176
3563C4646176j063894q59751q69588p46210n54634n43605n48014o24300n42526
$$ 34646176 33582282 32722531 31852943 31106733 30552099 30008494 29460480 28836180 28293654
3554B8293654m38119l17018k01017m69280n01168l60556l18066k67800j71231
$$ 28293654 27855535 27538517 27337500 26868220 26367052 26006496 25688430 25420630 25249399
3545B5249399k87073n2610m32893o59287l07007l82217m32790k71339j08456l51930
$$ 25249399 24962326 24909716 24476823 23817536 23510529 23128312 22695522 22424183 22315727 21963797
3535B1963797k75445m82175n23588k43061j42271k63428j93815l04672j73035
$$ 21963797 21688352 21206177 20682589 20439528 20297257 20033829 19840014 19535342 19362307
3526A9362307j89263p726m8151r2534k09276Q7902K35710j72159O9734r4633q2223
$$ 19362307 19173044 19165318 19117167 19024633 18815357 18903259 19138969 18966810 19036544 18941911 18859688
3515A8859688J04016M3583J54537Q4911r8460L6030j36J07074K36488K56124j01124
$$ 18859688 18963704 19007287 19161824 19246735 19148275 19184305 19184169 19291243 19527731 19783855 19682731
3504A9682731m3981M6288j07487O8119K67176K50995l7376j01748L1287K248K25225
$$ 19682731 19638750 19685038 19577551 19645670 19912846 20163841 20126465 20024717 20056004 20058252 20283477
3493B0283477J74411j09047k6571Q3682J33807m1333P0780J4338K12854K08288
$$ 20283477 20457888 20348841 20322270 20405952 20539759 20498426 20569206 20583544 20796398 21004686
3483B1004686L17557L8533J84023J36810L67918L60084N0727K71246L61690L85419
$$ 21004686 21322243 21360776 21544799 21681609 22049527 22409611 22460338 22731584 23093274 23478693
3473B3478693K19611M33552N07195L34468L16369N77890K36178N85255P80375
$$ 23478693 23698304 24131856 24639051 24973519 25289888 25867778 26103956 26689211 27469586
3464B7469586Q53424N86707O48750R38568P75871Q08286R71027Q05755J018038
$$ 27469586 28323010 28909717 29558467 30497035 31272906 32081192 33052219 33857974 34876012
3455C4876012O96477J073382J098229Q75834R24924J255323J125841R31429N21564
$$ 34876012 35572489 36645871 37744100 38619934 39544858 40800181 41926022 42857451 43379015
3446D3379015L98993L39854J34816L03925l5213l0824L5192r8836K8131P4660
$$ 43379015 43778008 44117862 44252678 44556603 44521390 44490566 44525758 44426922 44455053 44529713
3436D4529713J48441L68448J81693M86216O76245R68452O90561P81570O53284
$$ 44529713 44678154 45046602 45228295 45714511 46390756 47359208 48049769 48831339 49484623
3427D9484623J166697J137586J149059J267927J499132J484974J733807K078780
$$ 49484623 50651320 51788906 52937965 54205892 55705024 57189998 58923805 61002585
3419F1002585J677484J947760K315866K634063K857303K993024L272087L718985
$$ 61002585 62680069 64627829 66943695 69577758 72435061 75428085 78700172 82419157
3411H2419157M164379M717922N039290N453659O216584O678126P241223P925870
$$ 82419157 86583536 91301458 96340748 101794407 108010991 114689117 121930340 129856210
3403A29856210Q227726R093056R297473R540452R430764R205398Q436902P723202
$$ 129856210 138083936 147176992 156474465 166014917 175445681 184651079 193087981 200811183
3395B00811183O725658N634284M438509K911409J308052J5901j281719k630204
$$ 200811183 207536841 213171125 217609634 220521043 221829095 221844996 220563277 217933073
3387B17933073l636451m596919n298019o390158o805061o933783p121865p182647
$$ 217933073 214296622 209699703 204401684 198011526 191206465 184272682 177150817 169968170
3379A69968170p309871o761701o593431o173827n692955n207102m328656l831285
$$ 169968170 162658299 155896598 149303167 143129340 137436385 132229283 127900627 124069342
3371A24069342l158740k177701j286546o33442L95079J002894K056583L231189
$$ 124069342 120910602 118732901 117446355 116812913 117207992 118210886 120267469 123498658
3363A23498658M256505N780857P080442P938093P387097N458352J809763k164390
$$ 123498658 127755163 133536020 140616462 148554555 155941652 161400004 163209767 161045377
3355A61045377n542473q322848r293926r142783p470796n942150m496001l195002
$$ 161045377 155502904 147180056 137886130 128743347 121272551 115330401 110834400 107639398
3347A07639398k157264j384585o18454K0470P55506J074276J387750K159985K556591
$$ 107639398 105482134 104097549 103479095 103499565 104255071 105329347 106717097 108877082 111433673
3338A11433673L269808M118670M546832N349625O016983O745183P898789R410975
$$ 111433673 114703481 118822151 123368983 128718608 134735591 141480774 149379563 158790538
3330A58790538J1452117J3634637J6131105J7886005J7204847J3357959N856950
$$ 158790538 170242655 183877292 200008397 217894402 235099249 248457208 254314158
3323B54314158k172909j0060119j6400288j9119477j8389637j5449473j2247828
$$ 254314158 252141249 242081130 225680842 206561365 188171728 172722255 160474427
3316A60474427q937578o673450m652321l006504j850381q25307K0098P78730J656396
$$ 160474427 151536849 144863399 140211078 137204574 135354193 134528886 134548984 135327714 136984110
3307A36984110K054337K845641L429281M305596N301290O117363O888299P593544
$$ 136984110 139038447 141884088 145313369 149618965 154920255 161037618 167925917 175519461
3299A75519461R092524J0250620J1497981J2998415J4314484J5555111J5326396
$$ 175519461 184611985 194862605 206360586 219359001 233673485 249228596 264554992
3292B64554992J3530604R928423N595962J226054l186354o445513q020481q067708
$$ 264554992 278085596 288014019 293609981 294836035 291649681 285204168 277183687 269115979
3284B69115979p509723o400644n103526m500587m081629l180094l025394l157275
$$ 269115979 261606256 255205612 250102086 245601499 241519870 238339776 235314382 232157107
3276B32157107l647815m674832n541633o351043p397460q392301q816703r352165
$$ 232157107 228509292 223834460 218292827 211941784 204544324 196152023 187335320 177983155
3268A77983155r613203r334920q998184q369306p881782p616168o422752n738217
$$ 177983155 168369952 159035032 150036848 141667542 133785760 126169592 119746840 114008623
3260A14008623n340829m783452m400355l873605l508983l046756k926199k514759
$$ 114008623 108667794 103884342 99483987 95610382 92101399 89054643 86128444 83613685
3252H3613685k339617j904641j935604j492348j517102j458771j290265j082687
$$ 83613685 81274068 79369427 77433823 75941475 74424373 72965602 71675337 70592650
3244G0592650j194075q84439q37925j121316p34602r53774q52018o67967n05910
$$ 70592650 69398575 68514136 67676211 66554895 65820293 64866519 64014501 63346534 62840624
3235F2840624p34566n58351k17738m03992n65625k41784j20566Q4091j56385J72252
$$ 62840624 62106058 61547707 61329969 60925977 60360352 60118568 59998002 60082093 59925708 60097960
3225F0097960j5702J87128M29869K90874O71774N41945M80899O79292P07269P51749
$$ 60097960 60082258 60269386 60699255 60990129 61661903 62203848 62684747 63364039 64071308 64823057
3215F4823057N11393L42500M74889M06712K60774P26059N71109N75431N95395
$$ 64823057 65334450 65676950 66151839 66558551 66819325 67545384 68116493 68691924 69287319
3206F9287319Q79091R19058R51442J032151J065607J248904J715088J648698J146544
$$ 69287319 70166410 71085468 72036910 73069061 74134668 75383572 77098660 78747358 79893902
3197G9893902J478334J209776N09169K22967j3666n00283r32906j317735j705658
$$ 79893902 81372236 82582012 83091181 83314148 83300482 82800199 81867293 80549558 78843900
3188G8843900k244417k216787k167588k194215k265985j909648j877515j596985
$$ 78843900 76599483 74382696 72215108 70020893 67754908 65845260 63967745 62370760
3180F2370760j692855j621579j244396j360863j417733j243456j255509r77153
$$ 62370760 60677905 59056326 57811930 56451067 55033334 53789878 52534369 51557216
3172E1557216r40203o21413m62631n98506m77319m25008j52707P6351J39969J91132
$$ 51557216 50617013 49995600 49532969 48934463 48457144 48032136 47879429 47955780 48095749 48286881
3162D8286881J96914N42686O87952N21074R00754Q97152J103201J177576J299183
$$ 48286881 48483795 49026481 49714433 50235507 51136261 52033413 53136614 54314190 55613373
3153E5613373J400270J186906J455439J513116J674764K527867K587695L141650
$$ 55613373 57013643 58200549 59655988 61169104 62843868 65371735 67959430 71101080
3145G1101080L593030L704463M151524M673446N071074N240412N473466N526051
$$ 71101080 74694110 78398573 82550097 87223543 92294617 97535029 103008495 108534546
3137A08534546N617423N176444N066750M776246M230364L360124K405432J434254
$$ 108534546 114151969 119328413 124395163 129171409 133401773 136761897 139167329 140601583
3129A40601583L64132m54423j609991k875412l891190m911622n979681o145585
$$ 140601583 140965715 140511292 138901301 136025889 132134699 127223077 121243396 115097811
3121A15097811o298377o474052o465450o147882o090012n413629n163345m785403
$$ 115097811 108799434 102325382 95859932 89712050 83622038 78208409 73045064 68259661
3113F8259661m075439l785967l577466k954466k476985k602866k306544k020881
$$ 68259661 64184222 60398255 56820789 53866323 51389338 48786472 46479928 44459047
3105D4459047j933872j859544j790847j629072j421165j366805j476367j218814
$$ 44459047 42525175 40665631 38874784 37245712 35824547 34457742 32981375 31762561
3097C1762561j241960j159866j022706j024874q57412j025139n63783p57455n41788
$$ 31762561 30520601 29360735 28338029 27313155 26455743 25430604 24866821 24109366 23567578
3088B3567578p35643o38185n01954m42398l11234k79111m28096k95956J60508
$$ 23567578 22831935 22193750 21691796 21249398 20938164 20659053 20230957 19935001 20095509
3079B0095509k86340j64781k04113o9910Q9251J33507Q78J13827K22659J9256
$$ 20095509 19809169 19644388 19440275 19370365 19459616 19593123 19594001 19707828 19930487 19949743
3069A9949743O8389K74913K37611j21558J61511J28988M6992j17023l37914m0309
$$ 19949743 20018132 20293045 20530656 20409098 20570609 20699597 20746589 20629566 20291652 20251343
3059B0251343k33320j49292J86126k04315j2447j04483j1990L9869r1296k69979
$$ 20251343 20018023 19868731 20054857 19850542 19838095 19733612 19721622 19761491 19670195 19400216
3049A9400216k30599j84925j12279l1217j19068k03491P3970k73109l58990K1133
$$ 19400216 19169617 18984692 18872413 18841196 18722128 18518637 18592607 18319498 17960508 17981641
3039A7981641k92765j36641k06196p9614K2683k85486k53559m53981j32989j67136
$$ 17981641 17688876 17552235 17346039 17266425 17289108 17003622 16750063 16296082 16163093 15995957
3029A5995957K7285l58747l94183j96795l07083j71560j92635l23902k15917r4740
$$ 15995957 16023242 15664495 15270312 15073517 14766434 14594874 14402239 14078337 13862420 13767680
3019A3767680j43980k15238m7563K7101n989r0436j89390J22977Q3432K4638j16692
$$ 13767680 13623700 13408462 13360899 13388000 13382011 13291575 13102185 13225162 13308594 13333232 13216540
3008A3216540J38869p7567J68235J47646J11737K07756J04801L25123J84200J37418
$$ 13216540 13355409 13277842 13446077 13593723 13705460 13913216 14018017 14343140 14527340 14664758
2998A4664758O8311o4934M6696M3119J15507K0152L05654l8864k9345Q84J45341
$$ 14664758 14733069 14668135 14714831 14757950 14873457 14893609 15199263 15160399 15131054 15131938 15277279
2987A5277279M5364K31591J49132P737N4943L13242K43537J31978J52236J61567
$$ 15277279 15322643 15554234 15703366 15711103 15766046 16079288 16322825 16454803 16607039 16768606
2977A6768606K28728K33580Q9910J32296L15784L69062K32529K30273N36192L19235
$$ 16768606 16997334 17230914 17320824 17453120 17768904 18137966 18370495 18600768 19136960 19456195
2967A9456195J51739L71415J05159L99714M01316L43737K72932L01050M53558
$$ 19456195 19607934 19979349 20084508 20484222 20885538 21229275 21502207 21803257 22256815
2958B2256815M21656M60427L81345M12753N34356M96487M22464O77937M73493
$$ 22256815 22678471 23138898 23520243 23932996 24467352 24963839 25386303 26064240 26537733
2949B6537733N87030P34692N06573O20245P32672Q76562O15103N46306O84262
$$ 26537733 27124763 27859455 28366028 28986273 29718945 30595507 31210610 31756916 32441178
2940C2441178O83253O28067P99448J042777Q05157Q87785Q71127Q37411R67261
$$ 32441178 33124431 33752498 34551946 35594723 36399880 37287665 38158792 38996203 39963464
2931C9963464J042534R00063J136987R40838J068680J041717J134035J443465
$$ 39963464 41005998 41906061 43043048 43983886 45052566 46094283 47228318 48671783
2923D8671783J351471J467286J533717J518564J794476J706079J927928K012010
$$ 48671783 50023254 51490540 53024257 54542821 56337297 58043376 59971304 61983314
2915F1983314K123252K017389K371744K543679K695531K812459K831631L158494
$$ 61983314 64106566 66123955 68495699 71039378 73734909 76547368 79378999 82537493
2907H2537493L473348L535180L628733M068408M569463M889093N191332N917378
$$ 82537493 86010841 89546021 93174754 97243162 101812625 106701718 111893050 117810428
2899A17810428O756205P458371Q538450R557573J0856271J2255410J4054236J5776612
$$ 117810428 124566633 132025004 140563454 150121027 160977298 173232708 187286944 203063556
2891B03063556J7706182J9802010K2192430K4919001K7644845L0825302L3348451
$$ 203063556 220769738 240571748 262764178 287683179 315328024 346153326 379501777
2884C79501777L4538937L2478132K6899840J7474916M744030q472559k0493783
$$ 379501777 414040714 446518846 473418686 490893602 495637632 487165073 466671290
2877D66671290k9444915l4284304l5173477l2811270k8559937k4165721k0290778
$$ 466671290 437226375 402942071 367768594 334957324 306397387 282231666 261940888
2870B61940888j7002053j4172364j2120303j0520299q988509p999457p431810
$$ 261940888 244938835 230766471 218646168 208125869 199137360 191137903 183706093
2863A83706093o738682n912816n091594m568276l929531l660028l714617l074183
$$ 183706093 176967411 171054595 165963001 161394725 157465194 153805166 150090549 147016366
2855A47016366l145623l267179l495173l557919l731442l102108k718905k210370
$$ 147016366 143870743 140603564 137108391 133550472 129819030 126716922 123998017 121787647
2847A21787647j644751j209901o37710q72445j187159j364408j782624j965474
$$ 121787647 120142896 118932995 118295285 117422840 116235681 114871273 113088649 111123175
2839A11123175j621245j052509o11215n12831q74084q50645j619156k087699k501299
$$ 111123175 109501930 108449421 107838206 107325375 106451291 105600646 103981490 101893791 99392492
2830I9392492k553718k429476k167901j490678j557371j024674r76167j221335
$$ 99392492 96838774 94409298 92241397 90750719 89193348 88168674 87192507 85971172
2822H5971172j469161j711018k319238k867278l204157l086756l353902l186534
$$ 85971172 84502011 82790993 80471755 77604477 74400320 71313564 67959662 64773128
2814F4773128k989970l005323l014899k752533l076153k734816k735075k887614
$$ 64773128 61783158 58777835 55762936 53010403 49934250 47199434 44464359 41576745
2806D1576745k554217k245059k066447k006289j763381j472380j492600j185839
$$ 41576745 39022528 36777469 34711022 32704733 30941352 29468972 27976372 26790533
2798B6790533j160267j277438j018389j131974q88864p30996q13911q56581o37951
$$ 26790533 25630266 24352828 23334439 22202465 21313601 20582605 19768694 18912113 18274162
2789A8274162o13873o72796o81344o48105m86245o14573o95162n62763n56521
$$ 18274162 17660289 16987493 16306149 15658044 15171799 14557226 13862064 13299301 12742780
2780A2742780j29205l11170n19107q1482k33289m59197l09863o55485j97244k79395
$$ 12742780 12613575 12302405 11783298 11701816 11468527 11009330 10699467 10043982 9846738 9567343
2770I567343m60140j91008l99576l75300l0949j82210k87674k90131L6275k01740
$$ 9567343 9107203 8916195 8516619 8141319 8110370 7928160 7640486 7350355 7386630 7184890
2760G184890l05390O460J48693l68529k39077m1385M9421k733k03292l01223k52812
$$ 7184890 6879500 6885960 7034653 6666124 6427047 6385662 6435083 6432350 6229058 5927835 5675023
2749E675023K6293Q6110l17021m04500O8590k81945j49520j7298j14985K7754
$$ 5675023 5701316 5787426 5470405 5065905 5134495 4852550 4703030 4685732 4570747 4598501
2739D598501n9316p5807p1804m2075l28423j88784k00891L479j32304J0776m7502
$$ 4598501 4539185 4463378 4391574 4349499 4021076 3832292 3631401 3634880 3502576 3513352 3465850
2728C465850M3569J05626k32707k02297J4588m3865q3895m4347j34573J79700
$$ 3465850 3509419 3615045 3382338 3180041 3194629 3150764 3066869 3022522 2887949 3067649
2718C067649R6959k37916k35377n5396q0668R1679J69633n6868k23305k16276
$$ 3067649 3164608 2926692 2691315 2635919 2555251 2646930 2816563 2759695 2536390 2320114
2708B320114q2723n3918o5854N8767J33025q058k62803j64433P3092m2532n5748
$$ 2320114 2237391 2183473 2117619 2176386 2309411 2301353 2038550 1874117 1947209 1904677 1848929
2697A848929J99707j51135o5140k4288j9280j43866J44042J33894k04434k38003
$$ 1848929 2048636 1897501 1832361 1808073 1788793 1644927 1788969 1922863 1718429 1480426
2687A480426J33491j07867J9529k2250k01337j7700J89786j51463K028n0719Q7058
$$ 1480426 1613917 1506050 1525579 1503329 1301992 1284292 1474078 1322615 1324643 1273924 1360982
2676A360982j27184j56275k61761Q5344j12530o2100K84333l0220m6333M260k6588
$$ 1360982 1233798 1077523 815762 901106 788576 726476 1010809 980589 934256 938516 911928
2665I11928k9166J12226J92537P5416k84913j61632j43696N6095R7218m6086M6089
$$ 911928 882762 994988 1187525 1262941 978028 816396 672700 728795 826013 779927 826016
2654H26016j03966N2928J27465K9680j57959j70065N0272o6271J77159j851N2532
$$ 826016 722050 774978 902443 932123 774164 604099 654371 588100 765259 763408 815940
2643H15940j61566Q9752l9537k93110J53491o1005Q6187J87200k58203O5514l2579
$$ 815940 654374 744126 704589 411479 564970 503965 590152 777352 519149 584663 552084
2632E52084J0954k2097M9225r6658j97614P8228K7028R4533J88537o0024p1982
$$ 552084 563038 540941 590166 493508 295894 374122 401150 495683 684220 624196 552214
2621E52214q2927k58493J36912Q1357J16481J06653j62305Q1671K16842J22741
$$ 552214 469287 210794 347706 429063 545544 652197 489892 571563 788405 911146
2611I11146N9935K26355J00635p7056J13392P5281J21358N8737J76744J77856
$$ 911146 971081 1197436 1298071 1221015 1334407 1409688 1531046 1589783 1766527 1944383
2601A944383q1466K84995J27921J24517K39736L5493j25979P2392o0505k06919
$$ 1944383 1862917 2147912 2275833 2400350 2640086 2675579 2549600 2621992 2561487 2354568
2591B354568p8543r9544j42285j96790k43075l9607r2745Q3592j04125j81932
$$ 2354568 2276025 2176481 2034196 1837406 1594331 1554724 1461979 1545571 1441446 1259514
2581A259514q8942j19485n0423o3547n1410n548j57054R676J08565m0517M7354
$$ 1259514 1170572 1051087 1000664 937117 885707 880159 723105 732781 841346 800829 848183
2570H48183j23877r3430K70q19P4540r722J3877O3444n4106L5480r5917J32269
$$ 848183 724306 630876 631146 630327 704867 695145 709022 772466 718360 753840 657923 790192
2558G90192p8856j37354j66474o5603J47269q2002k3247J50606l0725N5465l8037
$$ 790192 711336 573982 407508 341905 489174 407172 383925 534531 503806 559271 521234
2547E21234p5220k4078J24885M5735J2736k29896m7051O7433R4548N4916n5851
$$ 521234 446014 421936 546821 592556 605292 375396 328345 395778 490326 545242 489391
2536D89391k0114j07980L0960o1062J20573p4640l2891j38422n7157J07501Q300
$$ 489391 469277 361297 392257 331195 451768 377128 344237 205815 148658 256159 264459
2525B64459L7155M2o6645j50140n0300J43841k78882L8678J87318j8532O166q3495
$$ 264459 301614 301656 235011 84871 34571 178412 -100470 -61792 125526 106994 113160 29665
2513B9665J54917J00090q5577j42274l5474J04574r6093j26255M2180J62377q747
$$ 29665 184582 284672 199095 56821 21347 125921 29828 -96427 -54247 108130 99383
2502I9383P8125J51749j13817r4192n2954k6406l2150r1639k23550j51427K9211
$$ 99383 177508 329257 215440 121248 68294 41888 9738 -81901 -305451 -456878 -427667
2491d27667J24550j8125j9820L8282j34108M6328P387n4744l6958m2710j39179
$$ -427667 -303117 -321242 -341062 -302780 -436888 -390560 -383173 -437917 -474875 -517585 -656764
2480f56764M6739K22903K7411j30600k1355n6459N1335j09830o3814J27804P08
$$ -656764 -610025 -387122 -359711 -490311 -511666 -568125 -516790 -626620 -690434 -562630 -561922
2469e61922j04047R3287L40896j00927l03768O483P2507m0215K1495J28338J23437
$$ -561922 -665969 -572682 -231786 -332713 -636481 -629998 -557491 -597706 -576211 -447873 -324436
2458c24436o8035Q5473j7306M4553L9856l4998j67622J56855J48779l9138k30896
$$ -324436 -392471 -306998 -324304 -279751 -239895 -274893 -442515 -285660 -136881 -176019 -406915
2447d06915p1246K6391j39067k8940L0774K4604J6309j17243M9414j40742K10561
$$ -406915 -478161 -451770 -590837 -619777 -589003 -564399 -548090 -665333 -615919 -756661 -546100
2436e46100R3981J42507o4851j02417l4654j43783J14123j27234J56267o2270
$$ -546100 -452119 -309612 -374463 -476880 -511534 -655317 -541194 -668428 -512161 -574431
2426e74431j03976J5705n6030P3114K17097n4262n4347R6969O3426k05870k1751
$$ -574431 -678407 -662702 -718732 -645618 -428521 -482783 -537130 -440161 -376735 -582605 -604356
2415f04356J29017k0999J5221j66472j09088j63294K14656K6340J28638n8970
$$ -604356 -475339 -496338 -481117 -647589 -756677 -919971 -705315 -678975 -550337 -609307
2405f09307j70278P2140J0338J72905Q7350M6874n166p2360l2754R3936j42626
$$ -609307 -779585 -707445 -697107 -524202 -436852 -389978 -395144 -467504 -500258 -406322 -548948
2394e48948N8570m512q337o7998j2436J37262q8101n8563J44942l40821j24903
$$ -548948 -490378 -494890 -503227 -571225 -583661 -446399 -534500 -593063 -448121 -788942 -913845
2383i13845K6788J41834j19776P6457L7170J5764N4955q1095r9460L1700K00026
$$ -913845 -887057 -745223 -864999 -788542 -751372 -735608 -680653 -761748 -861208 -829508 -629482
2372f29482K7304j67291L79J8776m0125J53692O5387R3225j0223P6449J20359
$$ -629482 -602178 -769469 -769090 -750314 -790439 -636747 -571360 -478135 -488358 -411909 -291550
2361b91550k19642j62804O7610j11566R7114o282K30238O0596j33941R0155J9851
$$ -291550 -511192 -673996 -606386 -717952 -620838 -627120 -396882 -336286 -470227 -380072 -360221
2350c60221j05242J11105p1555j20504L24077j33236l3834J58994k12479j5845
$$ -360221 -465463 -354358 -425913 -546417 -222340 -355576 -389410 -230416 -442895 -458740
2340d58740j1770p5477J01540R8452J2849m5908n5959p5941Q0249M8242J9036
$$ -458740 -470510 -545987 -444447 -345995 -333146 -379054 -435013 -510954 -430705 -382463 -363427
2329c63427n3833J3546J28718j31095J10793o5370J9075J7905k1732r4609Q4278
$$ -363427 -417260 -403714 -274996 -406091 -295298 -360668 -341593 -323688 -345420 -440029 -355751
2318c55751K7944J51277p2208P0141J82647j19757J4904m6636j8978j71372K25651
$$ -355751 -327807 -176530 -248738 -178597 4050 -115707 -100803 -147439 -166417 -337789 -112138
2307a12138R5713L1153r6491j88130J24112r9462k28502J75685J61745Q6968j22418
$$ -112138 -16425 14728 -81763 -269893 -145781 -245243 -473745 -298060 -136315 -49347 -171765
2296a71765J00399j40518j25316J03890j06174J6892J7445P3395n5199J09991
$$ -171765 -71366 -211884 -337200 -233310 -339484 -322592 -305147 -231752 -286951 -176960
2286a76960m8926p1503O2273J51582J48024j35877p2532j32505o5540k09891J12404
$$ -176960 -225886 -297389 -235116 -83534 64490 -71387 -143919 -276424 -341964 -551855 -439451
2275d39451J66112P460n9850J38041O7828o6846J820N1974o7604k66923l3022
$$ -439451 -273339 -265879 -325729 -187688 -119860 -186706 -184886 -132912 -200516 -467439 -500461
2264e00461K7696Q8427j0366K19396j13829j46412J0138J9357K24459P0231k53122
$$ -500461 -472765 -384338 -394704 -175308 -289137 -435549 -425411 -406054 -181595 -111364 -364486
2253c64486L7044J66013L62814k8849k09873j99921J91132J03282r9972n3927
$$ -364486 -327442 -161429 201385 172536 -37337 -237258 -46126 57156 -42816 -96743
2243i6743k04070j08673J74249L43240k79421j46185J25078J31687k66906J10925
$$ -96743 -300813 -409486 -235237 108003 -171418 -317603 -192525 -60838 -327744 -216819
2233b16819J90911q3247k09000J34139J2280J29691k38563N4909J59996L4894
$$ -216819 -25908 -109155 -318155 -184016 -171736 -42045 -280608 -225699 -65703 -30809
2223c0809p5443M6094p1019P1832n0662j08148J75063l7140J72628j28075j04718
$$ -30809 -106252 -60158 -131177 -59345 -110007 -218155 -43092 -80232 92396 -35679 -140397
2212a40397l2232J37354l4762o656J11875n6147j02391K00339j48437L066j29767
$$ -140397 -172629 -35275 -70037 -76693 35182 -20965 -123356 76983 -71454 -68388 -198155
2201a98155j81909K67967K22545J31959m8863j94942L2728j37173R8865q9895
$$ -198155 -380064 -112097 110448 242407 193544 -1398 31330 -105843 -6978 -96873
2191i6873L1018j7369M829P2243j73052j03321k5931K91411l3737K7612N9915
$$ -96873 -65855 -83224 -78395 -6152 -179204 -282525 -308456 -17045 -50782 -23170 36745
2180C6745j15086J58053M3752k78586R0651j31076J39760J31349k43148J09574
$$ 36745 -78341 79712 123464 -155122 -64471 -195547 -55787 75562 -167586 -58012
2170e8012P728L4422m480m0780M7236J07048j62872r955q1461K08839J32911j23151
$$ -58012 -50284 -15862 -20342 -61122 -13886 93162 -69710 -79665 -161126 47713 180624 57473
2158E7473j89080P9565K61671n2542j7548r7199Q1926N5638O6633k194p7162N1929
$$ 57473 -131607 -52042 209629 157087 139539 42340 124266 179904 246537 244343 167181 219110
2146B19110m1135q5765o6573K64066J05178O5100j56724j11651L8464J28733o751
$$ 219110 177975 92210 25637 289703 394881 459981 303257 191606 230070 358803 352052
2135C52052k7564J01105K45224J3146k3930j08766K532K27750L3686k21324j83616
$$ 352052 324488 425593 670817 683963 660033 551267 553799 781549 815235 593911 410295
2124D10295J61349J53689J03964p4866R994J43841J29687P3116j4169M8690n6832
$$ 410295 571644 725333 829297 754431 764425 908266 1037953 1111069 1096900 1145590 1088758
2113A088758j84441K03584J94613p6565J32977j7966Q8984L06239j85566q2409
$$ 1088758 904317 1107901 1302514 1225949 1358926 1340960 1429944 1736183 1550617 1468208
2103A468208J12622J02828p3300r3147L983L11485J3238O3551m3272J52200n355
$$ 1468208 1580830 1683658 1610358 1517211 1521194 1832679 1845917 1909468 1866196 2018396 2013041
2092B013041n197K11734J51762J30437P2686n8854J29015J33082O2213J9455J32498
$$ 2013041 2007844 2219578 2371340 2501777 2574463 2515609 2644624 2777706 2839919 2859374 2991872
2081B991872J23468J74555P524J69039K82165Q3658J38579K42747J43151K52651
$$ 2991872 3115340 3289895 3297419 3466458 3748623 3832281 3970860 4213607 4356758 4609409
2071D609409J33921J15716M28405J95556J58167M50431M74173N29389J96680M03080
$$ 4609409 4743330 4859046 5287451 5483007 5641174 6091605 6565778 7095167 7291847 7694927
2061G694927Q13342P15351N08322P12135O73723P39408J086502J467234J359244
$$ 7694927 8508269 9223620 9731942 10444077 11117800 11857208 12943710 14410944 15770188
2052A5770188J509577J774665K735907L154259L715398M875733O231489O798805
$$ 15770188 17279765 19054430 21790337 24944596 28659994 33535727 39767216 46566021
2044D6566021O291962M188946l23818k958251o203155p608329p718734o517980
$$ 46566021 52857983 57046929 56723111 53764860 47561705 39953376 32234642 25716662
2036B5716662m783540l358559k511112j845799j402767j381075o89032o10978
$$ 25716662 20933122 17574563 15063451 13217652 11814885 10433810 9744778 9133800
2028I133800n02803n15919m88817p12264o56352m96516n48233m95627k70444k74740
$$ 9133800 8630997 8115078 7626261 6913997 6257645 5761129 5212896 4717269 4446825 4172085
2018D172085l08150l27712k99224j25118k89838j689j67484N2417m61533l01380
$$ 4172085 3863935 3536223 3236999 3111881 2822043 2820354 2652870 2705287 2243754 1942374
2008A942374m3968q1968o8357j05929m25146p6948J07412j39269j143M4775M8014
$$ 1942374 1898406 1816438 1748081 1642152 1217006 1140058 1247470 1108201 1107058 1151833 1199847
1997A199847j05300m8060q3363J75501j55906j17323p9976K6389R9j78165j31859
$$ 1199847 1094547 1046487 963124 1138625 982719 865396 785420 811809 811908 633743 501884
1986E01884K54251Q9343j31000o5269N2449j48073r0864J74979J24926l53840
$$ 501884 756135 845478 714478 649209 701658 553585 462721 637700 762626 408786
1976D08786L7507j2886n8499J11593j93856R1945j89028p5128M9818J76180m4814
$$ 408786 446293 433407 374908 486501 292645 384590 195562 120434 170252 346432 301618
1965C01618o7228J28775k69382j44909J97583L8987P4387J9206O2713k64764l2194
$$ 301618 234390 363165 93783 -51126 146457 185444 259831 279037 341750 76986 44792
1954D4792J2984l1154O899P972j4152p3459l19750j07964J40358L32770m1257
$$ 44792 57776 26622 33521 41493 27341 -46118 -365868 -473832 -333474 -704 -41961
1943d1961j20169M8835j33828J28232J527q3087j36520K95277J7390n1199J49046
$$ -41961 -162130 -113295 -247123 -118891 -117364 -200451 -336971 -41694 -24304 -75503 73543
1932G3543k93383p6711N9240O6486J47605k35547q6957K59676j26153K730j55012
$$ 73543 -219840 -296551 -237311 -170825 -23220 -258767 -345724 -86048 -212201 -209471 -364483
1921c64483J09319J21411l6524m4674m2511p2916m4446O4093q11q741N43J25774
$$ -364483 -255164 -133753 -170277 -214951 -257462 -330378 -374824 -310731 -311542 -320283 -319740 -193966
1909a93966K24421m8988j46923p161m7207j10905k744M0799J29836J59795k28277
$$ -193966 30455 -18533 -165456 -172617 -219824 -330729 -333473 -292674 -162838 -3043 -231320
1898b31320N631p5579P5926j789m0921J5210L2391K3086p0092Q320o9277n4966
$$ -231320 -225689 -301268 -225342 -227131 -268052 -252842 -220451 -197365 -267457 -259137 -328414 -383380
1886c83380n9212j32508J35787j5820P8297j3212J74039j49770o8141j32923K15630
$$ -383380 -442592 -575100 -439313 -455133 -376836 -390048 -216009 -365779 -433920 -566843 -351213
1875c51213J43897o0442J29720q3154J8276j73180o540M3399l135J06688j61738
$$ -351213 -207316 -267758 -138038 -221192 -202916 -376096 -382636 -339237 -342372 -235684 -397422
1864c97422p9063O5357J07528j88518J22765j5623P0051k12752J05058L2902n0353
$$ -397422 -476485 -411128 -303600 -492118 -369353 -384976 -314925 -527677 -422619 -389717 -440070
1853d40070N4685J7902J09661k8648j37400p2967J05419j39276J04513J0744m0887
$$ -440070 -385385 -367483 -257822 -286470 -423870 -496837 -391418 -530694 -426181 -415437 -456324
1842d56324Q9808j38048n3158L6203M2280K299r3533M3410j24243L6302J02864
$$ -456324 -366516 -504564 -557722 -521519 -479239 -476940 -570473 -527063 -651306 -615004 -512140
1831e12140K6277K0993L40521m1774j59084k42326o8314P9597J62044J11005N858
$$ -512140 -485863 -464870 -124349 -166123 -325207 -567533 -635847 -556250 -394206 -283201 -277343
1820b77343j41337j08564J48789k3956P3564J49769Q236o4830l5012k45737J2932
$$ -277343 -418680 -527244 -378455 -402411 -328847 -179078 -170842 -235672 -270684 -516421 -503489
1809e03489R0601J37294r7649j4096N7384j86429P3534l6827N5743J7262j51463
$$ -503489 -412888 -275594 -373243 -387339 -329955 -516384 -442850 -479677 -423934 -406672 -558135
1798e58135k74269k8614J88539J11983N6076J07466l61576L4363K19278K17375
$$ -558135 -832404 -861018 -672479 -560496 -504420 -396954 -758530 -724167 -504889 -287514
1788b87514j4596J1297o6511r5193o4496k9754J35428L3497J75333N9772k46475
$$ -287514 -302110 -290813 -357324 -452517 -517013 -546767 -411339 -377842 -202509 -142737 -389212
1777c89212J49268q4693n7196L2399J42230J66267N6439m3586R0553k36286j81898
$$ -389212 -239944 -324637 -381833 -349434 -207204 -40937 15502 -28084 62469 -173817 -355715
1766c55715N5624p729J03655m402j93166J41358J35929j16721j38891O3482M2108
$$ -355715 -300091 -307820 -204165 -208567 -401733 -260375 -124446 -241167 -380058 -316576 -274468
1755b74468j46792J18755q1206J43189k2243p9355l3627j3273l6850J05845J3382
$$ -274468 -421260 -302505 -383711 -240522 -262765 -342120 -375747 -389020 -425870 -320025 -306643
1744c06643q4147k2632r2895K76265j76136O3635m320j25726M6346m9908j1206
$$ -306643 -390790 -413422 -506317 -230052 -406188 -342553 -346873 -472599 -426253 -476161 -487367
1733d87367Q7183j9352o4107K14180j12767j02246r9116O4573L7996q0259k8396
$$ -487367 -400184 -419536 -483643 -269463 -382230 -484476 -583592 -519019 -481023 -561282 -589678
1722e89678k7363Q453O9321Q0038q0784n8135J27505j5041J95073K21294P7008
$$ -589678 -617041 -608588 -539267 -459229 -540013 -598148 -470643 -485684 -290611 -69317 7691
1711G691k15843j08768J81227J15041r7563K00919k25952p8371j02033N023J67552
$$ 7691 -208152 -316920 -135693 -20652 -118215 82704 -143248 -221619 -323652 -318629 -151077
1700a51077n9027J68818j70386l11525M1835J38798K28617o1068l2150j02083
$$ -151077 -210104 -41286 -211672 -523197 -481362 -342564 -113947 -175015 -207165 -309248
1690c09248J31509J85636j12931J14597P955l52205L6943J96887J7681j15842
$$ -309248 -177739 7897 -105034 9563 17518 -334687 -297744 -100857 -83176 -199018
1680a99018j03002J07821J66911O6589j51305j30317j59647J4392J38647j90253
$$ -199018 -302020 -194199 -27288 39301 -112004 -242321 -401968 -387576 -248929 -439182
1670d39182j27719J88465J75242P1459j2235n3249J55108K4792j55972l0240O8277
$$ -439182 -566901 -378436 -203194 -131735 -143970 -197219 -42111 -17319 -173291 -203531 -135254
1659a35254l9028q7054N6201R3476k23074R5877Q7193L4899j60216l3431J54557
$$ -135254 -174282 -261336 -205135 -111659 -334733 -238856 -151663 -116764 -276980 -310411 -155854
1648a55854l5216L4747p6743P0693j10727l3232Q5631r2035j26065J55352K14499
$$ -155854 -191070 -156323 -233066 -162373 -273100 -306332 -220701 -312736 -438801 -283449 -68950
1637f8950N4262L0148k13891K8621J32119j46642K3243k396J29558j18978k7929
$$ -68950 -14688 15460 -198431 -169810 -37691 -184333 -161090 -163486 -33928 -152906 -180835
1626a80835k93502j20704J19616K46783J51896j37243k18694J05656L07645j85908
$$ -180835 -474337 -595041 -475425 -228642 -76746 -213989 -432683 -327027 -19382 -205290
1616b05290r9881K20271p5337j26882J013M7886J5986q5429m1119J49141j52461
$$ -205290 -305171 -84900 -160237 -287119 -286106 -238220 -222234 -307663 -348782 -199641 -352102
1605c52102R0935n8974k762J07704j02389J0281R6194j11767p4829K05604r6598
$$ -352102 -261167 -320141 -322903 -215199 -317588 -307307 -211113 -322880 -397709 -192105 -288703
1594b88703J21020K2769P0883P0974k3921k15941q5939j0053K8332J65492l07378
$$ -288703 -167683 -144914 -74031 -3057 -26978 -242919 -328858 -338911 -310579 -145087 -452465
1583d52465N298k5534j06901J06466J77650L8108l6505K3346J74837j19357j18003
$$ -452465 -447167 -472701 -579602 -473136 -295486 -257378 -293883 -270537 -95700 -215057 -333060
1572c33060j95342O6573J77674Q2154J12806l5684O1545K6520j96662K2378p5636
$$ -333060 -528402 -461829 -284155 -202001 -89195 -124879 -63334 -36814 -233476 -211098 -286734
1561b86734Q2194K11855k53010p515l3590J06506q3150m6231J9609n1224j3601
$$ -286734 -204540 7315 -245695 -253210 -286800 -180294 -263444 -309675 -290066 -341290 -354891
1550c54891N4323j2601P1373n0431o2553J52290O2466m6619n1359L2331p6440
$$ -354891 -300568 -313169 -241796 -292227 -354780 -202490 -140024 -186643 -238002 -205671 -282111
1539b82111j47371K82327p5747q4689M0592p0093J25722j60438O0868J40455r8232
$$ -282111 -429482 -147155 -222902 -307591 -266999 -337092 -211370 -371808 -310940 -170485 -268717
1528b68717M2945L3024j02873J09231P1872j89881j06709J55351P9124o0163J75173
$$ -268717 -225772 -192748 -295621 -186390 -114518 -304399 -411108 -255757 -176633 -236796 -61623
1517f1623m0016p1215M5132j50051K0468o9220K83491N7350k49124J65934J4376
$$ -61623 -101639 -172854 -127722 -277773 -257305 -326525 -43034 14316 -234808 -68874 -54498
1506e4498K4253j35832P0082q9845m2803M1978L8205O314M6624j09443J28746
$$ -54498 -30245 -166077 -95995 -185840 -228643 -186665 -148460 -142146 -95522 -204965 -76219
1495g6219m2467K08703J11356j25454k59113o4334N5416m036R7097Q5941l000
$$ -76219 -118686 90017 201373 75919 -183194 -247528 -192112 -196148 -99051 -13110 -16110
1484a6110K767k06980P0164J07289j8505n9099k30102m3940K46043Q4986j03551
$$ -16110 -13343 -220323 -150159 -42870 -61375 -120474 -350576 -394516 -148473 -63487 -167038
1473a67038K24254k39558N9789J35274k8937j49097K7718P3622K0181k27634L5978
$$ -167038 57216 -182342 -122553 12721 -16216 -165313 -137595 -63973 -43792 -271426 -235448
1462b35448k48824J58476J79892J54223J3587k54230J11739q662M862J80090r217
$$ -235448 -484272 -325796 -145904 8319 21906 -232324 -120585 -129247 -124385 55705 46488
1451D6488k7498m4093j2525N9889K49254p7323J25565j29877j24583J28179j13890
$$ 46488 18990 -25103 -37628 22261 271515 194192 319757 189880 65297 193476 79586
1440G9586k12684k7389J6782O3055O5032J77623l0785m0037N7373m3269j39026
$$ 79586 -133098 -160487 -143705 -80650 -15618 162005 131220 91183 148556 105287 -33739
1429c3739m9032J31342p7210Q1026N9623j35880J2882q9016j21155J63483J90983
$$ -33739 -82771 48571 -28639 52387 112010 -23870 -10988 -100004 -221159 -57676 133307
1418A33307o490j49039M957j59633J28305j17104J10793J55902k57904K7953J74790
$$ 133307 126817 -22222 -17265 -176898 -48593 -165697 -54904 100998 -156906 -128953 45837
1407D5837K9809r0199M0045Q4303k26781l1863Q8045J23790q1024j34215k4600
$$ 45837 75646 -14553 25492 109795 -116986 -148849 -60804 62986 -18038 -152253 -176853
1396a76853Q3746m5961L1520Q5679r0069J51634J7740q4936j60800j7806J85067
$$ -176853 -93107 -139068 -107548 -21869 -111938 39696 57436 -27500 -188300 -206106 -21039
1385b1039n5472l8152j33273j7212n9012K31739K9525O7932Q613r4825p017K6795
$$ -21039 -76511 -114663 -247936 -265148 -324160 -92421 -62896 5036 13649 -81176 -88193 -61398
1373f1398O3213P2339k78337J27177Q5647N4193j40599J4568o1867m1539J09607
$$ -61398 1815 74154 -204183 -77006 8641 62834 -77765 -63197 -125064 -166603 -56996
1362e6996J57595J9006m4662L2353j98064K03264M0290k42089k75373M7355J29303
$$ -56996 100599 119605 74943 107296 -90768 112496 152786 -89303 -364676 -317321 -188018
1351a88018o3296k6353J15131q5985m8873O129J25166p9919M8599q6489J918M2959
$$ -188018 -251314 -277667 -162536 -248521 -297394 -291265 -166099 -246018 -197419 -283908 -281990 -239031
1339b39031k8304Q2450L9729R0048J70630j3942n4989p4230l9311m816n8022M4493
$$ -239031 -267335 -184885 -145156 -55108 115522 101580 46591 -27639 -66950 -71766 -129788 -85295
1327h5295m9194N8065J41354j62819J15985J74905q1160j91594j25680K6512O9897
$$ -85295 -134489 -76424 64930 -97889 18096 193001 111841 -79753 -205433 -178921 -109024
1316a09024P3702Q743j60792j35122o6065J48991Q0744J09204J65377n9889k8283
$$ -109024 -35322 -26579 -187371 -322493 -388558 -239567 -158823 -49619 115758 55869 27586
1305B7586k8477m343K795J8816j17654K5059j41585k39372J74677J4002P3150
$$ 27586 -891 -5234 -2439 16377 -101277 -76218 -217803 -457175 -282498 -268496 -195346
1294a95346J3379J24437j26430j58753J13164n3610L8667J56337k5773P929j46206
$$ -195346 -181967 -57530 -183960 -342713 -229549 -283159 -244492 -88155 -113928 -105999 -252205
1283b52205n4906J05545k6463L0262k1233j13486J84900J38230K1936L1102m4910
$$ -252205 -307111 -201566 -228029 -197767 -219000 -332486 -147586 -9356 12580 43682 -1228
1272a228r2432k20807J07190K63121r7540q5219K4508P8210l151k49460j83841
$$ -1228 -93660 -314467 -207277 55844 -41696 -126915 -102407 -24197 -27348 -276808 -460649
1261d60649L23549l3674j11671K27852j21664j37088N5216j4634p4183K6203J03993
$$ -460649 -137100 -170774 -282445 -54593 -176257 -313345 -258129 -272763 -346946 -320743 -216750
1250b16750J12934J73251k27633m4243L042N8630J54426q5901j93746m7352J94420
$$ -216750 -103816 69435 -158198 -202441 -199399 -140769 13657 -72244 -265990 -313342 -118922
1239a18922n760L9661j12562J87383J0442l1346J1324k1897j08531j43323J00553
$$ -118922 -124682 -85021 -197583 -10200 242 -31104 -19780 -41677 -150208 -293531 -192978
1228a92978M1562M4401M9480j64433k4838J10675J01393q8500j19110l1580J81287
$$ -192978 -151416 -107015 -57535 -221968 -246806 -136131 -34738 -123238 -242348 -273928 -92641
1217i2641J36787m5843k00806j08805J02888J94556J61319l8968J5402j59898
$$ -92641 44146 -1697 -202503 -311308 -208420 -13864 147455 108487 123889 -36009
1207c6009j33847O4492m7472m3008j1978K71685J07200l5519k0576J6193j9654
$$ -36009 -169856 -105364 -152836 -195844 -207822 63863 171063 135544 114968 131161 111507
1196A11507M7742Q7029k4141j22058k36594J03780R9128o3303j41234j75557J15276
$$ 111507 159249 246278 222137 100079 -136515 -32735 66393 3090 -138144 -313701 -198425
1185a98425M1047R8169k6693K0877L1332j64321j0063J23123O9490N9515J19104
$$ -198425 -157378 -59209 -85902 -65025 -33693 -198014 -208077 -84954 -15464 44051 163155
1174A63155k5170l9536q9257j14358j3413J0390J1888J50768j37884r2657K55684
$$ 163155 137985 98449 9192 -105166 -118579 -108189 -96301 54467 -83417 -176074 79610
1163G9610j47699L8088n4476J29063J108O564P2780o1323N1770k3491k58680j01883
$$ 79610 -68089 -30001 -84477 44586 45694 52258 125038 63715 115485 91994 -166686 -268569
1151b68569J31368J16591n0072l2869J13168N2868J09395m0315p8846J03659j80502
$$ -268569 -137201 -20610 -70682 -103551 9617 62485 171880 131565 52719 156378 -24124
1140b4124j84105J12617Q9628K6509j31442K6350n9152K73930p8890k46976J20865
$$ -24124 -208229 -95612 -5984 20525 -110917 -84567 -143719 130211 51321 -195655 -74790
1129g4790q1639r7497J24742Q9512r1411Q696R7735J26665q4850k74888N2094
$$ -74790 -156429 -253926 -129184 -39672 -131083 -122387 -24652 102013 17163 -257725 -205631
1118b05631J23444K7404K5021P6686m5710J52221J26529l9546k18617j9280l0019
$$ -205631 -82187 -54783 -29762 46924 1214 153435 279964 240418 21801 2521 -27498
1107b7498J45784j1537R5177J13125l37062O5780p7268j60564Q7111P7616j36875
$$ -27498 118286 106749 201926 315051 -22011 43769 -33499 -194063 -106952 -29336 -166211
1096a66211l2439K84047N0229n4001R9r2495J1407R0444j2278k05534P544J14120
$$ -166211 -198650 85397 135626 81625 81724 -10771 636 91080 78802 -126732 -119188 -5068
1084e068o1647J09866j38558j20547J00882O454J62571K2876p7995Q2963K5502
$$ -5068 -66715 43151 -95407 -215954 -115072 -108618 53953 76829 -1166 81797 107299
1073A07299L3981q1689n1718J9753Q6195k7596j27672q9414K24047m4428j32307
$$ 107299 141280 59591 7873 27626 113821 86225 -41447 -130861 93186 48758 -83549
1062h3549J34303O2966o5126r5182N5300J85214j85089j3280j8852j07742J50765
$$ -83549 50754 113720 48594 -46588 8712 193926 8837 -4443 -23295 -131037 19728
1051A9728M2500j6425P7076o5907p5581q0612M0844K93744q5512r1801r751q3783
$$ 19728 62228 45803 122879 56972 -18609 -99221 -58377 235367 149855 58054 48303 -35480
1039c5480L6632j4938J1R9927j84445K11511J50688k24317L3103m1179j51276
$$ -35480 1152 -13786 -13775 86152 -98293 113218 263906 39589 72692 31513 -119763
1028a19763M9286J18457q0526j9582j21346K0649R0407l7995j4149J3253L7498
$$ -119763 -70477 47980 -32546 -52128 -173474 -152825 -62418 -100413 -114562 -101309 -63811
1017f3811J51253N8308m8975M4463N830q6729j7117k11277K5932Q2302j0545p7359
$$ -63811 87442 145750 96775 141238 147068 60339 43222 -168055 -142123 -59821 -70366 -147725
1005a47725j35266K18568Q1099M7583n4302Q3314o077J28485j75536n0669L3086
$$ -147725 -282991 -64423 16676 64259 9957 93271 87194 215679 40143 -10526 22560
994B2560R0079K624n9747j20156L8670J25812j68972M0745P334m6270K9333j0606
$$ 22560 112639 115263 55516 -64640 -25970 99842 -69130 -28385 -21051 -67321 -37988 -48594
982d8594p8455O8882J9487j2499J67499o2144J34520k0334k92854Q4499R5331
$$ -48594 -127049 -58167 -38680 -51179 116320 54176 188696 168362 -124492 -39993 55338
971E5338K8481K2826l7700J4561j5957K4290p3966O6011l9638O5448j72849p7215
$$ 55338 83819 106645 68945 83506 67549 91839 17873 83884 44246 109694 -63155 -140370
959a40370j77993K12384j66282P7910K19306J50470J29102Q0020j07082l50767
$$ -140370 -318363 -105979 -272261 -194351 24955 175425 304527 384547 277465 -73302
949g3302J33290n1612K2775L6831J05499R4174q3251j76169J8411R5989K91410
$$ -73302 59988 8376 31151 67982 173481 267655 184404 8235 26646 122635 414045
938D14045j59466r1710j62578N3776l3151j61693J67644J31564J035M0368O9001
$$ 414045 254579 162869 291 54067 20916 -140777 26867 158431 159466 199834 268835
927B68835p0332j75971J16749J09947r1269j79645j9701K9754Q4991L3030P8813
$$ 268835 198503 22532 139281 249228 157959 -21686 -41387 -11633 73358 106388 185201
916A85201P4198j07398N4945k20076p5024J4053M7335J32222J87904k25942j46666
$$ 185201 259399 152001 206946 -13130 -88154 -74101 -26766 105456 293360 67418 -79248
905g9248j3723M4243L6285O6357J26713j39177N1370L9944j83883m9637J687j39463
$$ -79248 -92971 -48728 -12443 53914 180627 41450 92820 132764 -51119 -100756 -99069 -238532
893b38532K51967R7885j30352j40793J95655j48029K9044j24030J247P5382n6582
$$ -238532 13435 111320 -19032 -159825 35830 -112199 -83155 -207185 -205938 -130556 -187138
882a87138j3925j02463J69938J75595o8106q7616P1123k1680J07846N839n7626
$$ -187138 -201063 -303526 -133588 42007 -26099 -113715 -42592 -64272 43574 49413 -8213
871h213J105j56013K201J13135R8706J88560M0100j31569j6058J65414n7259N899
$$ -8213 -7108 -163121 -160920 -47785 50921 239481 279581 148012 131954 297368 240109 246008
859B46008J44268j94116k24150j14204J20992J2535l2984N6396K18546q814J5877
$$ 246008 390276 196160 -27990 -142194 -21202 -8667 -41651 14745 233291 224477 240354
848B40354j93186K47195P3925r7415j42777j55949J28046J2435R6227j15696j4135
$$ 240354 47168 294363 368288 270873 128096 -27853 100193 112628 208855 93159 79024
837G9024j16882r3965R8258L18522r5895j14805K49062j38377j02320K5089p3348
$$ 79024 -37858 -131823 -33565 284957 189062 74257 323319 184942 82622 107711 34363
826C4363L7603J29077J10907k9357k5294k8949j92458p934O8172j08544M4159
$$ 34363 71966 201043 311950 282593 257299 228350 35892 27958 96130 -12414 31745
815C1745n9194J25246J7486J06359n0320q7817j12029N3570J11952N3682k7622
$$ 31745 -27449 97797 115283 221642 171322 83505 -28524 25046 136998 190680 163058
804A63058j3115O6942j94921J54342J1430K9989l0012q6074J29797j55431j86339
$$ 163058 149943 216885 21964 176306 187736 217725 187713 101639 231436 76005 -110334
793a10334j43510J10790N2576J77474R9158k3658J7489Q2565m6209n6345J2750
$$ -110334 -253844 -143054 -90478 86996 186154 162496 179985 262550 216341 159996 172746
782A72746j11230M6390j8776j40782J21267j33979M1421K33217L5081L7008j12305
$$ 172746 61516 107906 89130 -51652 69615 -64364 -22943 210274 245355 282363 170058
771A70058j71857J91830J43240r6224j8577m9016J20569q4494j79200J20453P1693
$$ 170058 -1799 190031 333271 237047 218470 169454 290023 205529 26329 146782 218475
760B18475j008k67987n6693J37605r144k4957L9936m5695O1726J26453j0726j61980
$$ 218475 217467 -50520 -107213 30392 21248 -3709 36227 -9468 52258 178711 167985 6005
748F005N8084n477K08903J10150j79865J38410k27732q5587o8828K9333O4852
$$ 6005 64089 58612 267515 377665 197800 336210 108478 22891 -45937 -16604 48248
737D8248K0252J6272J27487J4375m0630p0306P0403j91097m9229O2910j11219
$$ 48248 68500 84772 212259 226634 186004 115698 186101 -4996 -54225 8685 -102534
726a02534M0251K6903J80263k3386K19217N8590k13684p9756P5132p801p454j90518
$$ -102534 -62283 -35380 144883 121497 340714 399304 185620 105864 180996 173195 165741 -24777
714b4777L8540J03900j54050k71814J49596J03757J63232N9830j13833R0726j49796
$$ -24777 13763 117663 -36387 -308201 -158605 -54848 108384 168214 54381 145107 -4689
703d689l3748K49997l3626k53669L02544k8965j30407J04989M5790k24403k7763
$$ -4689 -38437 211560 177934 -75735 226809 197844 67437 172426 218216 -6187 -33950
692c3950J88856M4264o1465K8448J7836q1450O8116K0792J7506j26396j42717
$$ -33950 154906 199170 137705 166153 183989 102539 170655 191447 208953 82557 -60160
681f0160N5523j8271L442R754o0480Q9651J95375k19648j8629K13834j3808o3521
$$ -60160 -4637 -22908 -19466 -9712 -70192 19459 214834 -4814 -23443 190391 176583 113062
669A13062M1546o6317l180k4636Q7781j47093j0415J9110j5463O9679N7143J3621
$$ 113062 154608 88291 85111 60475 148256 1163 -9252 9858 -5605 64074 121217 134838
657A34838J19618j60458o0310R0504j44616m4519J36588J75877q5275k0191q0010
$$ 134838 254456 93998 33688 124192 -20424 -64943 71645 247522 162247 142056 62046
646F2046L8738r691n4920l3034K061J81692n9230j22421j10301n1089J20812J49776
$$ 62046 100784 91093 36173 3139 5200 186892 127662 5241 -105060 -156149 -35337 114439
634A14439K02445l17155J08853J11229q3527N4173j41788Q0741Q7773K2134j50950
$$ 114439 316884 -271 108582 219811 136284 190457 48669 129410 217183 239317 88367
623H8367J02238j14772m5229O6894J41065P1366j12849k8629J0977p624j47999
$$ 88367 190605 75833 30604 97498 238563 309929 197080 168451 179428 171804 23805
612B3805K25343j66164k8379Q8621J59671J16412j30116p5855J9372J41088j81361
$$ 23805 249148 82984 54605 143226 302897 419309 289193 213338 232710 373798 192437
601A92437m3398p595K7273R0190J3357k19306o4060J13009O8557j64409J07387
$$ 192437 149039 141444 168717 258907 272264 52958 -11102 101907 170464 6055 113442
590A13442L2189l9881j15322q2895K45976l9332L3205J34341m204n2075O0644
$$ 113442 145631 105750 -9572 -92467 153509 114177 147382 281723 277519 225444 286088
579B86088k39453j37803j12741Q0367J32563n0754J97459j71664Q2780j6501q5891
$$ 286088 46635 -91168 -203909 -123542 9021 -41733 155726 -15938 66842 50341 -35550
568c5550L7537k5354J56783k0244j20699L0608J92532m5201j2072o0459p7522
$$ -35550 1987 -23367 133416 113172 -7527 23081 215613 170412 158340 97881 20359
557B0359P443J23316l374P3495M2028m126j12506j93092O3510K21672r6504N4208
$$ 20359 27802 151118 147744 221239 263267 259141 146635 -46457 17053 238725 142221 196429
545A96429M179J37795q4563k4119j17361P788M1090M5594J12084M9070k44544
$$ 196429 200608 338403 253840 229721 112360 120148 161238 206832 318916 367986 123442
534A23442j91432J88786j5996P1928j40402k7574J61928P4627k18837o2014J76286
$$ 123442 -67990 120796 104800 176728 36326 8752 170680 245307 26470 -35544 140742
523A40742l6597k4076L39298K6730k18997n919m318j04948k9693m5185r8206j49185
$$ 140742 104145 80069 419367 446097 227100 221181 216863 111915 82222 37037 -61169 -210354
511b10354J78381K49468m3650j5186J6475j18269M9058m4375j35070L4831J12675
$$ -210354 -31973 217495 173845 158659 175134 56865 105923 61548 -73522 -38691 73984
500G3984J05871k73329P8036J9063J42020L2257j5716r2154N263J46695N0301
$$ 73984 179855 -93474 -15438 3625 145645 177902 162186 70032 75295 221990 272291
489B72291r7465l5506Q4576j39719r3029K0531J11158J30982K00736J68090M184
$$ 272291 174826 139320 223896 84177 -8852 11679 122837 253819 454555 622645 626829
478F26829l16573j3956J3276j42951k6885r4830L7551L8489J3298K50537j6939
$$ 626829 310256 296300 309576 166625 139740 44910 82461 120950 134248 384785 367846
467C67846k13104j12415J76050r1775o3430R4729l6322J08215j57715J77213j48254
$$ 367846 154742 42327 218377 126602 63172 157901 121579 229794 72079 249292 101038
456A01038r1202J36592o4317K5283P5100L2387P48M6382k55632O9615J56442j04378
$$ 101038 9836 146428 82111 107394 182494 214881 215629 262011 6379 75994 232436 128058
444A28058l944K43064M4298j99155k49626L34353l37396j49622N10329J04137
$$ 128058 124114 367178 411476 212321 -37305 297048 -40348 -189970 320359 424496
434D24496j66181J73747p062l33757m2029J22818k2410j38838K3450N8970o2009
$$ 424496 258315 432062 425000 91243 49214 172032 149622 10784 34234 93204 31195
423C1195J76313Q686J23643j11935j13728L1347J477J53378n521q1859K8483j14147
$$ 31195 207508 216194 339837 227902 114174 145521 146998 300376 294855 212996 241479 127332
411A27332j46530N5171p1225J52183J85856j32717Q4967j75711o9658K54436Q100
$$ 127332 -19198 35973 -35252 116931 302787 170070 255037 79326 9668 264104 272204
400B72204l9733k37589R3008K76731j23144M488j16753m7630K6207M6361k8491
$$ 272204 232471 -5118 87890 364621 241477 245965 129212 81582 107789 154150 125659
389A25659J69525J2459L9455m0389k26127J1900j95879K13922L7459j25964k4830
$$ 125659 295184 307643 347098 306709 80582 92482 -103397 110525 147984 22020 -2810
378b810K09297J01194m7240j72277k21670P2675K54567n1284k99427J34513K55175
$$ -2810 206487 307681 260441 88164 -133506 -60831 193736 142452 -156975 -22462 232713
367B32713P3123j67979l7869J03572j02882j17525K41986J27729r8823O4206o0381
$$ 232713 305836 137857 99988 203560 100678 -16847 225139 352868 254045 318251 257870
356B57870j25024m1238J63986j69933J96033r9660k25094r8521q623J47126M09663
$$ 257870 132846 91608 255594 85661 281694 182034 -43060 -141581 -150204 -3078 406585
345D06585q1862m0641j65383N4140P5688j54610J25360N3528j4980r3148k01350
$$ 406585 324723 284082 118699 172839 248527 93917 219277 272805 257825 164677 -36673
334c6673J82849L1625j48864O8251Q1770J14884j65053J4183M5685j39598K15979
$$ -36673 146176 177801 28937 97188 178958 293842 128789 142972 188657 49059 265038
323B65038N2470k20359j94391J78918J86301R7451j65794j2174L613K785J37278
$$ 265038 317508 97149 -97242 81676 267977 365428 199634 187460 191073 193858 331136
312C31136K557L2001j6155n2815k0717l162K6946j03725k04620J62414j0039L4611
$$ 331136 333693 365694 349539 296724 276007 272845 299791 196066 -8554 153860 143821 178432
300A78432j4604r9818K67287m5815k12986Q9267K6027n9408k32655N9880K09440
$$ 178432 163828 64010 331297 285482 72496 161763 187790 128382 -104273 -44393 165047
289A65047P7713j78002P0922J21362L0801q0238J56727o9763k66083J27916j16629
$$ 165047 242760 64758 135680 257042 287843 207605 364332 294569 28486 156402 39773
278C9773O6453k9604l3354J62137k512P2969r0161j1905j08880J76379p0396L6600
$$ 39773 106226 76622 43268 205405 202893 275862 185701 173796 64916 241295 170899 207499
266B07499K1124M8558l8825m0717j20455N0500J32671l1284L6592j06318j27064
$$ 207499 228623 277181 238356 197639 77184 127684 260355 229071 265663 159345 32281
255C2281J05458N8191J43894K76462k02904k38268j01188K9463k9797N5838L3997
$$ 32281 137739 195930 339824 616286 413382 175114 73926 103389 73592 129430 163427
244A63427R4789N4322j66215j9341k585j102K48766K4439k39059O9439j14518
$$ 163427 258216 312538 146323 126982 124397 123295 372061 396500 157441 226880 112362
233A12362N403J0074p6468K83261m0807j55157J46447j19229L0333m461q4217
$$ 112362 117765 127839 51371 334632 293825 138668 285115 165886 196219 191758 107541
222A07541L2180k1471M8107l6820J31864j69979K9888n2492j40302J96877l9824
$$ 107541 139721 118250 166357 129537 261401 91422 121310 68818 -71484 125393 85569
211H5569m7682j9835J18942j5172n6245n4525J50711P9453j12568l4428J5703
$$ 85569 37887 18052 136994 121822 65577 11052 161763 241216 128648 94220 109923
200A09923k5161L046P5717p6209J44444M2899k1518l7796q9269J32918j56178
$$ 109923 84762 87808 163525 87316 231760 274659 253141 215345 126076 258994 102816
189A02816o9611K01180k9546O8022O6002j1783j48308r0176K41847k5500M1327
$$ 102816 33205 234385 204839 272861 338863 327080 178772 88596 330443 304943 346270
178C46270p590k11533J10020J13546k8140J58576q4253r9973k66939o4903J41641
$$ 346270 338680 127147 237167 350713 322573 481149 396896 296923 29984 -34919 106722
167A06722P8462K47968j29673m1764J3402m229N6701L6061j19653p3955M9603
$$ 106722 185184 433152 303479 261715 275117 270888 327589 363650 243997 170042 219645
156B19645L4126M7616o2273m8743J20384q8487l9748Q9704J49282N9252j86188
$$ 219645 253771 301387 239114 190371 310755 222268 182520 272224 421506 480758 294570
145B94570o8848N8160j21891J35178k84911q2216J56368n5963k0246R2445J64148
$$ 294570 225722 283882 161991 297169 12258 -69958 86410 30447 10201 102646 266794
134B66794J19072j03598R4082j95038K227O2030k0894O514J6748J69728q9785
$$ 266794 385866 282268 376350 181312 183539 245569 224675 231189 247937 417665 327880
123C27880j45430k40389J51946J86637j9785k22125J44148O1187j15950J16357
$$ 327880 182450 -57939 94007 280644 260859 38734 182882 244069 128119 244476
113B44476j14675k9320L8681P9224j2906k00991Q2741L37079r8767j19027J13363
$$ 244476 129801 100481 139162 218386 205480 4489 87230 424309 325542 206515 319878
102C19878o6069j3203L4035o8048O9418j9277n3249k12529J28971m1503n2621
$$ 319878 253809 240606 274641 206593 276011 256734 203485 -9044 119927 78424 25803
91B5803J48711l8182J02490J4548L1986n7220Q5691j9919L0796o8539l5663J46096
$$ 25803 174514 136332 238822 253370 285356 228136 313827 293908 324704 256165 220502 366598
79C66598j06867J5320J7199p7019J20267j6905k8922o6182j45337j3479O8497
$$ 366598 259731 275051 292250 215231 335498 318593 289671 223489 78152 64673 133170
68A33170n4372M5541N867j8911q4555R9525L0022j02025o7314P4123R5311O2872
$$ 133170 78798 124339 130206 111295 26740 126265 156287 54262 -13052 61071 156382 219254
56B19254m3813J30347K50j14491N1283m783K7797J9045M9191J03582j50852o5634
$$ 219254 175441 305788 306038 191547 242830 238047 265844 284889 334080 437662 286810 221176
44B21176Q1839o9228j10981Q2012J6918n8783J82116O8472o3023l076P2472N8222
$$ 221176 303015 233787 122806 204818 221736 162953 345069 413541 350518 347442 419914 478136
32D78136j19966j12914j2999j46628N2854j0727K8077M8753j4480J53628o9157
$$ 478136 358170 245256 232257 85629 138483 127756 155833 204586 190106 343734 274577
21B74577l9720O2157r4801l0079m4753P0055K32320m1091j36510r8999r216J1152
$$ 274577 234857 297014 202213 172134 127381 197436 429756 388665 252155 153156 143940 155092
9A55092P1420o446l951J02422p109q3483O2517j34410r3694
$$ 155092 226512 220066 216115 318537 311428 227945 290462 156052 62358
0F2358
$$ 62358
$$ Imaginary data points
##PAGE= N=2
##DATA TABLE= (X++(I..I)), XYDATA
16383c309325P0962J02150K7918J02342L2981j37580J00378N0143k253J52673
$$ -3309325 -3238363 -3136213 -3108295 -3005953 -2972972 -3110552 -3010174 -2960031 -2962284 -2809611
16373b809611l0461n7396J15994J43713K1401j5112k8523K626J63717M3006J0848
$$ -2809611 -2840072 -2897468 -2781474 -2637761 -2616360 -2631472 -2659995 -2657369 -2493652 -2450646 -2439798
16362b439798q641Q3821J96768R9437n0155r8336P2706L9649l7691L5236N5267
$$ -2439798 -2448439 -2364618 -2167850 -2068413 -2118568 -2216904 -2144198 -2104549 -2142240 -2107004 -2051737
16351b051737N8494R1164J7552O1480k62O8394J20629k2699J16675M6032R047
$$ -2051737 -1993243 -1902079 -1884527 -1823047 -1823309 -1754915 -1634286 -1656985 -1540310 -1494278 -1485231
16340a485231J0175L3326k80P8151R7087j20177L636J19188l05M7106R9585J7853
$$ -1485231 -1475056 -1441730 -1442010 -1363859 -1266772 -1386949 -1383313 -1264125 -1264430 -1217324 -1117739 -1099886
16328a099886m8388J14813P2542P6056l1221k7259o2813J05255J58232r262m9491
$$ -1099886 -1148274 -1033461 -960919 -884863 -916084 -943343 -1006156 -900901 -742669 -751931 -801422
16317h01422j6487K2447J11309K10991j29455r6027J12104J98331O4198K10238
$$ -801422 -817909 -795462 -684153 -473162 -602617 -698644 -586540 -388209 -324011 -113773
16307a13773K9810J6337Q5910j15564j18633k3556Q3066j53605R2216J24225N0478
$$ -113773 -83963 -67626 18284 -97280 -215913 -239469 -156403 -310008 -217792 -93567 -43089
16296d3089R819j1773J23498Q1492K2541J30940J4211k55896m67K36308J48771
$$ -43089 -33270 -45043 78455 159947 182488 313428 327639 71743 71276 307584 456355
16285D56355q6744N3053R7669l5562O4207J14678j14375j47084J11771K53968
$$ 456355 369611 422664 520333 484771 548978 663656 549281 402197 513968 767936
16275G67936K6361j44189M7107m9M0847P6297P9770j47444j674J20216J24946
$$ 767936 794297 650108 697215 697166 738013 814310 894080 746636 744962 865178 990124
16264I90124J5373L4929K05419j25248j25959m4955J02456J20112o5255O6368
$$ 990124 1005497 1040426 1245845 1120597 994638 949683 1052139 1172251 1106996 1173364
16254A173364J47494n5779r08J12803J62369k12151j5596N4246P5027K585J47566
$$ 1173364 1320858 1265079 1264171 1376974 1539343 1327192 1311596 1365842 1440869 1443454 1591020
16243A591020R745N4070m3258p2205j5466p8810J22320n9488K31198K55427p8172
$$ 1591020 1600765 1654835 1611577 1539372 1523906 1445096 1567416 1507928 1739126 1994553 1916381
16232A916381o8541j1746k3388L5937j11853P8163K73006j84848N6500J09957
$$ 1916381 1847840 1836094 1812706 1848643 1736790 1814953 2087959 1903111 1959611 2069568
16222B069568j22331O4043Q2210k05439k13129Q1379J34041q7968J28534P8991
$$ 2069568 1947237 2011280 2093490 1888051 1674922 1756301 1890342 1802374 1930908 2009899
16212B009899o3607K61710m4429k07364O574R783j0753M3773J32229J86983K20321
$$ 2009899 1946292 2208002 2163573 1956209 1962783 1972566 1961813 2005586 2137815 2324798 2545119
16201B545119P5412K3582o2596k01755m9362k8049j6502P9432j2255o8273k30584
$$ 2545119 2620531 2644113 2581517 2379762 2330400 2302351 2285849 2365281 2353026 2284753 2054169
16190B054169J94126J54164j44762o1135J34694P7491M6818J63892J2532j11116
$$ 2054169 2248295 2402459 2257697 2196562 2331256 2408747 2455565 2619457 2631989 2520873
16180B520873R9646p7326l0614K38707l8368q8639j02540N3453j46787Q2332m2914
$$ 2520873 2620519 2543193 2512579 2751286 2712918 2624279 2521739 2575192 2428405 2510737 2467823
$$ [...]
##END NTUPLES=NMR SPECTRUM
##END=
