##TITLE=1H_EC-3287-xy
 DMSO
 8 sc, 
 21.12.2022
##JCAMPDX= 6.0         $$ Bruker NMR JCAMP-DX V2.0
##DATA TYPE= NMR SPECTRUM
##DATA CLASS= NTUPLES
##ORIGIN= UXNMR, Bruker Analytische Messtechnik GmbH
##OWNER= root
$$ XWIN-NMR		Version 3.5
$$ Wed Dec 21 14:08:31 2022 Russian Standard Time (UT+4h)  she@DPX200
##.OBSERVE FREQUENCY= 200.13135
##.OBSERVE NUCLEUS= ^1H
##.ACQUISITION MODE= SIMULTANEOUS
##.ACQUISITION SCHEME= undefined
##.AVERAGES= 8
##.DIGITISER RES= 18
##SPECTROMETER/DATA SYSTEM= spect
##.PULSE SEQUENCE= zg30
##.SOLVENT NAME= DMSO
##.SHIFT REFERENCE= (INTERNAL, DMSO, 0, 15.7634)
##AUDIT TRAIL= $$ (NUMBER, WHEN, WHO, WHERE, WHAT)
$$ ##TITLE= Audit trail, XWIN-NMR		Version 3.5
$$ ##JCAMPDX= 5.01
$$ ##ORIGIN= Bruker BioSpin GmbH
$$ ##OWNER= she
$$ F:/spectra/data/she/nmr/H-F/1/pdata/1/auditp.txt
$$ ##AUDIT TRAIL=  $$ (NUMBER, WHEN, WHO, WHERE, WHAT)
(   1,<2022-12-21 14:07:02.35 +0400>,<she>,<DPX200>,
      <created by zg, POWCHK disabled, PULCHK disabled
       configuration hash MD5:
       00 E9 B6 7A A2 85 ED C7 34 08 36 98 17 FE 4E 26
       data hash MD5: 16K
       E9 4D 2E 52 50 DF 55 DC 22 E9 9A 07 B1 45 68 1C>)
(   2,<2022-12-21 14:07:04.56 +0400>,<she>,<DPX200>,
      <Start of raw data processing
       efp BC_mod = 2 LB = 0.24 FT_mod = 6 PKNL = 1 PHC0 = -19117.98 PHC1 = 22.00072 SI = 16K 
       data hash MD5: 16K
       F0 9C BF 77 E1 4E 40 91 06 1C 24 E9 18 DA 3A 1C>)
(   3,<2022-12-21 14:07:25.29 +0400>,<she>,<DPX200>,
      <pk PHC0 = 10.17465 PHC1 = -18.2 
       data hash MD5: 16K
       13 5C 9A FD C5 E1 64 0C 96 60 15 65 75 9A 35 EA>)
(   4,<2022-12-21 14:07:28.59 +0400>,<she>,<DPX200>,
      <abs ABSG = 5 
       data hash MD5: 16K
       84 20 F6 BA 6F 96 72 0C B3 D9 26 40 80 F0 D4 C0>)
$$ ##END=
$$ 
$$ hash MD5
$$ 3E FF 8E F5 EC 68 4E 3E 88 2D 14 61 A4 77 36 B7
##$RELAX= 
##$RELAX= 
##$RELAX= 
##$RELAX= 
##$RELAX= 
##$RELAX= 
$$ Bruker specific parameters
$$ --------------------------
##$DU= <F:/spectra>
##$EXPNO= 1
##$NAME= <H-F>
##$PROCNO= 1
##$TYPE= <nmr>
##$USER= <she>
##$AMP= (0..31)
100 100 100 100 100 100 100 100 100 100 100 100 100 100 100 100 100 100 
100 100 100 100 100 100 100 100 100 100 100 100 100 100 
##$AQSEQ= 0
##$AQ_mod= 1
##$AUNM= <au_zg>
##$AUTOPOS= <>
##$BF1= 200.13
##$BF2= 200.13
##$BF3= 200.13
##$BF4= 200.13
##$BF5= 200.13
##$BF6= 200.13
##$BF7= 200.13
##$BF8= 200.13
##$BYTORDA= 1
##$CFDGTYP= 0
##$CFRGTYP= 5
##$CHEMSTR= <none>
##$CNST= (0..31)
1 1 145 1 1 1 1 1 1 1 1 1 1 1 1 1 1 1 1 1 1 1 1 1 1 1 1 1 1 1 1 1 
##$CPDPRG= <>
##$CPDPRG1= <>
##$CPDPRG2= <>
##$CPDPRG3= <>
##$CPDPRG4= <mlev>
##$CPDPRG5= <mlev>
##$CPDPRG6= <mlev>
##$CPDPRG7= <mlev>
##$CPDPRG8= <mlev>
##$CPDPRGB= <>
##$CPDPRGT= <>
##$D= (0..31)
0 1.2 0 0 0 0 0 0 0 0.06 0 0.03 0 0 0 0 0.0002 0 0 0 0 0 0 0 0 0 0 0 0 
0 0 0 
##$DATE= 1671617221
##$DBL= (0..7)
120 120 120 120 120 120 120 120 
##$DBP= (0..7)
150 150 150 150 150 150 150 150 
##$DBP07= 0
##$DBPNAM0= <>
##$DBPNAM1= <>
##$DBPNAM2= <>
##$DBPNAM3= <>
##$DBPNAM4= <>
$$ [...]
##$SUBNAM3= <"">
##$SUBNAM4= <"">
##$SUBNAM5= <"">
##$SUBNAM6= <"">
##$SUBNAM7= <"">
##$SUBNAM8= <"">
##$SUBNAM9= <"">
##$SW= 18.05172834244
##$SWIBOX= (0..15)
0 0 2 0 0 0 0 0 0 0 0 0 0 0 0 0 
##$SW_h= 3612.71676300578
##$TD= 16384
##$TD0= 1
##$TE= 0
##$TE2= 300
##$TE3= 300
##$TEG= 300
##$TL= (0..7)
0 120 120 120 120 120 120 120 
##$TP= (0..7)
150 150 150 150 150 150 150 150 
##$TP07= 0
##$TPNAME0= <>
##$TPNAME1= <>
##$TPNAME2= <>
##$TPNAME3= <>
##$TPNAME4= <>
##$TPNAME5= <>
##$TPNAME6= <>
##$TPNAME7= <>
##$TPOAL= (0..7)
0.5 0.5 0.5 0.5 0.5 0.5 0.5 0.5 
##$TPOFFS= (0..7)
0 0 0 0 0 0 0 0 
##$TUNHIN= 0
##$TUNHOUT= 0
##$TUNXOUT= 0
##$USERA1= <user>
##$USERA2= <user>
##$USERA3= <user>
##$USERA4= <user>
##$USERA5= <user>
##$V9= 5
##$VALIST= <valist>
##$VCLIST= <CCCCCCCCCCCCCCC>
##$VD= 0
##$VDLIST= <DDDDDDDDDDDDDDD>
##$VPLIST= <PPPPPPPPPPPPPPP>
##$VTLIST= <TTTTTTTTTTTTTTT>
##$WBST= 1024
##$WBSW= 4
##$XGAIN= (0..3)
0 0 0 0 
##$XL= 0
##$YL= 0
##$YMAX_a= 144958
##$YMIN_a= -125726
##$ZGOPTNS= <>
##$ZL1= 120
##$ZL2= 120
##$ZL3= 120
##$ZL4= 120
##$ABSF1= 15.75019
##$ABSF2= -2.30166
##$ABSG= 5
##$ABSL= 3
##$ALPHA= 0
##$AQORDER= 0
##$ASSFAC= 0
##$ASSFACI= 0
##$ASSFACX= 0
##$ASSWID= 0
##$AUNMP= <proc_1d>
##$AZFE= 0.1
##$AZFW= 0.1
##$BCFW= 0
##$BC_mod= 2
##$BYTORDP= 0
##$COROFFS= 0
##$CY= -3
##$DATMOD= 1
##$DC= 0
##$DFILT= <>
##$DTYPP= 0
##$F1P= 0
##$F2P= 0
##$FCOR= 1
##$FTSIZE= 16384
##$FT_mod= 6
##$GAMMA= 0
##$GB= 0
##$INTBC= 1
##$INTSCL= 3.70164e-10
##$ISEN= 128
##$LB= 0.24
##$LEV0= 0
##$LPBIN= 0
##$MAXI= 10000
##$MC2= 0
##$MEAN= 0
##$ME_mod= 0
##$MI= 1.114404
##$NCOEF= 0
##$NC_proc= -8
##$NLEV= 6
##$NOISF1= 3.799351
##$NOISF2= 2.8
##$NSP= 0
##$NTH_PI= 0
##$NZP= 0
##$OFFSET= 15.76342
##$PC= 1
##$PHC0= -19107.81
##$PHC1= 3.800718
##$PH_mod= 1
##$PKNL= yes
##$PPARMOD= 0
##$PSCAL= 0
##$PSIGN= 0
##$REVERSE= no
##$SF= 200.130001625132
##$SI= 16384
##$SIGF1= 3
##$SIGF2= 2
##$SINO= 5.538805
##$SIOLD= 16384
##$SREGLST= <1H.CDCl3>
##$SSB= 0
##$STSI= 16384
##$STSR= 0
##$SW_p= 3612.71676300578
##$SYMM= 0
##$S_DEV= 0
##$TDeff= 16384
##$TDoff= 0
##$TI= <>
##$TILT= no
##$TM1= 0
##$TM2= 0
##$TOPLEV= 0
##$USERP1= <user>
##$USERP2= <user>
##$USERP3= <user>
##$USERP4= <user>
##$USERP5= <user>
##$WDW= 1
##$XDIM= 16384
##$YMAX_p= 369790029
##$YMIN_p= -3975687
$$ End of Bruker specific parameters
$$ ---------------------------------
##NTUPLES= NMR SPECTRUM
##VAR_NAME=  FREQUENCY,     SPECTRUM/REAL,   SPECTRUM/IMAG
##SYMBOL=    X,             R,               I
##VAR_TYPE=  INDEPENDENT,   DEPENDENT,       DEPENDENT
##VAR_FORM=  AFFN,          ASDF,            ASDF
##VAR_DIM=   16384,         16384,           16384
##UNITS=     HZ,            ARBITRARY UNITS, ARBITRARY UNITS
##FACTOR=    0.220516191357247, 1,           1
##FIRST=     3154.73329122738, 0,            0
##LAST=      -457.983471778401, 0,           0
##MIN=       -457.983471778401, -3975687,    0
##MAX=       3154.73329122738, 369790029,    0
$$ Real data points
##PAGE= N=1
##DATA TABLE= (X++(R..R)), XYDATA
$$ [...]
12919a82127M4182K84596J29046l87084q722M96215J78651m27343L3332l22566
$$ -182127 -137945 146651 275697 -111387 -120109 376106 554757 127414 160746 -161820
12909a61820l02702j0223K37061K47329k13878K22834P7139l03158k22562L57107
$$ -161820 -464522 -474745 -237684 9645 -204233 18601 95740 -207418 -429980 -72873
12899g2873J71771L3645m0664l47389k91458j26292J18170R2087J73780K80689
$$ -72873 98898 132543 91879 -255510 -546968 -673260 -555090 -463003 -289223 -8534
12889h534N2757k0874J00774J1009J77862k00499j62259l36916l00208M16167
$$ -8534 44223 23349 124123 135132 312994 112495 -49764 -386680 -686888 -270721
12879b70721J58877Q3331k41566j24840M6545j3715L93114J1253o5576p1902k55503
$$ -270721 -111844 -28513 -270079 -394919 -348374 -362089 31025 42278 -23298 -95200 -350703
12868c50703J39915M2026J0204L53288l7664k00001J21889p5984j79724o5896
$$ -350703 -210788 -168762 -158558 194730 157066 -42935 78954 2970 -176754 -242650
12858b42650j48377K34909P6850M32814K49186n29792m862M25038k69764j96001
$$ -242650 -391027 -156118 -79268 353546 602732 72940 68078 493116 223352 27351
12848B7351o1271k80402K15427j73892K72754J00699l23812j86448J01141Q6045
$$ 27351 -33920 -314322 -98895 -272787 -33 100666 -223146 -409594 -308453 -222408
12838b22408J50981r4607m9959l10109L15151K9639M54362j62581l84907l15148
$$ -222408 -71427 -166034 -215993 -526102 -210951 -181312 273050 110469 -274438 -589586
12828e89586N23883j0565j45573L45552k64385k24463K95622J39948j45900p6276
$$ -589586 -65703 -76268 -221841 123711 -140674 -365137 -69515 70433 -75467 -151743
12818a51743L32670L08103m44039l43617J21954q9801J8906J03283M78032j29260
$$ -151743 180927 489030 44991 -298626 -176672 -266473 -247567 -144284 333748 204488
12808B04488o25339j84000K18799K91677K27223m12940m7179L68100Q8309n76948
$$ 204488 -420851 -604851 -386052 -94375 132848 -280092 -327271 40829 129138 -447810
12798d47810J88591K80930K85346j3169k62791k43775m81787N96696l31952K45080
$$ -447810 -259219 21711 307057 293888 31097 -212678 -694465 -97769 -429721 -184641
12788a84641L92400j02653K4369J67493J71668j899L1064k87350m59302J41580
$$ -184641 207759 105106 129475 296968 468636 466737 497801 210451 -248851 -107271
12778a07271L95401K21873k05195j4384j33739j53216m07451J69911N89443K9079
$$ -107271 288130 510003 304808 290424 156685 3469 -403982 -234071 355372 384451
12768C84451j70156J6032l77793J60906J29958j25901j09799Q050J7969J75042
$$ 384451 214295 230327 -147466 13440 143398 17497 -92302 -84252 -66283 108759
12758A08759l1414o2647n34023q5324K13250n5659k916L18982K81415m9372j79957
$$ 108759 77345 14698 -519325 -604649 -391399 -447058 -449974 -130992 150423 101051 -78906
12747g8906n10197K70389K59219j06210O6881K10775K10440J42319j38518l49317
$$ -78906 -589103 -318714 -59495 -165705 -98824 111951 322391 464710 326192 -23125
12737b3125L22333P041l51359j49584J76421K2761K2002J31311j7350k5800M9599
$$ -23125 299208 306249 -45110 -194694 -18273 4488 26490 157801 140451 114651 164250
12726A64250J537O1434k8082l26643n01061j11331R3089O4022k84970L25810L15731
$$ 164250 165787 227221 199139 -127504 -628565 -739896 -646807 -582785 -867755 -541945 -226214
12715b26214L5746j26499L32719K09772l7769k51210j20494L55997m33838k61644
$$ -226214 -190468 -316967 15752 225524 187755 -63455 -183949 172048 -261790 -523434
12705e23434M3336L59709J02995n4662j79731K2276M99282J08436Q5836j72543
$$ -523434 -480098 -120389 -17394 -72056 -251787 -229511 269771 378207 464043 291500
12695B91500n60377J23536L07449o3635K61878L5085k37735R375K66023k76631
$$ 291500 -268877 -145341 162108 98473 360351 395436 157701 167076 433099 156468
12685A56468k526J60466J6281j10017j15958K01257k4158j48428O8658j8793J32562
$$ 156468 153942 314408 330689 220672 104714 305971 281813 133385 202043 183250 315812
12674C15812m44097P8996J04818j74748K61901P075O2755q8940K81559M0520l56488
$$ 315812 -128285 -49289 55529 -119219 142682 149757 212512 123572 405131 445651 89163
12663H9163j00143J96595j65073J96401l0711l78158M7242J41516l30632m91304
$$ 89163 -10980 185615 20542 216943 186232 -191926 -144684 -3168 -333800 -825104
12653h25104M50237M46972r2153O5612q4395K17557J08473k50345l64300L51665
$$ -825104 -374867 72105 -20048 45564 -38831 178726 287199 36854 -327446 24219
12643B4219m4237J42068N5424m98610L254K33095L0845N11328R3530j30315R5693
$$ 24219 -20018 122050 177474 -321136 -317882 -84787 -53942 457386 550916 420601 516294
12632E16294k29652j28959J13765m53306j93594j13218L81212M43275J91404J1418
$$ 516294 286642 157683 271448 -181858 -375452 -488670 -107458 335817 527221 538639
12622E38639K67624k21564j19432L07479n45720j98834j26986k81231L1397K56281
$$ 538639 806263 584699 465267 772746 227026 28192 -98794 -380025 -348628 -92347
12612i2347N4104k52281K98173p8123k61174l75599O89070L93403k32424m9191
$$ -92347 -38243 -290524 7649 -70474 -331648 -707247 -18177 375226 142802 93611
12602I3611l49166O44345N9084q18208L49399L74991J89567j03494l18168j85817
$$ 93611 -255555 388790 447874 -370334 -20935 354056 543623 440129 121961 -63856
12592f3856J1437j63236J56781J52502m96025J98038O89928j37954N1605m59362
$$ -63856 -52419 -215655 -58874 93628 -402397 -204359 485569 347615 399220 -60142
12582f0142j40745M91129K9915J1225l64665K61051K74763o79505m19019J86340
$$ -60142 -200887 290242 320157 331382 -33283 227768 502531 -176974 -595993 -409653
12572d09653k0537M47678J51574R9607j49485m72926M7900L68657k07372l986
$$ -409653 -430190 17488 169062 268669 119184 -353742 -305842 62815 -144557 -148543
12562a48543n0391L77836J36351l6954J39323J5061J7928K4062n74465j35461
$$ -148543 -198934 178902 315253 278299 417622 432683 450611 474673 -99792 -235253
12552b35253J5620K56608l86397P3603K24652J16473k10680j86656L78979L95627
$$ -235253 -219633 36975 -349422 -275819 -51167 65306 -145374 -332030 46949 442576
12542D42576Q2424l14196k24829n9574K20406K05612k77646j94627L38865j44575
$$ 442576 525000 210804 -14025 -73599 146807 352419 74773 -119854 219011 74436
12532G4436l03371j8018K2493K19102l01563k6106M06532L53656m57088R0844
$$ 74436 -228935 -246953 -224460 -5358 -306921 -333027 73505 427161 -29927 60917
12522F0917N16044k35313k39082J55632L98677m03121o4870K27458j23287k10596
$$ 60917 576961 341648 102566 258198 656875 253754 188884 416342 293055 82459
12512H2459j04793j84366j6974J68488J30527M33090O5618k9832k25666l50983
$$ 82459 -22334 -206700 -223674 -55186 75341 508431 574049 544217 318551 -32432
12502c2432Q7881O4796J80170K92802J62773R2647m10637j09407N33094q8883
$$ -32432 55449 120245 300415 593217 755990 848637 438000 328593 861687 772804
12492G72804k71598K1468L8819k38917l56134j08659L16344L06783k4579j01198
$$ 772804 501206 522674 561493 322576 -33558 -142217 174127 480910 456331 355133
12482C55133j6753J06627L3284p6326k38364K62282M2028j52109M5504k8897L87429
$$ 355133 338380 445007 478291 401965 163601 425883 467911 315802 361306 332409 719838
12471G19838o3664Q137j42956l14145J97553J61891L56381l3210l07681N1799
$$ 719838 656174 664311 521355 207210 404763 566654 923035 889825 582144 633943
12461F33943j49699L11477K3838K68093j03281j52076K4735J43048k30303J28666
$$ 633943 484244 795721 819559 1087652 984371 832295 857030 1000078 769775 898441
12451H98441m57051l5753J02526M54475K74669j14000j75188l28027K5794K73470
$$ 898441 441390 405637 508163 962638 1237307 1123307 948119 620092 645886 919356
12441I19356l1535j99310K68442j93708k5414K81636K02137j57794n0700M44651
$$ 919356 887821 688511 956953 763245 737831 1019467 1221604 1063810 1013110 1457761
12431A457761J06074o56237k1328J64951J94006j64169K31190k9891J08992K42792
$$ 1457761 1563835 907598 886270 1051221 1245227 1081058 1312248 1282357 1391349 1634141
12421A634141l46493k95046P3361L75121j30237j7527N80030L27666n08285k12577
$$ 1634141 1287648 992602 1065963 1441084 1310847 1293320 1873350 2201016 1692731 1480154
12411A480154N87727P4691l64970J51664O9013k32271J19107N91052P2362l90085
$$ 1480154 2067881 2142572 1777602 1929266 1998279 1766008 1885115 2476167 2548529 2158444
12401B158444J90549J80945l63324J33233L90660q3483K9459l11618j56017K78371
$$ 2158444 2348993 2529938 2166614 2299847 2690507 2607024 2636483 2324865 2168848 2447219
12391B447219M89157m76391l93268j19195J85135O66418K3067j9369M4745j06720
$$ 2447219 2936376 2459985 2066717 1947522 2132657 2799075 2822142 2802773 2847518 2740798
12381B740798L68398K39135r1207O2610J34360k48230K97478j3785M63354n7519
$$ 2740798 3109196 3348331 3257124 3319734 3454094 3205864 3503342 3489557 3952911 3895392
12371C895392j49125L5314r3515N70946K09747L9209n10300J91392J33880j82730
$$ 3895392 3746267 3781581 3688066 4259012 4468759 4507968 3997668 4189060 4322940 4140210
12361D140210l70502L75911K08264J51081l5001K8486j29976J72135J77416J05118
$$ 4140210 3769708 4145619 4353883 4504964 4469963 4498449 4368473 4540608 4718024 4823142
12351D823142j6353K42759N729l6871K62719o42589j66636L40959M98284j19461
$$ 4823142 4806789 5049548 5055277 5018406 5281125 4638536 4471900 4812859 5311143 5191682
12341E191682J01796j15799q725L32643k19833l0087L12334L03650j32395L8116
$$ 5191682 5293478 5177679 5168954 5501597 5281764 5251677 5564011 5867661 5735266 5773382
12331E773382N15867m09339k15114K59457M67599J94276q99302M55054L44554
$$ 5773382 6289249 5879910 5664796 5924253 6391852 6586128 5686826 6141880 6486434
12322F486434o8723J22585j12395m1404j36895m0040N8366J48771J02939M46886
$$ 6486434 6417711 6540296 6427901 6386497 6249602 6209562 6267928 6416699 6519638 6966524
12312F966524l03857J16036k75029K09542j6228P0150M06103q1528N3219j7008
$$ 6966524 6662667 6778703 6503674 6713216 6696988 6767138 7173241 7091713 7144932 7127924
12302G127924K07993o52845q494K20050K45875q4935k80686k18276O66630k31681
$$ 7127924 7335917 6683072 6674578 6894628 7140503 7055568 6774882 6556606 7223236 6991555
12292F991555n7113M0376M4817J90493j15702K42925o5546l33707k02779J84881
$$ 6991555 6934442 6974818 7019635 7210128 7094426 7337351 7271805 6938098 6735319 6920200
12282F920200J08399l54015j9325l61971j2327N00452l05918l1371k52964M16041
$$ 6920200 7028599 6674584 6655259 6293288 6280961 6781413 6475495 6444124 6191160 6607201
12272F607201J54780l33831Q329J6542l10135K6895k73578n2111L5891k52344
$$ 6607201 6761981 6428150 6436479 6453021 6142886 6169781 5896203 5844092 5879983 5627639
12262E627639k35595J3445k493K2286j33321m46552m8853K5244r8696K46811j95875
$$ 5627639 5392044 5405489 5402996 5425282 5291961 4845409 4796556 4821800 4723104 4969915 4774040
12251D774040l68882n341L55733n27643q2228n9811j35631K13717M2788k89792
$$ 4774040 4405158 4399817 4755550 4227907 4145679 4085868 3950237 4163954 4206742 3916950
12241C916950j98677M8893L04438m15297o57494L66269K9678k55716p9346o6243
$$ 3916950 3718273 3767166 4071604 3656307 2998813 3365082 3394760 3139044 3059698 2993455
12231B993455n21214L10571n04468l8138M7450j54282J88334K03491n1367j23460
$$ 2993455 2472241 2782812 2278344 2240206 2287656 2133374 2321708 2525199 2473832 2350372
12221B350372l12647l71067K77451J72330j64064j09088P5470K2629k07690k39564
$$ 2350372 2037725 1666658 1944109 2116439 1952375 1843287 1918757 1941386 1733696 1494132
12211A494132L15977l5595j50750K7856o2132k75062l30485P1087J89000K47221
$$ 1494132 1810109 1774514 1623764 1651620 1589488 1314426 983941 1055028 1244028 1491249
12201A491249o2357J51637k39041o03056K58895J26455j58633q2355K25355P1521
$$ 1491249 1428892 1580529 1341488 738432 997327 1123782 965149 882794 1108149 1179670
12191A179670k61520K16304J0481n35326J24863n6744l1319j57333n507R3358
$$ 1179670 918150 1134454 1144935 609609 734472 677728 646409 489076 483569 576927
12181E76927L15618J46807q3572J29110J14395j45757K13533m98034j29874p6833
$$ 576927 892545 1039352 955780 1084890 1199285 1053528 1267061 769027 639153 562320
12171E62320j70305K84472P3379J01249L8727L811m84149j28348K28162q5538
$$ 562320 392015 676487 749866 851115 889842 893653 409504 281156 509318 423780
12161D23780j60426j31610j84658N28528j9224O0999K43779j63962Q5164L74238
$$ 423780 263354 131744 -52914 475614 456390 517389 761168 597206 682370 1056608
12151A056608m65790k02273k16838o6158L05729k399j31210k6225k21406K47012
$$ 1056608 590818 388545 171707 105549 411278 408879 277669 251444 30038 277050
12141B77050K49246R8647N0440n1676k90444k57143j64323K21600J67528N4753
$$ 277050 526296 624943 675383 623707 333263 76120 -88203 133397 300925 355678
12131C55678j4913J55313k1580J63808j12592k67542m54858J04796K7811q8875
$$ 355678 340765 496078 474498 638306 525714 258172 -196686 -91890 -64079 -152954
12121a52954J19999k10846O46209K94847n73329M44015p0087o8968Q3767j89489
$$ -152954 -32955 -243801 402408 697255 123926 567941 497854 428886 512653 323164
12111C23164n8005n4600n5322J01410Q1670k97559K78132k30290K67227j4065
$$ 323164 265159 210559 155237 256647 338317 40758 318890 88600 355827 341762
12101C41762K7672n33834J69885k57017J16346L31113L12650k64388J71919L94650
$$ 341762 369434 -164400 5485 -251532 -135186 195927 508577 244189 416108 810758
12091H10758l10301M7868k23798k71550j66857L86095Q6983n66128k13475L74672
$$ 810758 500457 548325 324527 52977 -113880 272215 359198 -206930 -420405 -45733
12081d5733K3978P7270m6248J62377j59707p685K13228O3626l2398l5456K58674
$$ -45733 -21755 55515 9267 171644 11937 4252 217480 281106 248708 213252 471926
12070D71926k15042j75248j75858J72737o7837J7586M5038l13125K93716O00528
$$ 471926 256884 81636 -94222 78515 10678 28264 73302 -239823 53893 654421
12060F54421n84875K9057K36991J42906k233r1621P8730m64597O7376j11153L38309
$$ 654421 69546 98603 335594 478500 476267 384646 463376 -1221 66155 -44998 293311
12049B93311J26347K00084m12434m00594L2079K74914J67308q6129j20078K78731
$$ 293311 419658 619742 207308 -193286 -161207 113707 281015 194886 74808 353539
12039C53539j0920k28035j69446j86926J65017k08049J59230k20035N3941j15371
$$ 353539 342619 114584 -54862 -241788 -76771 -284820 -125590 -345625 -291684 -407055
12029d07055k48463L63760L52736R7702j6338J3783q9735N8261l08099J62414
$$ -407055 -655518 -291758 60978 158680 142342 156125 66390 124651 -183448 -21034
12019b1034P2470k44405J17816m3108N02926K5853l25598n2289o5668N588L48415
$$ -21034 51436 -192969 -75153 -118261 384665 410518 84920 32631 -33037 -27449 320966
12008C20966l6201j43582K6639l25908p7687K24736l22414K14854R9111q118n78307
$$ 320966 284765 141183 167822 -158086 -235773 -11037 -333451 -118597 -19486 -27604 -605911
11997f05911L99138L64767m9268K15383k61461m2668p0351n6585l03811K37970
$$ -605911 -206773 157994 108726 324109 62648 19980 -50371 -106956 -410767 -172797
11987a72797K20513J39902J9621k643j84906Q4387Q1741k36077l64973M92500
$$ -172797 47716 187618 207239 204596 19690 104077 185818 -50259 -415232 77268
11977G7268J11120j66689k73226m9493L2499r461J70139L74597k2440L38145j59599
$$ 77268 188388 21699 -251527 -301020 -268521 -277982 -107843 266754 244314 582459 422860
11966D22860j50225j17487q1706J00511J907J64356l35491j22269N4770J1313
$$ 422860 272635 155148 73442 173953 175860 340216 4725 -117544 -62774 -51461
11956e1461J35364k14580l7390J83154J60492Q2367J37947l17393k71868j75173
$$ -51461 83903 -130677 -168067 15087 175579 257946 395893 78500 -193368 -368541
11946c68541M3799K57937J13629J3867k08938K00519J88427k65657l26002L96784
$$ -368541 -324742 -66805 46824 60691 -148247 52272 240699 -24958 -350960 45824
11936D5824j33676K01738l0330q5759j42185j94310J60946N4557j07596N64568
$$ 45824 -87852 113886 83556 -2203 -144388 -338698 -177752 -123195 -230791 333777
11926C33777j68733r8131K1758n2260o7141l8206j71072k23981K89718p2793Q2061
$$ 333777 165044 66913 88671 36411 -30730 -68936 -240008 -463989 -174271 -247064 -165003
11915a65003Q0051k98902L06475j20698J04929j60803n9855K16452m1150m3912
$$ -165003 -84952 -383854 -77379 -198077 -93148 -253951 -313806 -97354 -138504 -182416
11905a82416K99541K69515j13177j34354j87396k23410P9337k7596L40810J47504
$$ -182416 117125 386640 273463 139109 -48287 -271697 -192360 -219956 120854 268358
11895B68358K22j96408L6670j80948j3114J48950m46831O04173k72859O8870L51775
$$ 268358 268580 72172 108842 -72106 -85220 63730 -383101 221072 -51787 17083 368858
11884C68858j96109o26633J18789J60978j57448k66367K56355k6541N72575k50108
$$ 368858 172749 -453884 -335095 -174117 -331565 -597932 -341577 -368118 204457 -45651
11874d5651L09150L7629k96930K16686p8483L1141J9955j61061k99417j49765
$$ -45651 263499 301128 4198 220884 142401 173542 193497 32436 -266981 -416746
11864d16746M353j70899M39297P4116k61076R879K11303N46671l95319l36062
$$ -416746 -412393 -583292 -143995 -69879 -330955 -321076 -109773 436898 41579 -294483
11854b94483j80180O42158N8223j60208J76977j66580q9538J18641l01647j77227
$$ -294483 -474663 167495 225718 65510 242487 75907 -13631 105010 -196637 -373864
11844c73864R8230p4110N3403K02512j08362J43020R4826J33968j39794j64447
$$ -373864 -275634 -349744 -296341 -93829 -202191 -59171 35655 169623 29829 -134618
11834a34618L85742J76077j46049q3411m07668k00949K28333J6694L25955q139
$$ -134618 251124 427201 281152 197741 -209927 -410876 -182543 -165849 160106 151967
11824A51967n1119K08081j56180l15756J17499k96862M31562J44814J87964j99761
$$ 151967 100848 308929 152749 -163007 -45508 -342370 89192 234006 421970 222209
11814B22209n23817Q1401Q1311k47081K42044R8493R1356l6584l9924j6830n74664
$$ 222209 -301608 -220207 -138896 -385977 -143933 -45440 45916 9332 -30592 -47422 -622086
11803f22086O84694J86248l31855k34660N02655R3692J7770j74042k72099l45101
$$ -622086 62608 248856 -82999 -317659 184996 278688 296458 122416 -149683 -494784
11793d94784K01685M769l1729o9782j80337L90133K46190m19086N5732K68122
$$ -494784 -293099 -288330 -320059 -389841 -570178 -180045 66145 -352941 -297209 -29087
11783b9087M63242Q1432l25041l77609K23840m68293N0911N31697n26799l94153
$$ -29087 434155 515587 190546 -187063 36777 -431516 -380605 151092 -375707 -769860
11773g69860J60230N37554M9085J23472l65025j01689M73238k00513j77525O8136
$$ -769860 -609630 -72076 -22991 100481 -264544 -366233 107005 -93508 -271033 -202897
11763b02897L99404K16344l29379j01512J10238r0318k4271k3791j47859O32272
$$ -202897 196507 412851 83472 -18040 92198 1880 -22391 -46182 -194041 438231
11753D38231r047l42204n77908K41465L03845O1703k62050j44720J42158K91475
$$ 438231 429184 86980 -490928 -249463 54382 116085 -145965 -290685 -148527 142948
11743A42948l8983k55470l68575K1021K5995L37679M74106j05611k50115K5868
$$ 142948 103965 -151505 -520080 -499059 -473064 -135385 338721 233110 -17005 8863
11733H863N8906P3808k632j71892K52696K47474j37844k60000R7071j84986p3491
$$ 8863 67769 141577 138945 -32947 219749 467223 329379 69379 166450 -18536 -92027
11722i2027j21843k0880N1717J57005l62880J46651m9966R0018j08878N9484L08918
$$ -92027 -213870 -234750 -183033 -26028 -388908 -242257 -292223 -202205 -311083 -251599 57319
11711E7319j04195J29250p7947K08122K5738k90407j82859m5789j5038N68620
$$ 57319 -46876 82374 4427 212549 238287 -52120 -234979 -280768 -295806 272814
11701B72814K45318p73868J76074K66644M5217J6948m15349j37882M39070p036
$$ 272814 518132 -255736 -79662 186982 232199 249147 -166202 -304084 134986 127950
11691A27950j39009k8873n3501k20612J17937N06944o1963P0483j28783J72974
$$ 127950 -11059 -39932 -93433 -314045 -196108 310836 248873 319356 190573 363547
11681C63547m49324O9023k69318J84528j01855j29806K52132k65519J33144q2255
$$ 363547 -85777 -16754 -286072 -101544 -203399 -333205 -81073 -346592 -213448 -295703
11671b95703N6550J09017K14699N3972L34945k2071k95932k61420o5435K7114
$$ -295703 -239153 -130136 84563 138535 473480 451409 155477 -105943 -171378 -144264
11661a44264J35402J53416J60376k16650m3872M56321p6381m49597j26916N9981
$$ -144264 -8862 144554 304930 88280 44408 500729 424348 -25249 -152165 -92184
11651i2184k6620Q0436J25366R9183j39472k31488j85805M44940J61996m9569
$$ -92184 -118804 -38368 86998 186181 46709 -184779 -370584 74356 236352 186783
11641A86783k56268K30909K24079k52642K73205K16673o7063l73060L50826L9966
$$ 186783 -69485 161424 385503 132861 406066 622739 555676 182616 533442 573408
11631E73408j48442m12647l96619R7117m7579J47532j16980R7011K10957J61173
$$ 573408 424966 12319 -384300 -287183 -334762 -187230 -304210 -207199 3758 164931
11621A64931n9173K92301m46291o01860L66702K16539j94795L11094m42398J43510
$$ 164931 105758 398059 -48232 -650092 -283390 -66851 -261646 49448 -392950 -249440
11611b49440m5677K51274P1640L03101M80732l41593J60297p4367j16417k15646
$$ -249440 -295117 -43843 27797 330898 811630 470037 630334 555967 439550 223904
11601B23904j46768l63706l7571K08815P0410j7703J07248J18737Q6351J61848
$$ 223904 77136 -286570 -324141 -115326 -44916 -62619 44629 163366 249717 411565
11591D11565k15932j35045J05891j9078l4897l8423J91113l38164J5595j59266
$$ 411565 195633 60588 166479 147401 112504 74081 265194 -72970 -57375 -216641
11581b16641R3633N0642N8145k13502K77907j02037l68001J68181r2761j23932
$$ -216641 -123008 -72366 -14221 -227723 50184 -51853 -419854 -251673 -344434 -468366
11571d68366J65953O04556j76248n5805L87080m88184O0191M69420k6182l03919
$$ -468366 -302413 302143 125895 70090 457170 -31014 29177 498597 472415 168496
11561A68496l35438l21180J44041J27026L04666l632j37948J28703J10463j58957
$$ 168496 -166942 -488122 -344081 -217055 87611 83979 -53969 74734 185197 26240
11551B6240J55358L60861m18340j32737l7808k76467p5626L17944M23207k54927
$$ 26240 181598 542459 124119 -8618 -46426 -322893 -398519 -80575 342632 87705
11541H7705j57526L74162l69487M6263m09745j36742M24592j11994k72639J55434
$$ 87705 -69821 304341 -65146 -18883 -428628 -565370 -140778 -252772 -525411 -369977
11531c69977J15628K5835L74334R2047r5510n3313l1233M294k10077j46508K28815
$$ -369977 -254349 -228514 145820 237867 142357 89044 57811 62105 -147972 -294480 -65665
11520f5665J61035j07703m07967k9563L78935J22836l18309K17898J04196j04940
$$ -65665 95370 -12333 -420300 -449863 -70928 51908 -266401 -48503 55693 -49247
11510d9247m9615J18251M02703l70153k99160K46065k26144K79413j52202K26067
$$ -49247 -98862 19389 422092 51939 -247221 -1156 -227300 52113 -100089 125978
11500A25978J07994l38880l74787K44611J84558l28125L83286j38426j91915Q9724
$$ 125978 233972 -104908 -479695 -235084 -50526 -378651 4635 -133791 -325706 -235982
11490b35982L39888J9518j73697p1635L02152K77458l2032n82347J44108j76069
$$ -235982 103906 123424 -50273 -121908 180244 457702 425670 -156677 -12569 -188638
11480a88638r9860q0835m5668Q3923K098J14334j33572J57141J73253K68022k88142
$$ -188638 -288498 -369333 -415001 -331078 -328980 -214646 -348218 -191077 -17824 250198 -37944
11469c7944N17608N75350n15978m82888K85705J7134J85010k38321q6181p6952
$$ -37944 479664 1055014 539036 56148 341853 358987 543997 305676 219495 142543
11459A42543k24305J38873J59302l29792J10461K28331J17824r0066o74202j63317
$$ 142543 -81762 57111 216413 -113379 -2918 225413 343237 253171 -421031 -584348
11449e84348P1227J81385p1704J80854N4539L19974J2219j16046j36141K1779
$$ -584348 -513121 -331736 -403440 -222586 -168047 151927 164146 48100 -88041 -66262
11439f6262J76253r657j54304K156O4081L16476j45696Q0165p64770J8841L25910
$$ -66262 109991 100334 -53970 -51814 12267 328743 183047 263212 -501558 -482717 -156807
11428a56807K5621L9680k35147R3212N13949J96968j42867r2925K58014l70076
$$ -156807 -131186 -91506 -326653 -233441 280508 477476 334609 241684 499698 129622
11418A29622k71568O2161P7253P9822p6480o0970n9052J33694j79167L27295J3101
$$ 129622 -141946 -79785 -2532 77290 810 -60160 -119212 14482 -164685 162610 175711
11407A75711r9060P7512M24087j45977j88923R8816p4246m96778J97858J5472
$$ 175711 76651 154163 578250 432273 243350 342166 267920 -228858 -31000 -15528
11397a5528J79981J80383m25738l93415l4149L97231J29610M7214l95441K09885
$$ -15528 164453 344836 -80902 -474317 -508466 -111235 18375 65589 -329852 -119967
11387a19967j70828M7434j95004L79849M00765l15533k53531P6770k74447o9462
$$ -119967 -290795 -243361 -438365 -58516 342249 26716 -226815 -150045 -424492 -493954
11377d93954Q47612r0127l42964k7787k3270L8677K65897j61054l35974K92623
$$ -493954 353658 263531 -79433 -107220 -130490 -91813 174084 13030 -322944 -30321
11367c0321j24134K43311J6587m23303N90125k96903k60505L10120j03159n8008
$$ -30321 -154455 88856 105443 -317860 272265 -24638 -285143 24977 -78182 -136190
11357a36190L13165K85842K6656N5028j64613J2192k622m48156K53572K88738
$$ -136190 176975 462817 489473 544501 379888 392080 389458 -58698 194874 483612
11347D83612J54687l03279q8266n7304J15843k45388P8912J790m23229J13276
$$ 483612 638299 335020 246754 189450 305293 59905 138817 140607 -282622 -169346
11337a69346O88351o822j50172l45549J43009p2762k45088o0655L50300j37242
$$ -169346 519005 512183 362011 16462 159471 86709 -158379 -219034 131266 -5976
11327e976k5214J39277l56957l25514Q17240j78077k8766J59597j99460O78077
$$ -5976 -31190 108087 -248870 -574384 242856 64779 36013 195610 -3850 674227
11317F74227j60675l23546j1691m0029l42412K14242k83507L2451L45364l3178
$$ 674227 513552 190006 178315 138286 -204126 10116 -273391 -240940 104424 71246
11307G1246l23833N6034K9342K22555K95870K05867j51235j47135j28650K4575
$$ 71246 -252587 -196553 -167211 55344 351214 557081 405846 258711 130061 154636
11297A54636j74602k04780R7498P9781q352M2947J23894j03199j40902J62107
$$ 154636 -19966 -224746 -127248 -47467 -55819 -12872 111022 7823 -133079 29028
11287B9028M0892J88941k03961m11955L25297J1575j02942p4121K1231Q6294p4685
$$ 29028 69920 258861 54900 -357055 -31758 -20183 -123125 -197246 -176015 -89721 -164406
11276a64406J59527k91859n2742K85038J79574M96741K74595l0899n39042j42407
$$ -164406 -4879 -296738 -349480 -64442 115132 611873 886468 855569 316527 174120
11266A74120k17450K4225K20034j91356N89813k38743n4356J3878k91971k37741
$$ 174120 -43330 -19105 200929 9573 599386 360643 306287 320165 28194 -209547
11256b09547l7457J03846K01855k69375K77971j10555L80766N5770K8760J24647
$$ -209547 -247004 -143158 58697 -210678 67293 -43262 337504 393274 422034 546681
11246E46681m50034Q1882J2751m2115l84856j04695N438L98180q917R3161l3280
$$ 546681 96647 178529 191280 149165 -235691 -340386 -334948 63232 54315 147476 114196
11235A14196K34709m9789P0136K57484k75853k92492K87484L10776k38386l99552
$$ 114196 348905 299116 369252 626736 350883 58391 345875 656651 418265 18713
11225A8713P5599M7068k29299M9752q1973J24671J24742Q0959J94754q1119K5647
$$ 18713 94312 141380 -87919 -38167 -120140 4531 129273 210232 404986 323867 349514
11214C49514L2732j38006j57713p3119m4185L03200L65272l41860m7931j89976
$$ 349514 382246 244240 86527 13408 -30777 272423 637695 295835 247904 57928
11204E7928L8200J31855K69527m6467q5763m16511l34497J16924Q3038K51844
$$ 57928 96128 227983 497510 451043 365280 -51231 -385728 -268804 -185766 66078
11194F6078j86045p3037P8709R1620J20188k66413J20641o9882p6313J09334K13818
$$ 66078 -119967 -193004 -114295 -22675 97513 -168900 -48259 -118141 -194454 -85120 128698
11183A28698j59401k13481J67872l49405L12041K78137j71529Q5614k67995o0976
$$ 128698 -30703 -244184 -76312 -425717 -113676 164461 -7068 78546 -189449 -250425
11173b50425K02504K63967M3953m96184M23985K52545n7450m0325K1299J66589
$$ -250425 -47921 216046 259999 -236185 187800 440345 382895 342570 363869 530458
11163E30458M34581k88271m31875M8804l34768n7068J83952M06758m4797m47312
$$ 530458 965039 676768 244893 293697 -41071 -98139 85813 492571 447774 462
11153D62M48265j14896j42613P6732k4649K64395j03597k46467k46141k60016
$$ 462 448727 333831 191218 267950 243301 507696 404099 157632 -88509 -348525
11143c48525N24015N56250k57406j65566m61002k68474L25474J90459J91961M5370
$$ -348525 175490 731740 474334 308768 -152234 -420708 -95234 95225 287186 332556
11133C32556j99181q3788R405l07466m4682p8248M82042J49825J11321K1143k80401
$$ 332556 133375 49587 58992 -248474 -293156 -371404 110638 260463 371784 392927 112526
11122A12526L21905k22338j65720m38271K89756K12206l39959k6379j82707K60751
$$ 112526 434431 212093 46373 -391898 -102142 110064 -229895 -256274 -438981 -178230
11112a78230N15782j43312K76143k11159o06602L25094K22653k39791j07769J80603
$$ -178230 337552 194240 470383 259224 -347378 -22284 200369 -39422 -147191 33412
11102C3412j17887P6018J77123k41275N4746J50123j4319J03599j15406K4642
$$ 33412 -84475 -8457 168666 -72609 -17863 132260 117941 221540 106134 130776
11092A30776J47080J1060j51370J42478o81863j50971O38222K66179k2370J23299
$$ 130776 277856 288916 137546 280024 -401839 -552810 85412 351591 329221 452520
11082D52520j20758n5936O035j73975Q9230p6429M34152N2688k92142m08121P5125
$$ 452520 331762 275826 281861 107886 197116 120687 554839 607527 315385 -92736 -17611
11071a7611K11981l96426M13012J48236J4481K30024k83647l91732N9348O17651
$$ -17611 194370 -202056 210956 359192 373673 603697 320050 -71682 -12334 605317
11061F05317m00550J18115J21166l64082m15338N20492m31279j99273K38366K71182
$$ 605317 204767 322882 444048 79966 -335372 185120 -246159 -445432 -207066 64116
11051F4116L02038j72552N6104J3879k5420j7483N22815k79534l52759j14000
$$ 64116 366154 193602 249706 263585 238165 220682 743497 463963 111204 -2796
11041b796K62155l71591O8987O0212K33390k46684K35441J41880J29569k3664
$$ -2796 259359 -112232 -43245 16967 250357 3673 239114 380994 510563 486899
11031D86899O8848J68433k52485o9946m31102K98030J73829q8138p045q4030k7416
$$ 486899 555747 724180 471695 401749 -29353 268677 442506 354368 347323 263293 235877
11020B35877p2359P3596J83111j20303k22060J40015J99011J51705P4253n7936
$$ 235877 163518 237114 420225 299922 77862 217877 416888 568593 642846 584910
11010E84910k88548l11197Q4601K69346j70316L01199L39586m98340N6331k06450
$$ 584910 296362 -14835 69766 339112 168796 469995 809581 311241 367572 161122
11000A61122j58494O637O4270n256j36077j92572P35023L6606j69175J54825j46601
$$ 161122 2628 9265 73535 68279 -67798 -260370 474653 511259 342084 496909 350308
10989C50308L7716l54204K73225J03265k07174p0732J31115l02402K67471O9215
$$ 350308 388024 33820 307045 410310 203136 132404 263519 -38883 228588 297803
10979B97803k43450J4048J4596L93467J57052k20265k58114Q2074L9920n6816
$$ 297803 54353 68401 82997 476464 633516 413251 155137 237211 277131 220315
10969B20315N4758l03299j47339N7690k96044M27967K99707k00810k20614L34669
$$ 220315 275073 -28226 -175565 -117875 -413919 14048 313755 112945 -107669 227000
10959B27000o9660n8396M70825J358n90637j04087L26140J20763k78935J91019
$$ 227000 157340 98944 569769 571127 -19510 -123597 202543 323306 44371 235390
10949B35390J09150l05646m3262K23820O6480L6436j63790P76467q68064K80412
$$ 235390 344540 38894 -4368 219452 285932 322368 158578 935045 66981 347393
10939C47393J06513q1057M5970n5808l42271k3927L52071j51741J79046j02196
$$ 347393 453906 372849 418819 363011 20740 -3187 348884 197143 376189 273993
10929B73993l9852R5442O8501R9447K12652m71136K32106k43194l92266M74381
$$ 273993 234141 329583 398084 497531 710183 239047 471153 227959 -164307 310074
10919C10074j23866j67626J10474O0967K76286l34588L66322j58468K51569M123
$$ 310074 186208 18582 129056 190023 466309 131721 498043 339575 591144 595267
10909E95267J10113M5984m06878J56131M0007o4124J81037m05357l63867K80376
$$ 595267 705380 751364 344486 500617 540624 476500 657537 252180 -111687 168689
10899A68689M46106J10218j58419K29861j05798l29494m4268q3056M178p5287
$$ 168689 614795 725013 566594 796455 690657 361163 316895 233839 238017 162730
10889A62730K04977R9760L65657p67194m1852M19824m2510K55847J19650j90108
$$ 162730 367707 467467 833124 65930 24078 443902 401392 657239 776889 586781
10879E86781j02129j91792K93594k15379M45491R2609j04147l29862j88082K32458
$$ 586781 484652 292860 586454 371075 816566 909175 805028 475166 287084 519542
10869E19542J51468P4227j94002j37680K7788K26995p1855j50560p451K67767
$$ 519542 671010 745237 551235 413555 441343 668338 596483 445923 438472 706239
10859G06239j51959J16230K892k82518L6781m7490L13869k19849J57746J26402
$$ 706239 554280 670510 673402 390884 427665 380175 694044 474195 631941 758343
10849G58343l55854j98851M61775j60542r031J48552k72k04242K82622P0689k33067
$$ 758343 402489 203638 665413 504871 495840 644392 644120 439878 722500 793189 560122
10838E60122j97575q6557o011P3672N42740k58224M00328J40261j62735m13825
$$ 560122 362547 275990 269979 343651 886391 628167 1028495 1168756 1006021 592196
10828E92196K412M7677j97499j33235N02373j69852j7382j56557O4669l31356
$$ 592196 594608 642285 444786 311551 813924 644072 626690 470133 534802 203446
10818B03446P09297J20477l54535j85073O79j046o5873j27384K70538o4843k23278
$$ 203446 912743 1033220 678685 493612 494291 493245 427372 299988 570526 505683 282405
10807B82405K85590M59172j46354r9532j31754j48496K16925M31888l54386K6326
$$ 282405 567995 1027167 880813 781281 649527 501031 717956 1149844 795458 821784
10797H21784J39345L78861L5492k20651m00873j95841n9364J94238K57793j49045
$$ 821784 961129 1339990 1375482 1154831 753958 558117 498753 692991 950784 801739
10787H01739L53696N5059l38010K14538K04927k85219J85075l56565R1476q1329
$$ 801739 1155435 1210494 872484 1087022 1291949 1006730 1191805 835240 926716 845387
10777H45387k95706l94286L51891L54960K13658m46841K76984j60547l0496N1301
$$ 845387 549681 155395 507286 862246 1075904 629063 906047 745500 715004 766305
10767G66305J79883L3220j07139r9592k17012L67366k3585K76821n4869k42988
$$ 766305 946188 979408 872269 772677 555665 923031 899446 1176267 1121398 878410
10757H78410N4488J49259O6364O6137m33321r5941l65834l62259N11678L17991
$$ 878410 932898 1082157 1148521 1214658 781337 685396 319562 -42697 468981 786972
10747G86972J28280l1068R2609K41144k10M4387m8018k64459J63557M09078l5322
$$ 786972 915252 884184 976793 1217937 1217727 1262114 1214096 949637 1113194 1522272 1486950
10736A486950J53300j10917K902p4395j45510k57449m22947j4653J15794j53035
$$ 1486950 1640250 1529333 1532235 1457840 1312330 1054881 631934 617281 733075 580040
10726E80040J21725O6227l0844L86967K140n9117L00691j33440j26017P8902k19575
$$ 580040 701765 767992 737148 1124115 1126255 1067138 1367829 1234389 1108372 1187274 967699
10715I67699j1794M5661L36761m2853k57259O9231J17469p38134M62152q36n7015
$$ 967699 955905 1001566 1338327 1295474 1038215 1107446 1224915 486781 948933 948097 891082
10704H91082J59383M10487j12287k18885M8038K52276o5786J32121k41086K79822
$$ 891082 1050465 1460952 1348665 1129780 1177818 1430094 1364308 1496429 1255343 1535165
10694A535165K37813l59286k5286q0090k7239j3028K21165K4772n4507O8670J60945
$$ 1535165 1772978 1413692 1388406 1308316 1281077 1268049 1489214 1513986 1459479 1528149 1689094
10683A689094m52415J58445L2478k73664r692K01495J36294L10250k90897K7495
$$ 1689094 1236679 1395124 1427602 1153938 1144246 1345741 1482035 1792285 1501388 1528883
10673A528883K5159J60694k03857q3437j9228j34451J16839p853J09279L85488
$$ 1528883 1554042 1714736 1510879 1427442 1408214 1273763 1390602 1382749 1492028 1877516
10663A877516J00049R7258p9529M01169N4066n54157K24902j35798k30218j72109
$$ 1877516 1977565 2074823 1995294 2396463 2450529 1896372 2121274 1985476 1755258 1583149
10653A583149J19402K68290J33364J64313J51659L21092J61979J40556j73283
$$ 1583149 1702551 1970841 2104205 2268518 2420177 2741269 2903248 3043804 2870521
10644B870521j86723J63370l0966k48713j10695J65017P6911J0886L21158k34334
$$ 2870521 2683798 2847168 2816202 2567489 2456794 2621811 2698722 2709608 3030766 2796432
10634B796432j61790l3583M20083j20008l87849N37778K93413J85463J10754k41694
$$ 2796432 2634642 2601059 3021142 2901134 2513285 3051063 3344476 3529939 3640693 3398999
10624C398999L1989J9070j98123K54923K21265K2510Q1582J82966j52480l17533
$$ 3398999 3430988 3450058 3251935 3506858 3728123 3750633 3832215 4015181 3862701 3545168
10614C545168K01085N38166k64588k94019l34969M71303K29261J4961j23905j460
$$ 3545168 3746253 4284419 4019831 3725812 3390843 3862146 4091407 4106368 3982463 3981003
10604C981003p7259O0194j48653k4482P4040n0019R8465M53105L20136K01870
$$ 3981003 3903744 3963938 3815285 3790803 3864843 3814824 3913289 4366394 4686530 4888400
10594D888400o0414j84381l75671K38163o3107j48588P44090j70250K46k69929
$$ 4888400 4827986 4643605 4267934 4506097 4442990 4294402 5038492 4868242 4868488 4598559
10584D598559M11943q0794o16766j6009L8703j94165P64334k68139J16362J03749
$$ 4598559 5010502 4929708 4312942 4296933 4335636 4141471 4905805 4637666 4754028 4857777
10574D857777J84595J53208K20293J52850l09435J65137l21588k71265K65441
$$ 4857777 5042372 5195580 5415873 5568723 5259288 5424425 5102837 4831572 5097013
10565E097013j71799K05184K48501k67862p3013J56636l31607j60433L01588k59492
$$ 5097013 4925214 5130398 5378899 5111037 5038024 5194660 4863053 4702620 5004208 4744716
10555D744716M55491o3156k94178L88198j46292j93831k8728N40417J66483k92729
$$ 4744716 5200207 5137051 4842873 5231071 5084779 4890948 4862220 5402637 5569120 5276391
10545E276391k44752j95666K95667k57648l07837l522K06053Q8206j51273k06162
$$ 5276391 5031639 4835973 5131640 4873992 4566155 4562633 4768686 4856892 4705619 4499457
10535D499457J04149k23141J5997j04269l20696n714Q805j44319p496J20467M1381
$$ 4499457 4603606 4380465 4396462 4292193 3971497 3965783 3974588 3830269 3822773 3943240 3984621
10524C984621m80157J57781L80245L02539n15688k6546J21877K48147J01935k72022
$$ 3984621 3504464 3662245 4042490 4345029 3829341 3802795 3924672 4172819 4274754 4002732
10514D002732J61482l71113J52971J54020o0790m42393k76879J55923l05026K3411
$$ 4002732 4164214 3793101 3946072 4100092 4039302 3596909 3320030 3475953 3170927 3194338
10504C194338j73899J68640J16823J63864k01731L12278n2643m36927L75833J25908
$$ 3194338 3020439 3189079 3305902 3469766 3268035 3580313 3527670 3090743 3466576 3592484
10494C592484L32914o20770l34954N9083m1962J01277J07975p4183P9199l34226
$$ 3592484 3925398 3304628 2969674 3028757 2986795 3088072 3196047 3121864 3201063 2866837
10484B866837n7554K58362J77241j63877K1539j46123K18521j66721l18928J29146
$$ 2866837 2809283 3067645 3244886 3081009 3102548 2956425 3174946 3008225 2689297 2818443
10474B818443N5441K18507m5074R4756Q4803k14856K03628l87211R7173K66469
$$ 2818443 2873884 3092391 3047317 3142073 3226876 3012020 3215648 2828437 2925610 3192079
10464C192079q5135m13879J6813K94545k00801J7794J23564J93016Q8945K3853
$$ 3192079 3106944 2693065 2709878 3004423 2803622 2821416 2944980 3137996 3226941 3250794
10454C250794j4297O4720p3951j84358K83747J83174l2367n603l36468M43417
$$ 3250794 3236497 3301217 3227266 3042908 3326655 3509829 3477462 3471859 3135391 3578808
10444C578808r7093m08578N5602J78749l9740J09082k59319J47379m9953J75810
$$ 3578808 3481715 3073137 3128739 3307488 3267748 3376830 3117511 3264890 3214937 3390747
10434C390747R2207J83619J9230n36116l39338J88089N47884M3706R8811j32686
$$ 3390747 3482954 3666573 3685803 3149687 2810349 2998438 3546322 3590028 3688839 3556153
10424C556153k14055M8629J85789j34941l6609j62875K4758L32818P2479J49786
$$ 3556153 3342098 3390727 3576516 3441575 3404966 3242091 3266849 3599667 3672146 3821932
10414C821932K15802k08907j62220l86664M13700J94518Q9582j97248l69218J2304
$$ 3821932 4037734 3828827 3666607 3279943 3693643 3888161 3977743 3780495 3411277 3423581
10404C423581O3643j25416M21434K09546k71841K35589J89720K53295l66450j92430
$$ 3423581 3487224 3361808 3783242 3992788 3720947 3956536 4146256 4399551 4033101 3840671
10394C840671m56552K35238J92794K26534k37157j89755K92083J15221J23103
$$ 3840671 3384119 3619357 3812151 4038685 3801528 3611773 3903856 4019077 4142180
10385D142180K12377j60544N242n32435j82815K04178Q9965P7280M77436J06545
$$ 4142180 4354557 4194013 4199255 3666820 3484005 3688183 3778148 3855428 4332864 4439409
10375D439409J15828M25627n24806M2952l11247j45784K53863J43260p5622J08909
$$ 4439409 4555237 4980864 4456058 4499010 4187763 4041979 4295842 4439102 4363480 4472389
10365D472389M309N1892M0209p54K51726k87423m9706J16014J10367j37230J119
$$ 4472389 4476698 4528590 4568799 4568045 4819771 4532348 4482642 4598656 4709023 4571793 4572912
10354D572912K23799L6586J31527P0687J89286r0512o5507j92807K72627l118
$$ 4572912 4796711 4833297 4964824 5035511 5224797 5134285 5068778 4875971 5148598 5145480
10344E145480k24488J3869M4522R7841k5224J81989O5242j90283K03229j49740
$$ 5145480 4920992 4934861 4979383 5077224 5052000 5233989 5299231 5108948 5312177 5162437
10334E162437L57900J90965k32431R1387M3017K22968N4221J73839k18353n0563
$$ 5162437 5520337 5711302 5478871 5570258 5613275 5836243 5890464 6064303 5845950 5795387
10324E795387l569L0517L79906r7452m29245k11265O04116J56507r4095j63055
$$ 5795387 5791818 5822335 6202241 6104789 5675544 5464279 6068395 6224902 6130807 5967752
10314E967752J82391K56211K07806l8734R2108O685J9412l9073J28000k88526
$$ 5967752 6150143 6406354 6614160 6575426 6667534 6674219 6693631 6654558 6782558 6494032
10304F494032L21479K63651j38931l2699J35282P0326k7358M57334m05492R9276
$$ 6494032 6815511 7079162 6940231 6907532 7042814 7113140 7085782 7543116 7137624 7236900
10294G236900k77169l6174J96106J85362J79614p982K4343j54804j20273L21821
$$ 7236900 6959731 6923557 7119663 7305025 7484639 7476657 7501000 7346196 7225923 7547744
10284G547744j07967N58852M29133Q4325k52036N3994r8999k13498K05617j03207
$$ 7547744 7439777 7998629 8427762 8512087 8260051 8314045 8215046 8001548 8207165 8103958
10274H103958M3226K28059n7870O4495K39366J01655K95293L04460k38607Q4648
$$ 8103958 8147184 8375243 8317373 8381868 8621234 8722889 9018182 9322642 9084035 9168683
10264I168683j9807j50653M40955l35323J69111M00405K05763J41952K21860l5572
$$ 9168683 9148876 8998223 9439178 9103855 9272966 9673371 9879134 10021086 10242946 10207374
10254A0207374k98736J19040N63182J17426J91807J293k92483J7953K0211M21168
$$ 10207374 9908638 10027678 10590860 10708286 10900093 10901386 10608903 10626856 10647067 11068235
10244A1068235m7133J36065K68821K52651j78709L14927m2572L7682j17833l12643
$$ 11068235 11021102 11157167 11425988 11678639 11499930 11814857 11772285 11809967 11692134 11379491
10234A1379491Q17949J95317l16851J00387K15672K62083J23931L91977J0511
$$ 11379491 12197440 12392757 12075906 12176293 12391965 12654048 12777979 13169956 13180467
10225A3180467k53001P4635j16795K60460J24237Q2117L61231Q0650k63116J95767
$$ 13180467 12927466 13002101 12885306 13145766 13270003 13352120 13713351 13794001 13530885 13726652
10215A3726652J1703N14245L95054M3171n4148N34203j77165M1657P1718k07144
$$ 13726652 13738355 14252600 14647654 14690825 14636677 15170880 14993715 15035372 15107090 14899946
10205A4899946N71966N31630K4283k71259J42031O96035o1771O0119L47956M09010
$$ 14899946 15471912 16003542 16027825 15756566 15898597 16594632 16532861 16592980 16940936 17349946
10195A7349946j43722L3502L40610K26723K35894j09931M05717L26395M14454
$$ 17349946 17206224 17239726 17580336 17807059 18042953 17933022 18338739 18665134 19079588
10186A9079588M16318q5771l43040J83160L38456M65799M00900j24864L41345
$$ 19079588 19495906 19410135 19067095 19250255 19588711 20054510 20455410 20330546 20671891
10177B0671891J17799K31843K15399J988K23209R66703O63427k37117K97322K85500
$$ 20671891 20789690 21021533 21236932 21238920 21462129 22428832 23092259 22855142 23152464 23437964
10167B3437964K73702j09142L07309P49485L16036L353k02402J87593R72867M58826
$$ 23437964 23711666 23602524 23909833 24659318 24975354 24978707 24776305 24963898 25936765 26395591
10157B6395591J97620m5606Q56152P25743P1485K96755M07033K40834K56289K13180
$$ 26395591 26593211 26547605 27403757 28129500 28200985 28497740 28904773 29145607 29401896 29615076
10147B9615076P43358L32948M17515N2881O05051M34061L98810P31838J58860
$$ 29615076 30358434 30691382 31108897 31161778 31766829 32200890 32599700 33331538 33490398
10138C3490398M77448L84395J36368J81151P63775O24041Q39539M31353M28537
$$ 33490398 33967846 34352241 34488609 34669760 35433535 36057576 36897115 37328468 37757005
10129C7757005K44777L16430P59491O69560P14371L68381L23763N34761R61714
$$ 37757005 38001782 38318212 39077703 39747263 40461634 40830015 41153778 41688539 42650253
10120D2650253N87357L44531M05401R24450R84290P34965N36166O71841M00841
$$ 42650253 43237610 43582141 43987542 44911992 45896282 46631247 47167413 47839254 48240095
10111D8240095P95448J192542O59578M14870R97492J021173Q44337P69605R44903
$$ 48240095 49035543 50228085 50887663 51302533 52300025 53321198 54165535 54935140 55880043
10102E5880043N55011Q68727Q51016J027288J317192J091378J312909L85857Q57175
$$ 55880043 56435054 57303781 58154797 59182085 60499277 61590655 62903564 63289421 64146596
10093F4146596J035925J312182J163200J425974J438043J420406J153901J048199
$$ 64146596 65182521 66494703 67657903 69083877 70521920 71942326 73096227 74144426
10085G4144426J616289J263238P99821J643119J306131J577025J608500J854437
$$ 74144426 75760715 77023953 77823774 79466893 80773024 82350049 83958549 85812986
10077H5812986J687469J626535J274490J517650J540739J884210K033115K063661
$$ 85812986 87500455 89126990 90401480 91919130 93459869 95344079 97377194 99440855
10069I9440855J885338K597784J928108J682316K339971J862640K600809K555089
$$ 99440855 101326193 103923977 105852085 107534401 109874372 111737012 114337821 116892910
10061A16892910K206739J851902K446495K701567K638954K529800K982919K917318
$$ 116892910 119099649 120951551 123398046 126099613 128738567 131268367 134251286 137168604
10053A37168604K940021K996642L224098K884028L307002L260149L128673L431115
$$ 137168604 140108625 143105267 146329365 149213393 152520395 155780544 158909217 162340332
10045A62340332L158527L698875L658043L779627L806953L818483M109500L795654
$$ 162340332 165498859 169197734 172855777 176635404 180442357 184260840 188370340 192165994
10037A92165994L759249M138416M558206M640153M226696M326311M573872M709908
$$ 192165994 195925243 200063659 204621865 209262018 213488714 217815025 222388897 227098805
10029B27098805M839852M638253M956658M853481M949964N062691M854482N110345
$$ 227098805 231938657 236576910 241533568 246387049 251337013 256399704 261254186 266364531
10021B66364531N084190N452629N557185M941639N283723N148243M866054N284305
$$ 266364531 271448721 276901350 282458535 287400174 292683897 297832140 302698194 307982499
10013C07982499N173953M883273M536135M729177M505606L903561L997636M235574
$$ 307982499 313156452 318039725 322575860 327305037 331810643 335714204 339711840 343947414
10005C43947414L917919L576133L247319K595473K737726K421369K087258J544820
$$ 343947414 347865333 351441466 354688785 357284258 360021984 362443353 364530611 366075431
9997C66075431J457815J566422O90361q3370k0653k86344n48377j009589j588281
$$ 366075431 367533246 369099668 369790029 369706659 369686006 369399662 368851285 367841696 366253415
9988C66253415j782733k023351k648304k644336k551809l482527l471653m073047
$$ 366253415 364470682 362447331 359799027 357154691 354602882 351120355 347648702 343575655
9980C43575655m010975l648572m151338m744023m995778m598346m993553m877831
$$ 343575655 339564680 335916108 331764770 327020747 322024969 317426623 312433070 307555239
9972C07555239m747385n107467n121914n351572n307648m937994m945058n147638
$$ 307555239 302807854 297700387 292578473 287226901 281919253 276981259 272036201 266888563
9964B66888563n142431m895346m816271m977832m773329n149970m842640m416100
$$ 266888563 261746132 256850786 252034515 247056683 242283354 237133384 232290744 227874644
9956B27874644m606500m602892m689851m913742m244114l808014l755508m442129
$$ 227874644 223268144 218665252 213975401 209061659 204817545 201009531 197254023 192811894
9948A92811894m245729l822617l774459l412462l585359l728863l698165l375863
$$ 192811894 188566165 184743548 180969089 177556627 173971268 170242405 166544240 163168377
9940A63168377k928822l179429l349236k948672k743961l118645k646842l072969
$$ 163168377 160239555 157060126 153710890 150762218 148018257 144899612 142252770 139179801
9932A39179801k944367k710539k666550k256462k480801k217140k247887j849125
$$ 139179801 136235434 133524895 130858345 128601883 126121082 123903942 121656055 119806930
9924A19806930k490716k484069k166121j978342k010167j891415j771376j481940
$$ 119806930 117316214 114832145 112666024 110687682 108677515 106786100 105014724 103532784
9916A03532784j901494j857318k021442j562511j477929j422362j995358j215819
$$ 103532784 101631290 99773972 97752530 96190019 94712090 93289728 91294370 90078551
9908I0078551j235647j546797j861266j387745j165971j519237r95844j395318
$$ 90078551 88842904 87296107 85434841 84047096 82881125 81361888 80366044 78970726
9900G8970726j484953j269001j111226j106971j434532j124075o54344j073313
$$ 78970726 77485773 76216772 75105546 73998575 72564043 71439968 70785624 69712311
9892F9712311j343572r00858j040650j231659q04214j107321o76740n89706q19313
$$ 69712311 68368739 67467881 66427231 65195572 64391358 63284037 62607297 62017591 61198278
9883F1198278j264146r54247n76601p72346r97303p85528m51382o89243r38463
$$ 61198278 59934132 58979885 58403284 57630938 56633635 55848107 55396725 54707482 53769019
9874E3769019n78321q26685n55363k35585j268595q29318k64194o94982l66053
$$ 53769019 53190698 52364013 51808650 51573065 50304470 49475152 49210958 48515976 48149923
9865D8149923p08980m97069m61121m10048j208985n16417l60623p24289o29511
$$ 48149923 47440943 46943874 46482753 46072705 44863720 44347303 43986680 43262391 42632880
9856D2632880o5417j51776o02984p66577o27054q78o72845m51560n55690j99162
$$ 42632880 42567463 42415687 41812703 41046126 40419072 40418194 39745349 39293789 38738099 38538937
9846C8538937o05655j035188j86942m36280m64234k84334k71684k80621k07672
$$ 38538937 37933282 36898094 36711152 36274872 35810638 35526304 35254620 34973999 34766327
9837C4766327R4573n73492q31821o46177l15238p6963m78205k40568k33046j93420
$$ 34766327 34860900 34287408 33455587 32809410 32494172 32417209 31939004 31698436 31465390 31271970
9827C1271970l16894n55049n65252j89308l82837J60523m46425m20070k57220
$$ 31271970 30955076 30400027 29834775 29645467 29262630 29423153 28976728 28556658 28299438
9818B8299438p48009j78534n61762q41962J35449L91896j28710n3067m07896o49449
$$ 28299438 27551429 27372895 26811133 25969171 26104620 26496516 26367806 26314739 25906843 25257394
9808B5257394j97852l123n23331k69540j23097j31432m06165J04877J18066l87021
$$ 25257394 25059542 25056419 24533088 24263548 24140451 24009019 23602854 23707731 23825797 23438776
9798B3438776q96177j32326K38774o61523k32669j40570j27453m55796j29780
$$ 23438776 22542599 22410273 22649047 21987524 21754855 21614285 21486832 21031036 20901256
9789B0901256L31743o8104r61081l63001o5535l2860L41408l95941q71846j57826
$$ 20901256 21232999 21164895 20203814 19840813 19775278 19742418 20083826 19687885 18816039 18658213
9779A8658213J89865p48915m25800j28222O0080J43355k94964k36552K32761k40810
$$ 18658213 18848078 18099163 17673363 17545141 17605221 17748576 17453612 17217060 17449821 17209011
9769A7209011j11711j18329l77953j60932k8492p32398j48211K16747k10350m4965
$$ 17209011 17097300 16978971 16601018 16440086 16411594 15679196 15530985 15747732 15537382 15492417
9759A5492417k53702K04408m9070l09314k05121l07753j74413l45475K73842q1526
$$ 15492417 15238715 15443123 15394053 15084739 14879618 14571865 14397452 14051977 14325819 14244293
9749A4244293n98835k01389r6980J26171j6780R5152r1014r0317J4927J11307
$$ 14244293 13645458 13444069 13347089 13473260 13456480 13551632 13460618 13370301 13385228 13496535
9739A3496535k10648k40284m60567o4790m67858n06887K95448K07733p6937l69660
$$ 13496535 13285887 13045603 12585036 12520246 12052388 11545501 11840949 12048682 11971745 11602085
9729A1602085J70621k16003r3654l15863R330N4664j58756K75570m83395l47716
$$ 11602085 11772706 11556703 11463049 11147186 11156516 11211180 11052424 11327994 10844599 10496883
9719A0496883O12693k59814m24863j98328Q6494J43781l3922n63920k42452K99572
$$ 10496883 11109576 10849762 10424899 10226571 10313065 10456846 10422924 9859004 9616552 9916124
9709I916124k49474J11184K60159l06931j59185L55633L49854M3600l59303L04757
$$ 9916124 9666650 9777834 10037993 9731062 9571877 9927510 10277364 10320964 9961661 10266418
9699A0266418k09040n29256k3399n1766O4119Q5510l43323k01072k53534L9344
$$ 10266418 10057378 9528122 9504723 9452957 9517076 9602586 9259263 9058191 8804657 8844001
9689H844001L09034q6547l79058L63867q4453m32913j11124m0712K0112j6087
$$ 8844001 9153035 9066488 8687430 9051297 8966844 8533931 8422807 8382095 8402207 8386120
9679H386120k8431j82317Q8463J27683m6205l32774K26028L8781M10234l5350
$$ 8386120 8357689 8175372 8263835 8391518 8345313 8012539 8238567 8277348 8687582 8652232
9669H652232k76552k23740j64234J1441N9313k24173k59220Q5539k08536L34424
$$ 8652232 8375680 8151940 7987706 7999147 8058460 7834287 7575067 7660606 7452070 7786494
9659G786494L31313j21145l58792j14745o1361j591m2828J10472M56962j08492
$$ 7786494 8117807 7996662 7637870 7523125 7461764 7460173 7417345 7527817 7984779 7876287
9649G876287j19912j19956l36049m2927K89813l34692K77809P2778k56853j52724
$$ 7876287 7756375 7636419 7300370 7257443 7547256 7212564 7490373 7563151 7306298 7153574
9639G153574L63297M24012k10313J14655l00603j29494k96725j95703M612p6258
$$ 7153574 7516871 7940883 7730570 7845225 7544622 7415128 7118403 6922700 6927312 6851054
9629F851054N3061Q1727j4908J48975L86408l77489M2977K13368m7399m48833
$$ 6851054 6904115 6985842 6970934 7119909 7506317 7128828 7171805 7385173 7337774 6888941
9619F888941K24675J05920K41823J76777m55621J13617N21827L79901m84240J22859
$$ 6888941 7113616 7219536 7461359 7638136 7182515 7296132 7817959 8197860 7713620 7836479
9609G836479M9300M24533k82515L7900j04400J6931K01446j03712k7665K66900
$$ 7836479 7885779 8310312 8027797 8065697 7961297 7978228 8179674 8075962 8048297 8315197
9599H315197J77765Q68506k74677k10549k56363J66547M38200m90739K92323O65585
$$ 8315197 8492962 9361468 9086791 8876242 8619879 8786426 9224626 8733887 9026210 9691795
9589I691795K86030j3434L75843R967K41565j6959L22949L46461J88233K31991
$$ 9691795 9977825 9964391 10340234 10350201 10591766 10574807 10897756 11244217 11432450 11664441
9579A1664441M72305N29259K74101K02380K58103M96462M01412J57217N34812
$$ 11664441 12136746 12666005 12940106 13142486 13400589 13897051 14298463 14455680 14990492
9570A4990492N43614M39774P89408J334208P40199N55452P70124Q83037J140903
$$ 14990492 15534106 15973880 16763288 18097496 18837695 19393147 20163271 21046308 22187211
9561B2187211J476545J295049J502907J496079J868802K212937K292483K503863
$$ 22187211 23663756 24958805 26461712 27957791 29826593 32039530 34332013 36835876
9553C6835876K580015K716214K517705J820196J041932N89541j91695R573q73336
$$ 36835876 39415891 42132105 44649810 46470006 47511938 48101479 47909784 47919357 47046021
9544D7046021j136481j777521k339278k415631j908159k198594j611429j706139
$$ 47046021 45909540 44132019 41792741 39377110 37468951 35270357 33658928 31952789
9536C1952789p97072l41147o55829j07263m61305K19791N15441N08884O44379
$$ 31952789 31155717 30814570 30158741 30051478 29590173 29809964 30325405 30834289 31478668
9527C1478668L38104Q51064O37693J119313K000840J750528J428459J663512K718605
$$ 31478668 31816772 32667836 33305529 34424842 36425682 38176210 39604669 41268181 43986786
9518D3986786K485209K900662K142018J238386Q92314N83570k43504j074922j120433
$$ 43986786 46471995 49372657 51514675 52753061 53645375 54228945 53985441 52910519 51790086
9509E1790086k285381k339027k910546l505808k944812l229140k296121k479447
$$ 51790086 49504705 47165678 44255132 40749324 37804512 34575372 32279251 29799804
9501B9799804j916774j763174j173778j286733j012480q97012r63612p01205o98493
$$ 29799804 27883030 26119856 24946078 23659345 22646865 21749853 20786241 20085036 19386543
9492A9386543k83662m58525q42975l03350n52750j99177j90628l70259j08432
$$ 19386543 19102881 18644356 17801381 17498031 16945281 16746104 16555476 16185217 16076785
9483A6076785m08741r5987l85265m50838m7765k49669m00213m39026m05108m10992
$$ 16076785 15668044 15572057 15186792 14735954 14688189 14438520 14038307 13599281 13194173 12783181
9473A2783181p5948k91247m70858p46260l71735j55913P262n01356p7692m51856
$$ 12783181 12707233 12415986 11945128 11198868 10827133 10671220 10678482 10177126 10099434 9647578
9463I647578k21960k58124k0911j45219k72569J71069j03202j77394p90567m08119
$$ 9647578 9425618 9167494 9146583 9001364 8728795 8899864 8796662 8619268 7828701 7420582
9453G420582N5464j87888j29638K84289J34119k25716O2376k63752l25903k16310
$$ 7420582 7476046 7288158 7158520 7442809 7576928 7351212 7413588 7149836 6823933 6607623
9443F607623k99668M77257k29187K02814n62521M66629n917l11883k36244M61447
$$ 6607623 6307955 6785212 6556025 6758839 6196318 6662947 6657030 6345147 6108903 6570350
9433F570350K38674l45701j12732L03349M2765l83224j3528K19590L05718L95410
$$ 6570350 6809024 6463323 6350591 6653940 6696705 6313481 6299953 6519543 6825261 7220671
9423G220671O986k1556j06810J67696k90579j52422L13705K648l11385J7303K38288
$$ 7220671 7227657 7206101 7099291 7266987 6976408 6823986 7137691 7140339 6828954 6846257 7084545
9412G084545M32057M73728M2902N4964J00680L10949N79034M55190J1885M23786
$$ 7084545 7516602 7990330 8033232 8088196 8188876 8499825 9078859 9534049 9545934 9969720
9402I969720N16575N01949J098681M20896L08245M63743R16251J305614J006227
$$ 9969720 10486295 10988244 12086925 12507821 12816066 13279809 14196060 15501674 16507901
9393A6507901J327052J217980J248827J038029J559465M03604J31331K23473n45939
$$ 16507901 17834953 19052933 20301760 21339789 22899254 23302858 23434189 23657662 23111723
9384B3111723p99604j196063r34666j074803j553252j433832q83577p47928o38826
$$ 23111723 22312119 21116056 20181390 19106587 17553335 16119503 15235926 14487998 13849172
9375A3849172m59647l95551k54080l10398l18394j4914K45283j76506k34215P76145
$$ 13849172 13389525 12993974 12739894 12429496 12111102 12096188 12341471 12164965 11930750 12706895
9365A2706895n8841K51063P69405M69675K63463N57781R84235O38331J413885
$$ 12706895 12648054 12899117 13668522 14138197 14401660 14959441 15943676 16582007 17995892
9356A7995892J115065J493649J242475J238899R72523Q50685N40392K9392k44352
$$ 17995892 19110957 20604606 21847081 23085980 24058503 24909188 25449580 25478972 25234620
9347B5234620p10268j366981j441394j272847j856661j708539j209739j111523
$$ 25234620 24524352 23157371 21715977 20443130 18586469 16877930 15668191 14556668
9339A4556668j287487q93248m84315r23745q93307m83068j131637o81675p8110
$$ 14556668 13269181 12375933 11891618 10967873 10074566 9591498 8459861 7778186 7700076
9330G700076l23291k09819l73626J28430k97121m85321m85700k43572j9295N97880
$$ 7700076 7376785 7166966 6793340 6921770 6624649 6139328 5653628 5410056 5390761 5988641
9320E988641n12813n55747o1911J06733l12453l10699K76795j64199K4084k95432
$$ 5988641 5475828 4920081 4858170 4964903 4652450 4341751 4618546 4454347 4478431 4182999
9310D182999N2939O8700j43276l49270K24585p0301j13018J2352J63451j86385
$$ 4182999 4235938 4304638 4161362 3812092 4036677 3966376 3853358 3865710 4029161 3842776
9300C842776Q5255p4465j94173P0002k45670o1613L73160l6290j74460p623m06470
$$ 3842776 3928031 3853566 3659393 3729395 3483725 3422112 3795272 3758982 3584522 3576899 3170429
9289C170429J0729K6956K50129K47936k64531q6571O7458k38173J72013K5040
$$ 3170429 3181158 3208114 3458243 3706179 3441648 3355077 3422535 3184362 3356375 3381415
9279C381415M4168K5585k9725j10615l09746K4888L339p9919J77554l63889K78149
$$ 3381415 3425583 3451168 3421443 3310828 3001082 3025970 3029309 2949390 3126944 2763055 3041204
9268C041204J28097j30045K19309k18528N85137K39049l35259K55191J14851l15409
$$ 3041204 3169301 3039256 3258565 3040037 3625174 3864223 3528964 3784155 3899006 3583597
9258C583597l1470K07673j1883K51176M18144p33327j21290L31629R0864K93955
$$ 3583597 3552127 3759800 3747917 3999093 4417237 3683910 3562620 3894249 3985113 4279068
9248D279068L63775j99881Q883n7260J11754O79870M6649j41017J21912K1434
$$ 4279068 4642843 4442962 4451845 4394585 4506339 5186209 5232858 5091841 5213753 5235187
9238E235187J66204M7427R28984L52287j73631n1238k59988R7223M63710O3812
$$ 5235187 5401391 5448818 6377802 6730089 6556458 6505220 6245232 6342455 6806165 6869977
9228F869977J10750k7830l47908M9341j53012N49541K3958j37905k8460J07387
$$ 6869977 6980727 6952897 6604989 6654330 6501318 7050859 7074817 6936912 6908452 7015839
9218G015839n8966J94722J92749k12459l02682N1803J20880j28523J24517L11057
$$ 7015839 6956873 7151595 7344344 7131885 6829203 6881006 7001886 6873363 6997880 7308937
9208G308937J15527l04806k36916q2844K20465N21519K78540j35904L39559K02274
$$ 7308937 7424464 7119658 6882742 6799898 7020363 7541882 7820422 7684518 8024077 8226351
9198H226351j59603K79525L69739m92458M51924K04485O9648P9763J01361L48523
$$ 8226351 8066748 8346273 8716012 8223554 8675478 8879963 8949611 9029374 9130735 9479258
9188I479258m33804l32903J79774N59877r3709n09911L4402J98849j25738q7781
$$ 9479258 9045454 8712551 8892325 9452202 9358493 8848582 8882984 9081833 8956095 8868314
9178H868314k37436J64639k95498r4287j14585j72182K27696J35816l03297n0946
$$ 8868314 8630878 8795517 8500019 8405732 8291147 8118965 8346661 8482477 8179180 8128234
9168H128234J8754M53981j40620l560l25661q7780Q0884r4539L89308k56230k37912
$$ 8128234 8146988 8600969 8460349 8456789 8131128 8043348 8124232 8029693 8419001 8162771 7924859
9157G924859N64391J40190k33024M79690r7009l97032n5569P096k90890k12670
$$ 7924859 8489250 8629440 8396416 8876106 8779097 8382065 8326496 8333592 8042702 7830032
9147G830032j25048k7649j13737l47636j36881r8580j47028J03869m04247Q6788
$$ 7830032 7704984 7677335 7563598 7215962 7079081 6980501 6833473 6937342 6533095 6619883
9137F619883L45668K19620j24361m21209J37378p0311L74738j42809m38993o5272
$$ 6619883 6965551 7185171 7060810 6639601 6776979 6706668 7081406 6938597 6499604 6434332
9127F434332P25787J57442j88920n6629J4479M57874l8492J19529l94836P6021
$$ 6434332 7160119 7317561 7128641 7072012 7086491 7544365 7505873 7625402 7230566 7306587
9117G306587j80395n0554l1321k04895l86058j12193M6353j72513l74230k27072
$$ 7306587 7126192 7075638 7044317 6839422 6453364 6341171 6387524 6215011 5840781 5613709
9107E613709j14150J62167K7512k18531k93122k4751k40287j82935Q6646l05492
$$ 5613709 5499559 5661726 5689238 5470707 5177585 5152834 4912547 4729612 4816258 4510766
9097D510766l30550n56419p9299K80902m69662K16332L2021p2548l72769J87171
$$ 4510766 4180216 3623797 3544498 3825400 3355738 3572070 3604091 3531543 3158774 3345945
9087C345945l095l04396J89519K2285O8690n03789L05762P14698k75687p01704
$$ 3345945 3342850 3038454 3227973 3250258 3318948 2815159 3120921 3835619 3559932 2858228
9077B858228l39767q001k14560K53018M7955k0976Q224k32862K14364l17285K17229
$$ 2858228 2518461 2510460 2295900 2548918 2596873 2575897 2584121 2351259 2565623 2248338 2465567
9066B465567k11599j7184j85930J03462M11322J3070j45777j26516n0663M7173
$$ 2465567 2253968 2236784 2050854 2154316 2565638 2578708 2432931 2306415 2255752 2302925
9056B302925k00469j7161J77036K92815j36662J0155J13684k27747l33104J21017
$$ 2302925 2102456 2085295 2262331 2555146 2418484 2428639 2542323 2314576 1981472 2102489
9046B102489m7648m06102J30926K08163N9577j73836Q2461K14780k4511j6411
$$ 2102489 2054841 1648739 1779665 1987828 2047405 1873569 1956030 2170810 2146299 2129888
9036B129888Q3687K11087o1705n93694Q8236K16155j62553j57671J63590q7021
$$ 2129888 2213575 2424662 2362957 1769263 1857499 2073654 1911101 1753430 1917020 1829999
9026A829999J0870K29136J58413N8876k30708j54230N3748K56388l55830N71145
$$ 1829999 1840869 2070005 2228418 2287294 2056586 1902356 1956104 2212492 1856662 2427807
9016B427807J6283l37123k45188J5645J81313J08581k9921j91552o2688L8150
$$ 2427807 2444090 2106967 1861779 1877424 2058737 2167318 2137397 1945845 1883157 1921307
9006A921307M41778J71851n34377q0284K88000n27541l0124L70095n0071L00210
$$ 1921307 2363085 2534936 2000559 1920275 2208275 1680734 1650610 2020705 1970634 2270844
8996B270844q8140j49495N78357k65441j99857L34609M61249j25155k9583p8261
$$ 2270844 2182704 2033209 2611566 2346125 2146268 2480877 2942126 2816971 2787388 2709127
8986B709127j27645L2492j87922L36150L79183j15010j4105k80000K46802L25505
$$ 2709127 2581482 2613974 2426052 2762202 3141385 3026375 3012270 2732270 2979072 3304577
8976C304577J27648O8406j45283J22337M38438k18875l94723k28015L21177K58431
$$ 3304577 3432225 3500631 3355348 3477685 3916123 3697248 3302525 3074510 3395687 3654118
8966C654118Q7580K1349N61501R5780L2215L61343l39069J12641l1008J67848
$$ 3654118 3741698 3763047 4324548 4420328 4452543 4813886 4474817 4587458 4556450 4724298
8956D724298Q2071J24376N89665j34920J16043K3993K39039N58755K80914P48714
$$ 4724298 4806369 4930745 5520410 5385490 5501533 5525526 5764565 6323320 6604234 7352948
8946G352948J25489O2044P2393K06324O79315K12869k08525L02061K41184N68756
$$ 7352948 7478437 7540481 7612874 7819198 8498513 8711382 8502857 8804918 9046102 9614858
8936I614858L04013Q97048O51305P1525Q78294Q73714J84461R09808J236071M45095
$$ 9614858 9918871 10815919 11467224 11538749 12417043 13290757 13475218 14385026 15621097 16066192
8926A6066192J537796J003134P66408J213436R90784R58642J73472P32833P00067
$$ 16066192 17603988 18607122 19373530 20586966 21577750 22536392 22709864 23442697 24142764
8917B4142764P30283N30019J06683J56009K09486K51885N41269J358647J344354
$$ 24142764 24873047 25403066 25509749 25665758 25875244 26127129 26668398 28027045 29371399
8908B9371399Q33462P39451J435609K197698K544213J845588K484020K636626
$$ 29371399 30204861 30944312 32379921 34577619 37121832 38967420 41451440 44088066
8900D4088066J766771J728896J582137J070713R83996J120671M61594L04316J97488
$$ 44088066 45854837 47583733 49165870 50236583 51220579 52341250 52802844 53107160 53304648
8891E3304648L70897Q29936N72839J001448J045666J212180J708408R74449N6534
$$ 53304648 53675545 54505481 55078320 56079768 57125434 58337614 60046022 61020471 61077005
8882F1077005l56191o35531j200949j386711j716813k233440k234345k705961
$$ 61077005 60720814 60085283 58884334 57497623 55780810 53547370 51313025 48607064
8874D8607064k598589k691001k101716k276389k158599j160551j402010j376332
$$ 48607064 46008475 43317474 41215758 38939369 36780770 35620219 34218209 32841877
8866C2841877j649755p05583j035544n54497j44762m40584l25607k26507N26511
$$ 32841877 31192122 30486539 29450995 28896498 28751736 28311152 27985545 27759038 28285549
8857B8285549K66152j43082O75479l7354j81155J95988J8377j58850k51420m30392
$$ 28285549 28551701 28408619 29084098 29046744 28865589 29061577 29079954 28921104 28669684 28239292
8847B8239292r65159k32411p10808p54557j278851p05364r21124j149940k28375
$$ 28239292 27274133 27041722 26330914 25576357 24297506 23592142 22671018 21521078 21292703
8838B1292703o23479p27783j10117p58190p79402o88494p51555o45507o919j51527
$$ 21292703 20669224 19941441 19831324 19073134 18293732 17605238 16853683 16208176 16201257 16049730
8828A6049730r36058o97583l24116l33042k68820p38064n15287j12794l67294
$$ 16049730 15113672 14416089 14091973 13758931 13490111 12752047 12236760 12123966 11756672
8819A1756672m02753J17872P1615m38619m66916k25399j08857k8684O6162L7767
$$ 11756672 11353919 11471791 11543406 11104787 10637871 10412472 10303615 10274931 10341093 10378860
8809A0378860j61192j71912k12896n15552j98484R8216J50253m54806j95049k73525
$$ 10378860 10217668 10045756 9832860 9317308 9118824 9217040 9367293 8912487 8717438 8443913
8799H443913K4002M9743m97285j71641k57239k75691r5834q8477J98195k74147
$$ 8443913 8467915 8517658 8020373 7848732 7591493 7315802 7219968 7131491 7329686 7055539
8789G055539j82831k11122K4526J66476N6552j01558l1954k03108n1795m4480
$$ 7055539 6872708 6661586 6686112 6852588 6909140 6807582 6775628 6572520 6520725 6476245
8779F476245j28629j64301J99365n8849k62072L86683L08932j97181J49557l73906
$$ 6476245 6347616 6183315 6382680 6323831 6061759 6448442 6757374 6560193 6709750 6335844
8769F335844j98956N8369K41050L65405k97528K49172q8482k4802L10527j96313
$$ 6335844 6136888 6195257 6436307 6801712 6504184 6753356 6664874 6640072 6950599 6754286
8759F754286L74751K9674O94179M2013l99723o4Q28358P42458j87357K55235L04146
$$ 6754286 7129037 7158711 7852890 7894903 7495180 7495116 8323474 9065932 8878575 9133810 9437956
8748I437956M98173M67353M74356j59023P18048N70450M66991J162650R49038
$$ 9437956 9936129 10403482 10877838 10718815 11436863 12007313 12474304 13636954 14585992
8739A4585992P07273R00989R58550J576214J603510J729216J538828J634053J177611
$$ 14585992 15293265 16194254 17152804 18729018 20332528 22061744 23600572 25234625 26412236
8730B6412236J360013L21438M34170O0924j153502n22586q57732p95964q23952
$$ 26412236 27772249 28093687 28527857 28588781 27435279 26912693 26054961 25258997 24435045
8721B4435045p63390j88448N141O2460M50569M31865N86826M72189M82801M56464
$$ 24435045 23671655 23483207 23488348 23550808 24001377 24433242 25020068 25492257 25975058 26431522
8711B6431522N58737M93103K62301K47932L67590P44762O26919N41360J254708
$$ 26431522 26990259 27483362 27745663 27993595 28361185 29105947 29732866 30274226 31528934
8702C1528934J093658J648782J933176J970405J745798K001085J348678P43649
$$ 31528934 32622592 34271374 36204550 38174955 39920753 41921838 43270516 44014165
8694D4014165O2021l06872j158595j806909k276141k249329j967143j772442j235410
$$ 44014165 44076186 43769314 42610719 40803810 38527669 36278340 34311197 32538755 31303345
8685C1303345j096855q49414m83628p60548J89618J00370n32832K52747j02986
$$ 31303345 30206490 29357076 28873448 28112900 28302518 28402888 27870056 28122803 28019817
8676B8019817M03153m35833n42051k05585j00679n52131k56494J68667K85405
$$ 28019817 28422970 27987137 27445086 27239501 27138822 26586691 26330197 26498864 26784269
8667B6784269n6576j48897J14064N22120K23863P73000Q803j95063j66578j042518
$$ 26784269 26727693 26578796 26692860 27214980 27438843 28211843 28220646 28025583 27859005 26816487
8657B6816487j259303j359344j336088j252325j582145j045363j007215r15386
$$ 26816487 25557184 24197840 22861752 21609427 20027282 18981919 17974704 17059318
8649A7059318p39491m34072k40963j90984j279030p52790j27270k56938p6820
$$ 17059318 16319827 15885755 15644792 15453808 14174778 13421988 13294718 13037780 12960960
8640A2960960o31541l11542k37819k03473m39284l94860n25792j78457k65940
$$ 12960960 12329419 12017877 11780058 11576585 11137301 10742441 10216649 10038192 9772252
8631I772252J95763k93825o28375o09815j47406M437m44618J68525j23609p73573
$$ 9772252 9968015 9674190 9045815 8436000 8288594 8293031 7848413 8016938 7893329 7119756
8621G119756l82343L06058J14592m73300l75184n5940k23223n47281l11672p3981
$$ 7119756 6737413 7043471 7158063 6684763 6309579 6253639 6030416 5483135 5171463 5097482
8611E097482p2024k81070k10454m17305L7963M58198m46469k73562K39194n84089
$$ 5097482 5025458 4744388 4533934 4116629 4154592 4612790 4166321 3892759 4131953 3547864
8601C547864m24664L06404m9804P2595l40488k68283J30309K7601k57276l2321
$$ 3547864 3123200 3429604 3379800 3452395 3111907 2843624 2973933 3001534 2744258 2711937
8591B711937j06293m98684J42223O6524J56922k77561M97705r9473n72806R2703
$$ 2711937 2605644 2106960 2249183 2315707 2472629 2195068 2692773 2593300 2020494 2113197
8581B113197J52789m6113k57279m9879L5086l32028J78507L56293J40813n40793
$$ 2113197 2265986 2219873 1962594 1912715 1947801 1615773 1794280 2150573 2291386 1750593
8571A750593j83368k26557k85416m64L64620J11171k76911M8731J97405l98161
$$ 1750593 1567225 1340668 1055252 1054788 1419408 1530579 1253668 1302399 1499804 1101643
8561A101643p127J63680m03208K2835Q9707J8990j66211L26106M72109J73793
$$ 1101643 1094516 1258196 854988 877823 967530 986520 820309 1146415 1618524 1792317
8551A792317o5779L45370l64192j77432k39491j58307l2302n8569o3605K44644
$$ 1792317 1726538 2071908 1707716 1530284 1290793 1132486 1100184 1041615 978010 1222654
8541A222654j54424J39583J77739n16185k21246K18768K55698q7679l3397J33718
$$ 1222654 1068230 1207813 1385552 869367 648121 866889 1122587 1034908 1001511 1135229
8531A135229J22382j96540K86950P9447J4790j29061m92146J05105r9588K21515
$$ 1135229 1257611 1061071 1348021 1427468 1442258 1313197 821051 926156 826568 1048083
8521A048083J02369k77052K1550K24349l20693j78927l99469R3421j32475J39507
$$ 1048083 1150452 873400 894950 1119299 798606 619679 220210 313631 181156 320663
8511C20663L76195K4863L33444j87890r2354j72206L62478j87588M0227K723R9204
$$ 320663 696858 721721 1055165 867275 774921 602715 965193 777605 817832 820555 919759
8500I19759K1075l556m13903Q065J9505M99512l03784K507k47941L4980K51090
$$ 919759 940834 937278 523375 531440 550945 1050457 746673 749180 501239 536219 787309
8489G87309m51057L3263m4943M7801J58276J1031k34782p2832L55586m49559O377
$$ 787309 336252 369515 324572 372373 530649 541680 306898 234066 589652 140093 146470
8478A46470l5985n7717P8303k32687L86624K4822O2125L6893J50908m40317K45744
$$ 146470 110485 52768 131071 -101616 285008 309830 371955 408848 559756 119439 365183
8467C65183j24580K74860j52512J20102N6240k24766J82199k9035k59965P6183
$$ 365183 240603 515463 362951 483053 539293 314527 496726 467691 207726 283909
8457B83909Q6521L5002r9416o2561l5507J17044k21661k6703k73364L52949k80751
$$ 283909 370430 405432 306016 243455 207948 324992 103331 76628 -196736 156213 -124538
8446a24538K46467O7285j01778J1607k54870K34880j59140m0156j00091J56250
$$ -124538 121929 189214 87436 99043 -155827 79053 -80087 -120243 -220334 -64084
8436f4084O1330j06135N7601n5877j19950K88569o0104K46522j21477J13676J22902
$$ -64084 -2754 -108889 -51288 -107165 -227115 61454 1350 247872 126395 240071 362973
8425C62973j54856M21934j28151j10745r4197M8640K06126J29015j71510j43011
$$ 362973 208117 630051 501900 391155 296958 345598 551724 680739 509229 366218
8415C66218j55007l61610J12770l24765k67047K51278L80389J25361M54821k10282
$$ 366218 211211 -150399 -37629 -362394 -629441 -378163 2226 127587 582408 372126
8405C72126J8490J85214P6040J11937n73193J17976k25173j70338K79391J02007
$$ 372126 390616 575830 651870 763807 190614 308590 83417 -86921 192470 294477
8395B94477k20403k03369J81547m5522J06089k81230n3111N37958Q6674k83663
$$ 294477 74074 -129295 52252 6730 112819 -168411 -221522 316436 403110 119447
8385A19447j82919K26082j60727j26018J87329O1044K49720L7148L9934l45152
$$ 119447 -63472 162610 1883 -124135 63194 124238 373958 411106 451040 105888
8375A05888K06185N2045j48170l1952j67020k65782M63494J03487N1381k1228
$$ 105888 312073 364118 215948 183996 16976 -248806 214688 318175 369556 348328
8365C48328j42404Q2991K08975J01509Q6095J50497m35970k89410J41938K0342
$$ 348328 205924 288915 497890 599399 685494 835991 400021 110611 252549 272891
8355B72891M7186P9358l80504j25274M48453j72207k71156O40J18708q5465k42031
$$ 272891 320077 399435 18931 -106343 342110 169903 -101253 -100613 18095 -67370 -309401
8344c09401J06522p5284J24431M2129k7665K77129K24571k15879J36664K22140
$$ -309401 -202879 -278163 -153732 -111603 -139268 137861 362432 146553 283217 505357
8334E05357m87160j56474J25528n1847K21002L40942j47440K9700P2301k24163
$$ 505357 18197 -138277 -12749 -64596 156406 497348 349908 379608 451909 227746
8324B27746j93235k43628J89372p7604L23935P9224l24714M1868J20336j68852
$$ 227746 34511 -209117 -19745 -97349 226586 305810 -18904 22964 143300 -25552
8314b5552K36802j19175j98629L5731J42931j62577k53246L76349J09140J26304
$$ -25552 211250 92075 -106554 -70823 72108 -90469 -343715 32634 141774 268078
8304B68078l4581p2438j69186Q0894l6345l961j2945K91380l1651k53823N5800
$$ 268078 233497 161059 -8127 72767 36422 32461 19516 310896 279245 25422 81222
8293H1222L5990j35427J14655J07675n0470j23996J88505j72445j95098N21821
$$ 81222 117212 -18215 96440 204115 153645 29649 218154 45709 -149389 372432
8283C72432K7044J8586M2767p9239J40975m64398o8293J19498n4178J20635k43800
$$ 372432 399476 418062 460829 381590 522565 58167 -10126 109372 55194 175829 -67971
8272f7971l55706j69308M85219J42325K4672j26525m30346r8146K94350N6813
$$ -67971 -423677 -592985 -107766 34559 59231 -67294 -497640 -595786 -301436 -244623
8262b44623j54978k50886N26826Q7076J2465j18700j58569l10464p4329K87912
$$ -244623 -399601 -650487 -123661 -36585 -24120 -142820 -301389 -611853 -686182 -398270
8252c98270j59388J48776K65996K14055q6271k11031K98205P1560n5478K3577
$$ -398270 -557658 -408882 -142886 71169 -15102 -226133 72072 143632 88154 111731
8242A11731j69054r8390J51702J90483l985n27005l08713O1469M1578k9456J8512
$$ 111731 -57323 -155713 -4011 186472 182487 -344518 -653231 -591762 -550184 -579640 -561128
8231e61128J29174N0487n1825K31484j89426l71834K16968M20918K67698l94811
$$ -561128 -431954 -381467 -433292 -201808 -391234 -763068 -546100 -125182 142516 -252295
8221b52295j14969K89033l43605k64605N54971M99610j76096M764m12571K29948
$$ -252295 -367264 -78231 -421836 -686441 -131470 368140 192044 196808 -215763 14185
8211A4185K05792m22523K68313m6000l71622O6868l37489o6575P27799L22540
$$ 14185 219977 -202546 65767 19767 -351855 -284987 -622476 -689051 38748 361288
8201C61288o9182K848J79660Q9481m39885j14166K98746K13086j19720m377843
$$ 361288 292106 294954 474614 564095 124210 10044 308790 521876 402156 -3975687
8191c975687N50318K333326l69713N06552N52407K34110j0927n1439j98881Q5096
$$ -3975687 -3425369 -1092043 -1461756 -955204 -402797 -168687 -179614 -231053 -429934 -344838
8181c44838m11583M7602J15491J2658j76329N00233j99358q540K03325L5986k123
$$ -344838 -756421 -708819 -593328 -580670 -756999 -256766 -456124 -464664 -261339 -225353 -227476
8170b27476k70338j13994N4776J96024l17720k15776q5139O19514N63793k346
$$ -227476 -497814 -611808 -557032 -361008 -678728 -894504 -979643 -360129 203664 201318
8160B01318K08990j31553o2053J40459k37338j96888L28993k7401n89665n43982
$$ 201318 410308 278755 216702 357161 119823 -77065 251928 224527 -365138 -909120
8150i09120m1637L82366P1301q4889L15765J28927K1384N6241J42893Q4172k88994
$$ -909120 -950757 -568391 -497090 -581979 -266214 -137287 -115903 -59662 83231 167403 -121591
8139a21591L4224J62855m11155r5731J57541M1397K13008K41846k97730l25247
$$ -121591 -87367 75488 -335667 -431398 -273857 -232460 -19452 222394 -75336 -400583
8129d00583j29279r2055K10884q7052m78636M04017L04113k61342J40835m51008
$$ -400583 -529862 -621917 -411033 -498085 -976721 -572704 -268591 -529933 -389098 -840106
8119h40106j88868O81661j10792J50757J14073J74375r8476m87369K70863K27753
$$ -840106 -1028974 -347313 -458105 -307348 -193275 -18900 -117376 -604745 -333882 -106129
8109a06129l49459j78429O14203N0881P8807K17370k72521k31608J22670L81134
$$ -106129 -455588 -634017 -19814 31067 109874 327244 54723 -176885 -54215 326919
8099C26919l34994o8323L32878m40227j37860J90591n0308K04592j56018j47826
$$ 326919 -8075 -76398 256480 -183747 -321607 -131016 -181324 23268 -132750 -280576
8089b80576K28997j50132j1316R9916k679l7494j38055L37805j98141k0987L25807
$$ -280576 -51579 -201711 -213027 -113111 -115790 -153284 -291339 46466 -151675 -172662 153145
8078A53145j45439P5024r5391j37571l63508J44637K17764L04033l75883j45985
$$ 153145 7706 82730 -12661 -150232 -513740 -369103 -151339 152694 -223189 -369174
8068c69174o84K07781k80171r8575J91968L34222r4316j17444m07290r1958K92668
$$ -369174 -369858 -162077 -442248 -540823 -348855 -14633 -108949 -226393 -633683 -725641 -432973
8057d32973j23041L77537K71601J59292l88302k04121J71855K06823L52425l00366
$$ -432973 -556014 -178477 93124 252416 -135886 -340007 -168152 38671 391096 90730
8047I0730k59841J77870j54923J40754K99686O062l87686j33375q4040J31917
$$ 90730 -169111 8759 -146164 -5410 294276 300338 -87348 -220723 -304763 -172846
8037a72846R5519L79437k21963l95173N4535k2441l02892r1333N0118P2965n6475
$$ -172846 -77327 302110 80147 -315026 -260491 -282932 -585824 -677157 -627039 -554074 -610549
8026f10549n38760j95626N03157o58N0043J95527J44257N8752J01939M74569j03048
$$ -610549 -1149309 -1344935 -841778 -842436 -792393 -596866 -452609 -393857 -291918 182651 79603
8015G9603k42977J68435N2003j11882l02763k1764K80602M5391l66741N6599K0917
$$ 79603 -163374 5061 57064 -54818 -357581 -379345 -98743 -53352 -420093 -363494 -342577
8004c42577j64720R8790J38685L33242N7014j60843m7902k07458k63477j8545
$$ -342577 -507297 -408507 -269822 63420 120434 -40409 -88311 -295769 -559246 -577791
7994e77791L6580J8798O7919K73945p134j3678J49637j16864m09845J14009j2733
$$ -577791 -541211 -522413 -454494 -180549 -187683 -201361 -51724 -168588 -578433 -464424 -477157
7983d77157K08997O6964l71671q0375K42562L74738O1421n03101j22277j63343
$$ -477157 -268160 -201196 -572867 -653242 -410680 -35942 25479 -477622 -599899 -763242
7973g63242j4504K69162L21016Q5173q9319K01234p6029P1986k18451J56653J22456
$$ -763242 -777746 -508584 -187568 -102395 -191714 9520 -66509 5477 -212974 -56321 66135
7962F6135k09433j47903R3379J63172j40885j31853K5463P2042j81809L5221K38876
$$ 66135 -143298 -291201 -197822 -34650 -175535 -307388 -281925 -209883 -391692 -356471 -117595
7951a17595l35034L06422j49476J32609K73629l63747j62405p371k0162k18267
$$ -117595 -452629 -146207 -295683 -163074 110555 -253192 -415597 -422968 -443130 -661397
7941f61397J02602J43941q3862Q5197l28787J56074K23771L63148L10088j59437
$$ -661397 -558795 -414854 -498716 -413519 -742306 -586232 -362461 687 310775 151338
7931A51338o6574l3077J38604k86726o31608P9932M37409p6985J6866j5934p1149
$$ 151338 84764 51687 190291 -96435 -728043 -648111 -210702 -287687 -270821 -286755 -357904
7920c57904J11331J69757q9055m9550k764n14023K564M42460p7464j80596M7688
$$ -357904 -246573 -76816 -165871 -215421 -218185 -732208 -729644 -287184 -364648 -545244 -497556
7909d97556R4384M31706r7431m01723P9569M86422k16716L38940j91607k95116
$$ -497556 -403172 28534 -68897 -470620 -391051 95371 -121345 217595 25988 -269128
7899b69128M20437j62149j90741k56270K30818N4042K2144k58070l01839j03435
$$ -269128 151309 -10840 -201581 -457851 -227033 -172991 -150847 -408917 -710756 -814191
7889h14191J23456L80958n3659k90528j06840J7887K73706j53575L28186l40744
$$ -814191 -690735 -309777 -363436 -653964 -760804 -742917 -469211 -622786 -294600 -635344
7879f35344n8394O036K50607K17443l4421j87057j08689j4689m5608q3947J38751
$$ -635344 -693738 -687702 -437095 -219652 -254073 -441130 -549819 -564508 -610116 -694063 -555312
7868e55312r0576M05069J18786q5072L29070k7636J52152k37707m13975j98895
$$ -555312 -645888 -240819 -122033 -207105 121965 94329 246481 8774 -405201 -604096
7858f04096K17507K52444N1507K10993k8070j72634m4017J65803n73695J25758
$$ -604096 -386589 -134145 -82638 128355 100285 -72349 -116366 49437 -524258 -398500
7848c98500J09008K17462k57462k58728Q6751L00926N5060k70443J26209p8533
$$ -398500 -289492 -72030 -329492 -588220 -501469 -200543 -145483 -415926 -289717 -368250
7838c68250N9395j67979L49194K40712j44922k33206L129J71162l65191R8753
$$ -368250 -308855 -476834 -127640 113072 -31850 -265056 -261927 -90765 -455956 -357203
7828c57203J87881k45871L2537k66217l06858O2115J41230j2850L85243k64788
$$ -357203 -169322 -415193 -382656 -648873 -955731 -893616 -752386 -765236 -379993 -644781
7818f44781k5874L56969L0818M86531j15295N24120P36708j003435k54586k10432
$$ -644781 -670655 -313686 -282868 203663 88368 612488 1349196 345761 91175 -119257
7808a19257n0632j68805j65014j25842L34196Q8108J27001m37181j83197k34579
$$ -119257 -169889 -338694 -503708 -629550 -295354 -207246 -80245 -517426 -700623 -935202
7798i35202K11054L49022j3251J04283n4080J57168L247k79668K8989K41745J59996
$$ -935202 -724148 -375126 -388377 -284094 -338174 -181006 -177759 -457427 -428438 -186693 -26697
7787b6697p24721m4320k87431o4396N82280j46759l5588J28190P2765K83760J19030
$$ -26697 -751418 -795738 -1083169 -1147565 -565285 -712044 -747632 -619442 -546677 -262917 -143887
7776a43887l76046K89622L10424K588n45927j3113J41819J12129J34008Q0571
$$ -143887 -519933 -230311 80113 82701 -463226 -476339 -334520 -222391 -88383 -7812
7766g812M5901J5371l53128l54798L12655J17097o9647J6095l51131K4594K09918
$$ -7812 38089 53460 -299668 -654466 -341811 -224714 -294361 -278266 -629397 -604803 -394885
7755c94885J75649q5445k17352L47292R3700l49619J7178R010r7332k61737K87458
$$ -394885 -219236 -304681 -522033 -174741 -81041 -430660 -413482 -404472 -501804 -763541 -476083
7744d76083n2069K12546q2291o4227j5727j17652M68768J96883j03075j26948
$$ -476083 -528152 -315606 -397897 -462124 -477851 -595503 -126735 70148 -32927 -159875
7734a59875j92103N265J00805K19321J63834l45603R2200K5700L28804k08879
$$ -159875 -351978 -346713 -245908 -26587 137247 -208356 -116156 -90456 238348 29469
7724B9469j75402j90607O996k51761M8250M92657K63998K8987n62408j03170j66951
$$ 29469 -145933 -336540 -329544 -581305 -533055 -40398 223600 252587 -309821 -412991 -579942
7713e79942j01644K17450M21848l80829j35444O3887m233J42953L5316K10562
$$ -579942 -681586 -464136 -42288 -423117 -558561 -494674 -498907 -355954 -320638 -110076
7703a10076Q0420M09500j25160l71185J55871j72694j62885J41102l3061l24929
$$ -110076 -29656 379844 254684 -116501 39370 -133324 -296209 -155107 -188168 -513097
7693e13097l40077O2030O42565n4579m16031J64759j95301k86329J94026K77596
$$ -513097 -853174 -791144 -148579 -203158 -619189 -454430 -649731 -936060 -742034 -464438
7683d64438k28059M49130j5549Q447J26194q7972P1558m41414J95413M2570j31395
$$ -464438 -692497 -243367 -258916 -250469 -124275 -212247 -140689 -582103 -386690 -344120 -475515
7672d75515j41320J49209J9195J87413J90865J38344o0615j73811J67553N6523
$$ -475515 -616835 -467626 -448431 -261018 -70153 68191 7576 -166235 1318 57841
7662E7841j04888Q9544k46460m16020K9571J13572J17980q3383l0537L46417k44196
$$ 57841 -47047 42497 -203963 -619983 -590412 -476840 -358860 -442243 -472780 -126363 -370559
7651c70559k41624J61801O5624j80336k6998K75187k08462M4497M09891J10593
$$ -370559 -612183 -450382 -384758 -565094 -592092 -316905 -525367 -480870 -70979 39614
7641C9614j65742o56349K8210R4185K64768L82118o36581j6819L05614l59069
$$ 39614 -126128 -782477 -754267 -660082 -395314 -13196 -649777 -666596 -360982 -720051
7631g20051J64832r704k62764L81438N7435J15371j16155P4970Q8531k7457k28723
$$ -720051 -555219 -564923 -827687 -446249 -388814 -273443 -389598 -314628 -226097 -253554 -482277
7620d82277K37002K28050j08183j30152m38539L60985l48928J82377j54170J31108
$$ -482277 -245275 -17225 -125408 -255560 -694099 -333114 -682042 -499665 -653835 -522727
7610e22727N99426L0547j12716l34171K56771P8767j16639k60821m9152R1484
$$ -522727 76699 107246 -5470 -339641 -82870 -4103 -120742 -381563 -430715 -339231
7600c39231m74465J94472r835j53650O83136o2920J8266K72399j41870p2450J91063
$$ -339231 -813696 -619224 -629059 -782709 -99573 -162493 -144227 128172 -13698 -86148 104915
7589A04915q3191k84266J58136Q6724j03114J23941J94744l14957k29328j28595
$$ 104915 21724 -262542 -104406 -17682 -120796 3145 197889 -117068 -346396 -474991
7579d74991r8410L65950L9195j71165o8506k63062K13543L92957O947L09742p0498
$$ -474991 -573401 -207451 -168256 -339421 -407927 -670989 -457446 -64489 -57542 252200 181702
7568A81702l75871n26189K23558L8330M44273k41982J78440K424l15478J57427
$$ 181702 -194169 -720358 -496800 -458470 -14197 -256179 -77739 -75315 -390793 -233366
7558b33366j07808R9181K81734K64691r5093j70074l78245m20459M46144L78562
$$ -233366 -341174 -241993 39741 304432 209339 39265 -338980 -759439 -313295 65267
7548F5267k8428k54090J74563Q6571n8362j75842p8174k57644K94587M01049q9499
$$ 65267 36839 -217251 -42688 43883 -14479 -190321 -268495 -526139 -231552 169497 79998
7537G9998j11247Q2018k69706q9762L78038J55933K3762q6760q6114l32486k5449
$$ 79998 -31249 50769 -218937 -308699 69339 225272 249034 162274 76160 -256326 -281775
7526b81775j01324K4604k84170K8010L76448N8705O7125o0969l25011Q4274N33086
$$ -281775 -383099 -358495 -642665 -614655 -238207 -179502 -112377 -173346 -498357 -414083 119003
7515A19003J28423j65181k63183n7100m4733j49792J78030P4476L08671k28892
$$ 119003 247426 82245 -180938 -238038 -282771 -432563 -254533 -180057 128614 -100278
7505a00278J67664j09533l16117L6190J2349j0233L11781l6794L17703N0373r7932
$$ -100278 67386 -42147 -358264 -322074 -309725 -319958 -8177 -44971 272732 323105 225173
7494B25173l63318K17748P7128k4878r1295k32875K64203J58040m31138K92763
$$ 225173 -138145 79603 156731 131853 40558 -192317 71886 229926 -201212 91551
7484I1551j3080k50164J58558J36006R917J33168k42346P3496J08552J68288Q7589
$$ 91551 78471 -171693 -13135 122871 132788 265956 23610 97106 205658 373946 461535
7473D61535m91967n0732J33521K35906J25272J98939k1137j86724n0680K97867
$$ 461535 -30432 -81164 52357 288263 413535 612474 591337 404613 353933 651800
7463F51800J34477J64038l32279K9977L22213J65204m10190j27550M46533Q1585
$$ 651800 786277 950315 618036 648013 970226 1135430 725240 597690 1044223 1125808
7453A125808J83833J39418j85917P603j04014P3800q7871n67192N03889K2176
$$ 1125808 1309641 1449059 1263142 1270745 1166731 1240531 1152660 585468 1089357 1111533
7443A111533N9535R8005m5478l9494N2705L45312P2923l22862j36039P49015l42789
$$ 1111533 1171068 1269073 1223595 1184101 1236806 1582118 1655041 1332179 1196140 1945155 1602366
7432A602366l93787N9397K3739J55623M36961l70923K72487R5059Q9155J27023
$$ 1602366 1208579 1267976 1291715 1447338 1884299 1513376 1785863 1880922 1970077 2097100
7422B097100L12399k65971J47599N24491P9373k66783M49184L05741J309J90078
$$ 2097100 2409499 2143528 2291127 2815618 2894991 2628208 3077392 3383133 3384442 3574520
7412C574520J19717L23314r0598k66608J20089M65581M3643m00136o08427M691
$$ 3574520 3694237 4017551 3926953 3660345 3780434 4246015 4289658 3889522 3281095 3285786
7402C285786K87730J60900k56134k11680L69260j87879K79551r3559l40648O8295
$$ 3285786 3573516 3734416 3478282 3266602 3635862 3447983 3727534 3633975 3293327 3361622
7392C361622j67917j16100K02250q4743O6701n6083R9181M82116l14692L93064
$$ 3361622 3193705 3077605 3279855 3195112 3261813 3205730 3304911 3787027 3472335 3865399
7382C865399M79792p9475l48717J90409M47728k9745O04833L19228k75892L22664
$$ 3865399 4345191 4265716 3916999 4107408 4555136 4525391 5130224 5449452 5173560 5496224
7372E496224m0549L39841j69066L06300N5610J66166j34332m24694k69191J86264
$$ 5496224 5455675 5795516 5626450 5932750 5988360 6154526 6020194 5595500 5326309 5512573
7362E512573r2892j14957K72639J4062n31553j99184N2056k78240j12426k12790
$$ 5512573 5419681 5304724 5577363 5591425 5059872 4860688 4912744 4634504 4522078 4309288
7352D309288k54740N5385j75353n9512L40747j34409k50205k14805l19622M1604
$$ 4309288 4054548 4109933 3934580 3875068 4215815 4081406 3831201 3616396 3296774 3338378
7342C338378L72656k89124l0838L63534m5411L76159K98248J29479J05635Q0792
$$ 3338378 3711034 3421910 3391072 3754606 3709195 4085354 4383602 4513081 4618716 4699508
7332D699508l60745j74835J0959J28816K72273j04034K56037m43593r6979L7391
$$ 4699508 4338763 4163928 4174887 4303703 4575976 4471942 4727979 4284386 4187407 4224798
7322D224798k31347p0691j06465k2350o18829M6331k72175j09063L70680k45860
$$ 4224798 3993451 3922760 3816295 3793945 3175116 3221447 2949272 2840209 3210889 2965029
7312B965029k74715l45742l605k2271p3115k67974k6393m6450k49651J63082J61333
$$ 2965029 2690314 2344572 2340967 2318696 2245581 1977607 1951214 1904764 1655113 1818195 1979528
7301A979528j40733m6949j35240K77128k26772k16400M6673r09q0226M928J70522
$$ 1979528 1838795 1791846 1656606 1933734 1706962 1490562 1537235 1536326 1456100 1461028 1631550
7290A631550j26014j43686M62762j15254l65433p348j84316L8591L68304m6922
$$ 1631550 1505536 1361850 1824612 1709358 1343925 1336577 1152261 1190852 1559156 1512234
7280A512234j18085p7809k84942n64431J29615J06876K87408q766l01650L03196
$$ 1512234 1394149 1316340 1031398 466967 596582 703458 990866 982100 680450 983646
7270I83646j40115l13021k02943N66550l08635Q5822m545k09132o7289L68433
$$ 983646 843531 530510 327567 894117 585482 671304 666759 457627 390338 758771
7260G58771l6879k64400M3468j5030J22312K41095m02865o6519M32805k83211
$$ 758771 721892 457492 500960 485930 608242 849337 446472 379953 812758 529547
7250E29547j53054m29471K55527K26393N0902j21905K06570K82772n8286R8771
$$ 529547 376493 -52978 202549 428942 479844 357939 564509 847281 788995 887766
7240H87766p8415m10991M52505k7013L70913J9064P1309J87546j52166R8962M454
$$ 887766 809351 398360 850865 823852 1194765 1213829 1285138 1472684 1320518 1419480 1423934
7229A423934P6683m23887k03973P8810J84290l94320M6499R8170K59880K38150
$$ 1423934 1500617 1076730 872757 951567 1135857 741537 788036 886206 1146086 1384236
7219A384236K00528n00284l54637M66598K2440L17254L8272o4522j22174m72L0563
$$ 1384236 1584764 1084480 729843 1196441 1218881 1536135 1574407 1509885 1387711 1387239 1417802
7208A417802k03930L53578N27547L91147m9326k0494J59032k23699J00869J95487
$$ 1417802 1213872 1567450 2094997 2486144 2436818 2416324 2575356 2351657 2452526 2648013
7198B648013P7860M22978J17308k38451j40107k0063Q3898q7517j13982j57143
$$ 2648013 2725873 3148851 3266159 3027708 2887601 2867538 2951436 2863919 2749937 2592794
7188B592794L09292K69601k98040k70897j38385j18820K6101r1560K04878Q2054
$$ 2592794 2902086 3171687 2873647 2602750 2464365 2345545 2371646 2280086 2484964 2567018
7178B567018K19848j18124J8117K21965K0311J38698R8834L30001j20099r4257
$$ 2567018 2786866 2668742 2686859 2908824 2929135 3067833 3166667 3496668 3376569 3282312
7168C282312K93983L66813k78050m9941J88325O33192J28574J69746M1473p9610
$$ 3282312 3576295 3943108 3665058 3615117 3803442 4436634 4565208 4734954 4776427 4696817
7158D696817l81819K04997l8950k05018p7375n49262M0455m3673L29927o0857
$$ 4696817 4314998 4519995 4481045 4276027 4198652 3649390 3689845 3646172 3976099 3915242
7148C915242l09163l80801n386J19462M1770L28621J13705l11532m45102J0944
$$ 3915242 3606079 3225278 3219892 3339354 3381124 3709745 3823450 3511918 3066816 3077760
7138C077760k69296J17407J89360j7981P018k61731L79590M02157l97537M0716
$$ 3077760 2808464 2925871 3115231 3097250 3104268 2842537 3222127 3624284 3226747 3267463
7128C267463J05505n542o0227J34230l177K33026J73437j12236k81484K4827J81942
$$ 3267463 3372968 3367426 3307199 3441429 3438252 3671278 3844715 3732479 3450995 3475822 3657764
7117C657764l35054M5359J27728K08065j73357m7229k39968J24451l57569k40028
$$ 3657764 3322710 3368069 3495797 3703862 3530505 3483276 3243308 3367759 3010190 2770162
7107B770162R5428l4845n217K4176m41974Q3058M1923j76101K70886j19081J80877
$$ 2770162 2865590 2830745 2825528 2849704 2407730 2490788 2532711 2356610 2627496 2508415 2689292
7096B689292K44047K3193l32063J45640L410Q9891K68771n7701k31326J20477
$$ 2689292 2933339 2956532 2624469 2770109 2773519 2863410 3132181 3074480 2843154 2963631
7086B963631j85514j37228J60182K15380J00737K62012k53006K32891R4475l5044
$$ 2963631 2778117 2640889 2801071 3016451 3117188 3379200 3126194 3359085 3453560 3418516
$$ [...]
##END NTUPLES=NMR SPECTRUM
##END=
