##TITLE=1H_EC-3287-x
 DMSO
 8 sc, 
 19.12.2022
##JCAMPDX= 6.0         $$ Bruker NMR JCAMP-DX V2.0
##DATA TYPE= NMR SPECTRUM
##DATA CLASS= NTUPLES
##ORIGIN= UXNMR, Bruker Analytische Messtechnik GmbH
##OWNER= root
$$ XWIN-NMR		Version 3.5
$$ Mon Dec 19 13:56:57 2022 Russian Standard Time (UT+4h)  she@DPX200
##.OBSERVE FREQUENCY= 200.13135
##.OBSERVE NUCLEUS= ^1H
##.ACQUISITION MODE= SIMULTANEOUS
##.ACQUISITION SCHEME= undefined
##.AVERAGES= 8
##.DIGITISER RES= 18
##SPECTROMETER/DATA SYSTEM= spect
##.PULSE SEQUENCE= zg30
##.SOLVENT NAME= CDCl3
##.SHIFT REFERENCE= (INTERNAL, CDCl3, 0, 15.7502)
##AUDIT TRAIL= $$ (NUMBER, WHEN, WHO, WHERE, WHAT)
$$ ##TITLE= Audit trail, XWIN-NMR		Version 3.5
$$ ##JCAMPDX= 5.01
$$ ##ORIGIN= Bruker BioSpin GmbH
$$ ##OWNER= she
$$ F:/spectra/data/she/nmr/H-F/1/pdata/1/auditp.txt
$$ ##AUDIT TRAIL=  $$ (NUMBER, WHEN, WHO, WHERE, WHAT)
(   1,<2022-12-19 13:55:20.85 +0400>,<she>,<DPX200>,
      <created by zg, POWCHK disabled, PULCHK disabled
       configuration hash MD5:
       00 E9 B6 7A A2 85 ED C7 34 08 36 98 17 FE 4E 26
       data hash MD5: 16K
       00 4B 53 C5 15 A2 C8 18 7D 66 EC 2A D1 EB E0 90>)
(   2,<2022-12-19 13:55:23.21 +0400>,<she>,<DPX200>,
      <Start of raw data processing
       efp BC_mod = 2 LB = 0.24 FT_mod = 6 PKNL = 1 PHC0 = -19101.09 PHC1 = 11.00072 SI = 16K 
       data hash MD5: 16K
       AF A4 D1 82 2B 77 FD 44 A9 DC BA E0 B9 47 58 91>)
(   3,<2022-12-19 13:55:45.23 +0400>,<she>,<DPX200>,
      <pk PHC0 = -7.084671 PHC1 = -5.4 
       data hash MD5: 16K
       38 26 E0 5A 81 82 90 6C 3C 0C 72 3D A4 6C 70 3C>)
(   4,<2022-12-19 13:55:48.46 +0400>,<she>,<DPX200>,
      <abs ABSG = 5 
       data hash MD5: 16K
       EF 83 C1 0E BE CE 23 A9 81 44 4B 1C E2 CA 0C 7A>)
(   5,<2022-12-19 13:56:15.17 +0400>,<she>,<DPX200>,
      <pk PHC0 = 1.769121 PHC1 = -5.2 
       data hash MD5: 16K
       CF 70 DD FD B4 0E D5 13 FF 02 AE 1F 64 19 2E 4A>)
(   6,<2022-12-19 13:56:18.50 +0400>,<she>,<DPX200>,
      <abs ABSG = 5 
       data hash MD5: 16K
       F5 D5 4F 4E 7C 64 62 1A 46 48 8A 7C 03 06 4F 96>)
$$ ##END=
$$ 
$$ hash MD5
$$ 2A 5B 92 C8 AB 0E 56 AD E5 95 53 B1 F5 4F C3 01
##$RELAX= 
##$RELAX= 
##$RELAX= 
##$RELAX= 
##$RELAX= 
##$RELAX= 
$$ Bruker specific parameters
$$ --------------------------
##$DU= <F:/spectra>
##$EXPNO= 1
##$NAME= <H-F>
##$PROCNO= 1
##$TYPE= <nmr>
##$USER= <she>
##$AMP= (0..31)
100 100 100 100 100 100 100 100 100 100 100 100 100 100 100 100 100 100 
100 100 100 100 100 100 100 100 100 100 100 100 100 100 
##$AQSEQ= 0
##$AQ_mod= 1
##$AUNM= <au_zg>
##$AUTOPOS= <>
##$BF1= 200.13
##$BF2= 200.13
##$BF3= 200.13
##$BF4= 200.13
##$BF5= 200.13
##$BF6= 200.13
##$BF7= 200.13
##$BF8= 200.13
##$BYTORDA= 1
##$CFDGTYP= 0
##$CFRGTYP= 5
##$CHEMSTR= <none>
##$CNST= (0..31)
1 1 145 1 1 1 1 1 1 1 1 1 1 1 1 1 1 1 1 1 1 1 1 1 1 1 1 1 1 1 1 1 
##$CPDPRG= <>
##$CPDPRG1= <>
##$CPDPRG2= <>
##$CPDPRG3= <>
##$CPDPRG4= <mlev>
##$CPDPRG5= <mlev>
##$CPDPRG6= <mlev>
##$CPDPRG7= <mlev>
##$CPDPRG8= <mlev>
$$ [...]
##$SUBNAM3= <"">
##$SUBNAM4= <"">
##$SUBNAM5= <"">
##$SUBNAM6= <"">
##$SUBNAM7= <"">
##$SUBNAM8= <"">
##$SUBNAM9= <"">
##$SW= 18.05172834244
##$SWIBOX= (0..15)
0 0 2 0 0 0 0 0 0 0 0 0 0 0 0 0 
##$SW_h= 3612.71676300578
##$TD= 16384
##$TD0= 1
##$TE= 0
##$TE2= 300
##$TE3= 300
##$TEG= 300
##$TL= (0..7)
0 120 120 120 120 120 120 120 
##$TP= (0..7)
150 150 150 150 150 150 150 150 
##$TP07= 0
##$TPNAME0= <>
##$TPNAME1= <>
##$TPNAME2= <>
##$TPNAME3= <>
##$TPNAME4= <>
##$TPNAME5= <>
##$TPNAME6= <>
##$TPNAME7= <>
##$TPOAL= (0..7)
0.5 0.5 0.5 0.5 0.5 0.5 0.5 0.5 
##$TPOFFS= (0..7)
0 0 0 0 0 0 0 0 
##$TUNHIN= 0
##$TUNHOUT= 0
##$TUNXOUT= 0
##$USERA1= <user>
##$USERA2= <user>
##$USERA3= <user>
##$USERA4= <user>
##$USERA5= <user>
##$V9= 5
##$VALIST= <valist>
##$VCLIST= <CCCCCCCCCCCCCCC>
##$VD= 0
##$VDLIST= <DDDDDDDDDDDDDDD>
##$VPLIST= <PPPPPPPPPPPPPPP>
##$VTLIST= <TTTTTTTTTTTTTTT>
##$WBST= 1024
##$WBSW= 4
##$XGAIN= (0..3)
0 0 0 0 
##$XL= 0
##$YL= 0
##$YMAX_a= 95235
##$YMIN_a= -142710
##$ZGOPTNS= <>
##$ZL1= 120
##$ZL2= 120
##$ZL3= 120
##$ZL4= 120
##$ABSF1= 15.75019
##$ABSF2= -2.30166
##$ABSG= 5
##$ABSL= 3
##$ALPHA= 0
##$AQORDER= 0
##$ASSFAC= 0
##$ASSFACI= 0
##$ASSFACX= 0
##$ASSWID= 0
##$AUNMP= <proc_1d>
##$AZFE= 0.1
##$AZFW= 0.1
##$BCFW= 0
##$BC_mod= 2
##$BYTORDP= 0
##$COROFFS= 0
##$CY= -3
##$DATMOD= 1
##$DC= 0
##$DFILT= <>
##$DTYPP= 0
##$F1P= 0
##$F2P= 0
##$FCOR= 1
##$FTSIZE= 16384
##$FT_mod= 6
##$GAMMA= 0
##$GB= 0
##$INTBC= 1
##$INTSCL= 3.70164e-10
##$ISEN= 128
##$LB= 0.24
##$LEV0= 0
##$LPBIN= 0
##$MAXI= 10000
##$MC2= 0
##$MEAN= 0
##$ME_mod= 0
##$MI= 1.114404
##$NCOEF= 0
##$NC_proc= -9
##$NLEV= 6
##$NOISF1= 3.799351
##$NOISF2= 2.8
##$NSP= 0
##$NTH_PI= 0
##$NZP= 0
##$OFFSET= 15.75019
##$PC= 1
##$PHC0= -19106.4
##$PHC1= 0.4007201
##$PH_mod= 1
##$PKNL= yes
##$PPARMOD= 0
##$PSCAL= 0
##$PSIGN= 0
##$REVERSE= no
##$SF= 200.130004272172
##$SI= 16384
##$SIGF1= 3
##$SIGF2= 2
##$SINO= 5.538805
##$SIOLD= 16384
##$SREGLST= <1H.CDCl3>
##$SSB= 0
##$STSI= 16384
##$STSR= 0
##$SW_p= 3612.71676300578
##$SYMM= 0
##$S_DEV= 0
##$TDeff= 16384
##$TDoff= 0
##$TI= <>
##$TILT= no
##$TM1= 0
##$TM2= 0
##$TOPLEV= 0
##$USERP1= <user>
##$USERP2= <user>
##$USERP3= <user>
##$USERP4= <user>
##$USERP5= <user>
##$WDW= 1
##$XDIM= 16384
##$YMAX_p= 522462075
##$YMIN_p= -2405425
$$ End of Bruker specific parameters
$$ ---------------------------------
##NTUPLES= NMR SPECTRUM
##VAR_NAME=  FREQUENCY,     SPECTRUM/REAL,   SPECTRUM/IMAG
##SYMBOL=    X,             R,               I
##VAR_TYPE=  INDEPENDENT,   DEPENDENT,       DEPENDENT
##VAR_FORM=  AFFN,          ASDF,            ASDF
##VAR_DIM=   16384,         16384,           16384
##UNITS=     HZ,            ARBITRARY UNITS, ARBITRARY UNITS
##FACTOR=    0.220516191357247, 1,           1
##FIRST=     3152.08554819687, 0,            0
##LAST=      -460.631214808913, 0,           0
##MIN=       -460.631214808913, -2405425,    0
##MAX=       3152.08554819687, 522462075,    0
$$ Real data points
##PAGE= N=1
##DATA TABLE= (X++(R..R)), XYDATA
$$ [...]
$$ plain form
7925 -330710 -880999 -1470059 -902982 -652830 -960860 -501488 -586335 -593773 -96154 -789429
7915 -789429 -1646703 -727804 -698508 -595966 -126746 -146963 230243 -210971 253922 402651
7905 402651 122367 146611 -332361 -1067458 -876528 -28850 -640250 -694043 -876944 162865
7895 162865 26112 -114930 -1100482 -1249432 -756269 -430125 159305 -438443 -1439807 -1365602
7885 -1365602 -832880 -511636 330660 95711 269334 380670 31382 -27169 314623 -389130
7875 -389130 -1082152 -489606 -340329 -1419581 -846051 -725300 -1145204 -763416 -434796 -918066
7865 -918066 -575742 -692065 162197 -68019 -467669 185916 -112902 630205 1373639 312710
7855 312710 -85691 -414207 -349638 -140892 172814 163450 -444725 -1300256 -890310 -331059
$$ packed form
7925c30710n50289n89060N67077K50152l08030M59372q4847p438M97619o93275
7915g89429q57274R18899K9296J02542M69220k0217L77206m41214M64893J48729
7905D02651k80284K4244m78972p35097J90930Q47678o11400n3793j82901J039809
7895A62865j36753j41042r85552j48950M93163L26144N89430n97748j001364P4205
7885a365602N32722L21244Q42296k34949J73623J11336l49288n8551L41792p03753
7875c89130o93022N92546J49277j079252N73530J20751m19904L81788L28620m83270
7865i18066L42324j16323Q54262k30216l99650O53585k98818P43107P43434j060929
7855C12710l98401l28516O4569K08746L13706r364o08175q55531M09946N59251
$$ plain form
7845 -331059 755537 139379 -518051 -444327 -58824 -304150 689037 851862 233286 -133683
7835 -133683 -714400 -438016 -167504 -322342 -541371 -926128 -1394766 -776634 -381422 -875307
7825 -875307 -96127 420052 -677525 -387762 659192 -182900 -1084712 -674025 -868691
7816 -868691 -1104659 -796540 -631284 -762437 328267 846344 334930 -282963 -787342 -573351
7806 -573351 -356281 -881377 -731152 258489 -156773 -626009 -576906 -798002 3726 -126763
7796 -126763 206317 -1359755 -212031 184435 229672 -475120 -286512 200079 -441167 -658441
7786 -658441 -805404 -312611 -1062349 -1763060 -929865 334499 -413043 -746809 -746215 430149
7776 430149 655852 -134553 -736161 -1062967 -706182 -275695 -361878 -756426 -420922 -386867
$$ packed form
7845c31059J086596o16158o57430P3724L85503k45326R93187J62825o18576l66969
7835a33683n80717K76384K70512j54838k19029l84757m68638O18132L95212m93885
7825h75307P79180N16179j097577K89763J046954q42092r01812M10687j94666
7816h68691k35968L08119J65256j31153J090704N18077n11414o17893n04379K13991
7806e73351K17070n25096J50225R89641m15262m69236M9103k21096Q01728j30489
7796a26763L33080j566072J147724L96466M5237p04792J88608M86591o41246k17274
7786f58441j46963M92793p49738p00711Q33195J264364p47542l33766N94J176364
7776D30149K25703p90405o01608l26806L56785M30487q6183l94548L35504L4055
$$ plain form
7766 -386867 -313130 203622 -138093 -685143 347526 306620 534411 301247 -91674 -967634
7756 -967634 -832022 -264287 -308068 -413942 -864976 -537872 -665948 34339 683817 -210850
7746 -210850 -418056 -683598 -1215598 -1023092 -609791 114835 -461152 -771719 -259006 -43670
7736 -43670 67204 -667630 -460385 273394 386599 -303882 -6504 766301 542133 241680
7726 241680 560681 508148 -460025 -805155 72273 -1315 115093 406426 32735 -501302
7716 -501302 -574134 -942964 -333678 248391 -14711 -32982 426879 553487 609236 693349
7706 693349 18700 -847335 -463821 653721 -103387 -698235 -453922 -128954 -17809 -314840
7696 -314840 140267 274605 -172189 -288430 -1288140 -395505 -837383 -218179 460192 -745357
$$ packed form
7766c86867P3737N16752l41715n47050J032669m0906K27791k33164l92921q75960
7756i67634J35612N67735m3781j05874m51034L27104j28076P00287O49478q94667
7746b10850k07206k65542n32000J92506M13301P24626n75987l10567N12713K15336
7736d3670J10874p34834K07245P33779J13205o90481K97378P72805k24168l00453
7726B41680L19001n2533r68173l45130Q77428p3588J16408K91333l73691n34037
7716e01302p2832l68830O09286N82069k63102j8271M59861J26608N5749Q4113
7706F93349o74649q66035L83514J117542p57108n94848K44313L24968J11145k97031
7696c14840M55107J34338m46794j16241r99710Q92635m41878O19204O78371j205549
$$ plain form
7686 -745357 -317139 192656 -501803 -419641 -577960 -202946 -616129 -192146 681517 536840
7676 536840 705835 471365 490709 909192 736092 -25196 -249888 60196 -154679 47442
7666 47442 -151368 -490915 -1186088 -1641623 -713917 306482 1018670 -303062 -826184 -225985
7656 -225985 -90548 523974 515180 -339056 -518168 79652 -533348 366794 470010 -83111
7646 -83111 101952 565577 28313 -189905 184219 548478 285677 380827 350713 -288117
7636 -288117 -489087 -244702 -312663 -409848 -619359 -232208 -427551 -486741 -269357 -377481
7626 -377481 -196037 -709816 -947699 -362934 218186 -219254 -12363 37629 524195 896284
7616 896284 901058 632662 -410040 -567238 -477457 -877389 29108 591907 -304158 152585
$$ packed form
7686g45357M28218N09795o94459Q2162j58319L75014m13183M23983Q73663j44677
7676E36840J68995k34470J9344M18483j73100p61288k24692L10084k14875K02121
7666D7442j98810l39547o95173m55535R27706J020399P12188j321732n23122O00199
7656b25985J35437O14522q794q54236j79112N97820o13000R00142J03216n53121
7646h3111J85063M63625n37264k18218L74124L64259k62801R5150l0114o38830
7636b88117k00970K44385o7961r7185k09511L87151j95343n9190K17384j08124
7626c77481J81444n13779k37883N84765N81120m37440K06891M9992M86566L72089
7616H96284M774k68396j042702j57198Q9781l99932R06497N62799q96065M56743
$$ plain form
7606 152585 -183381 -1310806 -1033959 -1338556 23925 366524 460303 -239156 -669091 -337648
7596 -337648 -172170 -470647 -502864 -707124 -491664 47788 -130813 334761 -726563 -1055844
7586 -1055844 173573 264152 101519 -104253 -634167 -5376 471807 1049421 882334 960246
7576 960246 828475 331780 -163725 -156990 379640 423923 95304 118414 546588 505407 -7329
7565 -7329 -121426 323627 96794 1125692 17141 -563557 47581 368160 -473081 -98546
7555 -98546 62122 247041 598736 293706 614226 -520715 -648763 276517 27859 -152755
7545 -152755 -556506 -54739 -689625 -528662 160072 -772380 -725544 -323856 63175 262042
7535 262042 322130 860584 773942 886588 202024 283316 -76065 -189539 -576641 434239
$$ packed form
7606A52585l35966j127425K76847l04597J362481L42599R3779o99459m29935L31443
7596c37648J65478k98477l2217k04260K15460N39452j78601M65574j061324l29281
7586a055844J229417R0579j62633k05772n29914O28791M77183N77614j67087P7912
7576I60246j31771m96695m95505O735N36630M4283l28619K3110M28174m1181n12736
7565g329j14097M45053k26833J028898j108551n80698O11138L20579q41241L74535
7555i8546J60668J84919L51695l05030L20520j134941j28048R25280k48658j80614
7545a52755m03751N01767o34886J60963O88734r32452M6836M01688L87031J98867
7535B62042O0088N38454q6642J12646o84564Q1292l59381j13474l87102J010880
$$ plain form
7525 434239 589631 195297 457270 621066 1207022 897373 849083 931584 813294 683458
7515 683458 451311 715317 675662 276043 1238939 -349340 -1024729 -786457 -118403 -12985
7505 -12985 922263 1047600 1084841 869838 1198768 734520 112139 1103580 1661362 1661802 666448
7494 666448 2070 294452 570351 899844 664056 794610 1201696 1557656 1012261 522887
7484 522887 -15244 208332 275932 743099 624720 1299105 596257 450731 900173 151808
7474 151808 -11189 -243603 522289 718603 1162715 1052215 814865 553600 514421 282998
7464 282998 861475 1158162 371726 573093 669393 1242639 1137911 1109145 1226626 1578284
7454 1578284 1939574 1068470 744756 635467 816591 931100 941756 789855 1162427 536647
$$ packed form
7525D34239J55392l94334K61973J63796N85956l09649m8290Q2501j18290j29836
7515F83458k32147K64006l9655l99619R62896j588279o75389K38272O68054J05418
7505a2985R35248J25337L7241k15003L28930m64248o22381R91441N57782M40r95354
7494F66448o64378K92382K75899L29493k35788J30554M07086L55960n45395m89374
7484E22887n38131K23576O7600M67167j18379O74385p02848j45526M49442p48365
7474A51808j62997k32414P65892J96314M44112j10500k37350k61265l9179k31423
7464B82998N78477K96687p86436K01367R6300N73246j04728k8766J17481L51658
7454A578284L61290q71104l23714j09289J81124J14509J0656j51901L72572o25780
$$ plain form
7444 536647 74451 378967 267064 -122556 147624 1009287 1568788 1681056 799237 -13842
7434 -13842 320695 1175357 1249288 1228594 798254 529565 126264 -377913 98962 227994
7424 227994 319119 1122218 1721818 1246250 1063256 871903 725123 151233 449173 621362
7414 621362 704832 1027501 1367303 1047093 584673 624993 605987 2409694 2341073 1709974
7404 1709974 991781 1151070 1383645 1219411 1048119 686980 1215834 1266450 1666333 1187157
7394 1187157 1335021 1845388 2336613 1666094 1864300 1995622 2021397 1468129 1146366 1562745
7384 1562745 1202844 1284929 1017469 620039 988319 1825409 2321270 1668185 666152 673026
7374 673026 1217022 2096386 1469906 1839819 2229737 1196001 1479095 1531660 1943719 1776002
$$ packed form
7444E36647m62196L04516j11903l89620K70180Q61663N59501J12268q81819q13079
7434a3842L34537Q54662P3931k0694m30340k68689m03301n04177M76875J29032
7424B27994R1125Q03099N99600m75568j82994j91353j46780n73890K97940J72189
7414F21362Q3470L22669L39802l20210m62420M0320j9006J803707o8621o31099
7404A709974p18193J59289K32575j64234j71292l61139N28854N0616L99883m79176
7394A187157J47864N10367M91225o70519J98206J31322K5775n53268l21763M16379
7384A562745l59901Q2085k67460l97430L68280Q37090M95861o53085j002033O874
7374F73026N43996Q79364o26480L69913L89918j033736K83094N2565M12059j67717
$$ plain form
7364 1776002 1215711 1197168 1907164 1850497 2047668 1232470 1060628 1480950 1565720 2411105
7354 2411105 2687487 2460925 2627888 2426959 2018940 2194170 2056854 2328529 2687633 2244109
7344 2244109 1991499 2707190 2946497 2650905 1843945 3058890 2878957 2235321 1896644
7335 1896644 2330703 2497236 2572208 1786355 927923 1860322 2665113 1338693 1543979 1664846
7325 1664846 1548398 1668295 2606364 2249943 1904228 1427949 2243473 2877446 2737376 2751625
7315 2751625 2370635 2671304 2575099 2611606 2587701 2690364 3261992 3295365 3133614 3580761
7305 3580761 2906419 3734014 3443238 3558544 2298972 2492564 3169219 3672779 3933634
7296 3933634 3433634 3059234 3047763 3125471 3612939 3503172 1941892 2410835 2802317 2215329
$$ packed form
7364A776002n60291j8543P09996n6667J97171q15198j71842M20322Q4770Q45385
7354B411105K76382k26562J66963k00929m08019J75230j37316K71675L59104m43524
7344B244109k52610P15691K39307k95592q06960J214945j79933o43636l38677
7335A896644M34059J66533P4972p85853q58432R32399Q04791j326420K05286J20867
7325A664846j16448J19897R38069l56421l45715m76279Q15524O33973j40070J4249
7315B751625l80990L00669r6205L6507k3905J02663N71628L3373j61751M47147
7305C580761o74342Q27595k90776J15306j259572J93592O76655N03560K60855
7296C933634n00000l74400j1471P7708M87468j09767j561280M68943L91482n86988
$$ plain form
7286 2215329 3616277 3455490 2692376 2453857 2865817 3029236 3618890 3624836 4105283 4217205
7276 4217205 3621754 4178889 3903551 3491883 3334189 2655968 3460828 4292902 3610632 4348418
7266 4348418 4719359 4539040 4639934 4273263 4088072 4350855 4502789 3796236 4981727
7257 4981727 5505255 5020106 4979621 5311885 5567497 5115676 5505860 5124969 5404202 5373201
7247 5373201 4660719 4499625 4937761 5054754 5291077 5560380 5832821 5280431 4843464 5904610
7237 5904610 6399949 6616047 6194899 6981747 7927365 6390455 5835880 6151383 7061937
7228 7061937 7097899 7017973 7239098 8046224 7562623 6816406 6670050 6651303 6773898 7458627
7218 7458627 7906098 7919975 7925557 7839052 8103286 7792916 7672775 8786718 8460737 8083999
$$ packed form
7286B215329J400948j60787p63114k38519M11960J63419N89654N946M80447J11922
7276D217205n95451N57135k75338m11668j57694o78221Q04860Q32074o82270P37786
7266D348418L70941j80319J00894l66671j85191K62783J51934p06553J185491
7257D981727N23528m85149m0485L32264K55612m51821L90184l80891K79233l1001
7247E373201p12482j61094M38136J16993K36323K69303K72441n52390m36967J061146
7237E904610M95339K16098m21148P86848R45618j536910n54575L15503R10554
7228G061937L5962p9926K21125Q07126m83601p46217j46356j8747J22595O84729
7218G458627M47471J3877N582q6505K64234l10370j20141J113943l25981l76738
$$ plain form
7208 8083999 9201237 9480354 9396262 9389690 9037391 8572051 9823988 9959038 9511524 9812203
7198 9812203 10744914 10931423 10957533 11528815 11805705 11846986 11251585 10954918 10393260 10497348
7188 10497348 10659185 10833393 11096942 11412021 11812315 11792855 11837669 12211342 12827105 13026591
7178 13026591 13198198 13735247 13417527 13501054 13385876 13837406 13501458 13675155 14699503
7169 14699503 14236245 14141201 14541543 14847646 14203534 14321312 14526238 15650473 16001181
7160 16001181 16017270 16261955 16042574 16006285 16180884 16006869 16521984 16351680 16064107 16608920
7150 16608920 16493090 16953870 17035039 16908674 16988646 16238083 15989880 17120738 17184907 16880239
7140 16880239 17415745 17720942 18183545 17983501 18092670 18472481 18321618 18167296 18015511
$$ packed form
7208H083999J117238K79117q4092o572l52299m65340J251937J35050m47514L00679
7198I812203R32711J86509K6110N71282K76890M1281n95401k96667n61658J04088
7188A0497348J61837J74208K63549L15079M00294j9460M4814L73673O15763J99486
7178A3026591J71607N37049l17720Q3527j15178M51530l35948J73697J024348
7169A4699503m63258r5044M00342L06103o44112J17778K04926J124235L50708
7160A6001181J6089K44685k19381l6289J74599j74015N15115j70304k87573N44813
7150A6608920j15830M60780Q1169j26365P9972p50563k48203J130858O4169l04668
7140A6880239N35506L05197M62603k00044J09169L79811j50863j54322j51785
$$ plain form
7131 18015511 18170011 17731114 18287747 18189999 18467872 18403279 18101767 18047537 18265221 18850312
7121 18850312 19058649 19118504 18462817 17062307 17070823 18277658 18408543 18277958 18772407 17933865
7111 17933865 17377382 17036080 17688469 17421828 17411259 17809422 17084327 17312001 18019432 17939730
7101 17939730 17419918 17110116 16677320 17149988 17073802 16942624 16970256 17364988 17256566 17198544
7091 17198544 16841205 16865725 16730210 16027463 16066105 16180457 15796637 15607926 15345912 15149572
7081 15149572 15323199 14469893 14071711 14057390 14483318 14678211 14553415 13250280 13457923
7072 13457923 13717795 13071216 13415422 13296194 13452208 12844531 12256691 12271141 11881233 12171743
7062 12171743 12336046 11761114 11063146 11214362 11506903 10383838 10364857 10190291 10618789
$$ packed form
7131A8015511J54500m38897N56633r7748K77873o4593l01512n4230K17684N85091
7121A8850312K08337N9855o55687j400510Q516J206835J30885j30585M94449q38542
7111A7933865n56483l41302O52389k66641j0569L98163p25095K27674P07431p9702
7101A7939730n19812l09802m32796M72668p6186j31178K7632L94732j08422n8022
7091A7198544l57339K4520j35515p02747L8642J14352l83820j88711k62014j96340
7081A5149572J73627q53306l98182j4321M25928J94893j24796j303135K07643
7072A3457923K59872o46579L44206j19228J56014o07677n87840J4450l89908K90510
7062A2171743J64303n74932o97968J51216K92541j123065j8981j74566M28498
$$ plain form
7053 10618789 10923389 10358646 9305341 9977931 10116797 9941018 8569508 9243884 9008987
7044 9008987 8949229 9097543 8755616 8359862 8647719 8700911 8023364 8272669 8246156 7911010
7034 7911010 8085556 8248163 7946848 7714257 7201359 7523147 7635333 7409429 7608663 7379631
7024 7379631 7483471 7354727 7353278 7216674 7186674 7615729 7451610 6749188 6245019 5985537
7014 5985537 6121540 5729257 6250925 7098999 6439371 6322188 6330195 6079910 5658229 5410254
7004 5410254 4295297 4628623 5490230 5163495 4179851 4830406 5150411 5390076 5235303
6995 5235303 5103968 4822696 4329680 4740518 4342504 3944033 4540447 4606517 4760105 4444258
6985 4444258 4248407 4045504 3611485 4297562 4819325 5330991 4302738 3053769 3820808
$$ packed form
7053A0618789L04600n64743j053305O72590J38866j75779j371510O74376k34897
7044I008987n9758J48314l41927l95754K87857N3192o77547K49305k6513l35146
7034G911010J74546J62607l01315k32591n12898L21788J12186k25904J99234k29032
7024G379631J03840j28744j449j36604l0000M29055j64119p02422n04169k59482
7014E985537J36003l92283N21668Q48074o59628j17183Q007k50285m21681k47975
7004E410254j114957L33326Q61607l26735r83644O50555L20005K39665j54773
6995E235303j31335k81272m93016M10838l98014l98471N96414O6070J53588l15847
6985D444258j95851k02903m34019O86077N21763N11666j028253j248969P67039
$$ plain form
6976 3820808 3203958 2820805 2636475 2866047 2857201 3262651 4107929 3628073 3017528 3043234
6966 3043234 3064125 3282871 3507824 3982102 3384035 2446087 1933317 1972628 2622384 2988582
6956 2988582 2318644 2857616 2273977 2208963 2470714 2234280 2225911 2736653 2963553 2608986
6946 2608986 2775024 2469625 2936500 2519466 1939984 2089982 2256285 2752661 2873792 2399101
6936 2399101 2199875 2834371 3219719 2689387 2915931 3601429 2189331 1233871 1636853
6927 1636853 2219144 1755508 2272756 2693188 2303800 2277019 2143155 2638915 2898629 1994273
6917 1994273 1534579 1885510 2734102 2294993 1647999 1143927 1564443 2223425 2618646 2562730
6907 2562730 2171532 1857893 1060328 1965683 1890801 1732251 1869471 1252809 1152052 2019506
$$ packed form
6976C820808o16850l83153j84330K29572q846M05450Q45278m79856o10545K5706
6966C043234K0891K18746K24953M74278n98067r37948n12770L9311O49756L66198
6956B988582o69938N38972n83639o5014K61751k36434q369N10742K26900l54567
6946B608986J66038l05399M66875m17034n79482J49998J66303M96376J21131m74691
6936B399101j99226O34496L85348n30332K26544O85498j412098r55460M02982
6927A636853N82291m63636N17248M20432l89388k6781j33864M95760K59714r04356
6917A994273m59694L50931Q48592m39109o46994n04072M20516O58982L95221n5916
6907B562730l91198l13639p97565R05355p4882j58550J37220o16662j00757Q67454
$$ plain form
6897 2019506 2313287 2170693 2528341 2419955 2700086 2645133 1648798 1900546 2131947 2725161
6887 2725161 2967247 3079619 2502712 2071796 1165463 2530295 2572356 2176857 2462749 1898921
6877 1898921 1990004 2007516 1874744 2054378 2121821 2321878 1760339 2277008 2181304 1777721
6867 1777721 1703451 1903289 1936149 2255230 2331695 2421874 2356086 1719776 1844504 1711536
6857 1711536 1626847 2011765 1526688 976210 2054315 2516397 1823695 1771598 1715271 1683081
6847 1683081 1756616 1381108 1141639 1510031 1472718 2225629 1895304 1586058 1289515 1356925
6837 1356925 2080795 2489294 2438415 2571550 2320625 1821417 1512591 1618677 897698 1349456
6827 1349456 1697589 1623533 2716027 2197015 1842067 1306283 1843526 1906435 2247634 1445608
$$ packed form
6897B019506K93781j42594L57648j08386K80131n4953r96335K51748K31401N93214
6887B725161K42086J12372n76907m30916r06333J364832M2061l95499K85892n63828
6877A898921R1083J7512j32772J79634O7443K00057n61539N16669r5704m03583
6867A777721p4270J99838L2860L19081P6465R0179o5788o36310J24728j32968
6857A711536q4689L84918m85077n50478J078105M62082o92702n2097n6327l2190
6847A683081P3535l75508k39469L68392l7313P52911l30325l09246k96543O7410
6837A356925P23870M08499n0879J33135k50925m99208l08826J06086p20979M51758
6827A349456L48133p4056J092494n19012l54948n35784N37243O2909L41199q02026
$$ plain form
6817 1445608 1438509 1677209 1717063 1730965 2648269 2648845 2274342 2170245 1527193 1701015 2614863
6806 2614863 2883541 2229075 2186726 1726291 2283289 2714081 2912029 1991354 1899769 2242528
6796 2242528 1848806 2217293 1841008 1306875 1484737 1730171 1202061 1673866 2482355 2754969
6786 2754969 2355631 2128213 2323785 2659962 2498667 2376514 2587952 3179365 2560576 1946633
6776 1946633 2133479 1844652 1066776 1763678 2365338 2534320 1990170 1708578 2116581 2526719
6766 2526719 2691636 3221754 2233990 1753721 2132910 2282010 1731872 1732969 1927237 1694199
6756 1694199 1640977 1384460 1760097 2005016 2076398 1986163 1943852 2290057 2264108 2175796 3317734
6745 3317734 3073187 2600028 3472094 3326101 2354986 2891756 2976492 2249258 2530736 2674058
$$ packed form
6817A445608p099K38700L9854J3902R17304N76l74503j04097o43052J73822R13848
6806B614863K68678o54466m2349m60435N56998M30792J97948r20675r1585L42759
6796B242528l93722L68487l76285n34133J77862K45434n28110M71805Q08489K72614
6786B754969l99338k27418J95572L36177j61295j22153K11438N91413o18789o13943
6776A946633J86846k88827p77876O96902O01660J68982n44150k81592M08003M10138
6766B526719J64917N30118r87764m80269L79189J49100n50138J097J94268k33038
6756A694199n3222k56517L75637K44919P1382r0235m2311L46205k5949q8312J141938
6745C317734k44547m73159Q72066j45993r71115N36770Q4736p27234K81478J43322
$$ plain form
6735 2674058 2025721 1667396 1420531 832148 1706057 2093268 2317174 2234384 2224496 1635231
6725 1635231 998853 1660795 1772786 2110570 2232384 2049933 2330655 2063161 2194950 1882533
6715 1882533 1450095 1700095 2144446 2358177 2457752 2152380 1388186 1392217 1935470 1801301
6705 1801301 1707507 2616173 2504697 3139247 2538882 2280392 2416302 3306621 2058369 1931999
6695 1931999 2547197 2428320 2086744 2439340 3041855 2095387 1733245 2822325 2816015 1934992
6685 1934992 2426046 2995859 3107973 3020605 2831417 3539031 2783778 2372878 2631098 2425295
6675 2425295 2636986 2176888 2635955 1966291 1878882 1797373 2044656 2525323 2967395 2608427
6665 2608427 2124616 1694702 1265730 1749369 1920278 2218177 2759714 2166897 2842380 3432596
$$ packed form
6735B674058o48337l58325k46865n88383Q73909L87211K23906q2790r888n89265
6725A635231o36378O61942J11991L37784J21814j82451K80722k67494J31789l12417
6715A882533m32438K50000M44351K13731R9575l05372p64194M031N43253j34169
6705A801301r3794R08666j11476O34550o00365k58490J35910Q90319j248252j26370
6695A931999O15198j18877l41576L52596O02515r46468l62142J089080o310q81023
6685A934992M91054N69813J12114q7368j89188P07614p55253m10900K58220k05803
6675B425295K11691m60098M59067o69664q7409q1509K47283M80667M42072l58968
6665B608427m83811m29914m28972M83639J70909K97899N41537n92817O75483N90216
$$ plain form
6655 3432596 2554332 2411806 2594848 2605333 2683925 2681027 2711606 3063412 3105157 3051196 3178833
6644 3178833 2710133 2822691 2443822 2456469 2530647 2224482 3223842 3527382 3689769 2901371
6634 2901371 2659076 2501471 3259126 3104163 3600127 3167797 2181024 2544017 3058400 2935643
6624 2935643 3333445 3447568 3306840 3452966 2933766 3112959 2835592 2368978 1991630 2445410
6614 2445410 3326078 3232200 3370988 3204063 3000696 3630770 2986168 2893694 3531749 3561472
6604 3561472 3116318 2196955 1952095 2771291 2271798 3220925 4238144 3974495 2952750
6595 2952750 2380566 3513542 3655980 2707595 3058067 3365493 3327120 4120765 4772074 5114995
6585 5114995 3994216 3835773 3683961 3567631 3852035 3081908 4022997 4204714 3927437
$$ packed form
6655C432596q78264j42526J83042J0485P8592k898L0579L51806M1745n3961J27637
6644C178833m68700J12558l78869J2647P4178l06165R99360L03540J62387p88398
6634B901371k42295j57605P57655j54963M95964m32330r86773L62993N14383j22757
6624B935643L97802J14123j40728J46126n19200J79193k77367m66614l77348M53780
6614B445410Q80668r3878J38788j66925k03367O30074o44602r2474O38055K9723
6604C561472m45154r19363k44860Q19196m99493R49127J017219k63649j021745
6595B952750n72184J132976J42438r48385L50472L07426l8373P93645O51309L42921
6585E114995j120779j58443j51812j16330K84404p70127R41089J81717k77277
$$ plain form
6576 3927437 3485011 3786788 4254515 3961834 4254208 4222975 3432961 3556542 4120693 3904512
6566 3904512 3694667 3447444 3762828 3525670 3495414 4152215 5003833 4422111 3696048 3122564
6556 3122564 3822704 4492974 4510235 4937245 4741680 4677775 4309737 4621207 3527378 3606444
6546 3606444 4750234 4865018 5081198 5351038 4858438 4870049 4429346 4823405 5323284 4497511
6536 4497511 4847614 4652033 4393776 3488799 4558622 4727447 4345240 4636854 4491070
6527 4491070 4412025 4502305 4288985 4871954 5026889 4606730 4678678 5034187 5471006 5281248
6517 5281248 5331301 3589840 4591224 5171219 4641097 5143303 5625499 5555131 5439813 5426654
6507 5426654 5027085 5144220 5423897 5523817 5209061 4612056 5271454 5152678 4724249 4536054
$$ packed form
6576C927437m42426L01777M67727k92681K92374l1233p90014J23581N64151k16181
6566C904512k09845k47223L15384k37158l0256O56801Q51618n81722p26063n73484
6556C122564P00140O70270J7261M27010j95565o3905l68038L11470j093829P9066
6546C606444J143790J14784K16180K69840m92600J1611m40703L94059M99879q25773
6536D497511L50103j95581k58257r04977J069823J68825l82207K91614j45784
6527D491070p9045R0280k13320N82969J54935m20159P1948L55509M36819j89758
6517E281248N0053j741461J001384N79995n30122N02206M82196p0368j15318j3159
6507E426654l99569J17135K79677R9920l14756n97005O59398j18776m28429j88195
$$ plain form
6497 4536054 4426338 4827599 5361612 5077121 5017948 5790424 6419633 6243931 6205486 6491451
6487 6491451 6582564 6288965 5522000 5682216 5210861 5866522 6484944 5254251 5306554 6055343
6477 6055343 5964453 6176318 5165660 5722833 6226164 5970803 5743005 5915158 5525986 5271406
6467 5271406 5272077 5948872 6177169 6474643 6379565 5775466 6733453 6104518 6214421 6216132 6503327
6456 6503327 6818119 6703648 7015640 7043177 7712839 7584584 6795834 6488464 6138219 6466113
6446 6466113 6658877 6886557 6681137 6661684 6092021 6279418 5997080 6146235 6236010 6028374
6436 6028374 6704015 6940486 6952714 6914247 6513477 7020741 7078059 7252230 7520973 7220921
6426 7220921 6801382 7235701 6955440 7481744 7824036 7264341 7819961 8158782 7560867 7613874
$$ packed form
6497D536054j09716M01261N34013k84491n9173P72476O29209j75702l8445K85965
6487F491451R1113k93599p66965J60216m71355O55661O18422j230693N2303P48789
6477F055343r0890K11865j010658N57173N03331k55361k27798J72153l89172k54580
6467E271406O71O76795K28297K97474r5078o04099R57987o28935J09903J711K87195
6456F503327L14792j14471L11992K7537O69662j28255p88750l07370l50245L27894
6446F466113J92764K27680k05420j9453n69663J87397k82338J49155Q9775k07636
6436F028374O75641K36471J2228l8467m00770N07264N7318J74171K68743l00052
6426G220921m19539M34319k80261N26304L42292n59695N55620L38821n97915N3007
$$ plain form
6416 7613874 7448500 7674863 7565763 7837888 7416537 6685632 7752701 7274457 6901776
6407 6901776 7385425 8172813 8104061 7470711 7844140 7997762 8176348 9475065 8062937
6398 8062937 8760843 9468239 9357151 8865636 8461439 7808304 8686786 8683566 8884363 8535077
6388 8535077 9837558 9210110 8496562 8941135 9301089 9055497 8532380 8583345 8836655 8529322
6378 8529322 9358876 8851412 7844313 7720419 8401148 9193660 8370201 8894423 9356849
6369 9356849 9802002 9889961 9705080 9617891 9748959 10101331 9799495 9835998 10056349 10693947
6359 10693947 10485856 9924512 10208008 9757090 10206073 9959274 10375174 10550256 10639356 10099332
6349 10099332 10579114 11052915 11015770 11006037 11273110 11031719 11106434 10600828 10409774 10973780
$$ packed form
6416G613874j65374K26363j09100K72125m21351p30905J067069m78244l72681
6407F901776M83649P87388o8752o33350L73429J53622J78586J298717j412128
6398H062937O97906P07396j11088m91515m04197o53135Q78482l220K00797l49286
6388H535077J302481o27448p13548M44573L59954k45592n23117N0965K53310l07333
6378H529322Q29554n07464j007099j23894O80729P92512q23459N24222M62426
6369I356849M45153Q7959j84881q7189J31068L52372l01836L6503K20351O37598
6359A0693947k08091n61344K83496m50918M48983k46799M15900J75082Q9100n40024
6349A0099332M79782M73801l7145r733K67073k41391P4715n05606j91054N64006
$$ plain form
6339 10973780 11393813 10946158 11063762 11414959 11311098 11689483 11697937 10973911 11264514 11425121
6329 11425121 11222281 11761459 12176497 11776164 11787729 11149621 11281312 12534543 12161069
6320 12161069 11723285 10913833 10238843 11215870 10850723 10770924 12000909 12035755 11821574 12416996
6310 12416996 12304588 12210109 11264904 12319556 12350770 12396378 12690416 12095016 11675650 11554579
6300 11554579 11775827 11689871 11343552 12162476 12800415 13141048 13542140 13343860 13317617 12807537
6290 12807537 12705439 13092559 13906870 13609527 13427850 13516525 13993773 14014468 13471919 13422528
6280 13422528 13345119 14085014 14539835 14427555 14247970 14194278 14739780 13991933 13988528 14737693
6270 14737693 14749619 14715396 14429270 14564787 14535252 14341394 15265991 15243598 15222575 14776239
$$ packed form
6339A0973780M20033m47655J17604L51197j03861L78385Q454p24026K90603J60607
6329A1425121k02840N39178M15038m00333J1565o38108J31691J253231l73474
6320A2161069m37784q09452o74990R77027l65147p9799J229985L4846k14181N95422
6310A2416996j12408r4479r45205J054652L1214M5608K94038n95400m19366j21071
6300A1554579K21248q5956l46319Q18924O37939L40633M01092j98280k6243n10080
6290A2807537j02098L87120Q14311k97343j81677Q8675M77248K0695n42549m9391
6280A3422528p7409P39895M54821j12280j79585n3692N45502p47847l405P49165
6270A4737693J1926l4223k86126J35517k9535j93858R24597k2393k1023m46336
$$ plain form
6260 14776239 14467403 14414730 14979518 15480262 14899988 15194322 14777893 15209464 15608567 15101854
6250 15101854 15309599 14487143 14618916 15198670 15416621 15718927 15859435 15456922 16075508
6241 16075508 16570165 16392631 15523462 15402003 16461785 16707628 16443078 16171951 16628622
6232 16628622 16576502 16629293 17430260 17232105 16625939 17318925 17289880 17607611 18484575 17298230
6222 17298230 16702639 16848076 17540216 18362476 17647659 17313760 17984560 17941964 18060707 18620470
6212 18620470 19115534 18951164 19407467 18952773 18812771 18145516 18424149 18615320 18714319 19008480
6202 19008480 19773891 19838274 19880092 20070115 19169465 19343958 19499366 20219456 20816830 21518099
6192 21518099 20994261 20202972 20993768 21620404 21967208 22187286 22147963 22291503 21909440 22544882
$$ packed form
6260A4776239l08836n2673N64788N00744n80274K94334m16429M31571L99103n06713
6250A5101854K07745q22456J31773N79754K17951L02306J40508m02513O18586
6241A6075508M94657j77534q69169j21459J059782K45843k64550k71127M56671
6232A6628622n2120N2791Q00967j98155o06166O92986k9045L17731Q76964j186345
6222A7298230n95591J45437O92140Q22260p14817l33899O70800m2596J18743N59763
6212A8620470M95064j64370M56303m54694j40002o67255K78633J91171R8999K94161
6202A9008480P65411O4383M1818J90023r00650J74493J55408P20090N97374P01269
6192B1518099n23838p91289P90796O26636L46804K20078l9323J43540l82063O35442
$$ plain form
6182 22544882 22274674 22447272 22642378 22608538 22026659 22597109 23154770 23354773 24106134 23386185
6172 23386185 23209855 23955565 24435461 24768900 24780687 24393433 24394620 25111787 24973852 24844946
6162 24844946 25118820 25573509 25759355 25713118 26750205 26661602 26420885 27257103 28068650 27859042
6152 27859042 28528997 29156624 28785245 28487369 28807779 28936201 29259303 29128487 29017635
6143 29017635 29777556 29439343 30437842 30974811 30825316 31548059 30994858 31303354 32308867
6134 32308867 32155526 32165591 33359710 34269340 35141342 36783137 37426642 38552214 39710173
6125 39710173 40215143 41061575 41846448 43045307 44470404 45297912 45632695 45725966 46702840
6116 46702840 47009977 45938727 45731568 45855776 46671911 46648900 47185592 47977905 47723643
$$ packed form
6182B2544882k70208J72598J95106l3840n81879N70450N57661K00003P51361p19949
6172B3386185j76330P45710M79896L33439J1787l87254J187P17167j37935j28906
6162B4844946K73874M54689J85846m6237J037087q8603k40717Q36218Q11547k09608
6152B7859042O69955O27627l71379k97876L20410J28422L23102j30816j10852
6143B9017635P59921l38213R98499N36969j49495P22743n53201L08496J005513
6134C2308867j53341J0065J194119R09630Q72002J641795O43505J125572J157959
6125C9710173N04970Q46432P84873J198859J425097Q27508L34783R3271R76874
6116D6702840L07137j071250k07159J24208Q16135k3011N36692P92313k54262
$$ plain form
6107 47723643 47395100 48262653 48261242 47239771 47269817 46882731 46412713 45953812 45171850 45065057
6097 45065057 44928053 44252750 43910593 42861850 41634994 40841765 40429815 39886943 39163055
6088 39163055 38618895 37305193 37287759 37082032 36212783 35715921 35054015 34894011 34311674
6079 34311674 35132503 34993629 34916969 34770225 34962558 35209193 35403907 35057944 35282951 36135728
6069 36135728 36723532 37183050 37391496 37639376 37787439 38314224 38601152 38649741 38379368 38219921
6059 38219921 36723841 35214346 34982803 34662998 34793469 33606380 32786119 31788667 31892446
6050 31892446 31453059 30803030 30268995 29957825 29439459 28258032 27975841 28146532 29107635
6041 29107635 28393374 28032421 27116308 26831731 27031779 27365567 27407619 27049526 27204758 26529150
$$ packed form
6107D7723643l28543Q67553j411j021471L0046l87086m70018m58901p81962j06793
6097D5065057j37004o75303l42157j048743j226856p93229m11950n42872p23888
6088C9163055n44160j313702j7434k05727q69249m96862o61906j60004n82337
6079C4311674Q20829j38874p6660j46744J92333K46635J94714l45963K25007Q52777
6069C6135728N87804M59518K08446K47880J48063N26785K86928M8589k70373j59447
6059C8219921j496080j509495k31543l19805J30471j187089q20261r97452J03779
6050C1892446m39387o50029n34035l11170n18366j181427k82191J70691R61103
6041B9107635p14261l60953r16113k84577K00048L33788M2052l58093J55232o75608
$$ plain form
6031 26529150 26688960 26350378 26254337 26448855 25808784 25988175 26127495 26633650 26316662 25960286
6021 25960286 26283738 25766336 25817653 26306591 26204678 26312211 26736808 26317633 26158397 26540779
6011 26540779 26230598 26592681 26309276 25751118 25252163 25424820 25817985 25897232 25485873 25362010
6001 25362010 25171541 24845043 24788844 24647021 24043469 22897765 23086828 22988490 22667046 22943442
5991 22943442 22727521 23266729 23473525 22626762 22283003 23138868 23336551 22897125 22581142
5982 22581142 22365606 21985700 21724135 22141479 21893459 21228235 21005193 20926818 21570087 20664369
5972 20664369 20159939 20664986 21182880 20837452 20669560 20076217 19807457 20700880 21055695
5963 21055695 20807058 20647651 20012140 20356366 19884347 19900929 20556470 19553689 19539547 19285768
$$ packed form
6031B6529150J59810l38582r6041J94518o40071J79391J39320N06155l16988l56376
6021B5960286L23452n17402N1317M88938j01913J07533M24597m19175j59236L82382
6011B6540779l10181L62083k83405n58158m98955J72657L93165P9247m11359j23863
6001B5362010j90469l26498n6199j41823o03552j145704J89063r8338l21444K76396
5991B2943442k15921N39208K06796q46763l43759Q55865J97683m39426l15983
5982B2581142k15536l79906k61565M17344k48020o65224k23042p8375O43269r05718
5972B0664369n04430N05047N17894l45428j67892n93343k68760Q93423L54815
5963B1055695k48637j59407o35511L44226m72019J6582O55541j002781j4142k53779
$$ plain form
5953 19285768 19247381 19557511 19257649 19349243 19238769 18734987 18849871 18921182 19419269 18331372
5943 18331372 18173789 18253705 18613394 18663229 18650437 18484681 18330821 17680845 17675954 17768475
5933 17768475 17320986 16762113 16169760 17300676 17270996 17794165 18021584 17715910 17233696
5924 17233696 17445334 17813774 16303039 15667063 16477882 16771874 16891731 16431507 16240462
5915 16240462 15521010 15310078 15447833 15341872 16155803 16645818 16849389 15532933 14915644
5906 14915644 15467886 15729636 15539612 14914710 15065719 14486181 13593508 14488935 14451412 14900495
5896 14900495 14553550 14229755 14663347 14612113 14993894 14725253 13870003 14299839 13183875
5887 13183875 13061187 13265989 13584690 13307308 13117881 13465366 13384432 13076648 13305644 13496499
$$ packed form
5953A9285768l8387L10130k99862R1594j10474n03782J14884P1311M98087j087897
5943A8331372j57583P9916L59689M9835j2792j65756j53860o49976m891R2521
5933A7768475m47489n58873n92353J130916k9680N23169K27419l05674m82214
5924A7233696K11638L68440j510735o35976Q10819K93992J19857m60224j91045
5915A6240462p19452k10932J37755j05961Q13931M90015K03571j316456o17289
5906A4915644N52242K61750j90024o24902J51009n79538q92673Q95427l7523M49083
5896A4900495l46945l23795M33592n1234L81781k68641q55250M29836j115964
5887A3183875j22688K04802L18701k77382j89427L47485q0934l07784K28996J90855
$$ plain form
5877 13496499 13169286 13365626 12247239 12113547 13296354 13457498 13285384 13188756 12611123
5868 12611123 12745281 11627860 11451166 11875415 11565785 11741535 11340228 12091027 12196430
5859 12196430 12346605 12832346 12743633 12286587 12024285 12025121 11378264 11713657 11241280 11374679
5849 11374679 11103641 11330727 11396924 11482228 11118941 10548500 10245625 11151816 11218818 10547453
5839 10547453 10449850 11273861 12211572 11656365 11358786 10810199 10390961 10224704 10688032 10759687
5829 10759687 10756320 10161091 9591724 9357970 9559402 9579478 9158507 9298466 9771291 10119814
5819 10119814 10101631 9959307 9447312 9560484 9336953 9393768 9404855 9682203 9818650 9667056
5809 9667056 9265499 10135547 10079189 9081809 9387307 9591759 9426143 9783679 9885741 9331676
$$ packed form
5877A3496499l27213J96340j118387j33692J182807J61144j72114r6628n77633
5868A2611123J34158j117421j76694M24249l09630J75750m01307P50799J05403
5859A2196430J50175M85741q8713m57046k62302Q36o46857L35393m72377J33399
5849A1374679k71038K27086O6197Q5304l63287n70441l02875R06191O7002o71365
5839A0547453r7603Q24011R37711n55207k97579n48587m19238j66257M63328P1655
5829A0759687l367n95229n69367k33754K01432K0076m20971J39959M72825L48523
5819A0119814j8183j42324n11995J13172k23531N6815J1087K77348J36447j51594
5809I667056m01557Q70048n6358r97380L05498K04452j65616L57536J02062n54065
$$ plain form
5799 9331676 8569470 8921196 8507504 7994464 8517461 9303111 9704256 9149522 9687829 9505039
5789 9505039 9587018 9149011 9305305 9181541 9254277 9170814 8790855 7634049 8216178 8375361
5779 8375361 7944548 8124637 7637781 8360312 7903345 7768487 8770293 9133490 9039616 9392868
5769 9392868 9536918 9424931 8514847 8677563 8515010 8328185 8066098 7594507 8038993 8232995
5759 8232995 8594779 9011872 8550266 8580218 8898110 9455430 9045402 8350847 7421974 8008574
5749 8008574 8327327 8036017 8163926 8340408 8265824 7636972 8059045 7443863 7775557 8192773
5739 8192773 7969333 8614532 8840303 9166725 9174558 8927328 8565992 8695594 9191360 8457271
5729 8457271 7916347 8031373 7363654 7545939 8370824 7805566 8000716 7768053 7807044 7944192
$$ packed form
5799I331676p62206L51726m13692n13040N22997P85650M01145n54734N38307j82790
5789I505039Q1979m38007J56294j23764P2736q3463l79959j156806N82129J59183
5779H375361m30813J80089m86856P22531m56967j34858J001806L63197r3874L53252
5769I392868J44050j11987r10084J62716j62553j86825k62087m71591M44486J94002
5759H232995L61784M17093m61606K9952L17892N57320m10028o94555r28873N86600
5749H008574L18753k91310J27909J76482p4584o28852M22073o15182L31694M17216
5739H192773k23440O45199K25771L26422P833k47230l61336J29602M95766p34089
5729H457271n40924J15026o67719J82285Q24885n65258J95150k32663L8991J37148
$$ plain form
5719 7944192 8636536 8279094 8393255 7485508 7933243 8996553 8181301 8054968 7836859
5710 7836859 7801077 8246612 7944215 7937215 7778632 7356945 7131901 8381293 8537474 8007687
5700 8007687 6771621 6751966 6810595 7470343 7955190 7634376 8038590 8729616 8734804 8368607
5690 8368607 8519347 8139360 7526134 7728385 7077809 7587628 8570219 8060401 7940791 7983770
5680 7983770 7599257 7995000 8275104 8354481 8983645 8569964 8178775 7940218 8570912 7983364
5670 7983364 7601603 7584263 8894776 8023119 8215818 7914664 8283354 8067347 7207428 6806653
5660 6806653 7771416 7839548 8534729 8678784 8771516 8579583 8410132 8093746 7623619 8108901
5650 8108901 8318471 8570063 8004367 8370058 8360484 8595049 8281887 8576934 8590602 8478775
$$ packed form
5719G944192O92344l57442J14161r07747M47735J063310q15252j26333k18109
5710G836859l5782M45535l02397p000j58583m21687k25044J249392J56181n29787
5700H007687j236066j9655N8629O59748M84847l20814M04214O91026N188l66197
5690H368607J50740l79987o13226K02251o50576N09819R82591n09818j19610M2979
5680G983770l84513L95743K80104P9377O29164m13681l91189k38557O30694n87548
5670G983364l81761j7340J310513q71657J92699l01154L68690k16007q59919m00775
5660F806653R64763O8132O95181J44055R2732j91933j69451l16386m70127M85282
5650H108901K09570K51592n65696L65691r574K34565l13162K95047J3668j11827
$$ plain form
5640 8478775 8411351 8339947 8119981 7836537 8542961 8025276 8020158 8311692 8418383 8428916
5630 8428916 8161271 8179727 8932932 8871867 8160702 6912842 6690763 7525917 8398273 8961667
5620 8961667 8029253 8238608 8980827 9121108 9191433 8869335 8821572 9332197 9363669 8875833
5610 8875833 8352031 8489384 9269930 9874066 10183414 9924883 9684475 9283919 8948055 8076154
5600 8076154 7711294 8649548 9904710 10523852 10084269 9675223 9172731 9405631 10088176
5591 10088176 10082693 9389529 9530943 10091754 10601133 10049910 10480450 10456717 9934746 9798343
5581 9798343 10250789 10700860 10289882 10750272 10712333 10395763 10501565 10928673 11729853 10723978
5571 10723978 10278559 10593106 11180141 11975192 11731303 10894057 12244779 12748003 12008898
$$ packed form
5640H478775o7424p1404k19966k83444P06424n17685n118K91534J06691J0533
5630H428916k67645J8456P53205o1065p11165j247860k22079Q35154Q72356N63394
5620H961667r32414K09355P42219J40281P0325l22098m7763N10625L1472m87836
5610H875833n23802J37353P80546O04136L09348k58531k40408m00556l35864q71901
5600H076154l64860R38254J255162O19142m39583m09046n02492K32900O82545
5591A0088176n483o93164J41414N60811N09379n51223M30540k3733n21971j36403
5581I798343M52446M50071m10978M60390l7939l16570J05802M27108Q01180j005875
5571A0723978m45419L14547N87035P95051k43889q37246J350722N03224p39105
$$ plain form
5562 12008898 12216151 12307508 12572270 13577637 13316114 11807084 12058989 11967543 11931467 12717072
5552 12717072 12747845 13454931 13132414 12912528 13134996 13666614 13975007 13937348 14062216 14895653
5542 14895653 14146498 14503514 14681178 14631551 14769008 15395716 14793369 15450548 15484316 14720532
5532 14720532 15292570 16172566 16536794 16036660 16513877 16956616 17202714 17264043 18011802 18966922
5522 18966922 19167659 18765802 18858419 18913863 19671752 20733728 20795611 20145315 21137888 21145324
5512 21145324 21044638 21706746 22126574 22966376 23560790 24474044 24497872 24076509 24674397 24916794
5502 24916794 25896306 26302168 27304132 27469015 27987366 27749152 28610404 28928190 28992012
5493 28992012 29793995 29778794 29810265 30096684 30671379 31120606 31316921 32047214 32047300 31241342
$$ packed form
5562A2008898K07253R1357K64762J005367k61523j509030K51905r1446l6076P85605
5552A2717072L0773P07086l22517k19886K22468N31618L08393l7659J24868Q33437
5542A4895653p49155L57016J77664m9627J37457O26708o02347O57179L3768p63784
5532A4720532N72038Q79996L64228n00134M77217M42739K46098O1329P47759R55120
5522A8966922K00737m01857R2617N5444P57889J061976O1883o50296R92573P436
5512B1145324j00686O62108M19828Q39802N94414R13254K3828m21363N97888K42397
5502B4916794R79512M05862J001964J64883N18351k38214Q61252L17786O3822
5493B8992012Q01983j5201L1471K86419N74695M49227J96315P30293Q6q05958
$$ plain form
5483 31241342 31754342 31328870 30544633 30421744 30659392 31771134 31446303 31299637 31466467
5474 31466467 31450426 30909938 30432118 30136438 30254238 30192626 29620734 29644818 30007362 30025003
5464 30025003 30005830 30350115 30195295 30230471 30804839 30998290 31420669 30032805 28746877
5455 28746877 28530859 28674837 29237684 29236626 28275491 28191034 26869234 26403845 26974571 27085883
5445 27085883 26232828 26282055 26382565 24973620 24530524 24634745 24297180 23809798 23093744
5436 23093744 22985620 23386273 22832306 23268226 22590551 21736202 22079955 22122736 21531237 21598630
5426 21598630 21791260 21115040 20283558 21226474 21313811 20995869 20375176 20128681 20282555 20082030
5416 20082030 20348310 21240695 20637586 20643383 21305262 21601902 20923960 20704960 20916330 21234660
$$ packed form
5483C1241342N13000m25472p84237j22889K37648J111742l24831j46666J66830
5474C1466467j6041n40488m77820k95680J17800o1612n71892K4084L62544J7641
5464C0025003j9173L44285j54820L5176N74368J93451M22379j387864j285928
5455B8746877k16018J43978N62847j058r61135q4457j321800m65389N70726J11312
5445B7085883q53055M9227J00510j408945m43096J04221l37565m87382p16054
5436B3093744j08124M00653n53967M35920o77675q54349L43753M2781n91499O7393
5426B1598630J92630o76220q31482R42916Q7337l17942o20693k46495J53874k00525
5416B0082030K66280Q92385o03109N797O61879K96640o77942k19000K11370L18330
$$ plain form
5406 21234660 21225871 21225988 21238822 20060704 19662782 19447112 19605895 20461205 20134418 20652408
5396 20652408 20557530 20276299 20088826 20080182 20236151 19308848 20050792 21303612 20672270 20246841
5386 20246841 20477798 21589632 21549358 21448613 21848161 21964114 22159507 22414312 21921914
5377 21921914 22281683 21966039 21430808 21680057 22556082 22596924 22232172 22156026 22471011 23009210
5367 23009210 22238440 23842512 23421952 24043764 24507016 24361189 24586343 24463525 24195991
5358 24195991 24427530 24628770 24501721 24721260 25085416 25106663 25144530 24818171 24427695 25140986
5348 25140986 24997533 25602329 24932643 25133918 26579349 26316876 26254942 26815432 27611075
5339 27611075 27396451 27130834 27482092 28037108 28174084 27686706 27958175 27939815 27918808 28255053
$$ packed form
5406B1234660q789J17J2834j178118l97922k15670J58783Q55310l26787N17990
5396B0652408r4878k81231j87473q644J55969r27303P41944J252820o31342m25429
5386B0246841K30957J111834m0274j00745L99548J15953J95393K54805m92398
5377B1921914L59769l15644n35231K49249Q76025M0842l64752p6146L14985N38199
5367B3009210p70770J604072m20560O21812M63252j45827K25154j22818k67534
5358B4195991K31539K01240j27049K19539L64156K1247L7867l26359l90476P13291
5348B5140986j43453O04796o69686K01275J445431k62473o1934N60490P95643
5339B7611075k14624k65617L51258N55016J36976m87378K71469j8360k1007L36245
$$ plain form
5329 28255053 28836437 29119181 29012349 30093125 30325239 29634285 30698654 30900821 30997870
5320 30997870 31142337 31991339 32540190 33158848 32531083 32230986 32872404 33083450 34659456
5311 34659456 33816742 34503401 35076280 35812686 36170762 36378981 36580356 35529222 35531364 36635461
5301 36635461 37412740 37245643 37754513 38963583 39067183 39424263 40319028 39888479 40146967
5292 40146967 41019530 42064089 41966418 42451997 42356528 43204770 44567691 44318848 45141999
5283 45141999 45832325 46460933 47135817 47720270 48562456 48368370 48083377 48808574 50206885
5274 50206885 50849014 50635398 51851966 52732352 53992442 54471103 54730555 55443214 55915008
5265 55915008 56076952 57216057 58630934 58656735 59067073 60413025 60849167 61959436 62414825
$$ packed form
5329B8255053N81384K82744j06832J080776K32114o90954J064369K02167R7049
5320C0997870J44467Q49002N48851O18658o27765l00097O41418K11046J576006
5311C4659456q42714O86659N72879P36406L58076K08219K01375j051134K142J104097
5301C6635461P77279j67097N08870J209070J03600L57080Q94765m30549K58488
5292D0146967Q72563J044559r7671M85579r5469Q48242J362921k48843Q23151
5283D5141999O90326O28608O74884N84453Q42186j94086k84993P25197J398311
5274E0206885O42129k13616J216568Q80386J260090M78661K59452P12659M71794
5265E5915008J61944J139105J414877K5801M10338J345952M36142J110269M55389
$$ plain form
5256 62414825 63539590 65009513 65669409 66424070 66936526 67656116 68541898 69394648 70284854
5247 70284854 72699353 73567515 74740470 75146005 76307110 77111194 77814642 79187499 80270654
5238 80270654 81590950 82831028 83767205 85414695 86883142 87956938 90720499 91596765
5230 91596765 93475298 94985780 95838935 97647906 100092120 101754056 103100381 104539922
5222 104539922 106860952 109584087 111546186 113365170 114607242 116440286 119111267 121725459
5214 121725459 123123735 124309190 127451444 130649972 132490517 134852440 136023025 139423488
5206 139423488 143122637 145721800 148001988 150422596 153630203 156685223 160564385 163014258
5198 163014258 166682727 170329311 174332379 177853593 181205404 184889390 188606626 192232596
$$ packed form
5256F2414825J124765J469923O59896P54661N12456P19590Q85782Q52750Q90206
5247G0284854K414499Q68162J172955M05535J161105Q04084P03448J372857J083155
5238H0270654J320296J240078R36177J647490J468447J073796K763561Q76266
5230I1596765J878533J510482Q53155J808971K444214J661936J346325J439541
5222A04539922K321030K723135J962099J818984J242072J833044K670981K614192
5214A21725459J398276J185455L142254L198528J840545K361923J170585L400463
5206A39423488L699149K599163K280188K420608L207607L055020L879162K449873
5198A63014258L668469L646584M003068L521214L351811L683986L717236L625970
$$ plain form
5190 192232596 196526692 202031356 205441249 209859535 215612472 220123564 223804736 228241445
5182 228241445 233653898 237995796 243020548 249086460 255508390 260471977 266072681 274121853
5174 274121853 279777290 285658558 291712498 297967884 304532445 312001112 319075646 325565216
5166 325565216 333078250 340925663 348843738 357248805 364801127 372414419 379833231 387733102
5158 387733102 396440214 404675827 412102603 420796761 429267040 437388353 445175642 452118800
5150 452118800 459824390 467714601 473649290 480818730 487071680 493302288 499234105 502980528
5142 502980528 507052333 511612572 515532884 518176204 520294388 521279328 522462075 521727895
5134 521727895 520895639 518843856 516441761 512794875 509241371 506189531 501351803 495242677
$$ packed form
5190A92232596M294096N504664L409893M418286N752937M511092L681172M436709
5182B28241445N412453M341898N024752O065912O421930M963587N600704Q049172
5174B74121853N655437N881268O053940O255386O564561P468667P074534O489570
5166C25565216P513034P847413P918075Q405067P552322P613292P418812P899871
5158C87733102Q707112Q235613P426776Q694158Q470279Q121313P787289O943158
5150D52118800P705590P890211N934689P169440O252950O230608N931817L746423
5142E02980528M071805M560239L920312K643320K118184R84940J182747p34180
5134E21727895q32256k051783k402095l646886l553504l051840m837728o109126
$$ plain form
5126 495242677 488943843 483124454 476343015 468766662 460972022 453787221 446079848 437056590
5118 437056590 428466765 419856026 410935519 401018871 393186935 384418657 375133708 366239591
5110 366239591 358209854 350047775 341072811 333110082 325291000 317413126 309040902 301258356
5102 301258356 293885084 286335884 278551679 271773484 265347941 258472927 251465444 245473972
5094 245473972 240081031 233425566 227449445 221730918 216691058 211334278 205418163 200648036
5086 200648036 195946905 191612976 186621041 182069658 177993921 173581186 170158771 166059023
5078 166059023 161075874 157432684 153382028 151176391 148231922 144666362 141623807 137989436
5070 137989436 133898639 130960255 128348402 124762046 123158676 120964357 117078579 114874422
$$ packed form
5126D95242677o298834n819389o781439p576353p794640p184801p707373r023258
5118D37056590q589825q610739q920507r916648p831936q768278r284949q894117
5110C66239591q029737q162079q974964p962729p819082p877874q372224p782546
5102C01258356p373272p549200p784205o778195o425543o875014p007483n991472
5094B45473972n392941o655465n976121n718527n039860n356780n916115m770127
5086B00648036m701131m333929m991935m551383m075737m412735l422415m099748
5078A66059023m983149l643190m050656k205637k944469l565560l042555l634371
5070A37989436m090797k938384k611853l586356j603370k194319l885778k204157
$$ plain form
5062 114874422 112051482 109421073 107289033 105236987 103805887 101622347 99580621 97360793
5054 97360793 95563752 93052675 90746955 89061318 87473989 86168505 83813684 82638797
5046 82638797 81159495 79386755 78579020 76998743 75080044 73638068 72010375 70238778
5038 70238778 69050225 68076792 67057788 66307449 65635808 63638817 62106071 61184534 60085599
5029 60085599 58095354 56962896 56864258 56777094 55888832 54309475 53226160 51883020 50789270
5020 50789270 50306323 50396128 49632530 48518312 47042341 46701765 45630601 43516551 43693939
5011 43693939 43110167 42540886 41625531 41450557 40753079 39482002 39418661 38992431 38597927
5002 38597927 38231235 37433435 36751265 36618791 36121385 35031223 34210303 33996882 33286642
$$ packed form
5062A14874422k822940k630409k132040k052046j431100k183540k041726k219828
5054I7360793j797041k511077k305720j685637j587329j305484k354821j174887
5046H2638797j479302j772740q07735j580277j918699j441976j627693j771597
5038G0238778j188553r73433j019004p50339o71641j996991j532746r21537j098935
5029F0085599j990245j132458r8638q7164q88262j579357j083315j343140j093750
5020E0789270m82947Q9805p63598j114218j475971l40576j071164k114050J77388
5011D3693939n83772n69281r15355j74974o97478j271077o3341m26230l94504
5002C8597927l66692p97800o82170j32474m97406j090162q20920k13421p10240
$$ plain form
4993 33286642 33480191 32397795 32370986 32867092 32116759 30957840 29819372 30111999 30071082
4984 30071082 29900708 29020907 28460919 27963762 27313760 26928099 25794990 25234627 25488307
4975 25488307 25250881 24618803 23892539 24264552 24545502 24875603 24970439 23815180 22768649
4966 22768649 22558673 22581297 22755308 22180278 21603350 21059314 22060386 23128682 21871859
4957 21871859 21253089 21421665 20681626 21169686 20527429 19791958 19862989 20632057 20066532 19469278
4947 19469278 19252756 18086914 18348458 18561900 18769018 18856992 18121731 17876084 18391537
4938 18391537 17766348 17339403 17962274 17547722 16085003 15694290 15614340 15516656 14815169 15231743
4928 15231743 15557016 14971081 14822890 15054801 14369682 15022166 14605084 13777940 13677573
$$ packed form
4993C3286642J93549j082396k6809M96106p50333j158919j138468K92627m0917
4984C0071082j70374q79801n59988m97157o50002l85661j133109n60363K53680
4975B5488307k37426o32078p26264L72013K80950L30101R4836j155259j046531
4966B2768649k09976K2624J74011n75030n76928n44036J001072J068296j256823
4957B1871859o18770J68576p40039M88060o42257p35471P1031P69068n65525n97254
4947A9469278k16522j165842K61544K13442K07118Q7974p35261k45647N15453
4938A8391537o25189m26945O22871m14552j462719l90713p9950r7684p01487M16574
4928A5231743L25273n85935j48191K31911o85119O52484m17082q27144j00367
$$ plain form
4919 13677573 13320160 13617158 13208678 13160157 13188647 12588645 12474580 12749417 13264814 13002953
4909 13002953 12755173 12052426 12106653 11897457 12027115 12640479 11695807 11541533 11862457 12035730
4899 12035730 11020764 10673478 10467340 10470078 10610200 9837607 10382268 10589452 10005731 9769537
4889 9769537 10026161 10010288 11228154 10911641 10282358 10187393 9578592 8987593 8426656 9353429
4879 9353429 9634884 9889194 10080816 9413182 8438055 8686823 8990210 9206636 9426957 8937227
4869 8937227 8276550 8013345 7809662 7435722 8365931 8836099 9220489 8957307 8154897 7945877
4859 7945877 8118570 8234369 8261617 8273808 7385298 7382302 7588285 7893581 8102994 9037565
4849 9037565 8930696 9090613 8681373 8094674 7673122 7332370 8061435 7815979 7135327 6682263
$$ packed form
4919A3677573l57413K96998m08480m8521K8490o00002j14065K74837N15397k61861
4909A3002953k47780p02747N4227k09196J29658O13364r44672j54274L20924J73273
4899A2035730j014966l47286k06138K738J40122p72593N44661K07184n83721k36194
4889I769537K56624j5873J217866l16513o29283r4965o08801n90999n60937R26773
4879I353429K81455K54310J91622o67634r75127K48768L03387K16426K20321m89730
4869H937227o60677k63205k03683l73940R30209M70168L84390k63182q02410k09020
4859G945877J72693J15799K7248J2191q88510k996K05983L05296K09413R34571
4849I037565j06869J59917m09240n86699m21552l40752P29065k45456o80652m53064
$$ plain form
4839 6682263 6529486 7174820 7611305 7572119 7427032 7163559 6803211 6778559 7560790 7804621
4829 7804621 7426520 7221632 6910166 5697970 6092017 7457620 7141970 7013230 6977878
4820 6977878 6878263 6504499 5626774 5649838 6286858 6525448 6183026 5694965 5100139 5484467
4810 5484467 5494209 5368578 5285814 5450672 5730369 5757520 6159660 5758966 5538252 6210976
4800 6210976 5774017 5672600 5362885 5598501 6171920 6283089 6719145 5645118 5273617
4791 5273617 5463048 5265081 5098669 4691668 5932898 5937049 5583912 6150612 5694547 6706768
4781 6706768 6364076 4578991 5856026 5953151 4667878 4690178 4815884 5125101 4504633
4772 4504633 4406172 4704310 5048298 5132432 4593858 4121473 4107282 4894838 5752796 5992712
$$ packed form
4839F682263j52777O45334M36485l9186j45087k63473l60348k4652P82231K43831
4829G804621l78101k04888l11466j212196L94047J365603l15650j28740l5352
4820F977878r9615l73764q77725K3064O37020K38590l42422m88061n94826L84328
4810E484467R742j25631q2764J64858K79697K7151M02140m00694k20714O72724
4800F210976m36959j01417l09715K35616N73419J11169M36056j074027l71501
4791E273617J89431j97967j66412m07001J241230M151l53137N66700m56065J012221
4781F706768l42692j785085J277035R7125j285273K2300J25706L09217o20468
4772D504633r8461K98138L43988Q4134n38574m72385j4191P87556Q57958K39916
$$ plain form
4762 5992712 6218107 5816948 4882874 4238580 4548333 4607798 4188146 4514313 4977902 4933520
4752 4933520 4757735 5285647 5575370 5213536 5586190 4940761 4645219 5144784 4635799 3475328
4742 3475328 3679590 4041146 3488782 4061792 4339219 4144727 4606900 4448515 4359620 3895421
4732 3895421 4232010 4986037 4807948 4973422 5210251 4302635 4328253 4989863 5792336 5258333
4722 5258333 5172500 5416378 4645550 5377240 4218050 4077304 4047961 3905528 3515930 4201978
4712 4201978 5154458 4758395 4449551 4438032 4839218 5056303 4068172 4070645 4329556 3723574
4702 3723574 3971088 3731452 3892392 3853133 3054511 3862053 3580893 3687613 3908591 3728435
4692 3728435 3778493 4012302 5050141 5163694 4588617 4419196 4391196 4166295 4616314 4311699
$$ packed form
4762E992712K25395m01159r34074o44294L09753N9465m19652L26167M63589m4382
4752D933520j75785N27912K89723l61834L72654o45429k95542M99565n08985j160471
4742C475328K04262L61556n52364N73010K77427j94492M62173j58385q8895m64199
4732C895421L36589P54027j78089J65474K36829r07616K5618O61610Q02473n34003
4722E258333q5833K43878p70828P31690j159190j40746k9343j42433l89598O86048
4712D201978R52480l96063l08844j1519M01186K17085r88131K473K58911o05982
4702C723574K47514k39636J60940l9259p98622Q07542k81160J06720K20978j80156
4692C728435N0058K33809J037839J13553n75077j69421k8000k24901M50019l04615
$$ plain form
4682 4311699 4299191 4771892 4797694 4818585 4743103 4208262 4573057 4484168 4365468 4791758
4672 4791758 5127259 4762663 4663781 4498821 4220056 4779984 4345282 3678799 3781229 3767214
4662 3767214 4062366 4528795 4036564 4371717 5111380 4616801 4348610 4041482 3822742 4612935
4652 4612935 4530622 3728586 4353703 4400278 3924115 4521142 4079162 4347071 4493445 3447182
4642 3447182 3624665 3759115 3205548 3577715 4272353 3628232 3503770 3463128 4199869 4665434
4632 4665434 4506040 4328087 4061744 3908374 4102084 4221787 4141186 4698165 5557272 4273922
4622 4273922 4478594 5056697 4360296 3470977 3945803 4323074 4008440 4089558 3108306 3634935
4612 3634935 3641117 3122398 3075294 3020984 3877125 4397378 4145705 4389989 4139606 4211188
$$ packed form
4682D311699j2508M72701K5802K0891p5482n34841L64795q8889j18700M26290
4672D791758L35501l64596r8882j64960k78765N59928m34702o66483J02430j4015
4662C767214K95152M66429m92231L35153P39663m94579k68191l07128k18740P90193
4652D612935q2313q02036O25117M6575m76163N97027m41980K67909J46374j046263
4642C447182J77483J34450n53567L72167O94638o44121j24462m0642P36741M65565
4632D665434j59394j77953k66343j53370J93710J19703q0601N56979Q59107j283350
4622D273922K04672N78103o96401q89319M74826L77271l14634Q1118r81252N26629
4612C634935O182n18719m7104n4310Q56141N20253k51673K44284k50383P1582
$$ plain form
4602 4211188 4044484 4456862 5391740 4726186 3273508 4502843 3794535 4761062 4610449
4593 4610449 4414377 4178768 3984874 4904425 4512275 4773166 4441829 3841741 4184040 3721031
4583 3721031 3341039 3998100 4616850 3863567 3519750 4412807 4328220 3998750 3569034 4350705
4573 4350705 3921001 4102928 4553100 4653673 4168958 3882289 4474944 4300417 4170457 3567979
4563 3567979 3993422 4294254 3507184 4014204 4490774 4413778 4165744 4369899 4075166 4239455
4553 4239455 4579879 4565764 3907282 4398061 3936459 3523732 4739778 5121418 5530815 4250930
4543 4250930 3975578 4528151 4716392 5264370 5551384 4814852 5005019 4303532 4707530 5189640
4533 5189640 5747995 6019198 6471538 6570058 5459072 5518223 4865610 4909961 4994398 4231618
$$ packed form
4602D211188j66704M12378R34878o65554j452678J229335p08308R66527j50613
4593D610449j96072k35609j93894R19551l92150K60891l31337o00088L42299m63009
4583C721031l79992O57061O18750p53283l43817Q93057q4587l29470m29716P81671
4573D350705m29704J81927M50172J00573m84715k86669N92655j74527j29960o02478
4563C567979M25443L00832p87070N07020M76570p6996k48034K04155k94733J64289
4553D239455L40424j4115o58482M90779m61602m12727J216046L81640M09397j279885
4543D250930k75352N52573J88241N47978K87014p36532J90167p01487M03998M82110
4533E189640N58355K71203M52340R8520j110986N9151o52613M4351Q4437p62780
$$ plain form
4523 4231618 4056408 4294215 5049707 4949725 4733889 5908172 5722824 6360201 5964139 6300852
4513 6300852 5397854 5532829 6227335 6990845 6768668 6018466 5256008 4968706 4848353 5636504
4503 5636504 5561046 5490341 5908274 6224619 6676143 7330166 6742850 6607706 6804105 7785376
4493 7785376 7877161 6840694 6167143 6427042 6428458 6093021 6548997 5931428 6268712 6651907
4483 6651907 6895438 7357150 7033313 7287493 7389425 7004654 6827079 6279704 6949183 6474470
4473 6474470 6142978 6453104 7538650 7135555 7046057 7074370 7874364 8628069 8821378 9132431
4463 9132431 8862732 8911845 9589551 9396126 8974207 8999179 9241434 8880855 9916527 10036514
4453 10036514 10218132 10834428 10594922 10720659 10790610 10894911 10216702 10261363 12322736 12403986
$$ packed form
4523D231618j75210K37807P55492r9982k15836J174283j85348O37377l96062L36713
4513F300852r02998J34975O94506P63510k22177p50202p62458k87302j20353P88151
4503E636504p5458p0705M17933L16345M51524O54023n87316j35144J96399R81271
4493G785376R1785j036467o73551K59899J416l35437M55976o17569L37284L83195
4483F651907K43531M61712l23837K54180J01932l84771j77575n47375O69479m74713
4473F474470l31492L10126J085546m03095q9498K8313P99994P53705J93309L11053
4463I132431k69699M9113O77706j93425m21919K4972K42255l60579J035672J19987
4453A0036514J81618O16296k39506J25737O9951J04301o78209M4661K061373Q1250
$$ plain form
4443 12403986 12401103 12606805 13380405 13800345 13749928 14271688 14477200 13762178 13711163 13301282
4433 13301282 13921124 15063995 15036465 15397371 16016359 16335959 16947346 18071712 18123296
4424 18123296 18171312 18635798 19207982 18843237 19610503 20663498 21219207 21074032 20701008
4415 20701008 21775940 23001100 24033160 24390730 24898625 25832489 26712497 26841022 27284589
4406 27284589 28054182 29333420 31057755 31743481 32781026 33917422 35535137 36655334
4398 36655334 37023066 38033201 40642252 42518227 44134517 46407925 48918456 51919755
4390 51919755 54267746 56930446 60767782 65063640 70567759 76192869 81933690 88808850
4382 88808850 95610457 102838997 109519534 115461260 120802009 125772612 133940759 141585750
$$ packed form
4443A2403986k883K05702P73600M19940n0417N21760K05512p15022n1015m09881
4433A3301282O19842J142871k7530L60906O18988L19600O11387J124366N1584
4424A8123296M8016M64486N72184l64745P67266J052995N55709j45175l73024
4415B0701008J074932J225160J032060L57570N07895R33864Q80008J28525M43567
4406B7284589P69593J279238J724335O85726J037545J136396J617715J120197
4398C6655334L67732J010135K609051J875975J616290K273408K510531L001299
4390E1919755K347991K662700L837336M295858N504119N625110N740821O875160
4382H8808850O801607P228540O680537N941726N340749M970603Q168147P644991
$$ plain form
4374 141585750 149575058 157735190 164774638 169457986 173910996 177292319 180256854 184337911
4366 184337911 188720559 193641862 197206126 199132702 197066980 192461042 187873376 182912702
4358 182912702 176921528 173364740 169946366 165489793 159905211 152526195 144329076 136181396
4350 136181396 127326098 120004723 114075194 108129530 101824589 94373720 87462066 80467275
4342 80467275 73608414 67305968 61928686 57600516 53132922 48783151 46668161 44032529
4334 44032529 41454288 38695323 36801509 34743527 32873941 31204301 29761737 29253426
4326 29253426 27766705 26593381 25897609 24779805 24290910 22739270 21612221 21733438 21134727
4317 21134727 20676205 19330321 18790369 18291109 17932524 17364667 17120057 16438531 15730927
$$ packed form
4374A41585750P989308Q160132P039448M683348M453010L381323K964535M081057
4366A84337911M382648M921303L564264J926576k065722m605938m587666m960674
4358A82912702n991174l556788l418374m456573n584582p379016q197119q147680
4350A36181396q855298p321375n929529n945664o304941p450869o911654o994791
4342H0467275o858861o302446n377282m328170m467594m349771k114990k635632
4334D4032529k578241k758965j893814k057982j869586j669640j442564n08311
4326B9253426j486721j173324o95772j117804m88895j551640j127049J21217n98711
4317B1134727m58522j345884n39952m99260l58585n67857k44610o81526p07604
$$ plain form
4308 15730927 14930158 14324216 14355661 14945049 14997592 14482272 14339939 13809255 13174058 12719607
4298 12719607 12712881 13312442 13049652 12579693 12224393 12488046 12037668 11105510 11320334 10876495
4288 10876495 10298514 9875321 9676781 9724226 9440015 10061444 9664640 9347396 9631432 9218524
4278 9218524 8751219 8393585 9166213 9725544 9343487 8813572 7973166 7846719 7941448 7340106
4268 7340106 8038055 8203378 9089939 8943286 9454564 8421931 7872860 7464133 7979179
4259 7979179 8651053 8455091 8815107 8221111 7303370 8036813 7459750 6191981 6880677
4250 6880677 7188725 7716114 7517179 7502491 7616852 7151904 6295639 6761253 6750617 7096446
4240 7096446 7563921 7951529 7864332 6840386 7580488 7420866 7050478 7323589 7401531 7667040
$$ packed form
4308A5730927q00769o05942L1445N89388N2543n15320j42333n30684o35197m54451
4298A2719607o726N99561k62790m69959l55300K63653m50378r32158K14824m43839
4288A0876495n77981m23193j98540M7445k84211O21429l96804l17244K84036m12908
4278I218524m67305l57634P72628N59331l82057n29915q40406j26447R4729o01342
4268G340106O97949J65323Q86561j46653N11278j032633n49071m08727N15046
4259G979179O71874j95962L60016n93996r17741P33443n77063j267769O88696
4250F880677L08048N27389j98935j4688J14361m64948q56265M65614j0636L45829
4240G096446M67475L87608q7197j023946P40102j59622l70388K73111P7942K65509
$$ plain form
4230 7667040 6749196 6855301 7201364 6860326 7451656 8132330 7496624 7426942 7294020 6840722
4220 6840722 6416365 6714485 6974539 8902415 8888209 7997024 8138760 7821791 7606015 6754269
4210 6754269 7199651 7329519 7154835 7665191 7828980 8165229 9231886 8978661 8659328
4201 8659328 8691718 7916645 8281942 7811494 8155376 8555670 8328330 8740644 9167909 9042244
4191 9042244 9059754 8864033 8856027 9137789 8261350 9447991 9308890 9131466 9908264 10138292
4181 10138292 10775078 10621371 11244583 10735428 10683527 10760284 10301818 9904754 10035198 10312642
4171 10312642 9892034 10269567 10479242 11048385 10633498 10865984 10611259 10810522 11341586
4162 11341586 11768432 13027833 12709676 12387228 12683726 12319476 12643511 12540164 12564348
$$ packed form
4230G667040r17844J06105L46063l41038N91330O80674o35706o9682j32922m53298
4220F840722m24357K98120K60054J927876j4206q91185J41736l16969k15776q51746
4210F754269M45382J29868j74684N10356J63789L36249J066657k53225l19333
4201H659328L2390p75073L65297m70448L43882M00294k27340M12314M27265j25665
4191I042244J7510j95721q006K81762q76439J186641j39101j77424P76798K30028
4181A0138292O36786j53707O23212n09155n1901P6757m58466l97064J30444K77444
4171A0312642m20608L77533K09675N69143m14887K32486k54725J99263N31064
4162A1341586M26846J259401l18157l22448K96498l64250L24035j03347K4184
$$ plain form
4153 12564348 13081614 12654145 12914940 12925117 13218577 13835408 15136554 14981213 14484791
4144 14484791 14779762 15317096 15722516 16153288 16580008 16370375 16496908 17578141 17073893
4135 17073893 17393941 17498648 17906975 17874864 18174139 19639792 20024783 20651497 19994669
4126 19994669 20084241 20611870 20573574 21260376 21979896 22404146 23302175 23094554 23624935 24384370
4116 24384370 24228320 24898480 26361551 27117444 27062398 27456128 28151300 29342962 30082947
4107 30082947 31170012 32238073 32302036 33656631 33998455 35129177 36007075 37454737 38852169
4098 38852169 39896144 41666526 42807412 44569975 45623855 46604000 47884886 49542485
4090 49542485 50421850 51114697 53104526 55619133 56392093 57403256 60092060 62198238 63731109
$$ packed form
4153A2564348N17266m27469K60795J0177K93460O16831J301146j55341m96422
4144A4484791K94971N37334M05420M30772M26720k09633J26533J081233n04248
4135A7073893L20048J04707M08327l2111K99275J465653L84991O26714o56828
4126A9994669Q9572N27629l8296O86802P19520M24250Q98029k07621N30381P59435
4116B4384370j56050O70160J463071P55893n5046L93730O95172J191662P39985
4107C0082947J087065J068061O3963J354595L41824J130722Q77898J447662J397432
4098C8852169J043975J770382J140886J762563J053880R80145J280886J657599
4090D9542485Q79365O92847J989829K514607P72960J011163K688804K106178J532871
$$ plain form
4081 63731109 65521775 68513743 70031512 72032667 72963976 75338511 77484010 79135867
4073 79135867 81136030 83164254 84997199 86522377 88636898 91104521 92835009 94134330
4065 94134330 95307581 96020816 96908322 98568287 99257727 99512128 101208042 101546590 102314568
4056 102314568 103065557 103240325 103954063 104257246 104581682 104233931 103088673 102853793 102845467
4047 102845467 102440150 101761130 100489388 99291116 97833480 97721474 96852424 95397910 94390956
4038 94390956 92437729 90706484 89851972 88859394 86742122 84748890 83889688 83195974 82225102
4029 82225102 81239488 80011221 78619998 77201915 76745148 75575311 75122317 74029756 73261097
4020 73261097 72370217 71211085 69863249 69860517 69935807 69526605 68915343 68517047 68523706 68049584
$$ packed form
4081F3731109J790666K991968J517769K001155R31309K374535K145499J651857
4073G9135867K000163K028224J832945J525178K114521K467623J730488J299321
4065I4134330J173251P13235Q87506J659965O89440K54401J695914L38548P67978
4056A02314568P50989J74768P13738L03183L24436l47751j145258k34880q326
4047A02845467m05317o79020j271742j198272j457636j12006q69050j454514j006954
4038I4390956j953227j731245q54512r92578k117272j993232q59202o93714r70872
4029H2225102r85614j228267j391223j418083m56767j169837m52994j092561p68659
4020G3261097q90880j159132j347836k732P5290m09202o11262l98296O659m74122
$$ plain form
4010 68049584 68487807 67886563 67495008 67848191 68306879 68851785 68898731 69965513 70322581
4001 70322581 70633455 70152580 70225783 70026382 70123308 69879648 70608099 71197807 71713206 72376108
3991 72376108 72549155 72853002 73321705 72886412 72114924 71746042 71474636 70503922 69448448
3982 69448448 68652253 67450627 65922976 63877671 63327266 62250990 60657499 59116199
3974 59116199 58377948 57867658 56635296 55248607 53988830 51334480 49846548 48660158
3966 48660158 47358593 46618993 45674698 44252042 43377990 42748817 41543381 39973308 38977014
3957 38977014 38458248 37364496 35874664 34900384 34554073 33936076 33778213 32958821 32107077
3948 32107077 31644204 30630947 31006951 30086029 29661939 29485471 29389809 29747093 28760599
$$ packed form
4010F8049584M38223o01244l91555L53183M58688N44906M6946J066782L57068
4001G0322581L10874m80875P3203j99401R6926k43660P28451N89708N15399O62902
3991G2376108J73047L03847M68703m35293p71488l68882k71406r70714j055474
3982F9448448p96195j201626j527651k045305n50405j076276j593491j541300
3974E9116199p38251n10290j232362j386689j259777k654350j487932j186390
3966D8660158j301565p39600r44295j422656q74052o29173j205436j570073r96294
3957C8977014n18766j093752j489832r74280l46311o17997j57863q19392q51744
3948C2107077m62873j013257L76004r20922m24090j76468r5662L57284r86494
$$ plain form
3939 28760599 27948995 27693422 27287888 27138916 26654287 26013849 25586428 25750680 26728076
3930 26728076 26535579 26143169 26371400 26502481 26889238 26539414 25635740 26003029 25554370
3921 25554370 25318972 25871029 26089629 26447078 25780335 26365262 27459412 27340301 27421328
3912 27421328 26739079 26849141 26514435 26607909 27308735 27272824 26771179 26976384 28277833 28189729
3902 28189729 28735607 28718419 28620553 29634235 30123864 29974144 29972226 31507050 32366922 32473503
3892 32473503 32527492 32079977 32482052 32554186 32658278 33642395 34411590 34237982 34003174 35025344
3882 35025344 36162665 36268583 37637215 38305909 38285500 39743729 39180662 39685711 41362575
3873 41362575 41517688 41115295 42246963 42836923 43320832 44533662 44890504 46068484 46045027
$$ packed form
3939B8760599q11604k55573m05534j48972m84629o40438m27421J64252R77396
3930B6728076j92497l92410K28231J31081L86757l49824r03674L67289m48659
3921B5554370k35398N52057K18600L57449o66743N84927J094150j19111Q1027
3912B7421328o82249J10062l34706R3474P00826l5911n01645K05205J301449q8104
3902B8189729N45878j7188r7866J013682M89629j49720j918J534824Q59872J06581
3892C2473503N3989m47515M02075P2134J04092R84117P69195j73608k34808J022170
3882C5025344J137321J05918J368632O68694k0409J458229n63067N05049J676864
3873D1362575J55113m02393J131668N89960M83909J212830L56842J177980k3457
$$ plain form
3864 46045027 46486015 47674065 48874976 49886320 50300614 51260435 52002428 52150058 52643214
3855 52643214 52892762 54164173 55943114 56090850 55949424 57106855 57830178 57818415 58478276
3846 58478276 60303497 61616353 62451984 63916656 64218001 65818080 67914710 67657548 67712866
3837 67712866 69402225 69533431 71013995 73123703 74062546 75678708 77616363 78224199 79983105
3828 79983105 82668249 83614603 85218318 87131444 89000272 91790050 93256242 94859243
3820 94859243 97210301 99435742 101732328 104410938 108197503 110317283 112693350 114971307
3812 114971307 117701345 120245596 122544552 125081061 128195761 130270698 132654659 136213728
3804 136213728 139284229 142288480 145030016 146979282 149641317 151978903 154059559 156067557
$$ packed form
3864D6045027M40988J188050J200911J011344M14294R59821P41993J47630M93156
3855E2643214K49548J271411J778941J47736j41426J157431P23323j1763O59861
3846E8478276J825221J312856Q35631J464672L01345J600079K096630k57162N5318
3837F7712866J689359J31206J480564K109708R38843J616162J937655O07836J758906
3828G9983105K685144R46354J603715J913126J868828K789778J466192J603001
3820I4859243K351058K225441K296586K678610L786565K119780K376067K277957
3812A14971307K730038K544251K298956K536509L114700K074937K383961L559069
3804A36213728L070501L004251K741536J949266K662035K337586K080656K007998
$$ plain form
3796 156067557 158134984 160259111 161843525 163863293 165550343 165505151 166326192 167007087 166505030
3787 166505030 167219267 167211936 166967936 167540704 167582026 166750455 167062151 165824715 165201187 164690949
3777 164690949 163021524 161548320 160540674 159661208 158022508 156623364 155453333 154427565
3769 154427565 153330751 152040388 149981704 147956075 146150573 145310739 144581568 142118067
3761 142118067 140307467 139152484 136864351 135064509 134293421 133332826 132285465 130899873
3753 130899873 128669883 126857204 125464560 123865124 122620285 120578992 120018268 118558443
3745 118558443 116895359 115113627 113973888 112344956 111250453 109807519 107864516 106972501
3737 106972501 105011634 103656069 102484255 101242846 99888176 98072397 96596858 95534107
$$ packed form
3796A56067557K067427K124127J584414K019768J687050m5192Q21041O80895n02057
3787A66505030P14237p331k44000N72768M1322q31571L11696j237436o23528n10238
3777A64690949j669425j473204j007646q79466j638700j399144j170031j025768
3769A54427565j096814j290363k058684k025629j805502q39834p29171k463501
3761A42118067j810600j154983k288133j799842p71088r60595j047361j385592
3753A30899873k229990j812679j392644j599436j244839k041293n60724j459825
3745A18558443j663084j781732j139739j628932j094503j442934j943003q92015
3737A06972501j960867j355565j171814j241409j354670j815779j475539j062751
$$ plain form
3729 95534107 94116124 92987413 91673873 89133414 88123603 87854920 86400387 85460807
3721 85460807 83455893 82050682 81122817 79691475 78436216 77408006 77373440 76370935 75095158
3712 75095158 73335599 72124589 70820012 69668057 69425524 68329168 67507826 66636176 66107857
3703 66107857 65605833 65349815 64423762 63410860 63105235 62697069 61783128 60113419 59333355
3694 59333355 59315657 59367647 59403567 58779579 59213345 58591006 58317411 58307886 58638102 58774078
3684 58774078 57881368 58254471 58779206 58374207 58548185 58961877 59096332 59072257 57948393
3675 57948393 58973988 60686210 61259392 60817500 60452295 61225963 61854947 62046936 63625823
3666 63625823 64417747 63657831 64006741 65152257 65472946 65671045 65771884 66174432 66673291
$$ packed form
3729I5534107j417983j128711j313540k540459j009811k68683j454533r39580
3721H5460807k004914j405211r27865j431342j255259j028210l4566j002505j275777
3712G5095158j759559j211010j304577j151955k42533j096356q21342q71650n28319
3703F6107857n02024k56018r26053j012902l05625m08166r13941j669709p80064
3694E9333355j7698N1990L5920o23988M33766o22339k73595r525L30216J35976
3684E8774078q92710L73103N24735m04999J73978M13692J34455k4075j123864
3675E7948393J025595J712222N73182m41892l65205P73668O28984J91989J578887
3666F3625823P91924p59916L48910J145516L20689J98099J00839M02548M98859
$$ plain form
3657 66673291 66319629 67396561 68384795 69996402 70852896 71116178 71651943 73026841 73014143
3648 73014143 73454929 75348996 76589700 77028854 77168194 78234648 79567710 81709016 84046597
3639 84046597 85583493 87422075 88752017 91124161 94155329 97672557 101014444 103666862
3631 103666862 107563242 110795762 114694092 119933377 124174292 128485570 133580904 137652399
3623 137652399 142936923 149098094 154476687 160401087 166140978 171877640 178293390 183313945
3615 183313945 189653549 194949422 199528695 204843898 209890205 215346537 219468049 223245771
3607 223245771 226721882 230316155 234026246 235790312 237675516 238201113 238752364 239313356
3599 239313356 238646948 238520638 237799107 236460980 234508858 230588701 226543164 223752465
$$ packed form
3657F6673291l53662J076932R88234J611607Q56494K63282N35765J374898j2698
3648G3014143M40786J894067J240704M39154J39340J066454J333062K141306K337581
3639H4046597J536896J838582J329942K372144L031168L517228L341887K652418
3631A03666862L896380L232520L898330N239285M240915M311278N095334M071495
3623A37652399N284524O161171N378593N924400N739891N736662O415750N020555
3615A83313945O339604N295873M579273N315203N046307N456332M121512L777722
3607B23245771L476111L594273L710091J764066J885204N25597N51251N60992
3599B39313356o66408j26310p21531j338127j952122l920157m045537k790699
$$ plain form
3591 223752465 219927563 216014782 211748873 207473832 202403726 196959531 191829903 186487394
3583 186487394 180950210 176188618 171058333 166194571 161450538 157588935 153835188 150026661
3575 150026661 146036426 142233575 138889967 135634350 132164459 128601682 126893302 125500725
3567 125500725 123782777 122158986 120110534 118518265 117084144 114923299 115383745 113890276
3559 113890276 112148141 110379710 109833525 109378095 108049483 106838149 106241011 105861735 104870236
3550 104870236 104349512 103392293 102447788 101345667 100243867 99047819 98901474 97774134 96801154
3541 96801154 96546000 96064282 95808792 95067068 93141137 92174864 91529231 90113792 89093964
3532 89093964 89286653 87651297 87134400 86113623 85394948 83959776 82239669 81047300 80270172
$$ packed form
3591B23752465l824902l912781m265909m275041n070106n444195n129628n342509
3583A86487394n537184m761592n130285m863762m744033l861603l753747l808527
3575A50026661l990235l802851l343608l255617l469891l562777j708380j392577
3567A25500725j717948j623791k048452j592269j434121k160845M60446j493469
3559A13890276j742135j768431n46185m55430j328612j211334n97138l79276r91499
3550A04870236n20724r57219r44505j102121j101800j196048j46345j127340r72980
3541I6801154k55154m81718k55490p41724j925931r66273o45633j415439j019828
3532H9093964J92689j635356n16897j020777p18675j435172j720107j192369p77128
$$ plain form
3523 80270172 79248544 76983608 75413327 73838485 73295987 72015486 69366557 66174285
3515 66174285 64232992 62042743 60857262 59271870 57496929 54467407 51834428 51228996
3507 51228996 50091879 47437878 45292556 43691429 42437197 41174099 39027571 37794513
3499 37794513 36488122 35410942 35283187 33895613 32572169 31405517 30860704 29022749
3491 29022749 28457050 27661945 27088402 27099919 26122239 25543081 25758053 25953195 26050136 24992345
3481 24992345 24049166 23919351 23832414 24051497 23256227 22986353 22847129 23113976 22538537 22265060
3471 22265060 22271016 22003880 21867915 21705427 21423849 21092034 19998183 20158582 18884998
3462 18884998 18986841 19488217 19187476 18330088 17882453 17075617 16904739 15845961 15368717
$$ packed form
3523H0270172j021628k264936j570281j574842n42498j280501k648929l192272
3515F6174285j941293k190249j185481j585392j774941l029522k632979o05432
3507E1228996j137117k654001k145322j601127j254232j263098k146528j233058
3499C7794513j306391j077180j27755j387574j323444j166652n44813j837955
3491B9022749n65699p95105n73543J1517r77680n79158K14972J95142R6941j057791
3481B4992345r43179j29815q6937K19083p95270k69874j39224K66847n75439k73477
3471B2265060N956k67136j35965j62488k81578l31815j093851J60399j273584
3462A8884998J01843N01376l00741q57388m47635q06836j70878j058778m77244
$$ plain form
3453 15368717 15550759 15214587 14450393 13994280 13079652 12155660 11822490 10666778 10506314
3444 10506314 10207056 10241761 10165115 9537535 8865106 8833263 7309756 6854594 6386151 7366908
3434 7366908 7046253 7766659 7492476 6609240 6131854 6295843 6572602 6439400 6685235 6199886
3424 6199886 5706002 5507795 5724074 5844739 5331553 4854332 4555375 3512852 3748643
3415 3748643 4021285 3347887 3392058 3194087 2737492 2986295 2980605 3349643 3508499 3683848
3405 3683848 2738259 1563399 2446749 3572689 2981871 2756461 2706805 2854935 2309710
3396 2309710 2535839 2827281 2133199 2131741 2262455 2402428 1920894 2170145 2641419 2094644
3386 2094644 2780566 2275276 2528502 2550189 2263999 2233875 2096750 1929736 2140413 1734678
$$ packed form
3453A5368717J82042l36172p64194m56113r14628r23992l33170j155712j60464
3444A0506314k99258L4705p6646o27580o72429l1843j523507m55162m68443R80757
3434G366908l20655P20406k74183q83236m77386J63989K76759j33202K45835m85349
3424F199886m93884j98207K16279J20665n13186m77221k98957j042523K35791
3415C748643K72642o73398M4171j97971m56595K48803n690L69038J58856J75349
3405C683848r45589j174860Q83350J125940n90818k25410m9656J48130n45225
3396B309710K26129K91442o94082j458J30714J39973m81534K49251M71274n46775
3386B094644O85922n05290K53226K1687k86190l0124j37125j67014K10677m05735
$$ plain form
3376 1734678 1461431 1402550 1471221 2467517 1820915 1236439 1777613 1729287 1381973 682671
3366 682671 623216 1376842 1738516 1573587 1965152 1389326 1066868 1108222 1314231 916719
3356 916719 61205 780418 1714406 1149520 936186 1345324 791182 1135176 1560475 1164797
3346 1164797 1097550 1394579 1397107 1485789 1477205 2176270 2057273 1725420 613671 836039
3336 836039 668741 533300 575248 636528 1194069 1876237 1478822 1157122 288747 563617
3326 563617 535809 644270 2100050 1980389 1841574 1783604 1642362 1120224 956249 1141813
3316 1141813 761145 958817 1598459 1903297 1932047 1830393 1679135 1609105 1616294 1233753
3306 1233753 806065 838786 1205083 909038 1124840 412464 245239 695145 891325 837202
$$ packed form
3376A734678k73247n8881O8671R96296o46602n84476N41174m8326l47314o99302
3366F82671n9455P53626L61674j64929L91565n75826l22458M1354K06009l97512
3356I16719q55514P19213R33988n64886k13334M09138n54142L43994M25299l95678
3346A164797o7247K97029K528Q8682q584O99065j18997l31853j111749K22368
3336H36039j67298j35441M1948O1280N57541O82168l97415l21700q68375K74870
3326E63617k7808J08461J455780j19661j38815n7970j41242n22138j63975J85564
3316A141813l80668J97672O39642L04838K8750j01654j51258p0030P189l82541
3306A233753m27688L2721L66297k96045K15802p12376j67225M49906J96180n4123
$$ plain form
3296 837202 353905 752760 662125 268107 816353 726511 553731 1138921 663368 401641
3286 401641 587409 795057 1241972 1307344 1442657 1567675 1630456 1089861 53385 -176774
3276 -176774 864964 761462 938126 603120 122493 409050 1086189 434489 -280530 677262
3266 677262 284117 554165 1336682 687248 1104572 1753797 871003 1090400 511642 1013467
3256 1013467 1989744 1083591 1087859 639510 265848 293419 66346 477505 444064 1121668
3246 1121668 1025221 522340 796507 1248000 1293287 959267 1147588 1522188 1532255 1312963
3236 1312963 1168744 1228421 770013 1041414 1351908 1446118 1737891 1897803 1329293 713318
3226 713318 1655255 2374854 1862477 1972020 1452539 1123509 1781162 1544026 881914 1249387
$$ packed form
3296H37202m83297L98855r0635l94018N48246q9842j72780N85190m75553k61727
3286D01641J85768K07648M46915O5372J35313J25018O2781n40595j036476k30159
3276a76774J041738j03502J76664l35006m80627K86557O77139o51700p15019R57792
3266F77262l93145K70048P82517o49434M17324O49225q82794K19397n78758N01825
3256A013467R76277r06153M268m48349l73662K7571k27073M11159l3441O77604
3246A121668r6447n02881K74167M51493M5287l34020J88321L74600J0067k19292
3236A312963j44219N9677m58408K71401L10494R4210K91773J59912n68510o15975
3226G13318R41937P19599n12377J09543n19481l29030O57653k37136o62112L67473
$$ plain form
3216 1249387 1882023 1874185 2334098 2702092 3037502 2874049 2598584 2457757 3582009 3250656
3206 3250656 2390387 2359522 1420151 1860024 1939254 1740128 1969182 1862495 1032447 916114
3196 916114 1505899 1767558 2139993 1512539 896809 678253 1535933 1317662 818224 959608
3186 959608 361181 731524 1788313 1400149 1367310 1223905 1033740 462302 11214 890390
3176 890390 890811 919700 1127573 1440499 1400613 367043 -65546 -719918 -405292 -226481
3166 -226481 -245022 512558 748939 1088168 1280527 688822 243969 1125535 1602817 648350
3156 648350 686033 328371 -263476 48206 77181 176414 46148 -303555 551811 306197
3146 306197 209321 1155765 947533 457899 191027 -357365 1020370 1814872 985448 422419
$$ packed form
3216A249387O32636p838M59913L67994L35410j63453k75465j40827J124252l31353
3206C250656q60269l0865r39371M39873P9230j99126K29054j06687q30048j16333
3196I16114N89785K61659L72435o27454o15730k18556Q57680k18271m99438J41384
3186I59608n98427L70343J056789l88164l2839j43405j90165n71438m51088Q79176
3176H90390M21K8889K07873L12926l9886j033570m32589o54372L14626J78811
3166b26481j8541P57580K36381L39229J92359n91705m44853Q81566M77282r54467
3156F48350L7683l57662n91847L11682K8975R9233j30266l49703Q55366k45614
3146C06197r6876R46444k08232m89634k66872n48392J377735P94502q29424n63029
$$ plain form
3136 422419 543011 1650148 2151735 1739236 1597181 1342458 1351434 1412092 742407 563919
3126 563919 707402 570260 71275 -118185 551500 248353 -126740 -232279 225463 75933
3116 75933 -428672 -417875 -886249 -343097 -126844 337612 454023 262702 -649773 -819897
3106 -819897 274367 720539 466926 247484 -363793 -15084 -1112809 -1494021 -477109
3097 -477109 -476518 -960659 -95247 -886424 -555045 -1034787 -944687 347826 452828 569164
3087 569164 34184 -933830 -681590 -684399 -1342184 -788489 -358857 -38363 -667366 -1148214
3077 -1148214 -1683044 -1715012 -1194436 -936595 -941584 -1107954 -1008566 -829901 -1247300 -1986174
3067 -1986174 -1611281 -445920 939990 306887 -247612 -179694 -18464 246069 349054
$$ packed form
3136D22419J20592J107137N01587m12499j42055k54723Q976O0658o69685j78488
3126E63919J43483j37142m98985j89460O69685l03147l75093j05539M57742j49530
3116G5933n04605J0797m68374N43152K16253M64456J16411j91321r12475j70124
3106h19897J094264M46172k53613k19442o11277L48709j097725l81212J016912
3097d77109N91m84141Q65412p91177L31379m79742R0100J292513J05002J16336
3087E69164n34980r68014K52240k809o57785N53695M29632L20494o29003m80848
3077a148214n34830l1968N20576K57841m989j66370R9388J78665m17399p38874
3067a986174L74893J165361J385910o33103n54499O7918J61230K64533J02985
$$ plain form
3058 349054 -6775 85309 677920 222077 -415314 -983647 -777533 -708137 -489998 -1263585
3048 -1263585 -1641059 -528916 335708 69335 -627721 -648143 -539473 -1259574 -1410087 -562885
3038 -562885 -167094 27728 -9936 -898607 -907605 -904263 -433251 -456529 -693650 -670019 -453824
3027 -453824 -621888 -883630 -924591 -707624 -93525 447437 -632305 -745040 -829511 41796
3017 41796 -332144 -136501 434309 -218030 204186 -31988 -119841 -121596 -517924 -514264 27069
3006 27069 -154328 -649648 -370759 -1372812 -578447 -555335 -625954 -550986 9051 -62328
2996 -62328 -198121 -87600 -110271 235582 -358151 75227 -291614 -849925 -189496 -291112
2986 -291112 -521387 -638504 -1181336 -1434370 -1581099 -755408 -561009 -598632 -707156 -855691
$$ packed form
3058C49054l55829R2084N92611m55843o37391n68333K06114O9396K18139p73587
3048a263585l77474J112143Q64624k66373o97056k0422J08670p20101j50513Q47202
3038e62885L95791J94822l7664q88671q998L342M71012k3278k37121K3631K16195
3027d53824j68064k61742m0961K16967O14099N40962j079742j12735q4471Q71307
3017D1796l73940J95643N70810o52339M22216k36174q7853j755l96328L660N41333
3006B7069j81397m95320K78889j002053P94365K3112p0619P4968N60037p1379
2996f2328j35793J10521k2671L45853n93733M33378l66841n58311O60429j01616
2986b91112k30275j17117n42832k53034j46729Q25691J94399l7623j08524j48535
$$ plain form
2976 -855691 -381191 15525 -972457 -999753 -672000 -473163 -1747821 -1024983 -800060 -676211
2966 -676211 -746808 -605150 -950929 -1076860 -1162275 -1294126 -568329 -81214 -963915 -1067442
2956 -1067442 -1218427 -1070520 -727430 -354903 -530758 -1188973 -1309300 -1234343 -399048 -271558
2946 -271558 -588623 -8498 61772 -605386 -755106 -1107827 -951619 -171648 -709845 -956857
2936 -956857 -17694 -365776 -525643 -83192 -1816 -361982 -907493 -1130800 -889393 -294436
2926 -294436 63024 25632 -523114 -241222 -174731 -457297 -196929 95219 259452 78292
2916 78292 -553173 -666200 -527950 -525707 -627075 -837120 329377 -713708 -956043 -1000997
2906 -1000997 -1250059 -695655 -584090 -429526 66043 43468 144157 215801 243202 894278
$$ packed form
2976h55691M74500L96716r87982k7296L27753J98837j274658P22838K24923J23849
2966f76211p0597J41658l45779j25931q5415j31851P25797M87115q82701j03527
2956a067442j50985J47907L43090L72527j75855o58215j20327P4957Q35295J27490
2946b71558l17065N80125P0270o67158j49720l52721J56208P79971n38197k47012
2936i56857R39163l48082j59867M42451Q1376l60166n45511k23307K41407N94957
2926b94436L57460l7392n48746K81892O6491k82566K60368K92148J64233j81160
2916G8292o31465j13027J38250K243j01368k10045J166497j043085k42335m4954
2906a000997k49062N54404J11565J54564M95569k2575J00689P1644K7401O51076
$$ plain form
2896 894278 186751 -286530 -55243 503324 -24177 -392222 60798 39778 230102 -61707
2886 -61707 -494096 83782 219531 -331947 -199488 176646 247577 466693 938484 31838
2876 31838 -124889 603004 724098 529420 464891 13885 327884 -436083 -494228 -1070351
2866 -1070351 -548663 -12630 517412 801846 185645 -917217 -457212 -805603 -1164472
2857 -1164472 -252586 -192913 59520 441152 -103985 -322181 -56892 205274 471031 393360
2847 393360 -4132 -191471 569304 261119 393311 -215113 -545284 -77072 652751 1555339
2837 1555339 1431384 415737 508630 -212841 -90840 -47487 713403 941298 321944 161524
2827 161524 159609 -84200 -1064703 -1772187 -1100173 -358811 -96961 433928 -91177 199352
$$ packed form
2896H94278p07527m73281K31287N58567n27501l68045M53020k1020J90324k91809
2886f1707m32389N77878J35749n51478J32459L76134P0931K19116M71791r06646
2876C1838j56727P27893J21094j94678o4529m51006L13999p63967n8145n76123
2866a070351N21688N36033N30042K84434o16201j102862M60005l48391l58869
2857a164472R11886N9673K52433L81632n45137k18196K65289K62166K65757p7671
2847C93360l97492j87339P60775l08185J32192o08424l30171M68212P29823R02588
2837A555339j23955j015647R2893p21471J22001M3353P60890K27895o19354j60420
2827A61524j915k43809r80503p07484O72014P41362K61850N30889n25105K90529
$$ plain form
2817 199352 -431001 -537412 106148 -200523 37703 -471868 -738375 -690575 -924711 -158044
2807 -158044 -302105 185193 9521 -248600 -196339 274792 538674 478915 897289 190868
2797 190868 -329634 -368527 -108401 85294 298121 -775251 -108350 -108861 -603367 96909
2787 96909 -478566 -488086 -592079 -869735 -291617 -638209 -394992 -492281 -2812 -775982
2777 -775982 -1015870 -327397 -601217 -613123 -556474 -453020 -741878 -952237 -520388 -832393
2767 -832393 -705905 -603787 -65736 -513422 -1038336 -970278 -408945 -680701 -1118848 -225904
2757 -225904 -126615 153268 -536930 -225541 99213 -819750 -924657 -164457 -675520 -403939
2747 -403939 36311 -1014644 -960061 -480960 -287704 -1149603 -854541 -624437 -1222826 -972447
$$ packed form
2817A99352o30353j06411O43560l06671K38226n09571k66507M7800k34136P66667
2807a58044j44061M87298j75672k58121N2261M71131K63882n9759M18374p06421
2797A90868n20502l8893K60126J93695K12827j073372O66901n11m94506P00276
2787I6909n75475r520j03993k77656N78118l46592K43217r7289M89469p73170
2777g75982k39888O88473k73820j1906N6649J03454k88858k10359M31849l12005
2767h32393J26488J02118N38051m47686n24914O8058N61333k71756m38147Q92944
2757b25904R9289K79883o90198L11389L24754r18963j04907P60200n11063K71581
2747d03939M40250j050955N4583M79101J93256q61899K95062K30104n98389K50379
$$ plain form
2737 -972447 -88919 512412 254710 -201897 -663235 -1087513 -1478333 -379305 -79477 -305298
2727 -305298 237055 466560 -232144 -472393 298344 -362473 -1278034 -1579706 -730278 -27990
2717 -27990 -169254 -186971 84399 -196778 -364524 -545427 -1221054 -1201862 -579118 -449962
2707 -449962 -452358 96258 -99813 337232 -295196 -634097 -725612 96989 -421701 -969770
2697 -969770 -325919 -493861 9518 -774975 -1685287 -1533014 -1025733 -1389707 -1056817 -610058
2687 -610058 128506 275967 -312692 141313 115895 -555578 -274061 -83707 -882128 -247573
2677 -247573 -547559 -61770 -719634 -253534 -590180 -750273 -487521 -871295 -988344 -661055
2667 -661055 -958868 -551872 -850364 -963433 -546920 -206242 -559016 -454757 -766033 -1419391
$$ packed form
2737i72447Q83528O01331k57702m56607m61338m24278l90820J099028K99828k25821
2727c05298N42353K29505o98704k40249P70737o60817r15561l01672Q49428P02288
2717b7990j41264j7717K71370k81177j67746j80903o75627J9192O22744J29156
2707d49962k396N48616j96071M37045o32428l38901r1515Q22601n18690n48069
2697i69770O43851j67942N03379p84493r10312J52273N07281l63974L32890M46759
2687f10058P38564J47461n88659M54005k5418o71473K81517J90354p98421O34555
2677b47573k99986M85789o57864M66100l36646j60093K62752l83774j17049L27289
2667f61055k97813M06996k98492j13069M16513L40678l52774J04259l11276o53358
$$ plain form
2657 -1419391 -1251470 -1148272 -1013471 -958989 -134169 96937 370518 207885 -196201 -286059
2647 -286059 -228239 74939 261699 -408315 -99936 -2222 93394 -328827 -1458187 -1320644
2637 -1320644 -1178427 -1834066 -1310022 -853252 -1273963 -743175 -783361 -1005586 -792464 -882786
2627 -882786 -1199142 -1324138 -170775 -813388 -420051 -545711 -995855 -1448059 -1753574 -1746499
2617 -1746499 -1202989 -1118471 -876834 -1623406 -907232 -294619 -886848 -782438 -430411 -557815
2607 -557815 -396817 -1090270 -855574 -597826 -734001 -774073 -85533 -253436 -477492 140567
2597 140567 364557 72617 -274989 62972 -695491 -430704 146160 216687 -380232 -170468
2587 -170468 -332596 -132449 -180374 -68861 685942 1002618 393800 36991 -940464 -1298345
$$ packed form
2657a419391J67921J03198J34801N4482Q24820K31106K73581j62633m04086q9858
2647b86059N7820L03178J86760o70014L08379R7714R5616m22221j129360J37543
2637a320644J42217o55639N24044M56770m20711N30788m0186k22225K13122r0322
2627h82786l16356j24996J153363o42613L93337j25660m50144m52204l05515P075
2617a746499N43510Q4518K41637p46572P16174O12613n92229J04410L52027j27404
2607e57815J60998o93453K34696K57748j36175m0072O88540j67903k24056O18059
2597A40567K23990k91940l47606L37961p58463K64787N76864P0527n96919K09764
2587a70468j62128K00147m7925J11513P54803L16676o08818l56809r77455l57881
$$ plain form
2577 -1298345 -1540509 -1203493 -553779 85181 362391 314 -362627 -935533 -1083899 171927
2567 171927 352416 141968 186127 -16036 -692146 -433358 -308840 -394177 195704 -444407
2557 -444407 -912326 -1066396 -1314600 -1472170 -815291 -482890 -1497925 -1515808 -333024 -838358
2547 -838358 -821299 -146102 -601793 -249078 -417917 62606 -292456 -426562 -11215 -303715
2537 -303715 -232249 -505056 41195 85350 121827 -294909 7033 -701565 -600490 11953
2527 11953 -693255 -952981 -917355 -957977 -1056951 -995317 -996239 -451638 345551 -682420 -838357
2516 -838357 -593900 -708813 -627950 -1044510 -1467702 -738594 -828745 -1412342 -2041369 -1964347
2506 -1964347 -1738188 -1116711 -189199 760547 43310 -193811 -1025301 -1583053 -516742
$$ packed form
2577a298345k42164L37016O49714O38960K77210l62077l62941n72906j48366J255826
2567A71927J80489k10448M4159k02163o76110K58788J24518q5337N89881o40111
2557d44407m67919j54070k48204j57570O56879L32401j015035j7883J182784n05334
2547h38358J7059O75197m55691L52715j68839M80523l55062j34106M15347k92500
2537c03715P1466k72807N46251M4155L6477m16736L01942p08598J01075O12443
2527A1953p05208k59726L5626m0622r8974O1634r22N44601P97189j027971j55937
2516h38357K44457j14913Q0863m16560m23192P29108r0151n83597o29027P7022
2506a964347K26159O21477R27512R49746p17237k37121q31490n57752J066311
$$ plain form
2497 -516742 -581417 -233265 -140220 -429746 -138223 -268844 366089 386441 -796124 -1603630
2487 -1603630 -1293251 -887299 -1004734 -500054 -1097332 -1011940 -1121068 -538786 297615 -99045
2477 -99045 -784398 -41302 -242779 -579041 -217286 -284795 -570085 -244833 -213284 -595820
2467 -595820 -761735 -503924 -303477 -727723 -531819 -738301 -848574 -367559 -257226 17109
2457 17109 -135511 -710390 -905527 249746 472299 256384 -297671 419573 256575 -869498
2447 -869498 -1722979 -1808235 -1410672 -720351 -963241 -1692163 -1466520 -999256 -834919 -1071068
2437 -1071068 -814315 -817459 -953567 -353263 -628404 8703 -392096 -731111 -134713 18018
$$ packed form
2497e16742o4675L48152R3045k89526K91523j30621O34933K0352j182565q07506
2487a603630L10379M05952j17435N04680n97278Q5392j09128N82282Q36401l96660
2477i9045o85353P43096k01477l36262L61755o7509k85290L25252L1549l82536
2467e95820j65915K57811K00447m24246J95904k06482j10273M81015J10333K74335
2457A7109j52620n74879j95137J155273K22553k15915n54055P17244j62998j126073
2447h69498q53481q5256L97563O90321k42890p28922K25643M67264J64337k36149
2437a071068K56753l144j36108O00304k75141O37107m00799l39015N96398J52731
$$ [...]
##END NTUPLES=NMR SPECTRUM
##END=
