##TITLE=1H_EC-3287(3-2)
 CDCl3
 8 sc, 
 14.12.2022
##JCAMPDX= 6.0         $$ Bruker NMR JCAMP-DX V2.0
##DATA TYPE= NMR SPECTRUM
##DATA CLASS= NTUPLES
##ORIGIN= UXNMR, Bruker Analytische Messtechnik GmbH
##OWNER= root
$$ XWIN-NMR		Version 3.5
$$ Wed Dec 14 14:03:18 2022 Russian Standard Time (UT+4h)  she@DPX200
##.OBSERVE FREQUENCY= 200.13135
##.OBSERVE NUCLEUS= ^1H
##.ACQUISITION MODE= SIMULTANEOUS
##.ACQUISITION SCHEME= undefined
##.AVERAGES= 8
##.DIGITISER RES= 18
##SPECTROMETER/DATA SYSTEM= spect
##.PULSE SEQUENCE= zg30
##.SOLVENT NAME= CDCl3
##.SHIFT REFERENCE= (INTERNAL, CDCl3, 0, 15.6433)
##AUDIT TRAIL= $$ (NUMBER, WHEN, WHO, WHERE, WHAT)
$$ ##TITLE= Audit trail, XWIN-NMR		Version 3.5
$$ ##JCAMPDX= 5.01
$$ ##ORIGIN= Bruker BioSpin GmbH
$$ ##OWNER= she
$$ F:/spectra/data/she/nmr/H-F/1/pdata/1/auditp.txt
$$ ##AUDIT TRAIL=  $$ (NUMBER, WHEN, WHO, WHERE, WHAT)
(   1,<2022-12-14 14:02:03.50 +0400>,<she>,<DPX200>,
      <created by zg, POWCHK disabled, PULCHK disabled
       configuration hash MD5:
       00 E9 B6 7A A2 85 ED C7 34 08 36 98 17 FE 4E 26
       data hash MD5: 16K
       42 41 86 29 36 F6 BA 37 A2 E0 2C 91 68 A7 EE 74>)
(   2,<2022-12-14 14:02:06.04 +0400>,<she>,<DPX200>,
      <Start of raw data processing
       efp BC_mod = 2 LB = 0.24 FT_mod = 6 PKNL = 1 PHC0 = -19114.09 PHC1 = 19.80072 SI = 16K 
       data hash MD5: 16K
       4B 87 C9 E1 EB 7F 52 D4 CE A7 7B 37 2B 1F EE E0>)
(   3,<2022-12-14 14:02:27.20 +0400>,<she>,<DPX200>,
      <pk PHC0 = 6.586892 PHC1 = -10.2 
       data hash MD5: 16K
       F1 F6 5B 81 2D 7A 5E 84 81 B9 44 5B F4 23 8D D9>)
(   4,<2022-12-14 14:02:29.68 +0400>,<she>,<DPX200>,
      <abs ABSG = 5 
       data hash MD5: 16K
       C3 FA 8A 85 04 E4 6D 09 CE 6F E8 D4 D0 30 8D AE>)
$$ ##END=
$$ 
$$ hash MD5
$$ 75 DC 1A 95 C2 CE 72 45 17 7B BB 8B 77 9C 26 36
##$RELAX= 
##$RELAX= 
##$RELAX= 
##$RELAX= 
##$RELAX= 
##$RELAX= 
$$ Bruker specific parameters
$$ --------------------------
##$DU= <F:/spectra>
##$EXPNO= 1
##$NAME= <H-F>
##$PROCNO= 1
##$TYPE= <nmr>
##$USER= <she>
##$AMP= (0..31)
100 100 100 100 100 100 100 100 100 100 100 100 100 100 100 100 100 100 
100 100 100 100 100 100 100 100 100 100 100 100 100 100 
##$AQSEQ= 0
##$AQ_mod= 1
##$AUNM= <au_zg>
##$AUTOPOS= <>
##$BF1= 200.13
##$BF2= 200.13
##$BF3= 200.13
##$BF4= 200.13
##$BF5= 200.13
##$BF6= 200.13
##$BF7= 200.13
##$BF8= 200.13
##$BYTORDA= 1
##$CFDGTYP= 0
##$CFRGTYP= 5
##$CHEMSTR= <none>
##$CNST= (0..31)
1 1 145 1 1 1 1 1 1 1 1 1 1 1 1 1 1 1 1 1 1 1 1 1 1 1 1 1 1 1 1 1 
##$CPDPRG= <>
##$CPDPRG1= <>
##$CPDPRG2= <>
##$CPDPRG3= <>
##$CPDPRG4= <mlev>
##$CPDPRG5= <mlev>
##$CPDPRG6= <mlev>
##$CPDPRG7= <mlev>
##$CPDPRG8= <mlev>
##$CPDPRGB= <>
##$CPDPRGT= <>
##$D= (0..31)
0 1.2 0 0 0 0 0 0 0 0.06 0 0.03 0 0 0 0 0.0002 0 0 0 0 0 0 0 0 0 0 0 0 
0 0 0 
##$DATE= 1671012123
##$DBL= (0..7)
120 120 120 120 120 120 120 120 
##$DBP= (0..7)
150 150 150 150 150 150 150 150 
##$DBP07= 0
##$DBPNAM0= <>
##$DBPNAM1= <>
##$DBPNAM2= <>
##$DBPNAM3= <>
##$DBPNAM4= <>
$$ [...]
##$SUBNAM3= <"">
##$SUBNAM4= <"">
##$SUBNAM5= <"">
##$SUBNAM6= <"">
##$SUBNAM7= <"">
##$SUBNAM8= <"">
##$SUBNAM9= <"">
##$SW= 18.05172834244
##$SWIBOX= (0..15)
0 0 2 0 0 0 0 0 0 0 0 0 0 0 0 0 
##$SW_h= 3612.71676300578
##$TD= 16384
##$TD0= 1
##$TE= 0
##$TE2= 300
##$TE3= 300
##$TEG= 300
##$TL= (0..7)
0 120 120 120 120 120 120 120 
##$TP= (0..7)
150 150 150 150 150 150 150 150 
##$TP07= 0
##$TPNAME0= <>
##$TPNAME1= <>
##$TPNAME2= <>
##$TPNAME3= <>
##$TPNAME4= <>
##$TPNAME5= <>
##$TPNAME6= <>
##$TPNAME7= <>
##$TPOAL= (0..7)
0.5 0.5 0.5 0.5 0.5 0.5 0.5 0.5 
##$TPOFFS= (0..7)
0 0 0 0 0 0 0 0 
##$TUNHIN= 0
##$TUNHOUT= 0
##$TUNXOUT= 0
##$USERA1= <user>
##$USERA2= <user>
##$USERA3= <user>
##$USERA4= <user>
##$USERA5= <user>
##$V9= 5
##$VALIST= <valist>
##$VCLIST= <CCCCCCCCCCCCCCC>
##$VD= 0
##$VDLIST= <DDDDDDDDDDDDDDD>
##$VPLIST= <PPPPPPPPPPPPPPP>
##$VTLIST= <TTTTTTTTTTTTTTT>
##$WBST= 1024
##$WBSW= 4
##$XGAIN= (0..3)
0 0 0 0 
##$XL= 0
##$YL= 0
##$YMAX_a= 753637
##$YMIN_a= -706996
##$ZGOPTNS= <>
##$ZL1= 120
##$ZL2= 120
##$ZL3= 120
##$ZL4= 120
##$ABSF1= 15.66646
##$ABSF2= -2.385387
##$ABSG= 5
##$ABSL= 3
##$ALPHA= 0
##$AQORDER= 0
##$ASSFAC= 0
##$ASSFACI= 0
##$ASSFACX= 0
##$ASSWID= 0
##$AUNMP= <proc_1d>
##$AZFE= 0.1
##$AZFW= 0.1
##$BCFW= 0
##$BC_mod= 2
##$BYTORDP= 0
##$COROFFS= 0
##$CY= -3
##$DATMOD= 1
##$DC= 0
##$DFILT= <>
##$DTYPP= 0
##$F1P= 0
##$F2P= 0
##$FCOR= 1
##$FTSIZE= 16384
##$FT_mod= 6
##$GAMMA= 0
##$GB= 0
##$INTBC= 1
##$INTSCL= 3.70164e-10
##$ISEN= 128
##$LB= 0.24
##$LEV0= 0
##$LPBIN= 0
##$MAXI= 10000
##$MC2= 0
##$MEAN= 0
##$ME_mod= 0
##$MI= 1.114404
##$NCOEF= 0
##$NC_proc= -5
##$NLEV= 6
##$NOISF1= 3.799351
##$NOISF2= 2.8
##$NSP= 0
##$NTH_PI= 0
##$NZP= 0
##$OFFSET= 15.64332
##$PC= 1
##$PHC0= -19107.5
##$PHC1= 9.60072
##$PH_mod= 1
##$PKNL= yes
##$PPARMOD= 0
##$PSCAL= 0
##$PSIGN= 0
##$REVERSE= no
##$SF= 200.130025661276
##$SI= 16384
##$SIGF1= 3
##$SIGF2= 2
##$SINO= 5.538805
##$SIOLD= 16384
##$SREGLST= <1H.CDCl3>
##$SSB= 0
##$STSI= 16384
##$STSR= 0
##$SW_p= 3612.71676300578
##$SYMM= 0
##$S_DEV= 0
##$TDeff= 16384
##$TDoff= 0
##$TI= <>
##$TILT= no
##$TM1= 0
##$TM2= 0
##$TOPLEV= 0
##$USERP1= <user>
##$USERP2= <user>
##$USERP3= <user>
##$USERP4= <user>
##$USERP5= <user>
##$WDW= 1
##$XDIM= 16384
##$YMAX_p= 425209872
##$YMIN_p= -592167
$$ End of Bruker specific parameters
$$ ---------------------------------
##NTUPLES= NMR SPECTRUM
##VAR_NAME=  FREQUENCY,     SPECTRUM/REAL,   SPECTRUM/IMAG
##SYMBOL=    X,             R,               I
##VAR_TYPE=  INDEPENDENT,   DEPENDENT,       DEPENDENT
##VAR_FORM=  AFFN,          ASDF,            ASDF
##VAR_DIM=   16384,         16384,           16384
##UNITS=     HZ,            ARBITRARY UNITS, ARBITRARY UNITS
##FACTOR=    0.220516191357247, 1,           1
##FIRST=     3130.69804976206, 0,            0
##LAST=      -482.018713243723, 0,           0
##MIN=       -482.018713243723, -592167,     0
##MAX=       3130.69804976206, 425209872,    0
$$ Real data points
##PAGE= N=1
##DATA TABLE= (X++(R..R)), XYDATA
$$ [...]
$$ plain form
6894 17847199 15884097 14163807 12680039 11472290 10539673 9720734 8956860 8373784 7870289
6885 7870289 7432870 7119096 6873892 6660773 6501514 6394097 6261762 6253602 6284859 6331500
6875 6331500 6452406 6638150 6808400 6976877 7299593 7653745 8020331 8179179 8182149 7942982
6865 7942982 7533771 7018771 6428495 5825601 5212149 4698924 4288254 3917882 3606301 3377577
6855 3377577 3168911 2980426 2782287 2584114 2439906 2307322 2250226 2157173 2037921 1950737
6845 1950737 1810787 1692527 1677228 1692560 1612264 1552545 1552373 1479911 1423057 1403284 1330690
6834 1330690 1328587 1279366 1216286 1183945 1182285 1115337 1096690 1091239 1025688 980961 915226 889839
6822 889839 829279 795844 818113 809237 761684 728131 763575 752202 697081 654793 698909 720494
$$ packed form
6894A7847199j963102j720290j483768j207749r32617q18939p63874n83076n03495
6885G870289m37419l13774k45204k13119j59259j07417j32335q160L1257M6641
6875F331500J20906J85744J70250J68477L22716L54152L66586J58848K970k39167
6865G942982m09211n15000n90276o02894o13452n13225m10670l70372l11581k28724
6855C377577k08666j88485j98139j98173j44208j32584n7096r3053j19252q7184
6845A950737j39950j18260j5299J5332q0296n9719j72p2462n6854j9773p2594
6834A330690k103m9221o3080l2341j660o6948j8647n451o5551m4727o5735k5387
6822H89839o0560l3435K2269q876m7553l3553L5444j1373n5121m2288M4116K1585
$$ plain form
6810 720494 726885 677052 594430 580979 622779 602821 556806 560511 604943 539886 530848 511189
6798 511189 520444 562401 558170 505174 491706 459379 430921 419712 422897 435448 439757 430910 424755
6785 424755 383781 376286 432649 329252 322914 358085 308438 260201 282083 299209 305152 269448
6773 269448 311625 291311 285680 275708 257755 260731 272477 233815 254763 317509 268775 230382
6761 230382 210554 196300 231809 181026 148058 180366 209023 229668 224609 218004 195526 191969
6749 191969 193685 174274 126632 125847 132552 148028 155455 167917 61073 46728 89795 110890
6737 110890 127605 91412 59027 91192 115844 79714 72224 66497 90532 80560 87544 93526 79421
6724 79421 93054 50092 103300 95342 67258 105451 68287 47257 61667 118493 106733 74960
$$ packed form
6810G20494O391m9833q2622j3451M1800j9958m6015L705M4432o5057r038j9659
6798E11189R255M1957m231n2996j3468l2327k8458j1209L185J2551M309q847o155
6785D24755m0974p495N6363j03397o338L5171m9647m8237K1882J7126N943l5704
6773B69448M2177k0314n631r972j7953K976J1746l8662K0948O2746m8734l8393
6761B30382j9828j4254L5509n0783l2968L2308K8657K0645n059o605k2478l557
6749A91969J716j9411m7642p85O705J5476P427J2462j06844j4345M3067K1095
6737A10890J6715l6193l2385L2165K4652l6130p490n727K4035r972O984N982j4105
6724G9421J3633m2962N3208p958k8084L8193l7164k1030J4410N6826j1760l1773
$$ plain form
6712 74960 59585 -1739 4754 9566 -6039 4956 48043 10089 -9867 -12424 -56061 -14228
6700 -14228 -8835 -3418 29021 28151 75696 42429 12496 21913 58567 74734 8077 -8468 14090
6687 14090 42572 31863 41064 51157 5168 -65179 -9200 -27540 -30263 10984 2847 9844 11183
6674 11183 -27150 -1221 5665 8541 2359 -17872 7563 10765 -371 -16354 -15677 -12431 -14307
6661 -14307 50009 -20 -22154 -8670 -32707 -43516 -42198 -39953 -9692 -150 -19565 -4519
6649 -4519 -49860 -12226 -39145 -15786 12922 -37142 22752 56877 35762 -4888 -4117 41612
6637 41612 34190 170 26629 55158 72420 55814 36505 37100 27686 57029 75949 93219 127664
6624 127664 116153 83554 19556 157 -21156 -75587 -30359 -9879 16161 2263 -51837 -49446
$$ packed form
6712G4960j5375o1324O493M812j5605J0995M3087l7954j9956k557m3637M1833
6700a4228N393N417L2439q70M7545l3267k9933R417L6654J6167o6657j6545K2558
6687A4090K8482j0709R201J0093m5989p0347N5979j8340k723M1247q137O997J339
6674A1183l8333K5929O886K876o182k0231K5435L202j1136j5983O77L246j876
6661a4307O4316n0029k2134J3484k4037j0809J318K245L0261R542j9415J5046
6649d519m5341L7634k6919K3359K8708n0064N9894L4125k1115m0650P71M5729
6637D1612p422l4020K6459K8529J7262j6606j9309N95r414K9343J8920J7270L4445
6624A27664j1511l2599o3998j9399k1313n4431M5228K0480K6040j3898n4100K391
$$ plain form
6612 -49446 -17098 6999 -24119 -29845 -25802 -32962 -44200 -16114 33007 85196 118388 105214
6600 105214 112058 80605 101769 120560 130194 85325 104427 131834 117068 125904 126981 54733
6588 54733 42515 30726 5642 50985 61278 94288 93846 54716 70250 37665 -48014 -49129
6576 -49129 -95208 -47103 33547 17356 19542 34010 13383 8658 8537 27320 47255 48085 77906
6563 77906 54911 52314 73151 41730 87851 143118 59969 48237 9470 -12432 -12537 -37101
6551 -37101 6361 -18947 9083 26713 -57372 -57283 -33666 -41448 -26918 2138 -40409 -52503 -23125
6538 -23125 -8094 -3741 -23389 -51691 -51313 -13025 27115 5568 -16158 14376 10216 -11508 -34962
6525 -34962 -32149 -8272 -17312 -55784 -34508 -57514 -46138 -21707 -52070 -38967 -34401 -28747 -71345
$$ packed form
6612d9446L2348K4097l1118n726M043p160j1238K8086M9121N2189L3192j3174
6600A05214O844l1453K1164J8791R634m4869J9102K7407j4766Q836J077p2248
6588E4733j2218j1789k5084M5343J0293L3010m42l9130J5534l2585q5679j115
6576d9129m6079M8105Q0650j6191K186J4468k0627m725j21J8783J9935Q30K9821
6563G7906k2995k597K0837l1421M6121N5267q3149j1732l8767k1902j05k4564
6551c7101M3462k5308K8030J7630q4085Q9K3617p782J4530K9056m2547j2094K9378
6538b3125J5031M353j9648k8302L78L8288M0140k1547k1726L0534m160k1724k3454
6525c4962K813K3877r040l8472K1276k3006J1376K4431l0363J3103M566N654m2598
$$ plain form
6512 -71345 -100331 -57754 -38020 -64602 -42363 -74487 -68549 -75033 -80310 -72895 -65782 -35436 -47093
6499 -47093 -30664 -70693 -118985 -62062 -37150 -58595 -50950 -83333 -63587 -48368 -29943 -44207
6487 -44207 -61719 -55846 -84534 -115340 -107222 -73323 -76970 -66116 -54575 -103741 -87492 -60591
6475 -60591 -64114 -41541 -26837 -29662 -60344 -58464 -26090 -51242 -98930 -48731 -4364 -82420
6463 -82420 -27817 -57802 -97066 -98901 -89060 -78927 -64572 -42749 -43601 -78366 -41914 -1328 -45493
6450 -45493 -18912 -39718 -65201 -30039 -24933 -44260 -43615 -90613 -45147 -29127 -54775 -69789
6438 -69789 -37828 -19909 -83170 -71846 -37512 -7567 -38781 -65591 -74346 -51368 -79590 -36347
6426 -36347 9857 10386 3271 -11373 -48853 -62475 -43138 -81808 -130067 -114933 -78510 -13964
$$ packed form
6512g1345k8986M2577J9734k6582K2239l2124N938o484n277P415P113L0346j1657
6499d7093J6429m0029m8292N6923K4912k1445P645l2383J9746J5219J8425j4264
6487d4207j7512N873k8688l0806Q118L3899l647J0854J1541m9166J6249K6901
6475f0591l523K2573J4704k825l0682J880L2374k5152m7688N0199M4367p8056
6463h2420N4603k9985l9264j835R841J0133J4355K1823q52l4765L6452M0586m4165
6450d5493K6581k0806k5483L5162N106j9327O45m6998M5466J6020k5648j5014
6438f9789L1961J7919o3261J1324L4334K9945l1214k6810q755K2978k8222M3243
6426c6347M6204N29p115j4644l7480j3622J9337l8670m8259J5134L6423O4546
$$ plain form
6414 -13964 -27714 -26033 -43534 -76443 -53884 -38111 -26257 -25768 2891 -36942 -58764 -29428
6402 -29428 -3787 -61293 -5116 -36595 -16085 -48169 -43837 -47306 -96600 -89893 -41866 -32570 -8130
6389 -8130 -22454 -70311 -40866 -55084 -51103 -22807 -45024 -65923 -96378 -37342 17748 -40915
6377 -40915 -49566 -45077 -56494 -5309 9746 -18630 -32328 -16442 -5395 -48348 -16587 -26381
6365 -26381 -10309 -15777 4283 -10336 -40696 -27291 -38912 -41850 -64703 -75913 -35135 -66825
6353 -66825 -62646 -39445 -29047 -9618 -37334 -16833 -21096 -1646 -33099 -48413 -26209 -32884
6341 -32884 4801 17776 14615 -9654 217 -6223 -35676 -13392 40765 61763 9465 25263
6329 25263 -20931 -54391 -27744 -37589 -53453 -63767 -4431 -47801 -35022 -43433 -48184 9780
$$ packed form
6414a3964j3750J681j7501l2909K2559J5773J1854M89K8659l9833k1822K9336
6402b9428K5641n7506N6177l1479K0510l2084M332l469m9294O707M8027R296K4440
6389h130j4324m7857K9445j4218L981K8296k2217k0899l0455N9036N5090n8663
6377d0915q651M489j1417N1185J5055k8376j3698J5886J1047m2953L1761r794
6365b6381J6072n468K0060j4619l0360J3405j1621k938k2853j1210M0778l1690
6353f6825M179K3201J0398J9429k7716K0501m263J9450l1453j5314K2204o675
6341c2884L7685J2975l161k4269R871o440k9453K2284N4157K0998n2298J5798
6329B5263m6194l3460K6647r845j5864j0314N9336m3370J2779q411m751N7964
$$ plain form
6317 9780 12550 -331 8473 -111 -42058 358 26817 9269 -18554 -25063 9818 46004 44543
6304 44543 35007 16176 -18837 -24657 11189 412 13880 -31003 11745 55799 77948 55082
6292 55082 30387 32888 20383 4856 -16934 9934 -25556 -4478 1617 -10928 -21461 -34197
6280 -34197 -65430 -39955 -32269 -7189 -4128 -38251 2044 -60053 -36780 22443 -7472 -8270 -9315
6267 -9315 -13118 -19923 15062 12052 -15492 15641 -38049 -54728 25269 54077 55575 42456 67143
6254 67143 -4249 -6411 9639 -6137 28071 -16980 -48901 -30089 -30682 -31674 -45471 -56250 791
6241 791 -5232 -38142 14176 13471 22801 25653 30682 20556 1630 10863 57878 32168 -2160 -26374
6227 -26374 16113 -4639 -27830 6157 24383 -25215 -45301 1215 16353 22081 -33092 -59061
$$ packed form
6317I780K770j2881Q804q584m1947M2416K6459j7548k7823o509L4881L6186j461
6304D4543r536j8831l5013n820L5846j0777J3468m4883M2748M4054K2149k2866
6292E5082k4695K501j2505j5527k1790K6868l5490K1078O095j2545j0533j2736
6280c4197l1233K5475P686K5080L061l4123M0295o2097K3273N9223k9915p98j045
6267i315l803o805L4985l010k7544L1133n3690j6679P9997K8808J498j3119K4687
6254F7143p1392k162J6050j5776L4208m5051l1921J8812n93r92j3797j0779N7041
6241G91o023l2910N2318p05R330K852N029j0126j8926R233M7015k5710l4328k4214
6227b6374M2487k0752k3191L3987J8226m9598k0086M6516J5138N728n5173k5969
$$ plain form
6215 -59061 -17386 -8503 -39490 -31767 -22249 16239 18938 50472 49475 61248 41681 34565 31717
6202 31717 71067 53926 36829 50238 84856 73450 69141 112953 94731 50336 23091 45980
6190 45980 63318 14149 29944 79986 80053 88572 80509 67677 84303 77893 100434 97153 77429
6177 77429 64875 96636 182826 161466 137678 135458 119158 163171 219386 164442 141939 230608
6165 230608 285975 280363 264492 271398 302405 311814 301737 275325 279484 237937 261675 250503
6153 250503 240161 248683 190019 173140 228116 239727 261449 233390 226956 273824 318403 321325
6141 321325 282836 344514 392383 388442 379381 444309 489692 493597 530175 530532 497117 476088 549016
6128 549016 536904 522087 490868 425585 474430 467695 433847 367530 322716 326420 401223 404554
$$ packed form
6215e9061M1675Q883l0987P723R518L8488K699L1534r97J1773j9567p116k848
6202C1717L9350j7141j7097J3409L4618j1406m309M3812j8222m4395k7245K2889
6190D5980J7338m9169J5795N0042O7Q519q063j2832J6626o410K2541l281j9724
6177G7429j2554L1761Q6190k1360k3788k220j6300M4013N6215n4944k2503Q8669
6165B30608N5367n612j5871O906L1007R409j0077k6412M159m1547K3738j1172
6153B50503j0342Q522n8664j6879N4976J1611K1722k8059o434M6868M4579K922
6141C21325l8489O1678M7869l941r061O4928M5383L905L6578L57l3415k1029P2928
6128E49016j2112j4817l1219o5283M8845o735l3848o6317m4814L704P4803L331
$$ plain form
6116 404554 382869 343567 317325 327015 317013 386539 362254 346574 367700 371934 441428 441027
6104 441027 432077 482548 468024 436024 480427 506550 552233 551581 548196 518339 502937 491289
6092 491289 493129 436826 407581 439258 418343 429216 446780 432643 412978 384521 364213 379169
6080 379169 416467 367035 394405 423393 393224 380101 382120 421543 422600 457372 426817 400025
6068 400025 391208 455343 470279 423485 433742 462157 497555 486418 504617 505729 523058 505966
6056 505966 474594 485376 452199 507156 521081 550610 537011 531679 579069 606500 617416 632839
6044 632839 676446 726109 735743 736612 752356 761271 777722 778554 757540 731715 692454 721546 761435
6031 761435 753596 769575 764528 751803 717315 717180 714036 781693 750943 773805 778665 863954 856725
$$ packed form
6116D04554k1685l9302k6242R690j0002O9526k4285j5680K1126M234O9494m01
6104D41027q950N0471j4524l2000M4403K6123M5683o52l385k9857j5402j1648
6092D91289J840n6303k9245L1677k0915J0873J7564j4137j9665k8457k0308J4956
6080C79169L7298m9432K7370K8988l0169j3123K019L9423J057L4772l0555k6792
6068D00025q817O4135J4936m6794J0257K8415L5398j1137J8199J112J7329j7092
6056E05966l1372J0782l3177N4957J3925K9529j3599n332M7390K7431J0916J5423
6044F32839M3607M9663R634Q69J5744Q915J6451Q32k1014k5825l9261K9092L9889
6031G61435p839J5979n047j2725l4488j35l144O7657l0750K2862M860Q5289p229
$$ plain form
6018 856725 806602 845747 857063 870363 933392 1017850 1030474 1066329 1069314 1108079 1133425 1126020
6006 1126020 1077327 1042086 1073973 1078097 1082898 1090447 1061392 1085066 1025655 1026271 1022490 1012155 994581
5993 994581 1009866 1002611 991457 1029011 1023584 1005747 1032605 1052848 1068558 1080490 1112667 1129436
5981 1129436 1141453 1169462 1175565 1210270 1234836 1231684 1239474 1207534 1208734 1210526 1200702 1214419 1249759
5968 1249759 1312864 1326342 1300128 1283122 1270056 1304191 1303571 1345703 1336261 1337704 1335827 1349307
5956 1349307 1368501 1420042 1451652 1447839 1448067 1488344 1548936 1560565 1519413 1545320 1578069 1578495
5944 1578495 1614072 1659489 1674949 1703441 1760963 1783330 1835286 1873155 1966793 2013876 2026999
5933 2026999 2046115 2087289 2133940 2142874 2197731 2294193 2313678 2334485 2353319 2459474 2460062 2475501
$$ packed form
6018H56725n0123L9145J1316J3300O3029Q4458J2624L5855K985L8765K5346p405
6006A126020m8693l5241L1887M124M801P549k9055K3674n9411O16l781j0335j7574
5993I94581J5285p255j1154L7554n427j7837K6858K0243J5710J1932L2177J6769
5981A129436J2017K8009O103L4705K4566l152P790l1940J200J792r824J3717L5340
5968A249759O3105J3478k6214j7006j3066L4135o20M2132r442J443j877J3480
5956A349307J9194N1541L1610l813K28M0277O0592J1629m1152K5907L2749M26
5944A578495L5577M5417J5460K8492N7522K2367N1956L7869R3638M7083J3123
5933B026999J9116M1174M6651Q934N4857R6462J9485K0807J8834J06155N88J5439
$$ plain form
5921 2475501 2563783 2592066 2620914 2639835 2700512 2777656 2879147 2977656 3051403 3107692 3156239
5910 3156239 3272888 3350832 3442027 3553502 3672421 3768868 3865682 3979773 4055315 4138690 4260783
5899 4260783 4338942 4487071 4573987 4663554 4739139 4847279 4974850 5136284 5231903 5298511 5448804
5888 5448804 5612052 5732691 5912238 6114628 6249390 6409571 6644046 6933600 7171251 7448154
5878 7448154 7722163 7970145 8259570 8577534 8967379 9296519 9711267 10027094 10449486 10892072
5868 10892072 11346095 11909306 12485993 13145066 13854513 14678651 15543222 16590489 17757095
5859 17757095 19128034 20680738 22451357 24478839 26878825 29603661 32618161 35690872
5851 35690872 38487215 40574557 41500716 41357249 40681532 39842846 39048045 38314860 37545962
$$ packed form
5921B475501Q8282K8283K8848J8921O0677P7144J01491R8509P3747N6289M8547
5910C156239J16649P7944R1195J11475J18919R6447R6814J14091P5542Q3375J22093
5899D260783P8159J48129Q6916Q9567P5585J08140J27571J61434R5619O6608J50293
5888E448804J63248J20639J79547K02390J34762J60181K34475K89554K37651K76903
5878G448154K74009K47982K89425L17964L89845L29140M14748L15827M22392M42586
5868A0892072M54023N63211N76687O59073P09447Q24138Q64571J047267J166606
5859A7757095J370939J552704J770619K027482K399986K724836L014500L072711
5851C5690872K796343K087342R26159j43467o75717q38686p94801p33185p68898
$$ plain form
5842 37545962 36713515 35684025 34603160 33548912 32584219 31913775 31582454 31634407 31984985
5833 31984985 32643684 33671898 35131700 37000606 39358346 42086934 45288667 48803595
5825 48803595 52492041 56084137 59512146 62947002 66599439 70820985 75408870 79752372
5817 79752372 82650944 83010565 80720031 76570417 71541770 66379274 61478534 56980378
5809 56980378 52831479 49061285 45545598 42373874 39667709 37352792 35459335 34106052
5801 34106052 33152529 32584730 32319578 32433105 32936600 33828775 35091010 36666943 38589949
5792 38589949 40723938 42913508 44823437 46495630 47919565 49379170 50956365 52526795
5784 52526795 53353664 52849990 50732863 47351795 43309552 39122726 35043434 31387853
$$ packed form
5842C7545962q32447j029490j080865j054248r64693o70444l31321N1953L50578
5833C1984985O58699J028214J459802J868906K357740K728588L201733L514928
5825D8803595L688446L592096L428009L434856L652437M221546M587885M343502
5817G9752372K898572L59621k290534m149614n028647n162496m900740m498156
5809E6980378m148899l770194l515687l171724k706165k314917j893457j353283
5801C4106052r53523n67799k65152J13527N03495Q92175J262235J575933J923006
5792C8589949K133989K189570J909929J672193J423935J459605J577195J570430
5784E2526795Q26869n03674k117127l381068m042243m186826m079292l655581
$$ plain form
5776 31387853 28195448 25488625 23247001 21377409 19806039 18461840 17307852 16299193
5768 16299193 15477996 14784653 14164962 13577675 13138834 12760491 12406654 12050409 11732713
5759 11732713 11459072 11268992 11048176 10901122 10792696 10636805 10520154 10452985 10329128 10223136
5749 10223136 10150947 10119144 10088777 10046820 10020725 9976587 9938534 9935940 9949634 9985711 10047532
5738 10047532 10161774 10332378 10491035 10689732 10815026 11054671 11332367 11605685 11864014
5729 11864014 12169242 12478887 12824456 13218090 13589191 13990628 14421908 15007163 15612138
5720 15612138 16251336 17011031 17830704 18721249 19794639 20982922 22411867 24085128 26002313
5711 26002313 28150835 30661098 33591409 37013045 40907999 45225854 49669583 53542189
$$ packed form
5776C1387853l192405k706823k241624j869592j571370j344199j153988j008659
5768A6299193q21197o93343o19691n87287m38841l78343l53837l56245l17696
5759A1732713k73641j90080k20816j47054j08426j55891j16651o7169j23857j05992
5749A0223136p2189l1803l0367m1957k6095m4138l8053k594J3694L6077O1821
5738A0047532J14242J70604J58657J98697J25294K39645K77696K73318K58329
5729A1864014L05228L09645L45569L93634L71101M01437M31280N85255O04975
5720A5612138O39198P59695Q19673Q90545J073390J188283J428945J673261J917185
5711B6002313K148522K510263K930311L421636L894954M317855M443729L872606
$$ plain form
5703 53542189 56082529 56783562 55942236 54386183 52662213 51223077 50006604 48632530
5695 48632530 46722040 44458530 42109993 39802053 37857952 36398016 35367307 34837263
5687 34837263 34792396 35140452 35864416 37079181 38722861 40864041 43541442 46714233 50317833
5678 50317833 54109876 57997422 61968767 66105082 70601618 75524179 80456428 84198022
5670 84198022 85373032 83644123 79628204 74547518 69315827 64438928 59923256 55560886
5662 55560886 51239398 46957166 43032347 39494705 36489067 34101491 32183556 30690824
5654 30690824 29731027 29120303 28910111 28994925 29389544 30128039 31097694 32188559 33254773
5645 33254773 34118172 34833375 35397514 35893073 36492646 37232112 38009725 38121034 37112723
$$ packed form
5703E3542189K540340P01033q41326j556053j723970j439136j216473j374074
5695D8632530j910490k263510k348537k307940j944101j459936j030709n30044
5687C4837263m4867L48056P23964J214765J643680K141180K677401L172791L603600
5678E0317833L792043L887546L971345M136315M496536M922561M932249L741594
5670H4198022J175010j728909m015919n080686n231691m876899m515672m362370
5662E5560886m321488m282232l924819l537642l005638k387576j917935j492732
5654C0690824r59797o10724k10192Q4814L94619P38495R69655J090865J066214
5645C3254773Q63399P15203N64139M95559N99573P39466P77613J11309j008311
$$ plain form
5636 37112723 35016083 32195477 29136760 26144696 23309074 20844401 18804200 17025143
5628 17025143 15513854 14303278 13207110 12305393 11471879 10744106 10191828 9698807 9212854
5619 9212854 8809827 8403625 8061563 7707761 7401275 7143757 6895168 6663349 6513411 6328177
5609 6328177 6075147 5917897 5781341 5579556 5431149 5288242 5099895 4947415 4784037 4668444
5599 4668444 4495745 4367794 4263733 4073709 3980554 3861378 3714358 3621395 3519268 3384681
5589 3384681 3327957 3238168 3168628 3079584 2997386 2983723 2892302 2810249 2774718 2755476 2701626
5578 2701626 2652914 2616617 2573446 2521002 2445868 2474844 2425787 2370311 2350840 2281853 2263324
5567 2263324 2287551 2236429 2191556 2175188 2101045 2037725 1990525 1982076 1927513 1887482 1852902 1776067
$$ packed form
5636C7112723k096640k820606l058717k992064k835622k464673k040201j779057
5628A7025143j511289j210576j096168r01717q33514p27773n52278m93021m85953
5619I212854m03027m06202l42062l53802l06486k57518k48589k31819j49938j85234
5609F328177k53030j57250j36556k01785j48407j42907j88347j52480j63378j15593
5599D668444j72699j27951j04061j90024r3155j19176j47020r2963j02127j34587
5589C384681n6724q9789o9540q9044q2198j3663r1421q2053l5531j9242n3850
5578B701626m8712l6297m3171n2444p5134K8976m9057n5476j9471o8987j8529
5567B263324K4227n1122m4873j6368p4143o3320m7200q449n4563m0031l4580p6835
$$ plain form
5555 1776067 1721619 1658005 1674727 1663159 1637606 1621750 1592624 1567141 1484092 1442602 1431495
5544 1431495 1491961 1488040 1482566 1487970 1421829 1411100 1428548 1435855 1443332 1432763 1446977 1428017
5532 1428017 1419996 1443015 1380079 1322203 1320361 1309864 1253711 1212152 1200441 1181883 1158851 1164900
5520 1164900 1155217 1117203 1132560 1085161 1072664 1058277 1031571 1030653 1016686 1030033 1051712 1056874
5508 1056874 1040333 1063517 1094993 1148650 1136452 1143857 1163724 1170417 1160345 1130471 1193278 1152386
5496 1152386 1081178 1040814 1013504 939133 934971 913926 899405 873412 822124 763540 711323 702222
5484 702222 689955 703496 713567 696866 683174 647445 672029 672770 655899 645907 645223 688632 746329
5471 746329 763028 763465 733090 748754 779314 791007 734100 716405 727635 652573 595511 574127
$$ packed form
5555A776067n4448o3614J6722j1568k5553j5856k9126k5483q3049m1490j1107
5544A431495O0466l921n474N404o6141j0729J7448P307P477j0569J4214j8960
5532A428017q021K3019o2936n7876j842j0497n6153m1559j1711j8558k3032O049
5520A164900r683l8014J5357m7399j2497j4387k6706r18j3967J3347K1679N162
5508A056874j6541K3184L1476N3657j2198P405J9867O693j0072k9874O2807m0892
5496A152386p1208m0364k7310p4371m162k1045j4521k5993n1288n8584n2217r101
5484G02222j2267J3541J0071j6701j3692l5729K4584P41j6871r992o84M3409N7697
5471G46329J6699M37l0375J5664L0560J1693n6907j7695J1230p5062n7062k1384
$$ plain form
5459 574127 554271 549629 550627 534309 528549 535492 502738 480312 507569 496414 466139 422573 400763
5446 400763 383787 388761 394352 332367 290125 322325 312854 314929 285596 293075 337923 372565 334680
5433 334680 308824 302698 309987 328207 312797 299586 311691 310757 308568 326488 286813 304898 274040
5420 274040 222079 227295 248347 231168 208911 223429 200573 216413 206166 203116 227802 242757
5408 242757 214241 208907 225862 208743 174572 210560 221048 203328 285282 262703 238044 249775
5396 249775 227680 212661 224577 219129 165952 182241 138737 199546 236182 217265 187056 210096
5384 210096 216289 204664 246788 279876 195945 187796 185936 182191 236570 289323 358912 368081 361273
5371 361273 360558 391507 364448 415741 380131 396095 403685 418805 421613 356896 356033 356173 365623
$$ packed form
5459E74127j9856m642R98j6318n760O943l2754k2426K7257j1155l0275m3566k1810
5446D00763j6976M974N591o1985m2242L2200r471K075k9333P479M4848L4642l7885
5433C34680k5856o126P289J8220j5410j3211J2105r34k189J7920l9675J8085l0858
5420B74040n1961N216K1052j7179k2257J4518k2856J5840j0247l050K4686J4955
5408B42757k8516n334J6955j7119l4171L5988J0488j7720Q1954k2579k4659J1731
5396B49775k2095j5019J1916n448n3177J6289m3504O0809L6636j8917l0209K3040
5384B10096O193j1625M2124L3088q3931q149j860l745N4379N2753O9589R169o808
5371C61273p15L0949k7059N1293l5610J5964P590J5120K808o4717q63J40R450
$$ plain form
5358 365623 406008 432600 391112 370641 342502 333393 293586 247293 236590 268806 290231 306559
5346 306559 320870 338280 320551 325806 354855 344389 366619 416617 454307 486957 474144 486666
5334 486666 484040 515854 547956 515546 501104 446908 445044 495946 473533 455252 453246 384129
5322 384129 362213 313662 299726 301660 281955 282724 264801 224314 249243 217723 219718 251116
5310 251116 214504 183143 211998 212505 231034 271235 305761 334499 304972 278706 275368 222762
5298 222762 213527 219223 189982 165181 197246 211575 153921 123306 186455 209675 152301 124459
5286 124459 115516 137481 139052 103945 73039 52026 47782 69658 44987 79863 75343 50086
5274 50086 87850 136861 79593 85682 67261 85376 90775 82695 78517 106573 70088 64861 87011
$$ packed form
5358C65623M0385K6592m1488k0471k8139r109l9807m6293j0703L2216K1425J6328
5346C06559J4311J7410j7729N255K9049j0466K2230M9998L7690L2650j2813J2522
5334D86666k626L1814L2102l2410j4442n4196j864N0902k2413j8281k006o9117
5322C84129k1916m8551j3936J934j9705P69j7923m0487K4929l1520J995L1398
5310B51116l6612l1361K8855N07J8529M0201L4526K8738k9527k6266l338n2606
5298B22762r235N696k9241k4801L2065J4329n7654l0615O3149K3220n7374k7842
5286A24459q943K1965J571l5107l0906k1013m244K1876k4671L4876m520k5257
5274E0086L7764M9011n7268O089j8421J8115N399q080m178K8056l6485n227K2150
$$ plain form
5261 87011 67761 50409 73806 73922 7554 45601 19778 25707 -22320 42925 62791 66496 81925
5248 81925 51107 49072 44709 2295 27945 3999 46331 17020 -55094 33392 87475 42938
5236 42938 24501 37825 29706 43452 23950 5905 -38917 -14035 36074 45476 34570 33011
5224 33011 1891 23225 74472 48738 45162 -2010 12427 15472 -17176 -43330 -53065 18756
5212 18756 -8083 30929 38558 19029 25968 27648 2485 -27744 309 20776 31571 -60990
5200 -60990 -39469 -9340 -55549 -40081 -16016 -49968 -61699 -39384 -522 49238 32005 -11114
5188 -11114 -28268 38502 34879 33179 22775 -39515 -6353 -248 6034 -12856 -5010 -9128 -20417
5175 -20417 -1936 -6112 9070 475 -22544 -79876 -15769 -18604 -8661 -8365 -10508 35081 -7434
$$ packed form
5261H7011j9250j7352K3397J16o6368L8047k5823N929m8027O5245J9866L705J5429
5248H1925l0818k035m363m2414K5650k3946M2332k9311p2114Q8486N4083m4537
5236D2938j8437J3324q119J3746j9502j8045m4822K4882N0109R402j0906j559
5224C3011l1120K1334N1247k5734l576m7172J4437L045l2648k6154r735P1821
5212A8756k6839L9012P629j9529O939J680k5163l0229K8053K0467J0795r2561
5200f0990K1521L0129m6209J5468K4065l3952j1731K2315L8862M9760j7233m3119
5188a1114j7154O6770l623j700j0404o2290L3162O105O282j8890P846m118j1289
5175b0417J8481m176J5182q595k3019n7332O4107k835R943K96k143M5589m2515
$$ plain form
5162 -7434 4821 34162 9359 -6263 -1250 17488 84270 86697 65453 76552 39870 7619
5150 7619 21739 16598 31381 31998 5055 496 -13617 -10835 25807 49647 12720 -38601 -1782
5137 -1782 41558 45324 6688 7434 59380 73612 9710 -60015 6590 93525 48725 -17007 -6168
5124 -6168 1686 7524 33377 61250 -15010 19192 6290 48096 51001 24627 -2143 -26835 48832
5111 48832 76840 67302 23558 26967 42077 66137 76222 91567 49813 1063 -2308 32506
5099 32506 22303 9524 29108 26951 10352 -3644 60863 68157 26139 39194 58079 18045
5087 18045 11782 31165 52963 54189 75499 23656 5601 -44439 -83889 -70781 -39800 2914
5075 2914 65464 54527 -4162 -12571 -39709 -1719 31903 53590 17473 11767 -8311 42661
$$ packed form
5162g434J2255K9341k4803j5622N013J8738O6782K427k1244J1099l6682l2251
5150G619J4120n141J4783O17k6943m559j4113K782L6642K3840l6927n1321L6819
5137a782M3340L766l8636P46N1946J4232o3902o9725O6605Q6935m4800o5732J0839
5124f168P854N838K5853K7873p6260L4202j2902M1806K905k6374k6770k4692P5667
5111D8832K8008r538m3744L409J5110K4060J0085J5345m1754m8750l371L4814
5099C2506j0203j2779J9584k157j6599j3996O4507P294m2018J3055J8885m0034
5087A8045o263J9383K1798J226K1310n1843j8055n0040l9450J3108L0981M2714
5075B914O2550j0937n8689q409k7138L7990L3622K1687l6117n706k0078N0972
$$ plain form
5063 42661 25725 2264 -3918 22790 -10065 -49965 -48859 -58946 -61231 -29016 -6496 -30500
5051 -30500 -30139 -41219 -67406 -61775 -66190 -12267 -13308 -14362 -42229 -25476 -29 -17016 -39456
5038 -39456 -18533 -47999 -94002 -60148 -86002 -64658 8896 24012 -20491 -998 11821 -12796
5026 -12796 -27167 44290 34721 20837 -7036 14235 12455 13963 7984 -8603 6619 11041 -9748
5013 -9748 -29928 -22456 -2878 17646 8348 -7129 -5764 -17231 13590 32207 7114 21787 -93573
5000 -93573 -36375 -18827 -50317 -23861 -1196 -9253 -42212 -20156 -15411 2313 45149 9677
4988 9677 -4179 -52565 -15095 7728 -9998 -35863 -29283 9745 59200 51364 39411 13998
4976 13998 -306 -20095 -46156 25579 -16015 1489 -1180 -34679 -28403 15902 12369 11172 55204
$$ packed form
5063D2661j6936k3461o182K6708l2855l9900J106j0087k285L2215K2520k4004
5051c0500L61j1080k6187N631m415N3923j041j054k7867J6753K5447j6987k2440
5038c9456K0923k9466m6003L3854k5854K1344P3554J5116m4503J9493J2819k4617
5026a2796j4371P1457r569j3884k7873K1271j780J508n979j6587J5222M422k0789
5013i748k0180P472J9578K0524r298j5477J365j1467L0821J8617k5093J4673j15360
5000i3573N7198J7548l1490K6456K2665q057l2959K2056M745J7724M2836l5472
4988I677j3856m8386L7470K2823j7726k5865O580L9028M9455p836j1953k5413
4976A3998j4304j9789k6061P1735m1594J7504k669l3499O276M4305l533j197M4032
$$ plain form
4963 55204 68380 35280 -22529 -58951 6389 33138 46341 20389 6434 12805 50048 43920
4951 43920 87355 105196 82208 55909 31736 -18660 -5360 -9417 9813 15591 31361 18371
4939 18371 31243 81332 42658 28270 7119 -9478 17233 30332 48767 12188 -13743 32213
4927 32213 47760 83450 99574 75150 37202 12271 7830 -6094 21749 43991 -6612 30002
4915 30002 61771 41768 23828 65210 57887 17812 -9169 15336 3060 21737 34277 40012
4903 40012 29861 26136 -21714 -40377 42197 58483 43420 40015 57406 46336 80283 89958
4891 89958 92717 68591 38730 93948 104432 94451 85783 124644 89227 107743 112762 134562 132808
4878 132808 143562 172058 170348 201769 158204 169058 199286 260233 315930 313775 416450 540821
$$ packed form
4963E5204J3176l3100n7809l6422O5340K6749J3203k5952j3955O371L7243o128
4951D3920M3435J7841k2988k6299k4173n0396J3300m057J9230N778J5770j2990
4939A8371J2872N0089l8674j4388k1151j6597K6711J3099J8435l6579k5931M5956
4927C2213J5547L5690J6124k4424l7948k4931m441j3924K7843K2242n0603L6614
4915C0002L1769k0003j7940M1382p323m0075k6981K4505j2276J8677J2540N735
4903D0012j0151l725m7850j8663Q2574J6286j5063l405J7391j1070L3947R675
4891H9958K759k4126k9861N5218J0484r981q668L8861l5417J8516N019K1800j754
4878A32808J0754K8496j710L1421m3565J0854L0228O0947N5697k155J02675J24371
$$ plain form
4866 540821 600949 645927 614371 536052 443897 366017 303255 266951 223543 254473 195166 165150
4854 165150 170265 128850 85000 139324 140398 163245 177017 108326 56652 56381 90189 100853
4842 100853 70047 17833 65176 78143 83004 95573 72477 62778 45608 79129 107917 79880
4830 79880 50671 88228 108282 118826 79912 58349 82912 84074 103083 122718 115417 101806
4818 101806 57496 19749 47477 43320 89010 61241 40124 93366 78484 28575 54918 41982
4806 41982 107261 98376 108824 86545 84334 87681 103254 126956 116400 102995 110445 121874 134974
4793 134974 70609 69023 110161 105791 52933 36764 40982 18032 9852 37122 90789 31109
4781 31109 13540 94962 101370 71427 65617 57252 117748 71830 115754 121201 74046 53356 63330
$$ packed form
4866E40821O0128M4978l1556p8319r2155p7880o2762l6304m3408L0930n9307l0016
4854A65150N115m1415m3850N4324J074K2847J3772o8691n1674k71L3808J0664
4842A00853l0806n2214M7343J2967M861J2569k3096r699j7170L3521K8788k8037
4830G9880k9209L7557K0054J0544l8914k1563K4563J162J9009J9635p301j3611
4818A01806m4310l7747K7728m157M5690k7769k1117N3242j4882m9909K6343j2936
4806D1982O5279q885J0448k2279k211L347J5573K3702j0556j3405P450J1429J3100
4793A34974o4365j586M1138m370n2858j6169M218k2950q180K7270N3667n9680
4781C1109j7569Q1422O408k9943n810q365O0496m5918M3924N447m7155k0690R974
$$ plain form
4768 63330 47658 75725 98714 93509 112027 120545 70507 88790 86187 91899 71937 78847 138497
4755 138497 102947 115192 48370 66308 50742 27822 58249 63854 46304 36681 85895 85298
4743 85298 108732 136890 106196 65525 69213 11855 18389 62831 50817 68193 96426 142149
4731 142149 134915 111758 68882 102042 89820 52697 16637 78033 70846 48831 140932 97557
4719 97557 114185 118976 165800 146509 122799 71613 54815 105160 96263 75636 95606 114686
4707 114686 117011 86964 126791 110160 119566 143148 100396 107867 126300 159374 92902 84875
4695 84875 121155 139446 159344 144628 115865 126539 107219 100676 101673 59880 74283 114503
4683 114503 85687 48845 113764 122839 140279 144019 95438 90449 64597 66526 87076 90286 89848
$$ packed form
4768F3330j5672K8067K2989n205J8518Q518n0038J8283k603N712j9962O910N9650
4755A38497l5550J2245o6822J7938j5566k2920L0427N605j7550r623M9214n97
4743H5298K3434K8158l0694m0671L688n7358O534M4442j2014J7376K8233M5723
4731A42149p234k3157m2876L3160j2222l7123l6060O1396p187k2015R2101m3375
4719I7557J6628M791M6824j9291k3710n1186j6798N0345q897k0627J9970J9080
4707A14686K325l0047L9827j6631R406K3582m2752P471J8433L3074o6472q027
4695H4875L6280J8291J9898j4716k8763J0674j9320o543R97m1793J4403M0220
4683A14503k8816l6842O4919R075J7440L740m8581m989k5852J929K0550L210m38
$$ plain form
4670 89848 110583 109919 89054 122348 106735 90003 144428 83456 86624 105407 59563 36152
4658 36152 90734 118750 128083 127385 100165 65131 87513 149204 138489 154278 184184 160134
4646 160134 164524 148924 116562 121745 147726 128513 105324 91908 93837 134713 157382 161685
4634 161685 126854 136878 171650 160554 118934 153934 133967 131357 84721 135024 152148 104314
4622 104314 123560 98460 99390 164348 136829 126911 150380 124698 112598 143592 177613 159129
4610 159129 143336 119083 117448 111853 129370 145462 195311 154485 150492 166001 179303 192858
4598 192858 187926 158664 173708 149786 149139 134471 142664 153206 154585 183673 153526 180314 160968
4585 160968 172753 170074 150009 174109 201212 191957 149108 187353 209421 197523 154665 182195
$$ packed form
4670H9848K0735o64k0865L3294j5613j6732N4425o0972L168J8783m5844k3411
4658C6152N4582K8016R333o98k7220l5034K2382O1691j0715J5789K9906k4050
4646A60134M390j5600l2362N183K5981j9213k3189j3416J929M0876K2669M303
4634A61685l4831J0024L4772j1096m1620L5000j9967k610m6636N0303J7124m7834
4622A04314J9246k5100R30O4958k7519r918K3469k5682j2100L0994L4021j8484
4610A59129j5793k4253j635n595J7517J6092M9849m0826l993J5509J3302J3555
4598A92858m932k9262J5044k3922o47j4668Q193J0542J379K9088l0147K6788j9346
4585A60968J1785k679k0065K4100K7103r255m2849L8245K2068j1898m2858K7530
$$ plain form
4573 182195 229275 152426 154506 222629 191966 205184 240266 234999 242360 238908 241721 261048 213223
4560 213223 211620 240803 234087 234543 250746 255558 264277 280097 239451 239140 297691 333346 304562
4547 304562 280944 252095 262637 276909 315060 333164 274697 282262 298630 324481 366923 379823
4535 379823 403517 405992 355164 338548 360930 371387 366385 347061 431058 456712 447299 457231
4523 457231 411364 401058 406674 436110 380613 386167 451541 490765 464723 483846 557834 488967
4511 488967 510899 530242 544394 521802 550793 579596 583665 586237 631059 601470 613103 594083
4499 594083 601055 615022 615610 663532 698641 701135 709336 731921 785382 752393 728864 756675 815248
4486 815248 914387 938569 937985 960734 1012529 1007710 1007071 1010673 1060967 1052386 1048573 1021904 1010679
$$ packed form
4573A82195M7080p6849K080O8123l0663J3218L5082n267P361l452K813J9327m7825
4560B13223j603K9183o716M56J6203M812Q719J5820m0646l11N8551L5655k8784
4547C04562k3618k8849J0542J4272L8151J8104n8467P565J6368K5851M2442J2900
4535C79823K3694K475n0828j6616K2382J0457n002j9324Q3997K5654r413R932
4523D57231m5867j0306N616K9436n5497N554O5374L9224k6042J9123P3988o8867
4511D88967K1932J9343J4152k2592K8991K8803M069K572M4822k9589J1633j9020
4499E94083O972J3967N88M7922L5109K494Q201K2585N3461l2989k3529K7811N8573
4486H15248R9139K4182n84K2749N1795m819o39L602N0294q581l813k6669j1225
$$ plain form
4473 1010679 1029606 1025692 1047370 1095026 1106503 1137078 1176913 1253219 1332147 1312963 1328226 1357736
4461 1357736 1338372 1412096 1453628 1487601 1479079 1565159 1653979 1632119 1678675 1751038 1774001 1790350
4449 1790350 1818225 1859591 1926988 2010748 2019851 2076059 2115173 2170443 2200873 2256416 2321389 2364343
4437 2364343 2396855 2417608 2431519 2461906 2499955 2505119 2467261 2446559 2489649 2517346 2471115 2424261
4425 2424261 2376106 2365502 2387503 2384690 2373390 2309597 2249324 2217915 2192453 2143444 2122787 2138149
4413 2138149 2143615 2105781 2089252 1983555 1893859 1896447 1842792 1843597 1834218 1805088 1823357 1804676
4401 1804676 1787548 1824924 1796721 1741859 1784623 1790796 1752062 1741805 1706854 1659867 1654777 1611844
4389 1611844 1584238 1587077 1602516 1607210 1626935 1626195 1631856 1582465 1590477 1559684 1530223 1539962 1553759
$$ packed form
4473A010679J8927l914K1678M7656J1477L0575L9835P6306P8928j9184J5263K9510
4461A357736j9364P3724M1532L3973q522Q6080Q8820k1860M6556P2363K2963J6349
4449A790350K7875M1366O7397Q3760R103N6208L9114N5270L0430N5543O4973M2954
4437B364343L2512K0753J3911L0387L8049N164l7858k0702M3090K7697m6231m6854
4425B424261m8155j0604K2001k813j1300o3793o0273l1409k5462m9009k0657J5362
4413B138149N466l7834j6529j05697q9696K588n3655Q05r379k9130J8269j8681
4401A804676j7128L7376k8203n4862M2764O173l8734j0257l4951m6987n090m2933
4389A611844k7606K839J5439M694J9725p40N661m9391Q012l0793k9461R739J3797
$$ plain form
4376 1553759 1538410 1472158 1460920 1451042 1413960 1449665 1389496 1333938 1304645 1330249 1294201 1295599
4364 1295599 1263183 1193186 1202588 1219978 1230445 1178706 1152407 1147377 1133946 1102222 1091400 1056644
4352 1056644 990437 1002610 995956 1027852 1018200 953772 945980 932606 923210 896001 933752 928877
4340 928877 909176 902245 932758 938612 961133 904693 898167 920473 913247 900338 883460 866047
4328 866047 821480 834104 810276 811344 843353 892983 893208 844418 818957 784308 807488 856059
4316 856059 830106 846857 896853 878463 881214 917871 906735 876368 912725 937668 933913 931419
4304 931419 911995 935057 963667 967651 1003587 975216 994129 983861 985459 995242 1000266 1008991 1047556
4291 1047556 1087997 1072447 1106364 1083959 1132978 1203728 1141587 1103819 1111602 1162652 1172689 1164253
$$ packed form
4376A553759j5349o6252j1238r878l7082L5705o0169n5558k9293K5604l6048J398
4364A295599l2416o9997R402J7390J0467n1739k6299n030j3431l1724j0822l4756
4352A056644o6207J2173o654L1896r652o4428p792j3374r396k7209L7751m875
4340I28877j9701o931L0513N854K2521n6440o526K2306p226j2909j6878j7413
4328H66047m4567J2624k3828J068L2009M9630K25m8790k5461l4649K3180M8571
4316H56059k5953J6751M9996j8390K751L6657j1136l0367L6357K4943l755k494
4304I31419j9424K3062K8610L984L5936k8371J8913j0268J598R783N024Q725L8565
4291A047556M0441j5550L3917k2405M9019P0750o2141l7768P783N1050J0037q436
$$ plain form
4279 1164253 1166717 1187354 1216264 1237815 1226204 1248129 1217054 1262568 1242332 1220882 1269424 1272925
4267 1272925 1270432 1331149 1363587 1366560 1399899 1399058 1399161 1348580 1402253 1409829 1411817 1443640 1444915
4254 1444915 1443079 1459899 1522930 1472198 1485115 1556617 1567397 1562686 1556330 1560450 1559140 1576564
4242 1576564 1577279 1592064 1603053 1620636 1655888 1662156 1676274 1705603 1705547 1698545 1688211 1721760 1765652
4229 1765652 1784193 1832069 1848593 1860060 1914888 1900807 1924246 1985069 2002222 2008984 2016147 1993089
4217 1993089 2069410 2118659 2162811 2250687 2336735 2409175 2400862 2374567 2376181 2420666 2447186 2529887
4205 2529887 2566243 2595884 2659932 2729096 2763593 2838154 2874558 2867109 2993261 3022623 3105550
4194 3105550 3195299 3255862 3321415 3430400 3499518 3612353 3677216 3705423 3811851 3906713 3998862
$$ packed form
4279A164253K464K0637K8910K1551j1611K1925l1075M5514k0236k1450M8542L501
4267A272925k493O0717L2438K973L3339q41J03n0581N3673P576J988L1823J275
4254A444915j836J6820O3031n0732J2917P1502J0780m711o356M120j310J7424
4242A576564P15J4785J0989J7583L5252O268J4118K9329n6p002j0334L3549M3892
4229A765652J8541M7876J6524J1467N4828j4081K3439O0823J7153O762P163k3058
4217A993089P6321M9249M4152Q7876Q6048P2440q313k6295J614M4485K6520Q2701
4205B529887L6356K9641O4048O9164L4497P4561L6404p449J26152K9362Q2927
4194C105550Q9749O0563O5553J08985O9118J12835O4863K8207J06428R4862R2149
$$ plain form
4183 3998862 4117759 4226179 4325889 4480397 4614686 4685238 4837914 4937303 5061977 5171903
4173 5171903 5305492 5442325 5624708 5760510 5863319 6021407 6158332 6321653 6459430 6624685
4163 6624685 6780559 6944777 7100644 7329183 7502277 7690044 7921895 8132985 8321192 8547347
4153 8547347 8829058 9074050 9333191 9599794 9809821 10084147 10455409 10806275 11154337 11516109
4143 11516109 11891205 12280443 12750419 13259514 13821988 14369975 14941162 15585544 16253618
4134 16253618 16983775 17707979 18528447 19419442 20373931 21398887 22507014 23661861 24863695
4125 24863695 26213535 27591943 29068154 30667460 32340997 34128339 35986775 37988806
4117 37988806 40014571 42137867 44309030 46599118 48953533 51348169 53730189 56281770
$$ packed form
4183C998862J18897J08420R9710J54508J34289P0552J52676R9389J24674J09926
4173E171903J33589J36833J82383J35802J02809J58088J36925J63321J37777J65255
4163F624685J55874J64218J55867K28539J73094J87767K31851K11090J88207K26155
4153H547347K81711K44992K59141K66603K10027K74326L71262L50866L48062L61772
4143A1516109L75096L89238M69976N09095N62474N47987N71187O44382O68074
4134A6253618P30157P24204Q20468Q90995R54489J024956J108127J154847J201834
4125B4863695J349840J378408J476211J599306J673537J787342J858436K002031
4117C7988806K025765K123296K171163K290088K354415K394636K382020K551581
$$ plain form
4109 56281770 58847431 61481318 64205028 66889575 69685052 72493668 75283104 78059655
4101 78059655 80756418 83404886 85885185 88191415 90413777 92478955 94398921 96247433
4093 96247433 97922107 99450593 100871930 102244414 103455028 104496995 105266598 105808693
4085 105808693 106013543 105845551 105468506 104749008 103837536 102705635 101457745 100123006 98674128
4076 98674128 97050407 95329415 93470527 91538203 89394257 87081331 84573302 81923854
4068 81923854 79140551 76287233 73455939 70561198 67691021 64877907 62129039 59476464
4060 59476464 56890562 54298714 51762740 49311373 46916010 44583259 42336995 40082321
4052 40082321 37860626 35793215 33827437 31895483 30122227 28506599 26979011 25576132
$$ packed form
4109E6281770K565661K633887K723710K684547K795477K808616K789436K776551
4101G8059655K696763K648468K480299K306230K222362K065178J919966J848512
4093I6247433J674674J528486J421337J372484J210614J041967P69603N42095
4085A05808693K04850j67992l77045p19498r11472j131901j247890j334739j448878
4076I8674128j623721j720992j858888j932324k143946k312926k508029k649448
4068H1923854k783303k853318k831294k894741k870177k813114k748868k652575
4060E9476464k585902k591848k535974k451367k395363k332751k246264k254674
4052D0082321k221695k067411j965778j931954j773256j615628j527588j402879
$$ plain form
4044 25576132 24188713 22947370 21771991 20628876 19606536 18610553 17671942 16829467 16033237
4035 16033237 15278622 14595685 13950918 13388792 12827829 12343988 11899371 11414529 11004452
4026 11004452 10642639 10277988 9979464 9657419 9333525 9040209 8793036 8564835 8359225
4017 8359225 8069965 7881973 7696971 7459332 7257159 7078105 6973441 6792521 6642730 6495270
4007 6495270 6307884 6110013 5962042 5862948 5766442 5629994 5519315 5404163 5299018 5177024
3997 5177024 5056619 4947327 4844600 4776920 4748068 4714962 4664574 4593396 4550848 4491053 4418882
3986 4418882 4398814 4374255 4361849 4380643 4370989 4377382 4325560 4295520 4241807 4203065 4244644 4273543
3974 4273543 4265686 4264916 4240592 4252918 4248047 4244342 4246209 4253346 4272098 4331959 4332729 4353773 4380755
$$ packed form
4044B5576132j387419j241343j175379j143115j022340r95983r38611q42475p96230
4035A6033237p54615o82937o44767n62126n60963m83841m44617m84842m10077
4026A1004452l61813l64651k98524l22045l23894k93316k47173k28201k05610
4017H359225k89260j87992j85002k37639k02173j79054j04664j80920j49791j47460
4007F495270j87386j97871j47971r9094r6506j36448j10679j15152j05145j21994
3997E177024j20405j09292j02727o7680k8852l3106n0388p1178m2548n9795p2171
3986D418882k0068k4559j2406J8794r654O393n1822l0040n3713l8742M1579K8899
3974D273543p857p70k4324J2326m871l705J867P137J8752N9861P70K1044K6982
$$ plain form
3961 4380755 4365662 4377446 4374837 4368932 4455114 4542431 4521199 4553138 4589516 4644581 4718253 4819576
3949 4819576 4888148 4985389 5047862 5091938 5095805 5183521 5261314 5337013 5375992 5347862 5305625 5265156
3937 5265156 5251218 5281554 5262541 5224512 5244259 5197091 5156928 5119469 5068100 5062777 4991030 4889424
3925 4889424 4817015 4697982 4604686 4550268 4518797 4425977 4304687 4295375 4258961 4191783 4061928
3914 4061928 3968176 3955158 3921297 3908365 3850011 3814091 3750972 3742910 3749442 3773021 3753535 3792772
3902 3792772 3860768 3864143 3809440 3802850 3846656 3826776 3863696 3846484 3837664 3795643 3750640 3810486
3890 3810486 3853274 3849865 3847458 3854188 3852192 3915699 3903422 3876735 3865847 3894833 3897843 3862843
3878 3862843 3859086 3768738 3787180 3809490 3817481 3821184 3808572 3829285 3877349 3891592 3895403 3905546
$$ packed form
3961D380755j5093J1784k609n905Q6182Q7317k1232L1939L6378N5065P3672J01323
3949D819576O8572R7241O2473M4076L867Q7716P7793P5699L8979k8130m2237m0469
3937E265156j3938L0336j9013l8029J9747m7168m0163l7459n1369n323p1747j01606
3925D889424p2409j19033r3296n4418l1471r2820j21290r312l6414o7178j29855
3914D061928r3752j3018l3861j2932n8354l5920o3119q062O532K3579j9486L9237
3902C792772O7996L375n4703o590M3806j9880L6920j7212q820m2021m5003N9846
3890C810486M2788l409k407O730j996O3507j2277k6687j0888K8986L010l5000
3878C862843l757r0348J8442K2310P991L703j2612K0713M8064J4243L811J0143
$$ plain form
3866 3905546 3974492 4010851 4055380 4091607 4123998 4188241 4260934 4324716 4345220 4446739 4526176
3855 4526176 4571100 4597221 4601432 4662551 4731557 4815299 4874505 4934256 4961480 5016715 5023904 5075546
3843 5075546 5121408 5207478 5294063 5309361 5286514 5290722 5329043 5382064 5479750 5546113 5593781 5595713
3831 5595713 5686523 5772900 5854860 5952015 5979712 6045918 6072876 6167052 6227982 6281052 6390023
3820 6390023 6485152 6568985 6698044 6851010 6886240 6948906 7043982 7197875 7343509 7437359 7510171
3809 7510171 7612957 7699109 7832243 7953986 8087744 8145668 8219760 8354935 8514974 8616747
3799 8616747 8717730 8802621 8940072 9055559 9183546 9345245 9476688 9632498 9773622 9975689
3789 9975689 10141432 10291814 10459158 10667596 10844227 11031599 11284408 11508413 11733514 12000856
$$ packed form
3866C905546O8946L6359M4529L6227L2391O4243P2693O3782K0504J01519P9437
3855D526176M4924K6121M211O1119O9006Q3742N9206N9751K7224N5235P189N1642
3843E075546M5862Q6070Q6585J5298k2847M208L8321N3021R7686O6363M7668J932
3831E595713R0810Q6377Q1960R7155K7697O6206K6958R4176O0930N3070J08971
3820F390023R5129Q3833J29059J52966L5230O2666R5076J53893J45634R3850P2812
3809G510171J02786Q6152J33134J21743J33758N7924P4092J35175J60039J01773
3799H616747J00983Q4891J37451J15487J27987J61699J31443J55810J41124K02067
3789I975689J65743J50382J67344K08438J76631J87372K52809K24005K25101K67342
$$ plain form
3779 12000856 12306479 12610071 12944138 13280094 13640676 14037607 14394160 14797198 15267371
3770 15267371 15717257 16199203 16662927 17146810 17696468 18357082 18981059 19612494 20356680
3761 20356680 21179347 22006571 22927491 23906185 24955889 26068989 27209749 28469870 29768337
3752 29768337 31080878 32386594 33648835 34968986 36287321 37529418 38697937 39787780
3744 39787780 40930418 42001355 43032895 44124338 45253336 46306077 47333793 48285365
3736 48285365 49159777 49872059 50460177 50835131 51122603 51338549 51439962 51437424 51462321 51521667
3726 51521667 51570094 51756150 51989729 52210558 52481001 52736242 53029894 53332103 53668305 54084457
3716 54084457 54534088 55147779 55874388 56706266 57737994 58943535 60263820 61852311 63643957
$$ packed form
3779A2000856L05623L03592L34067L35956L60582L96931L56553M03038M70173
3770A5267371M49886M81946M63724M83883N49658O60614O23977O31435P44186
3761B0356680Q22667Q27224R20920R78694J049704J113100J140760J260121J298467
3752B9768337J312541J305716J262241J320151J318335J242097J168519J089843
3744C9787780J142638J070937J031540J091443J128998J052741J027716R51572
3736D8285365Q74412P12282N88118L74954K87472K15946J01413k538K4897N9346
3726E1521667M8427J86056K33579K20829K70443K55241K93652L02209L36202M16152
3716E4084457M49631O13691P26609Q31878J031728J205541J320285J588491J791646
$$ plain form
3707 63643957 65646375 67793213 70274042 73014424 75984541 79282501 82888741 86780622
3699 86780622 90960661 95355561 100066803 104964076 109978636 115100734 120235978 125459958
3691 125459958 130611137 135762292 140911773 146036770 151257520 156514248 161839916 167249610
3683 167249610 172706809 178195327 183714734 189125762 194468078 199732192 204913238 210202456
3675 210202456 215720167 221544821 227894095 235006244 242936966 251982823 262167014 273686096
3667 273686096 286512565 300653073 316063480 332429566 349255430 365882467 381541083
3660 381541083 395535283 407158923 415861095 421503046 424511922 425209872 424353156 422660368
3652 422660368 420764265 419076077 417726404 416663821 415571992 413915778 410914780 405934279
$$ packed form
3707F3643957K002418K146838K480829K740382K970117L297960L606240L891881
3699H6780622M180039M394900M711242M897273N014560N122098N135244N223980
3691A25459958N151179N151155N149481N124997N220750N256728N325668N409694
3683A67249610N457199N488518N519407N411028N342316N264114N181046N289218
3675B10202456N517711N824654O349274P112149P930722R045857J0184191J1519082
3667B73686096J2826469J4140508J5410407J6366086J6825864J6627037J5658616
3660C81541083J3994200J1623640Q702172N641951L008876O97950q56716j692788
3652D22660368j896103j688188j349673j062583j091829j656214l000998m980501
$$ plain form
3644 405934279 398141824 387262771 373251699 356433647 337620162 317662358 297320553
3637 297320553 277360665 258372599 240707202 224534467 209803423 196519254 184446928
3630 184446928 173444154 163359701 154011101 145255364 137005034 129182707 121856306 115013127
3622 115013127 108549968 102583213 97044351 92045205 87483892 83382912 79722513 76458625
3614 76458625 73595460 71068966 68940765 67054258 65396717 64008072 62832475 61807986
3606 61807986 60917190 60070955 59276382 58494666 57799112 57106764 56388237 55747707 55128887
3597 55128887 54644656 54274340 53907193 53621012 53404468 53096868 52728659 52303106 51763871
3588 51763871 51068797 50280065 49396846 48355653 47151334 45926601 44665639 43362602 42048874
$$ packed form
3644D05934279p792455j0879053j4011072j6818052j8813485j9957804k0341805
3637B97320553j9959888j8988066j7665397j6172735j4731044j3284169j2072326
3630A84446928j1002774j0084453r348600q755737q250330p822327p326401o843179
3622A15013127o463159n966755n538862m999146m561313m100980l660399l263888
3614G6458625k863165k526494k128201j886507j657541j388645j175597j024489
3606F1807986q90796q46235p94573p81716o95554o92348p18527o40530o18820
3597E5128887m84231l70316l67147k86181k16544l07600l68209m25553n39235
3588E1763871o95074p88732q83219j041193j204319j224733j260962j303037j313728
$$ plain form
3579 42048874 40749568 39523055 38339215 37196581 36035654 34881205 33698650 32471895
3571 32471895 31173795 29909248 28672972 27386513 26147941 24961927 23891920 22801771
3563 22801771 21818248 20965878 20202935 19386587 18647205 17977818 17394293 16848876 16339581
3554 16339581 15833873 15406333 15013517 14579571 14225428 13914204 13597134 13278166 12981806
3545 12981806 12714159 12448609 12102459 11852794 11650640 11433686 11218360 10992942 10809081
3536 10809081 10617806 10410895 10205126 10027193 9815500 9647134 9526452 9305376 9159851
3527 9159851 9063275 8897466 8709521 8624275 8505378 8398045 8279113 8129294 8018834 7881987
3517 7881987 7687863 7547505 7436381 7332786 7200913 6995125 6904093 6784882 6670035 6574402
$$ packed form
3579D2048874j299306j226513j183840j142634j160927j154449j182555j226755
3571C2471895j298100j264547j236276j286459j238572j186014j070007j090149
3563B2801771r83523q52370p62943q16348p39382o69387n83525n45417n09295
3554A6339581n05708m27540l92816m33946l54143l11224l17070l18968k96360
3545A2981806k67647k65550l46150k49665k02154k16954k15326k25418j83861
3536A0809081j91275k06911k05769j77933k11693j68366j20682k21076j45525
3527I159851r6576j65809j87945q5246j18897j07333j18932j49819j10460j36847
3517G881987j94124j40358j11124j03595j31873k05788r1032j19211j14847r5633
$$ plain form
3507 6574402 6439654 6257218 6135629 6058083 5916363 5804159 5680279 5556360 5435087 5375126
3497 5375126 5316473 5210369 5124658 5034269 4921509 4802074 4741361 4701497 4610714 4543999 4528667
3486 4528667 4505947 4448015 4408398 4366390 4284476 4189440 4192417 4140951 4075466 4009936 3965161 3919129
3474 3919129 3877619 3883266 3820838 3786196 3747653 3664783 3567703 3518008 3431315 3405153 3388356 3329336
3462 3329336 3324934 3276306 3195528 3125099 3097907 3081992 3068005 3042456 3003363 2986415 2978209 2969976
3450 2969976 2955630 2945850 2913026 2869556 2873491 2871134 2853099 2817820 2849429 2845799 2833093 2819185
3438 2819185 2836976 2795969 2739516 2746603 2732324 2732658 2711050 2707171 2708767 2686583 2648846 2667210
3426 2667210 2645362 2601780 2507955 2488595 2534476 2453418 2438451 2479825 2463149 2428054 2443131
$$ packed form
3507F574402j34748j82436j21589p7546j41720j12204j23880j23919j21273n9961
3497E375126n8653j06104q5711r0389j12760j19435o0713l9864r0783o6715j5332
3486D528667k2720n7932l9617m2008q1914r5036K977n1466o5485o5530m4775m6032
3474C919129m1510N647o2428l4642l8543q2870r7080m9695q6693k6162j6797n9020
3462C329336m402m8628q0778p0429k7192j5915j3987k5549l9093j6948q206q233
3450B969976j4346r780l2824m3470L935k357j8035l5279L1609l630j2706j3908
3438B819185J7791m1007n6453P087j4279L34k1608l879J596k2184l7737J8364
3426B667210k1848m3582r3825j9360M5881q1058j4967M1374j6676l5095J5077
$$ plain form
3415 2443131 2453537 2421804 2422111 2428633 2390090 2381743 2426370 2432889 2360316 2418324 2470543 2453031
3403 2453031 2420121 2443574 2419083 2416334 2378352 2377669 2438778 2407602 2402791 2477273 2500434 2474763
3391 2474763 2454496 2507574 2565330 2549706 2604799 2563430 2624274 2662700 2681426 2707351 2737887
3380 2737887 2806798 2856551 2896695 2964499 3032489 3123435 3174608 3243665 3298094 3309878 3294430
3369 3294430 3345162 3347876 3359955 3381414 3400985 3458595 3435275 3410263 3411468 3435790 3405024 3399350
3357 3399350 3409314 3415580 3334467 3239849 3164859 3107044 3036594 2989943 2935755 2839964 2739320 2728475
3345 2728475 2682854 2601279 2591257 2499729 2487134 2431452 2391896 2383491 2338428 2370759 2397160 2383292
3333 2383292 2407959 2447007 2512946 2501304 2548428 2635000 2691147 2719841 2769810 2806253 2865284
$$ packed form
3415B443131J0406l1733L07O522l8543q347M4627O519p2573N8008N2219j7512
3403B453031l2910K3453k4491k749l7982o83O1109l1176m811P4482K3161k5671
3391B474763k0267N3078N7756j5624N5093m1369O0844L8426J8726K5925L0536
3380B737887O8911M9753M0144O7804O7990R0946N1173O9057N4429J1784j5448
3369C294430N0732K714J2079K1459J9571N7610k3320k5012J205K4322l0766n674
3357C399350R964O266q1113r4618p4990n7815p0450m6651n4188r5791j00644j0845
3345B728475m5621q1575j0022r1528j2595n5682l9556q405m5063L2331K6401j3868
3333B383292K4667L9048O5939j1642M7124Q6572N6147K8694M9969L6443N9031
$$ plain form
3322 2865284 2976798 3023157 3041740 3098146 3107949 3081533 3077952 3003496 2848863 2744090 2612488
3311 2612488 2485421 2401542 2262450 2146794 2108116 2067463 2003981 1934760 1891509 1857297 1813759
3300 1813759 1772282 1636681 1614935 1569674 1520042 1514916 1472595 1408774 1437281 1408451 1351165
3289 1351165 1362300 1290307 1236433 1217198 1179741 1177507 1095904 1062195 1094924 1088633 1028714 1032195
3277 1032195 1032863 1028116 1037445 989241 926480 938543 952892 932814 911222 876810 840071 862878
3265 862878 835903 760846 752465 842320 777773 798944 835849 818482 813660 795391 767318 730138
3253 730138 747114 719500 743843 705967 720748 670194 672841 662152 726940 679137 673282 638618
3241 638618 694012 733404 680538 655026 599080 597128 592099 618889 615268 576308 527007 579202
$$ packed form
3322B865284J11514M6359J8583N6406R803k6416l581p4456j54633j04773j31602
3311B612488j27067q3879j39092j15656l8678m0653o3482o9221m3251l4212m3538
3300A813759m1477j35601k1746m5261m9632n126m2321o3821K8507k8830n7286
3289A351165J1135p1993n3874j9235l7457k234q1603l3709L2729o291n9919L481
3277A032195O68m747R329m8204o2761J2063J4349k0078k1592l4412l6739K2807
3265H62878k6975p5057q381Q9855o4547K1171L6905j7367m822j8269k8073l7180
3253G30138J6976k7614K4343l7876J4781n0554K647j0689O4788m7803n855l4664
3241F38618N5394L9392n2866k5512n5946j952n029K6790l621l8960m9301N2195
$$ plain form
3229 579202 577483 557339 540514 524079 510247 466770 471093 447759 446524 497288 489456 488109 512173
3216 512173 516038 437656 427564 494503 463629 426630 477127 471284 437128 409145 395205 431572
3204 431572 446307 402616 372291 399296 432140 369374 383608 441517 442414 407988 384715 366913
3192 366913 361345 397929 425856 408400 382742 354551 387812 389957 380878 377479 402101 381140
3180 381140 356126 382129 393797 379539 366328 382257 433898 366253 305802 289324 254879 282913
3168 282913 312590 372118 340563 325765 315183 326508 300647 295030 311651 294430 337156 277663
3156 277663 266852 338211 323842 292079 265919 273271 251769 251850 270132 264533 256694 292360 247823
3143 247823 207315 194260 216368 212761 246645 275037 253928 198290 220710 249246 258461 212230
$$ packed form
3229E79202j719k0144j6825j6435j3832m3477M323k3334j235N0764p832j347K4064
3216E12173L865p8382j0092O6939l0874l6999N0497n843l4156k7983j3940L6367
3204D31572J4735m3691l0325K7005L2844o2766J4234N7909Q97l4426k3273j7802
3192C66913n568L6584K7927j7456k5658k8191L3261K145r079l399K4622k0961
3180C81140k5014K6003J1668j4258j3211J5929N1641o7645o0451j6478l4445K8034
3168B82913K9677N9528l1555j4798j0582J1325k5861n617J6621j7221M2726n9493
3156B77663j0811P1359j4369l1763k6160P352k1502Q1J8282n599p839L5666m4537
3143B47823m0508j3055K2108l607L3884K8392k1109n5638K2420K8536R215m6231
$$ plain form
3131 212230 167928 194441 201335 241275 279916 258828 264666 228302 202094 263715 253962 236678
3119 236678 225643 185377 179764 211197 189557 227640 188283 163915 177375 198873 195518 243361
3107 243361 323549 312805 259989 232476 232550 222375 242757 209921 222891 185424 178559 185513 187863
3094 187863 205275 190364 209178 196610 204299 201540 200963 149293 169151 142568 186687 198837
3082 198837 158365 162068 156467 173215 218115 214660 242146 204953 178667 190335 147749 171611
3070 171611 180141 175051 224628 210968 161932 176891 200318 144333 141725 175276 155506 171635
3058 171635 142131 214913 215500 196142 139822 164451 160574 201020 205276 177782 135337 171387
3046 171387 227757 221420 217987 184423 151937 184938 256855 203385 179735 190674 179974 209348
$$ packed form
3131B12230m4302K6513O894L9940L8641k1088N838l6364k6208O1621r753j7284
3119B36678j1035m0266n613L1433k1640L8083l9357k4368J3460K1498l355M7843
3107B43361Q0188j0744n2816k7513P4j0175K0382l2836J2970l7467o865O954K350
3094A87863J7412j4911J8814j2568P689k759n77n1670J9858k6583M4119J2150
3082A98837m0472L703n601J6748M4900l455K7486l7193k6286J1668m2586K3862
3070A71611Q530n090M9577j3660m9036J4959K3427n5985k608L3551j9770J6129
3058A71635k9504P2782N87j9358n6320K4629l877M0446M256k7494m2445L6050
3046A71387N6370o337l433l3564l2486L3001P1917n3470k3650J0939j0700K9374
$$ plain form
3034 209348 197521 226399 236841 208572 343228 329621 299406 337946 388731 420466 435101
3023 435101 469712 386596 352541 372755 381605 355336 357943 335485 356901 300463 316428 336147
3011 336147 321870 337835 335340 374432 343941 345570 387195 405809 411299 390100 376625 454448
2999 454448 424816 492037 519917 576158 593275 642295 700052 650971 620427 583988 553542 600871
2987 600871 593521 606717 603578 588207 609015 660982 648393 593607 565528 544080 548640 519604
2975 519604 509875 529913 535336 493461 475170 529300 498617 466259 466245 496650 544994 545384 499116
2962 499116 481160 513647 551593 595824 567138 581637 576750 558690 567499 540866 498042 490461
2950 490461 489386 451412 468177 441800 435528 363674 372975 389110 380210 392001 380565 388087 360809
$$ packed form
3034B09348j1827K8878J0442k8269J34656j3607l0215L8540N0785L1735J4635
3023D35101L4611q3116l4055K0214Q850k6269K607k2458K1416n6438J5965J9719
3011C36147j4277J5965k495L9092l0491J629M1625J8614N490k1199j3475P7823
2999D54448k9632O7221K7880N6241J7117M9020N7757m9081l0544l6439l0446M7329
2987F00871p350J3196l139j5371K0808N1967j2589n4786k8079k1448M560k9036
2975E19604r729K0038N423m1875j8291N4130l0683l2358j4L0405M8344L90m6268
2962D99116j7956L2487L7946M4231k8686J4499m887j8060Q809k6633m2824p581
2950D90461j075l7974J6765k6377o272p1854R301J6135q900J1791j1436P522k7278
$$ plain form
2937 360809 396806 401518 376636 340709 340340 320254 269329 242471 272801 286129 324987 287683
2925 287683 219053 186483 229027 243322 179278 119052 131148 154244 166181 206061 221340 152851
2913 152851 160268 156654 166442 137250 98420 96452 149059 140229 103161 131671 120108 83134 65272
2900 65272 86033 117790 98919 78593 58718 27910 64899 39616 60645 81849 91095 64628
2888 64628 9917 5984 16516 41719 30852 53849 35336 2240 -27379 -4755 20952 13670
2876 13670 -35575 -16908 -42266 -9213 -31300 -36755 13032 -487 19750 9970 -393 -52264
2864 -52264 -44862 -24427 -50823 -62186 -64047 -47993 -58995 -25674 -28015 -72279 -70664 -31198 70789
2851 70789 22108 -33696 -54581 -75843 -114622 -77824 -51808 -41560 -48831 -44584 -24849 -30122
$$ packed form
2937C60809L5997M712k4882l5927l69k0086n0925k6858L0330J3328L8858l7304
2925B87683o8630l2570M2544J4295o4044o0226J2096K3096J1937L9880J5279o8489
2913A52851P417l614R788k9192l8830j968N2607q830l7068K8510j1563l6974j7862
2900F5272K0761L1757j8871k0326j9875l0808L6989k5283K1029K1204R246k6467
2888F4628n4711l933J0532K5203j0867K2997j8513l3096k9619K2624K5707p282
2876A3670m9245J8667k5358L3053k2087n455M9787j3519K0237r780j0363n1871
2864e2264P402K0435k6396j1363j861J6054j1002L3321k341m4264J615L9466J01987
2851G0789m8681n5804k0885k1262l8779L6798K6016J0248p271M247J9735n273
$$ plain form
2839 -30122 -40613 -60288 -30710 -72471 -89411 -90856 -8505 -10352 -25967 -29796 -32293 -11337 -4439
2826 -4439 10022 -56956 -35416 -23891 4665 -53110 -69309 -68173 -62055 -72101 -62052 -62339 -44045
2813 -44045 -27442 -57140 -66906 -35745 -49149 -33094 -46018 -20064 -18508 -39089 -31784 -45661
2801 -45661 -7228 -39831 -40014 66943 59287 -10481 -80681 -86820 -49390 -61791 -67892 -24901 -35447
2788 -35447 -49346 -52012 -62380 -38845 -23462 -31295 -13699 -53314 -57463 -64836 -35992 -66643 -80386
2775 -80386 -71381 -73330 -66326 -79755 -78639 -48062 -15613 -31733 -21486 -48511 -29486 -41006 -7853
2762 -7853 -14631 -73102 -48674 -64461 -45859 -34574 -47057 -43698 -61155 -95665 -68656 -43669
2750 -43669 -99511 -65945 -109545 -78259 -55707 -19455 -42612 -58870 -77946 -63648 -39699 -49833
$$ packed form
2839c0122j0491j9675K9578m1761j6940j445Q2351j847j5615l829k497K0956O898
2826d439J4461o6978K1540J1525K8556n7775j6199J136O118j0046J0049k87J8294
2813d4045J6603k9698r766L1161j3404J6055j2924K5954J556k0581P305j3877
2801d5661L8433l2603j83J06957p656o9768p0200o139L7430j2401o101M2991j0546
2788c5447j3899k666j0368K3535J5383p833J7596l9615m149p373K8844l0651j3743
2775h0386R005j949P004j3429J116L0577L2449j6120J0247k7025J9025j1520L3153
2762g853o778n8471K4428j5787J8602J1285j2483L359j7457l4510K7009K4987
2750d3669n5842L3566m3600L1286K2552L6252k3157j6258j9076J4298K3949j0134
$$ plain form
2738 -49833 -56589 -35815 -34370 -74595 -77398 -63442 -53432 -42086 -62572 -78083 -37430 -52628
2726 -52628 -106186 -34556 -15031 -51845 -68943 -40950 -61076 -59066 -79515 -83761 -110932 -76987
2714 -76987 -88938 -66863 -85590 -131168 -104897 -110892 -141141 -69664 -28689 -63113 -101529 -93518
2702 -93518 -105394 -133762 -114741 -85276 -51129 -93852 -66016 -84698 -71945 -47576 -48904 -78922
2690 -78922 -87005 -65945 -97185 -131221 -102927 -79215 -49788 -11081 -49347 -89049 -59502 -44738
2678 -44738 -46155 -21229 -65410 -128320 -97565 -135180 -102486 -97799 -29305 -41305 -104906 -105320 -117713
2665 -117713 -97871 -97627 -105414 -68646 -104370 -117470 -129337 -107580 -123525 -61966 -41146 -76584
2653 -76584 -96467 -100512 -93533 -76029 -94598 -114811 -93369 -60661 -124223 -164784 -113677 -111972
$$ packed form
2738d9833o756K0774J445m0225k803J3956J0010J1346k0486j5511M0653j5198
2726e2628n3558P1630J9525l6814j7098K7993k0126K010k0449m246k7171L3945
2714g6987j1951K2075j8727m5578K6271n995l0249P1477M0975l4424l8416Q011
2702i3518j1876k8368J9021K9465L4147m2723K7836j8682J2753K4369j328l0018
2690g8922q083K1060l1240l4036K8294K3712K9427L8707l8266l9702K9547J4764
2678d4738j417K4926m4181o2910L0755l7615L2694M687O8494j2000o3601m14j2393
2665a17713J9842K44p787L6768l5724j3100j1867K1757j5945O1559K0820l5438
2653g6584j9883m045O979J7504j8569k0213K1442L2708o3562m0561N1107J705
$$ plain form
2641 -111972 -120497 -106885 -76144 -127319 -105386 -132299 -96402 -147238 -130654 -66366 -111226 -96942
2629 -96942 -93423 -79406 -103820 -85094 -108310 -97859 -40084 -41975 -70632 -75600 -81083 -91337 -111276
2616 -111276 -130165 -110843 -98720 -36261 -50336 -97088 -74225 -73536 -81238 -43749 -61396 -148804
2604 -148804 -162254 -151714 -117612 -138773 -109195 -147578 -160979 -131523 -142925 -94678 -118353 -48325
2592 -48325 -88876 -95024 -58357 -124962 -73275 -71751 -106597 -146258 -188502 -109985 -83426 -8075
2580 -8075 -31091 -82498 -123040 -109314 -129454 -77409 -57298 -62990 -45406 -116242 -101746 -95548
2568 -95548 -81898 -54076 -50647 -68440 -94905 -56133 -50228 -70446 -24193 -52611 -55162 -49103 -97280
2555 -97280 -151971 -74773 -76224 -77306 -65638 -108434 -64605 -41404 -32760 -39377 -53513 -76273 -27721
$$ packed form
2641a11972q525J3612L0741n1175K1933k6913L5897n0836J6584O4288m4860J4284
2629i6942L519J4017k4414J8726k3216J0451N7775j891k8657m968n483j0254j9939
2616a11276j8889J9322J2123O2459j4075m6752K2863O89p702L7489j7647q7408
2604a48804j3450J0540L4102k1161K9578l8383j3401K9456j1402M8247k3675P0028
2592d8325m0551o148L6667o6605N1687J524l4846l9661m2244P8517K6559P5351
2580h075k3016n1407m0542J3726k0140N2045K0111n692J7584p0836J4496O198
2568i5548J3650K7822L429j7793k6465L8772N905k0218M6253k8418k551O059m8177
2555i7280n4691P7198j451j082J1668m2796M3829K3201Q644o617j4136k2760M8552
$$ plain form
2542 -27721 -15878 -42381 -42129 -70209 -55455 -22446 -78816 -67961 -38780 -44660 -66227 -87477
2530 -87477 -56667 -105873 -131208 -134462 -72360 -62152 -69878 -50245 -124776 -79240 -89203 -99174 -64798
2517 -64798 -97946 -90114 -126986 -105807 -124220 -71491 -100281 -75770 -62056 -118050 -131487 -92577
2505 -92577 -97819 -154312 -89524 -37201 -30460 -57707 -55634 -53129 -18721 -32475 -70185 -19790 -103218
2492 -103218 -101293 -39139 -83013 -80858 -91864 -110766 -108260 -90865 -88200 -49307 -80779 -90012 -66753
2479 -66753 -76838 -92981 -68785 -121960 -61964 -24546 -23146 -27476 -67850 -52279 -67908 -59232
2467 -59232 -50561 -73930 -74529 -61067 8116 12621 -22118 -28095 -5014 -27670 -5236 42222 28324
2454 28324 5677 31806 45418 34438 29906 1691 -16370 30962 33000 24694 26616 2960 1972
$$ packed form
2542b7721J1843k6503K52k8080J4754L3009n6370J0855K9181n880k1567k1250
2530h7477L0810m9206k5335l254O2102J0208p726J9633p4531M5536r963r971L4376
2517f4798l3148P832l6872K1179j8413N2729k8790K4511J3714n5994j3437L8910
2505i2577n242n6493O4788N2323O741k7247K073K505L4408j3754l7710N0395q3428
2492a03218J925O2154m3874K155j1006j8902K506J7395K665L8893l1472r233K3259
2479f6753j0085j6143K4196n3175N9996L7418J400m330m0374J5571j5629Q676
2467e9232Q671k3369n99J3462O9183M505l4739n977K3081k2656K2434M7458j3898
2454B8324k2647K6129J3612j0980m532k8215j8061M7332K038q306J922k3656r88
$$ plain form
2441 1972 10863 1026 -47339 -56145 -26599 -31258 -89798 -14578 -23009 -93522 -100482 -13032 -35266
2428 -35266 -16658 -36288 -76305 -74306 -52793 -77127 -66673 -39772 -101983 -89378 -66671 -20339
2416 -20339 -48596 -66155 -90647 -36465 -20070 -78946 -75244 -26855 -35360 -25537 -21234 -25387 -31165
2403 -31165 -66717 -81852 -41560 -96495 -65157 -41324 -52363 -61480 -32080 826 -53375 -44178
2391 -44178 -64207 -16675 -39196 -27560 -43559 -4067 -10843 -1915 -33519 -34179 22328 -17903 -68336
2378 -68336 -64969 -39438 -42633 -58862 -55894 -27316 -47228 -67784 -101189 -94248 -58641 -74509 -72261
2365 -72261 -57022 -22825 -6033 -31173 7031 85118 14987 12714 40113 3274 -40892 -39819
2353 -39819 -275 15345 14336 -1387 25930 -10375 7675 23338 -4758 26220 94828 25034
$$ packed form
2441A972Q891r837m8365q806K9546m659n8540P5220q431p0513o960Q7450k2234
2428c5266J8608j9630m0017J999K1513k4334J0454K6901o2211J2605K2707M6332
2416b0339k8257j7559k4492N4182J6395n8876L702M8389q505R823M303m153n778
2403c1165l5552j5135M0292n4935L1338K3833j1039r117K9400L2906n4201R197
2391d4178k0029M7532k2521J1636j5999L9492o776Q928l1604o60N6507m0231n0433
2378f8336L367K5531l195j6229K968K8578j9912k0556l3405O941L5607j5868K248
2365g2261J5239L4197J6792k5140L8204P8087p0131k273K7399l6839m4166J073
2353c9819L9544J5620j009j5723K7317l6305J8050J5663k8096L0978O8608o9794
$$ plain form
2341 25034 -16698 38491 25210 25753 26910 55784 36477 29201 7535 1109 24787 48734 77481
2328 77481 83351 43884 3671 -64 -9684 -1001 46269 72312 59312 59736 21496 23022 61551
2315 61551 42924 68940 101701 108119 73006 15340 -54463 -39926 13883 64407 79184 37181
2303 37181 60055 104680 151122 121209 108456 91615 112174 82373 103209 82551 59049 86128
2291 86128 77358 102354 109037 67935 87466 97711 152480 126370 124374 112547 163558 187732
2279 187732 141606 178611 189005 159482 198899 194956 218560 253126 184006 212892 280110 298573
2267 298573 306139 327679 345279 334536 281475 327208 361278 334199 389215 388035 346278 357665
2255 357665 334068 401855 422395 471265 477989 461052 459706 454281 447742 458678 533974 549365
$$ packed form
2341B5034m1732N5189j3281N43J157K8874j9307p276k1666o426K3678K3947K8747
2328G7481N870l9467m0213l735r620Q683M7270K6043j3000M24l8240J526L8529
2315F1551j8627K6016L2761O418l5113n7666o9803J4537N3809N0524J4777m2003
2303C7181K2874M4625M6442k9913j2753j6841K0559k9801K0836k0658k3502K7079
2291H6128q770K4996O683m1102J9531J0245N4769k6110j996j1827N1011K4174
2279A87732m6126L7005J0394k9523L9417l943K3604L4566o9120K8886O7218J8463
2267B98573P566K1540J7600j0743n3061M5733L4070k7079N5016j180m1757J1387
2255C57665k3597O7787K0540M8870O724j6937j346n425o539J0936P5296J5391
$$ plain form
2243 549365 558941 569458 569905 554148 590568 610572 611738 654142 671385 659537 665319 681483 701395
2230 701395 713485 749313 782687 815611 829520 870896 906752 968859 1032587 1076463 1119697 1191584
2218 1191584 1262541 1371137 1447649 1565382 1652480 1734595 1824429 1888824 2008148 2091995 2178008
2207 2178008 2311060 2445979 2614689 2780817 3078924 3403890 3724913 3962560 4192372 4525763
2197 4525763 4992023 5510018 6134916 6882049 7780825 8948795 10302356 12036401 14602593
2188 14602593 18516879 22922861 24876101 22392060 18678290 15215043 12193553 9808998
2180 9808998 8087550 6806002 5806637 5076345 4548828 4146186 3841263 3530791 3320016
2171 3320016 3136692 2890865 2718100 2513596 2306358 2078092 1932732 1812130 1726891 1577976
$$ packed form
2243E49365R576J0517M47j5757L6420K0004J166M2404J7243j1848N782J6164J9912
2230G01395J2090L5828L3374L2924J3909M1376L5856O2107O3728M3876M3234P1887
2218A191584P0957J08596P6512J17733Q7098Q2115Q9834O4395J19324Q3847Q6013
2207B178008J33052J34919J68710J66128K98107L24966L21023K37647K29812L33391
2197D525763M66260N17995O24898P47133Q98776J167970J353561J734045K566192
2188A4602593L914286M405982J953240k484041l713770l463247l021490k384555
2180I808998j721448j281548r99365p30292n27517m02642l04923l10472k10775
2171C320016j83324k45827j72765k04504k07238k28266j45360j20602q5239j48915
$$ plain form
2161 1577976 1517448 1434098 1327957 1292008 1229273 1181599 1150239 1047414 1048726 1062489 973945
2150 973945 883468 877189 800216 756605 754838 682229 666139 706848 703086 642711 629043 581542
2138 581542 595785 548805 535968 551246 470415 455738 417924 434850 415160 379684 347039 350039
2126 350039 354208 360937 317861 280036 336531 340850 278176 275269 244125 266155 268739 266873 200760
2113 200760 188072 177478 248819 284386 254228 224714 192252 185926 187220 181359 192289 170145
2101 170145 153674 152449 160152 141998 130719 136122 103638 76598 97642 98505 115038 109535 101360
2088 101360 128558 153189 133886 121808 94030 77026 91776 96968 68434 84156 121256 128602
2076 128602 101064 86745 78715 85291 92446 79816 49379 71060 76573 7351 -3423 6148 43259
$$ packed form
2161A577976o0528q3350j06141l5949o2735m7674l1360j02825J312J3763q8544
2150I73945r0477o279p6973m3611j767p2609j6090M0709l762o0375j3668m7501
2138E81542J4243m6980j2837J5278q0831j4677l7814J6926j9690l5476l2645L000
2126C50039M169O729m3076l7825N6495M319o2674k907l1144K2030K584j866o6113
2113B00760j2688j0594P1341L5567l0158k9514l2462o326J294n861J0930k2144
2101A70145j6471j225P703j8154j1279N403l2484k7040K1044Q63J6533n503q175
2088A01360K7198K4631j9303j2078k7778j7004J4750N192k8534J5722L7100P346
2076A28602k7538j4319q030O576P155j2630l0437K1681N513o9222j0774R571L7111
$$ plain form
2063 43259 62372 2513 -16673 10142 54863 110272 99294 95730 15250 9295 32554 48759
2051 48759 20581 28987 33448 12801 28440 2928 -12850 20201 -10824 10603 32509 41842
2039 41842 -2126 77328 71145 57320 33326 7551 13337 -14394 -1450 17273 7319 -7127
2027 -7127 -24452 -13093 24906 -17089 -750 30061 37928 -5570 9289 20914 20376 -1284 -48058
2014 -48058 -250 3811 24055 46771 28126 17379 -10253 -21852 -18150 -1337 11526 -10857
2002 -10857 2617 49286 20525 6439 -26653 -31479 -41099 1805 23839 -45847 -54896 -32259
1990 -32259 -25466 -38944 -30588 -14411 -2492 -30900 3274 -1603 -54997 -47929 -17536 -31406 -6358
1977 -6358 -19688 -11289 -25740 -58474 -13295 -20747 -51142 -44484 -18857 -18716 -5477 -36480 -23766
$$ packed form
2063D3259J9113n9859j9186K6815M4721N5409j0978l564q0480n955K3259J6205
2051D8759k8178Q406M461k0647J5639k5512j5778L3051l1025K1427K1906R333
2039D1842m3968P9454o183j3825k3994k5775N786k7731J2944J8723r954j4446
2027g127j7325J1359L7999m1995J6339L0811P867m3498J4859J1625n38k1660m6774
2014d8058M7808M061K0244K2716j8645j0747k7632j1599L702J6813J2863k2383
2002a0857J3474M6669k8761j4086l3092m826r620M2904K2034o9686r049K2637
1990c2259O793j3478Q356J6177J1919k8408L4174m877n3394P068L0393j3870K5048
1977f358j3330Q399j4451l2734M5179p452l0395O658K5627J41J3239l1003J2714
$$ plain form
1964 -23766 -45291 -83462 -87197 -40775 862 10290 2616 -7502 -58387 -69113 -69848 -62345 -19690
1951 -19690 -8765 25033 6086 -6568 -1141 -3481 -21871 -46447 -46169 -56515 -35764 -23562 -13855
1938 -13855 9249 -20384 -6009 -40911 -35181 -39491 -31474 -31314 -22344 -3480 5389 4700 -24133 -31519
1924 -31519 -33703 55350 47312 15542 3972 53831 76706 14014 71226 59715 74207 85676
1912 85676 23779 425 58444 11869 -52349 -9534 -14994 30948 -16867 -34153 1773 -2186
1900 -2186 20452 14142 12667 -26331 -56991 -60875 -33496 -35383 -9798 -1772 -26440 -1935 -1953 16811
1886 16811 -36592 -37927 -32356 -39212 -49879 -54297 -70590 263 41535 235 -27887 719 3607
1873 3607 -12158 -2147 15541 -10587 -76678 -62808 -62005 -41898 -27559 -42971 -38082 -15753 -16422
$$ packed form
1964b3766k1525l8171l735M6422M1637R428p674j0118n0885j0726p35P503M2655
1951a9690J0925L3798j8947j2654N427k340j8390k4576K78j0346K0751J2202R707
1938a3855K3104k9633J4375l4902N730m310Q017J60Q970J8864Q869o89k8833p386
1924c1519k184Q9053q038l1770j1570M9859K2875o2692N7212j1511J4492J1469
1912H5676o1897k3354N8019m6575o4218M2815n460M5942m7815j7286L5926l959
1900b186K2638o310j475l8998l0660l884K7379j887K5585Q026k4668K4505j8J8764
1886A6811n3403j335N571o856j0667m418j6293P0853M1272m1300k8122K8606K888
1873C607j5765J0011J7688k6128o6091J3870Q03K0107J4339j5412M889K2329o69
$$ plain form
1860 -16422 -26737 4439 -54558 -56324 -66364 -35128 -19680 -13953 -21067 -14098 41270 -19529 -74006
1847 -74006 -44149 -13599 -19336 -18807 -28729 -29371 -47930 -60395 -76255 -77461 -41970 -79509 -34296
1834 -34296 -46738 -53326 -44825 -92723 -36691 -45666 -26064 -38534 -53946 -93797 -71902 -74525 -82387
1821 -82387 -45582 -114133 -106396 -67865 -103650 -134373 -110980 -67188 -7953 -21557 -23247 -28193
1809 -28193 -54012 -75711 -92293 -36661 -24535 -10260 -13612 3966 -20758 -21899 -50918 -63945
1797 -63945 -43877 -24697 16552 5187 -9883 -30715 -67245 -30328 -4581 24305 -2779 -45995
1785 -45995 -58322 -32779 -45909 -70326 -58706 -35022 -51441 -38372 1923 -12643 -13173 -31157
1773 -31157 6616 34034 14315 16814 -17963 -21492 4325 9614 -7619 -6329 -46157 -60996 -41375
$$ packed form
1860a6422j0315L1176n8997j766j0040L1236J5448N727p114O969N5368o0799n4477
1847g4006K9857L0550n737N29r922o42j8559j2465j5860j206L5491l7539M5213
1834c4296j2442o588Q501m7898N6032q975J9602j2470j5412l9851K1895k623p862
1821h2387L6805o8551P737L8531l5785l0723K3393M3792N9235j3604j690m946
1809b8193k5819k1699j6582N5632J2126J4275l352J7578k4724j141k9019j3027
1797f3945K0068J9180M1249j1365j5070k0832l6530L6917K5747K8886k7084m3216
1785d5995j2327K5543j3130k4417J1620K3684j6419J3069M0295j4566n30j7984
1773c1157L7773K7418j9719K499l4777l529K5817N289j7233J290l9828j4839J9621
$$ plain form
1760 -41375 -53116 -45114 -69398 -49858 -71033 -63203 -72619 -98965 -46403 -12326 -29316 -12535
1748 -12535 31683 -1169 -5890 -21889 -52123 -61449 -85215 -59631 -46228 -42326 -22929 34222
1736 34222 34093 31207 -24209 -31468 18590 -6187 -33028 -49259 -39588 -43740 -34959 -69308 -56330
1723 -56330 -90683 -68120 -4099 15236 -5679 -42334 37937 49619 3082 -1649 -76709 -104850
1711 -104850 -105232 -79061 -79209 -78863 -28864 -24273 7728 -20205 13868 -47216 -50050 -6818 -7532 205
1697 205 3290 13713 -1583 1754 10043 17845 24847 -65032 -58200 -62605 -84080 -10575 -39061 -27535
1683 -27535 -30207 -44778 -63245 -58559 -42257 -10066 -41143 -41235 2312 -61051 -60860 -64551 -18012
1670 -18012 2813 -19373 -55147 -82127 -52917 -10526 -49139 -12787 12421 8467 16721 -6111
$$ packed form
1760d1375j1741Q002k4284J9540k1175P830r416k6346N2562L4077j6990J6781
1748a2535M4218l2852m721j5999l0234r326k3766K5584J3403L902J9397N7151
1736C4222j29k886n5416p259N0058k4777k6841j6231R671m152Q781l4349J2978
1723e6330l4353K2563O4021J9335k0915l6655Q0271J1682m6537m731p5060k8141
1711a04850l82K6171j48L46M9999M591L2001k7933L4073o1084k834M3232p14P737
1697B05L085J0423j5296L337Q289P802P002q9879O832m405k1475P3505k8486J1526
1683b7535k672j4571j8467M686J6302L2191l1077r2M3547o3363J91l691M6539
1670a8012K0825k2186l5774k6980K9210M2391l8613L6352K5208l954Q254k2832
$$ plain form
1658 -6111 42992 49010 10459 -11217 10034 15839 5028 17932 7140 -6075 -5789 -57599 -37122
1645 -37122 -15364 -33986 -32103 -53206 -83557 -61553 -47929 -30030 17149 19893 31624 37786
1633 37786 13 -25429 4697 -31694 -51490 -19286 -43137 -25094 -43960 -28887 -22603 -54211
1621 -54211 -54792 -36919 -65389 -44945 -47711 -57664 -86604 -133205 -71401 -9938 9664 -11663 -2202
1608 -2202 72337 52452 13438 -1300 -31357 -49744 -51678 -23813 10692 41359 -1097 -49477
1596 -49477 -65459 -56325 -42512 -49180 -55363 -43134 -101294 -56706 -27250 -56514 31285 -14092
1584 -14092 -22881 7359 39719 1492 -53431 2441 40853 -7326 -52271 -10746 -19909 18981
1572 18981 -49935 -35047 -12668 -13180 -8591 -18328 10745 -11258 -23751 -35189 -57861 -51989 -24239
$$ packed form
1658f111M9103O018l8551k1676K1251N805j0811J2904j0792j3215K86n1810K0477
1645c7122K1758j8622J883k1103l0351K2004J3624J7899M7179K744J1731O162
1633C7786l7773k5442L0126l6391j9796L2204k3851J8043j8866J5073O284l1608
1621e4211n81J7873k8470K0444k766r953k8940m6601O1804O1463J9602k1327R461
1608b202P4539j9885l9014j4738l0057j8387j934K7865L4505L0667m2456m8380
1596d9477j5982R134J3813o668o183J2229n8160M4588K9456k9264Q7799m5377
1584a4092q789L0240L2360l8227n4923N5872L8412m8179m4945M1525r163L8890
1572A8981o8916J4888K2379n12M589r737K9073k2003j2493j1438k2672N872K7750
$$ plain form
1559 -24239 -10828 -33990 -2012 997 -18729 -47908 -104112 -67380 -53071 -65673 -86412 -53519
1547 -53519 -25368 -13766 -23998 -806 17915 26236 -60933 -95500 -44131 -58193 -14030 -21530
1535 -21530 -41344 -37201 -45385 -54911 -61638 -46836 4713 4152 13048 7904 -3338 -49016 -63332
1522 -63332 -50333 -13087 26407 8403 44995 -17628 -23914 -1217 37660 40141 20952 -11148
1510 -11148 16061 -2035 -38256 -6115 11538 19253 -29578 -27635 -38231 58958 68298 8133
1498 8133 -39140 -51286 18264 31897 2507 15294 32025 39830 30212 22291 55044 11327 -29784
1485 -29784 -3161 -44006 12579 78564 -10077 -9955 -4305 34027 3462 7506 23774 9946 -27589
1472 -27589 -56850 -27781 3414 -37984 -30389 -23486 -11506 -37719 -80862 -60176 -45151 -862
$$ packed form
1559b4239J3411k3162L1978L009j9726k9179n6204L6732J4309j2602k0739L2893
1547e3519K8151J1602j0232K3192J8721Q321q7169l4567N1369j4062M4163p500
1535b1530j9814M143q184r526o727J4802N1549n61Q896n144j1242m5678j4316
1522f3332J2999L7246L9494j8004L6592o2623o286K2697L8877K481j9189l2100
1510a1148K7209j8096l6221L2141J7653P715m8831J943j0596R7189R340o0165
1498H133m7273j2146O9550J3633k9390J2787J6731P805r618p921L2753m3717m1111
1485b9784K6623m0845N6585O5985q8641J22N650L8332l0565M044J6268j3828l7535
1472b7589k9261K9069L1195m1398P595O903J1980k6213m3143K0686J5025M4289
$$ plain form
1460 -862 -17207 -55156 -41922 -7063 -40600 -78055 -45171 -29751 1435 28740 53931 198
1448 198 -17500 -23240 -43482 -35387 -50573 -62300 -4663 7181 -9573 -53691 -55051 -36753 -13907
1435 -13907 32782 36051 4471 -26238 -16693 2794 8832 -49364 1012 -19174 -44598 -54418 -28935
1422 -28935 -21330 -5547 -31349 -2036 -17274 -11210 -74678 -62962 -21242 8639 21053 1868
1410 1868 -17617 -24339 -52355 -72548 -100044 -64980 -85721 -63517 23230 33461 9774 -618
1398 -618 13880 28145 16779 -30319 -42604 -36579 -39163 -22332 -47678 -53252 -29635 -10642 4881
1385 4881 -38919 -33778 -20760 -23385 -53323 -24477 -45779 -25665 27930 -3022 -43023 -47045 -13981
1372 -13981 -31181 -82284 -36972 -13861 -53138 -21504 19980 31759 48095 24666 -12429 -46524
$$ packed form
1460h62j6345l7949J3234L4859l3537l7455L2884J5420L1186K7305K5191n3733
1448A98j7698n740k0242Q095j5186j1727N7637J1844j6754m4118j360J8298K2846
1435a3907M6689L269l1580l0709R545J9487O038n8196N0376k0186k5424r820K5483
1422b8935P605J5783k5802K9313j5238O064o3468J1716M1720K9881J2414j9185
1410A868j9485o722k8016k0193k7496L5064k0741K2204Q6747J0231k3687j0392
1398f18J4498J4265j1366m7098j2285O025k584J6831k5346n574K3617J8993J5523
1385D881m3800N141J3018k625k9938K8846k1302K0114N3595l0952m0001m022L3064
1372a3981j7200n1103M5312K3111l9277L1634M1484J1779J6336k3429l7095l4095
$$ plain form
1360 -46524 3346 9247 -14064 39678 73464 56586 78271 3191 32271 11059 26468 15663
1348 15663 14551 -16641 -20873 -460 9750 -6814 -26557 -59023 -68556 -10622 -1815 -13771 -28024
1335 -28024 -46827 -18538 -12111 -35246 -23660 -57239 -40070 -25335 9129 56828 19607 16238
1323 16238 48078 7172 -33128 15084 34586 13585 4581 -66909 -47024 -35155 -41790 -12053
1311 -12053 25664 -19593 -13949 -48774 -51327 -11558 25458 -2786 8405 11033 -6008 -26980
1299 -26980 -42046 8533 16329 2840 5517 -31374 4966 59184 45943 39624 -8338 -28122
1287 -28122 -42478 4078 -21488 -83878 -68325 -6952 -14580 -39348 -9228 -12073 45516 51032
1275 51032 -29268 -40108 -10862 16300 -14512 -30405 -12517 7880 28735 30871 -32904 -38430
$$ packed form
1360d6524M9870N901k3311N3742L3786j6878K1685p5080K9080k1212J5409j0805
1348A5663j112l1192m232K0413J0210j6564j9743l2466r533N7934Q807j1956j4253
1335b8024j8803K8289O427k3135J1586l3579J7169J4735L4464M7699l7221l369
1323A6238L1840m0906m0300M8212J9502k1001r004p1490J9885J1869o635K9737
1311a2053L7717m5257N644l4825k553L9769L7016k8244J1191K628j7041k0972
1299b6980j5066N0579P796j3489K677l6891L6340N4218j3241o319m7962j9784
1287b8122j4356M6556k5566o2390J5553O1373p628k4768L0120k845N7589N516
1275E1032q0300j0840K9246K7162l0812j5893J7888K0397K0855K136o3775n526
$$ plain form
1263 -38430 -32060 -11379 7224 30027 24737 32645 8505 -27198 -22606 -41204 -67116 -40755 2186
1250 2186 20628 38705 20990 -33683 -63252 -7442 24371 -13639 -56422 41943 62728 6393
1238 6393 292 38694 16975 23226 32145 26576 -4754 -40071 -91198 -88944 -12833 -30452 20051
1225 20051 1407 -52460 -19162 -8932 10413 31914 24681 -19079 35276 39686 37597 40039 28811
1212 28811 63023 -289 -41543 -56904 -54473 -47043 -15982 22 -19055 -18765 -10432 56338 29834
1199 29834 -5582 10732 -33416 4231 -8967 -36224 -10976 -35830 -51429 -20764 -11807 -40194
1187 -40194 3060 5667 8371 -24667 18356 -33460 -38810 33247 -8898 -32069 -5228 3795 -44789
1174 -44789 1369 42942 43348 36991 38754 17873 31526 37967 30894 43906 27892 9577 -643
$$ packed form
1263c8430O370K0681J8603K2803n290P908k4140l5703M592j8598k5912K6361M2941
1250B186J8442J8077j7715n4673k9569N5810L1813l8010m2783R8365K0785n6335
1238F393o101L8402k1719O251Q919n569l1330l5317n1127K254P6111j7619N0503
1225B0051j8644n3867L3298J0230J9345K1501p233m3760N4355M410k089K442j1228
1212B8811L4212o3312m1254j5361K431P430L1061J6004j9077K90Q333O6770k6504
1199B9834l5416J6314m4148L7647j3198k7257K5248k4854j5599L0665Q957k8387
1187d0194M3254K607K704l3038M3023n1816n350P2057m2145k3171K6841R023m8584
1174d4789M6158M1573M06o357J763k0881J3653O441p073J3012j6014j8315j0220
$$ plain form
1161 -643 -20302 -1844 -5480 -9973 8991 -29771 11385 35939 -39491 679 -4287 58870 20794
1148 20794 -12118 -13344 3851 49136 37120 -18003 26422 14704 1519 41690 20643 9756
1136 9756 -46434 -26299 13193 10081 18611 25907 25298 -12605 -11917 38711 37015 6569 -49280 -76174
1122 -76174 -48225 -19286 -21675 -9658 -54743 4789 26001 35509 6754 26634 12929 3041
1110 3041 18756 4209 -21227 -14538 14223 -8266 -16221 11757 30369 9811 -29096 -12498
1098 -12498 14864 11183 28655 33723 -12055 -15796 -44643 -14071 -56621 -7063 8477 -79510
1086 -79510 -72532 -55231 -2250 -15422 53200 8367 22548 52623 33350 18560 7910 29820
1074 29820 64159 47613 14905 52565 30630 8482 22375 14369 -17995 -913 13118 -31850
$$ packed form
1161f43j9659J8458l636m493J8964l8762M1156K4554p5430M0170m966O3157l8076
1148B0794l2912j226J7195M5285j2016n5123M4425j1718j3185M0171k1047j0887
1136I756n6190K0135L9492l112Q530P296o09l7903O88N0628j696l0446n5849k6894
1122g6174K7949K8939k389J2017m5085N9532K1212R508k8755J9880j3705r888
1110C041J5715j4547k5436O689K8761k2489p955K7978J8612k0558l8907J6598
1098a2498K7362l681J7472N068m5778l741k8847L0572m2550M9558J5540q7987
1086g9510O978J7301N2981j3172O8622m4833J4181L0075j9273j4790j0650K1910
1074B9820L4339j6546l2708L7660k1935k2148J3893q006l2364J7082J4031m4968
$$ plain form
1062 -31850 -22575 -23102 -39000 -54433 -48366 6890 19042 -5039 -13357 -2043 -22312 -61680 -32124
1049 -32124 -42763 -8783 -18241 1236 41031 -11406 8683 -686 8557 6989 -8397 -24825 -35925
1036 -35925 28513 57483 100361 68254 80498 62352 13261 11070 19309 54914 24146 -8063
1024 -8063 11114 -38313 -44045 -37166 -27456 26915 53664 35370 44977 35998 21625 -7037 8893
1011 8893 11770 -112 26471 -19115 -2323 3629 -30695 -17560 -19310 -40070 -10709 21156 8822
998 8822 1408 -24964 -4219 10903 -10589 2861 14301 55775 47177 44251 19224 21041 12666
985 12666 46260 6229 -46962 -12613 -28174 -21466 -10294 8089 12004 4912 -800 -27423 -9964
972 -9964 -7953 -5290 -17168 -51790 -47473 -8910 -18539 -12532 -2449 -8201 -21283 613 7807 -16631
$$ packed form
1062c1850R275n27j5898j5433O067N5256J2152k4081q318J1314k0269l9368K9556
1049c2124j0639L3980r458J9477L9795n2437K0089r369R243j568j5386j6428j1100
1036c5925O4438K8970M2878l2107J2244j8146m9091k191Q239L5605l0768l2209
1024h063J9177m9427n732O879R710N4371K6749j8294R607q979j4373k8662J5930
1011H893K877j1882K6583m5586J6792N952l4324J3135j750k0760K9361L1865j2334
998H822p414k6372K0745J5122k1492J3450J1440M1474q598k926k5027J817q375
985A2666L3594m0031n3191L4349j5561O708J1172J8383L915p092n712k6623J7459
972i964K011K663j1878l4622M317L8563r629O007J0083n752j3082K1896P194k4438
$$ plain form
958 -16631 940 33832 6042 -18194 -56946 -64478 -28660 -29881 -38383 -10937 -25098 -2287 28028
945 28028 32233 39045 26364 8974 36042 30450 47003 8861 1749 31343 1353 2974 -28419
932 -28419 9976 64693 12271 -4182 -3201 -39473 618 21064 54941 14341 52538 71172
920 71172 15742 -5966 -8629 -8869 -2138 32995 52504 47606 61111 58445 65232 37542 84623
907 84623 35430 -683 41119 38459 54597 59775 65266 32346 42595 -31327 -2915 4906 -27836
894 -27836 -73193 -44153 1602 -3778 37884 29016 -18904 -26030 210 32965 34370 18671 8844
881 8844 -7138 -8065 -20851 -311 3858 21420 64773 56449 43450 24130 14864 14974 24625 51831
867 51831 12541 30308 38393 43243 18225 -20306 2571 -3167 -31658 -13930 6023 4696 11561
$$ packed form
958a6631J7571L2892k7790k4236l8752p532L5818j221q502K7446j4161K2811L0315
945B8028M205O812j2681j7390K7068n592J6553l8142p112K9594k9990J621l1393
932b8419L8395N4717n2422j6453R81l6272M0091K0446L3877m0600L8197J8634
920G1172n5430k1708k663k40O731L5133J9509m898J3505k666O787k7690M7081
907H4623m9193l6113M1802k660J6138N178N491l2920J0249p3922K8412P821l2742
894b7836m5357K9040M5755n380M1662q868m7920p126K6240L2755J405j5699r827
881H844j5982r27j2786K0540M169J7562M3353q324j2999j9320r266J10R651K7206
867E1831l9290J7767Q085M850k5018l8531K2877n738k8491J7728J9953j327O865
$$ plain form
854 11561 66220 58167 11555 -10500 34138 39164 3469 -27855 1147 23693 10096 -6502
842 -6502 -12298 -3770 17391 24805 644 24114 11504 18454 32769 -15501 -20633 31868 55846
829 55846 64186 17577 -13374 9997 26478 6359 15680 45548 559 -38449 -48748 -58649 5691
816 5691 -4101 -23905 35020 58964 61281 17492 10889 41720 75645 51778 43429 22489 11638
803 11638 11786 20019 38438 -320 -11278 -13147 14205 36002 9115 35938 42233 -14873 -7900
790 -7900 31345 18670 -8804 44518 -10145 -28921 -27141 -3860 20128 39854 10996 -42230
778 -42230 -5795 -22626 -25424 -7688 20278 8335 3247 -15162 -3996 6711 22587 3424
766 3424 33853 38911 -6534 -18119 3087 24187 13335 33527 57005 23878 -8754 2494
$$ packed form
854A1561N4659q053m6612k2055M4638N026l5695l1324K9002K2546j3597j6598
842f502n796Q528K1161P414k4161K3470j2610O950J4315m8270n132N2501K3978
829E5846Q340m6609l0951K3371J6481k0119R321K9868m4989l9008j0299r901O4340
816E691r792j9804N8925K3944K317m3789o603L0831L3925k3867q349k0940j0851
803A1638J48Q233J8419l8758j0958j869K7352K1797k6887K6823O295n7106O973
790g900L9245j2675k7474N3322n4663j8776J780K3281K3988J9726k8858n3226
778d2230L6435j6831k798J7736K7966j1943n088j8409J1166J0707J5876j9163
766C424L0429N058m5445j1585K1206K1100j0852K0192K3478l3127l2632J1248
$$ plain form
754 2494 -5518 7254 25646 8983 599 -23762 13003 36179 -29911 38205 76655 -595 -12122
741 -12122 -504 -40656 -6972 -15382 21496 69467 64374 47683 60815 68867 63168 51147 12410
728 12410 -648 15936 36519 27491 8673 41463 50127 57089 44724 53481 46032 39353 23518
715 23518 3489 53809 17106 24021 -740 23720 28068 2835 -4652 43523 67680 31799 35141
702 35141 31403 49035 23468 18736 21851 44532 66050 58634 21790 11766 -27271 -10013 51463
689 51463 32212 1314 -10379 6067 9016 -4109 34569 33680 15589 -4428 -5846 319 20859
676 20859 -2233 -28794 -38107 -27996 -35090 22597 12353 58777 69489 -6110 24694 42741
664 42741 36053 16627 25765 10822 35859 30858 -6436 29289 35416 48274 34041 25839 28536
$$ packed form
754B494q012J2772J8392j6663q384k4361L6765K3176o6090O8116L8450p7250j1527
741a2122J1618m0152L3684q410L6878M7971n093j6691J3132Q052n699j2021l8737
728A2410j3058J6584K0583r028j8818L2790Q664O962j2365Q757p449o679j5835
715B3518k0029N0320l6703O915k4761K4460M348k5233p487M8175K4157l5881L342
702C5141l738J7632k5567m732L115K2681K1518p416l6844j0024l9037J7258O1476
689E1463j9251l0898j1693J6446K949j3125L8678q89j8091k0017j418O165K0540
676B0859k3092k6561r313J0111p094N7687j0244M6424J0712p5599L0804J8047
664D2741o688j9426R138j4943K5037n001l7294L5725O127J2858j4233q202K697
$$ plain form
651 28536 17657 48103 30261 45657 56149 21004 -1950 -17014 11793 19173 27848 40543
639 40543 11138 34459 46563 29327 -17271 -33589 -17408 31774 -19987 3874 14604 28566
627 28566 36599 50011 45776 22691 -15019 10584 4440 15616 -11546 5961 6755 1559 28289
614 28289 36439 5358 12512 57206 35726 6065 -50703 -34039 -27692 -6986 72964 26360 -14236
601 -14236 31679 45741 48456 55563 60015 27074 26798 38264 42676 12640 36134 57041 70972
588 70972 31000 -6129 -6661 -11721 -8127 1082 -2353 -6584 10575 -24538 23858 46644 36672 54895
574 54895 47134 34353 15602 45455 40324 -9525 -20985 16422 36802 3266 -5140 -10489 26755
561 26755 41934 50810 28839 2299 42041 -1431 6144 -10650 22870 -8063 17596 75908
$$ packed form
651B8536j0879L0446j7842J5396J0492l5145k2954j5064K8807P380Q675J2695
639D0543k9405K3321J2104j7236m6598j6318J6181M9182n1761K3861J0730J3962
627B8566Q033J3412m235k3085l7710K5603o144J1176k7162J7507P94n196K6730
614B8289Q150l1081P154M4694k1480k9661n6768J6664O347K0706P9950m6604m0596
601a4236M5915J4062K715P107M452l2941k76J1466M412l0036K3494K0907J3931
588G0972l9972l7129n32n060L594R209l435m231J7159l5113M8396K2786r972J8223
574E4895p761j2781j8751K9853n131m9849j1460L7407K0380l3536q406n349L7244
561B6755J5179Q876k1971k6540L9742m3472P575j6794L3520l0933K5659N8312
$$ plain form
549 75908 62515 108454 77556 21070 -20939 -5723 -27515 3505 16723 -19625 -6072 7994
537 7994 41684 5985 -6190 13915 15533 106 34639 51686 47486 48624 58125 11237 31298
524 31298 27178 43829 39877 -1255 -27712 32810 3247 23375 48056 67952 61197 25993 44803
511 44803 21780 41583 109020 58515 38131 49726 23153 46900 -10359 -15251 -1534 11967
499 11967 23952 45437 33987 34784 9740 19384 14475 44911 38538 3690 51415 87273 69713
486 69713 58954 23433 -34694 34325 92077 50500 24212 -16016 8639 25525 62099 62080 30091
473 30091 91422 103707 35896 20731 48838 42314 18675 17001 28489 -15567 -11560 20778 29048
460 29048 16988 -18421 24582 21944 24928 20414 45743 -680 -15790 78331 89210 49663 31254
$$ packed form
549G5908j3393M5939l0898n6486m2009J5216k1792L1020J3218l6348J3553J4066
537G994L3690l5699j2175K0105J618j5427L4533J7047m200J138R501m6888K0061
524C1298m120J6651l952m1132k6457O0522k9563K0128K4681J9896o755l5204J8810
511D4803k3023J9803O7437n0505k0384J1595k6573K3747n7259m892J3717J3501
499A1967J1985K1485j1450P97k5044R644m909L0436o373l4848M7725L5858j7560
486F9713j0759l5521n8127O9019N7752m1577k6288m0228K4655J6886L6574j9l1989
473C0091O1331J2285o7811j5165K8107o524k3639j674J1488m4056M007L2338Q270
460B9048j2060l5409M3003k638K984m514K5329m6423j5110R4121J0879l9547j8409
$$ plain form
447 31254 33784 63860 33020 8921 31270 71686 42514 38196 81301 66523 27144 -37741
435 -37741 -24273 3312 94119 91118 38245 -28652 -57917 -5569 43278 6218 1535 -7724 35017
422 35017 48947 51219 35609 8650 14573 23610 8630 16716 5595 -30817 22610 64825 43989
409 43989 -6176 25235 39308 17492 -19377 -59864 -83676 -24465 41340 39247 18133 9878
397 9878 19640 38320 72716 95466 60872 48173 28260 -23287 17537 95549 53524 23287
385 23287 -2569 24193 15624 3104 -29039 -41477 -1594 43294 20564 41033 72001 6097
373 6097 -29372 29891 4288 -2095 10586 -6520 27740 45131 121 40848 81151 75732 69184
360 69184 60746 43800 45654 50144 7123 3894 2903 -7320 7255 34885 3787 -3715 25243
$$ packed form
447C1254K530L0076l0840k4099K2349M0416k9172m318M3105j4778l9379o4885
435c7741J3468K7585R0807l001n2873o6897k9265N2348M8847l7060m683r259M2741
422C5017J3930K272j5610k6959N923R037j4980Q086j1121l6412N3427M2215k0836
409D3989n0165L1411J4073k1816l6869m0487k3812N9211O5805k093k1114q255
397I878R762J8680L4396K2750l4594j2699j9913n1547M0824P8012m2025l0237
385B3287k5856K6762q569j2520l2143j2438L9883M4888k2730K0469L0968o5904
373F097l5469N9263k5603o383J2681j7106L4260J7391m5010M0727M0303n419o548
360F9184q438j6946J854M490m3021l229r91j0223J4575K7630l1098p502K8958
$$ plain form
347 25243 50194 54349 68154 46255 44735 64832 30037 -16156 -1852 38765 -7857 4215
335 4215 -27667 12995 65908 16741 40983 31555 38785 1321 33615 10174 26561 33893 61027
322 61027 43776 -21714 19116 14248 -2493 52499 51014 19700 -16503 1706 3288 -6052 22664
309 22664 28544 4392 10775 -20332 -39597 2527 19198 -3467 20959 48442 14161 -9524
297 -9524 53311 2231 27786 45082 50979 75793 51864 45345 5070 27895 73088 58318 -22364
284 -22364 5554 58505 66117 46014 -33063 -13483 -31509 -11611 -902 -41927 11593 56631
272 56631 91934 40368 39453 -12893 -37589 -63486 -14481 34455 59040 79977 89242 40401 4656
259 4656 47696 15326 221 -39888 -7393 25497 69534 83204 4773 -18576 -39253 -35630
$$ packed form
347B5243K4951M155J3805k1899j520K0097l4795m6193J4304M0617m6622J2072
335D215l1882M0662N2913m9167K4242r428P230l7464L2294k3441J6387P332K7134
322F1027j7251o5490M0830m868j6741N4992j485l1314l6203J8209J582r340K8716
309B2664N880k4152O383l1107j9265M2124J6671k2665K4426K7483l4281k3685
297i524O2835n1080K5555J7296N897K4814k3929o519m0275K2825M5193j4770q0682
284b2364K7918N2951P612k0103p9077J9580j8026J9898J0709m1025N3520M5038
272E6631L5303n1566r15n2346k4696k5897M9005M8936K4585K0937R265m8841l5745
259D656M3040l2370j5105m0109L2495L2890M4037J3670p8431k3349k0677L623
$$ plain form
247 -35630 -30624 -2314 -43405 -34771 18291 60071 68562 47667 26003 65831 83891 76172 86255
234 86255 41660 44920 12657 25178 1037 1164 7086 19044 29455 51780 68779 -1668 3641
221 3641 -11397 30295 49851 16645 34919 38926 49523 57288 20529 -6776 33625 15533 7009
208 7009 19872 -41565 1704 52498 57367 69718 64426 38835 71746 90870 27291 17218 13469
195 13469 38200 59784 61646 56145 42067 53887 19008 52170 13274 1147 21024 21490 76276
182 76276 82521 61715 47504 41681 35644 35177 18298 -8500 -17504 8478 24720 -4675 -6852
169 -6852 37591 28656 24967 51058 36802 14784 32587 47405 46523 14777 31633 31322 -36513
156 -36513 -11823 -22028 -6621 40577 41318 57809 52932 32453 40407 37602 48851 22047 33141
$$ packed form
247c5630N006K8310m1091Q634N3062M1780Q491k0895k1664L9828J8060p719J0083
234H6255m4595L260l2263J2521k4141J27N922J1958J0411K2325J6999p0447N309
221C641j5038M1692J9556l3206J8274M007J0597P765l6759k7305M0401j8092q524
208G009J2863o1437M3269N0794M869J2351n292k5591L2911J9124o3579j0073l749
195A3469K4731K1584J862n501j4078J1820l4879L3162l8896j2127J9877M66N4786
182G6276O245k0806j4211n823o037m67j6879k6798r004K5982J6242k9395k177
169f852M4443q935l689K6091j4256k2018J7803J4818q82l1746J6856l11o7835
156c6513K4690j0205J5407M7198P41J6491m877k0479P954k805J1249k6804J1094
$$ [...]
##END NTUPLES=NMR SPECTRUM
##END=
