##TITLE=1H_EC-3287(3-1)
 CDCl3
 8 sc, 
 14.12.2022
##JCAMPDX= 6.0         $$ Bruker NMR JCAMP-DX V2.0
##DATA TYPE= NMR SPECTRUM
##DATA CLASS= NTUPLES
##ORIGIN= UXNMR, Bruker Analytische Messtechnik GmbH
##OWNER= root
$$ XWIN-NMR		Version 3.5
$$ Wed Dec 14 14:09:29 2022 Russian Standard Time (UT+4h)  she@DPX200
##.OBSERVE FREQUENCY= 200.13135
##.OBSERVE NUCLEUS= ^1H
##.ACQUISITION MODE= SIMULTANEOUS
##.ACQUISITION SCHEME= undefined
##.AVERAGES= 8
##.DIGITISER RES= 18
##SPECTROMETER/DATA SYSTEM= spect
##.PULSE SEQUENCE= zg30
##.SOLVENT NAME= CDCl3
##.SHIFT REFERENCE= (INTERNAL, CDCl3, 0, 15.6896)
##AUDIT TRAIL= $$ (NUMBER, WHEN, WHO, WHERE, WHAT)
$$ ##TITLE= Audit trail, XWIN-NMR		Version 3.5
$$ ##JCAMPDX= 5.01
$$ ##ORIGIN= Bruker BioSpin GmbH
$$ ##OWNER= she
$$ F:/spectra/data/she/nmr/H-F/1/pdata/1/auditp.txt
$$ ##AUDIT TRAIL=  $$ (NUMBER, WHEN, WHO, WHERE, WHAT)
(   1,<2022-12-14 14:08:27.84 +0400>,<she>,<DPX200>,
      <created by zg, POWCHK disabled, PULCHK disabled
       configuration hash MD5:
       00 E9 B6 7A A2 85 ED C7 34 08 36 98 17 FE 4E 26
       data hash MD5: 16K
       65 9C A3 79 2C 2E 80 EE 50 15 20 1E 0D 84 B2 46>)
(   2,<2022-12-14 14:08:30.26 +0400>,<she>,<DPX200>,
      <Start of raw data processing
       efp BC_mod = 2 LB = 0.24 FT_mod = 6 PKNL = 1 PHC0 = -19107.5 PHC1 = 9.600722 SI = 16K 
       data hash MD5: 16K
       E6 D1 56 3B 2F AF B1 50 60 27 80 D5 2A 42 6B B8>)
(   3,<2022-12-14 14:08:46.26 +0400>,<she>,<DPX200>,
      <pk PHC0 = -0.4189738 PHC1 = 2.2 
       data hash MD5: 16K
       56 E0 4A 89 73 A2 30 79 91 3C 61 DC 82 6A 71 05>)
(   4,<2022-12-14 14:08:49.07 +0400>,<she>,<DPX200>,
      <abs ABSG = 5 
       data hash MD5: 16K
       D6 FA 85 32 56 A2 B8 C1 B9 64 4E B1 DB 5C B9 3B>)
$$ ##END=
$$ 
$$ hash MD5
$$ F7 43 12 50 2E B9 AC D9 AA 2F F4 99 49 44 5E 75
##$RELAX= 
##$RELAX= 
##$RELAX= 
##$RELAX= 
##$RELAX= 
##$RELAX= 
$$ Bruker specific parameters
$$ --------------------------
##$DU= <F:/spectra>
##$EXPNO= 1
##$NAME= <H-F>
##$PROCNO= 1
##$TYPE= <nmr>
##$USER= <she>
##$AMP= (0..31)
100 100 100 100 100 100 100 100 100 100 100 100 100 100 100 100 100 100 
100 100 100 100 100 100 100 100 100 100 100 100 100 100 
##$AQSEQ= 0
##$AQ_mod= 1
##$AUNM= <au_zg>
##$AUTOPOS= <>
##$BF1= 200.13
##$BF2= 200.13
##$BF3= 200.13
##$BF4= 200.13
##$BF5= 200.13
##$BF6= 200.13
##$BF7= 200.13
##$BF8= 200.13
##$BYTORDA= 1
##$CFDGTYP= 0
##$CFRGTYP= 5
##$CHEMSTR= <none>
##$CNST= (0..31)
1 1 145 1 1 1 1 1 1 1 1 1 1 1 1 1 1 1 1 1 1 1 1 1 1 1 1 1 1 1 1 1 
##$CPDPRG= <>
##$CPDPRG1= <>
##$CPDPRG2= <>
##$CPDPRG3= <>
##$CPDPRG4= <mlev>
##$CPDPRG5= <mlev>
##$CPDPRG6= <mlev>
##$CPDPRG7= <mlev>
##$CPDPRG8= <mlev>
##$CPDPRGB= <>
##$CPDPRGT= <>
##$D= (0..31)
0 1.2 0 0 0 0 0 0 0 0.06 0 0.03 0 0 0 0 0.0002 0 0 0 0 0 0 0 0 0 0 0 0 
0 0 0 
##$DATE= 1671012507
##$DBL= (0..7)
120 120 120 120 120 120 120 120 
##$DBP= (0..7)
150 150 150 150 150 150 150 150 
##$DBP07= 0
##$DBPNAM0= <>
##$DBPNAM1= <>
##$DBPNAM2= <>
##$DBPNAM3= <>
##$DBPNAM4= <>
$$ [...]
##$SUBNAM3= <"">
##$SUBNAM4= <"">
##$SUBNAM5= <"">
##$SUBNAM6= <"">
##$SUBNAM7= <"">
##$SUBNAM8= <"">
##$SUBNAM9= <"">
##$SW= 18.05172834244
##$SWIBOX= (0..15)
0 0 2 0 0 0 0 0 0 0 0 0 0 0 0 0 
##$SW_h= 3612.71676300578
##$TD= 16384
##$TD0= 1
##$TE= 0
##$TE2= 300
##$TE3= 300
##$TEG= 300
##$TL= (0..7)
0 120 120 120 120 120 120 120 
##$TP= (0..7)
150 150 150 150 150 150 150 150 
##$TP07= 0
##$TPNAME0= <>
##$TPNAME1= <>
##$TPNAME2= <>
##$TPNAME3= <>
##$TPNAME4= <>
##$TPNAME5= <>
##$TPNAME6= <>
##$TPNAME7= <>
##$TPOAL= (0..7)
0.5 0.5 0.5 0.5 0.5 0.5 0.5 0.5 
##$TPOFFS= (0..7)
0 0 0 0 0 0 0 0 
##$TUNHIN= 0
##$TUNHOUT= 0
##$TUNXOUT= 0
##$USERA1= <user>
##$USERA2= <user>
##$USERA3= <user>
##$USERA4= <user>
##$USERA5= <user>
##$V9= 5
##$VALIST= <valist>
##$VCLIST= <CCCCCCCCCCCCCCC>
##$VD= 0
##$VDLIST= <DDDDDDDDDDDDDDD>
##$VPLIST= <PPPPPPPPPPPPPPP>
##$VTLIST= <TTTTTTTTTTTTTTT>
##$WBST= 1024
##$WBSW= 4
##$XGAIN= (0..3)
0 0 0 0 
##$XL= 0
##$YL= 0
##$YMAX_a= 311749
##$YMIN_a= -298950
##$ZGOPTNS= <>
##$ZL1= 120
##$ZL2= 120
##$ZL3= 120
##$ZL4= 120
##$ABSF1= 15.64332
##$ABSF2= -2.408527
##$ABSG= 5
##$ABSL= 3
##$ALPHA= 0
##$AQORDER= 0
##$ASSFAC= 0
##$ASSFACI= 0
##$ASSFACX= 0
##$ASSWID= 0
##$AUNMP= <proc_1d>
##$AZFE= 0.1
##$AZFW= 0.1
##$BCFW= 0
##$BC_mod= 2
##$BYTORDP= 0
##$COROFFS= 0
##$CY= -3
##$DATMOD= 1
##$DC= 0
##$DFILT= <>
##$DTYPP= 0
##$F1P= 0
##$F2P= 0
##$FCOR= 1
##$FTSIZE= 16384
##$FT_mod= 6
##$GAMMA= 0
##$GB= 0
##$INTBC= 1
##$INTSCL= 3.70164e-10
##$ISEN= 128
##$LB= 0.24
##$LEV0= 0
##$LPBIN= 0
##$MAXI= 10000
##$MC2= 0
##$MEAN= 0
##$ME_mod= 0
##$MI= 1.114404
##$NCOEF= 0
##$NC_proc= -6
##$NLEV= 6
##$NOISF1= 3.799351
##$NOISF2= 2.8
##$NSP= 0
##$NTH_PI= 0
##$NZP= 0
##$OFFSET= 15.6896
##$PC= 1
##$PHC0= -19107.92
##$PHC1= 11.80072
##$PH_mod= 1
##$PKNL= yes
##$PPARMOD= 0
##$PSCAL= 0
##$PSIGN= 0
##$REVERSE= no
##$SF= 200.13001640042
##$SI= 16384
##$SIGF1= 3
##$SIGF2= 2
##$SINO= 5.538805
##$SIOLD= 16384
##$SREGLST= <1H.CDCl3>
##$SSB= 0
##$STSI= 16384
##$STSR= 0
##$SW_p= 3612.71676300578
##$SYMM= 0
##$S_DEV= 0
##$TDeff= 16384
##$TDoff= 0
##$TI= <>
##$TILT= no
##$TM1= 0
##$TM2= 0
##$TOPLEV= 0
##$USERP1= <user>
##$USERP2= <user>
##$USERP3= <user>
##$USERP4= <user>
##$USERP5= <user>
##$WDW= 1
##$XDIM= 16384
##$YMAX_p= 282445771
##$YMIN_p= -995971
$$ End of Bruker specific parameters
$$ ---------------------------------
##NTUPLES= NMR SPECTRUM
##VAR_NAME=  FREQUENCY,     SPECTRUM/REAL,   SPECTRUM/IMAG
##SYMBOL=    X,             R,               I
##VAR_TYPE=  INDEPENDENT,   DEPENDENT,       DEPENDENT
##VAR_FORM=  AFFN,          ASDF,            ASDF
##VAR_DIM=   16384,         16384,           16384
##UNITS=     HZ,            ARBITRARY UNITS, ARBITRARY UNITS
##FACTOR=    0.220516191357247, 1,           1
##FIRST=     3139.95990348378, 0,            0
##LAST=      -472.756859521995, 0,           0
##MIN=       -472.756859521995, -995971,     0
##MAX=       3139.95990348378, 282445771,    0
$$ Real data points
##PAGE= N=1
##DATA TABLE= (X++(R..R)), XYDATA
$$ [...]
9057 2463415 2520803 2479547 2601448 2715427 2694258 2642852 2704526 2740481 2778587 2805941 2896810
9046 2896810 2939277 2942521 2934748 2975325 3042203 3032437 3126584 3151808 3217384 3351580 3453422 3510492
9034 3510492 3472067 3515997 3597122 3664734 3586308 3674331 3703688 3821178 3875115 3982034 4049177
9023 4049177 4125670 4171076 4202126 4213751 4247810 4326778 4426686 4444058 4488474 4563253 4628993
9012 4628993 4753903 4822865 4914398 5038845 5108913 5298671 5453308 5616778 5739391 5949481
9002 5949481 6021940 6078992 6310334 6540150 6761440 6834419 7004428 7216699 7426860 7670241
8992 7670241 7983506 8254314 8496672 8737006 8902217 9175265 9477507 9889294 10232991 10615990
8982 10615990 10959025 11388462 11910624 12439579 13075095 13762478 14622270 15660608 16815980
8973 16815980 18145036 19782671 21619343 23587994 25237788 26571954 28001515 29424261
8965 29424261 30538987 31667850 32508481 32867502 32788168 32370064 31508171 30036082 28209045
8956 28209045 26653765 25377267 24441819 23732570 23448058 23412458 23416796 23744887 24233783 24911956
8946 24911956 25763208 26729661 27936682 29259923 30817363 32756379 35043479 37667765
8938 37667765 40802311 44539811 48928938 54535792 61451147 68916979 75651826 80910824
8930 80910824 85239096 89173100 91997867 93529732 94457251 94560268 93396638 91573097
8922 91573097 89356428 85993067 81926839 78402723 76253806 75681276 75491720 74076853
8914 74076853 71306078 68911932 67714652 67042232 65392419 61724813 56834891 52134788
8906 52134788 47869431 44412715 41986341 40150469 38819464 37476023 36680134 36279190
8898 36279190 36231986 36248208 36301257 36444545 37049647 37968499 39392338 41330798 43776230
8889 43776230 46984260 51411297 56757772 61535524 63886766 63657745 63037294 63106463 64126520
8880 64126520 64658577 62947411 59247315 54830504 50476311 46958081 44258399 42374425
8872 42374425 41142187 40056451 39161255 38902233 39449262 40566357 41760823 41946843 41287720
8863 41287720 41064463 41397503 41982017 41959391 40678086 39069516 37838295 37118572 36973450
8854 36973450 37478801 38688374 40526840 43154311 46735437 51040013 55530904 59372941
8846 59372941 61902668 63714793 66079117 68854624 70487491 71081893 71701466 72025095 71555622
8837 71555622 71558671 72368278 72356144 70776188 67661793 63216961 57488097 50770298 44422394
8828 44422394 38772266 34221291 30668960 27894391 25819953 24073952 22672849 21395157
8820 21395157 20323505 19436649 18637087 17961330 17442127 17083439 16866039 16805722 16925810
8811 16925810 17223898 17439619 17513142 17200544 16842584 16369723 15736726 14962311 14166796 13415902
8801 13415902 12820150 12411176 12049121 11855365 11664471 11317347 11154871 10922147 10659720
8792 10659720 10510242 10472325 10378498 10373644 10316079 10291468 10247935 10244732 10213936 10146975 10220642
8781 10220642 10122758 10009966 9916337 9975812 10070944 10125320 10191081 10305494 10402755 10596027 10760362
8770 10760362 10910970 11079979 11311779 11483333 11746549 12058519 12416135 12750907 13222227
8761 13222227 13585296 13904585 14061825 14364396 14647178 14926825 15407483 15850645 16318372
8752 16318372 16905140 17497864 18196731 18976991 19907158 20959087 22133850 23795395 25728153
8743 25728153 28047964 30932563 34646574 39038842 43299791 46067699 47044367 47195133
8735 47195133 47762437 49439807 52443188 55060378 54661729 51438635 47393359 43558838
8727 43558838 40526087 38490403 37135856 36550082 36665625 37408312 37964768 37879068 37215233
8718 37215233 36784618 36793515 37455861 38630705 40287165 42574442 45766968 49796900 54775531
8709 54775531 60433568 65855151 71063742 76824227 83614263 90412893 97614083 105792365
8701 105792365 113993282 117178594 112241235 104440484 97124411 88532140 79015217 69746448
8693 69746448 61276134 54140351 48452480 44201483 41213798 39205544 38103840 37376556
8685 37376556 36426512 34818952 33012380 31458579 30220752 29539918 29312925 29472473 30237979
8676 30237979 31457997 33309012 35659937 37617071 38515061 38637522 38074043 37066053 36346251
8667 36346251 35708883 34308075 31843468 29101767 26597831 24570572 23326285 22509472
8659 22509472 21429889 19899781 18162398 16650625 15183934 13973327 12871384 11965837
8651 11965837 11307054 10727857 10159711 9678872 9226929 8716784 8334034 8053600 7678944
8642 7678944 7514295 7225315 6986920 6812445 6532717 6322160 6187396 6117985 5986152 5866040
8632 5866040 5599305 5561892 5495757 5303642 5137664 4918814 4718893 4477241 4387863 4306744
8622 4306744 4220024 4018882 3965217 3897551 3851955 3797906 3733525 3674368 3536605 3465057 3378624
8611 3378624 3346607 3288678 3202741 3136387 3134112 3008351 2924032 2939812 2926387 2906483 2988836
8600 2988836 2992535 2909903 2908511 2912129 2840116 2862974 2868650 2819847 2725180 2668853 2650009 2502291
8588 2502291 2370390 2268638 2189415 2207796 2112762 2100652 1997441 2043933 1999335 1940482 1927364
8577 1927364 1911343 1839241 1781719 1671984 1621162 1560355 1667097 1715539 1699680 1758787 1720395
8566 1720395 1664762 1615875 1566804 1620817 1621094 1631512 1663159 1717156 1810991 1773317 1726169 1739545
8554 1739545 1777525 1635391 1686055 1676099 1554487 1484178 1463529 1399415 1390416 1378186 1211968
8543 1211968 1124222 1145406 1116684 1163441 1139367 1125882 1078423 1064282 1095530 1065924 1092227
8532 1092227 1156173 1133911 1064997 1191530 1241184 1112819 1048314 1062481 1156881 1060800 966663
8521 966663 1021813 1087504 1050775 1052245 1085817 1020003 876482 801621 878329 950430 981606 922894
8509 922894 849211 780839 673369 725755 758800 853224 868514 797396 707583 755519 806158
8498 806158 652574 730220 740467 915036 970923 930235 941707 883605 884220 881198 833943 843940
8486 843940 890636 861502 864616 871464 881581 826037 784143 805232 773501 680700 690746 619457
8474 619457 535782 466946 522907 487467 509668 562491 523605 565288 499959 436100 505204 621045
8462 621045 561584 549034 627837 640344 603194 621230 604934 544510 485864 455343 543363 528037
8450 528037 499067 526231 601538 554741 506675 499152 544420 583273 561486 495648 506844 526309
8438 526309 542489 430455 415311 412505 355785 379395 372916 344755 328351 406752 407434 341351
8426 341351 329201 368496 368791 345822 337753 379586 402365 449328 414685 427347 392762 311604
8414 311604 338093 330187 336052 409609 368092 392648 437811 385457 426031 402370 351505 274800
8402 274800 288238 269175 289127 317078 319316 359426 297870 311776 270239 311876 351486 330494
8390 330494 237873 227629 291597 285979 254482 248472 256549 366273 397246 386666 356797 336434
8378 336434 370958 427634 341466 331164 359721 328396 311639 331691 312713 271643 277904 296577
8366 296577 352834 307902 224272 278308 354511 382613 322366 218044 277555 302731 328320
8355 328320 295950 265860 313846 232696 238531 280835 273869 210690 282568 366411 373942 423806
8343 423806 363143 387114 435319 397604 390051 441079 452323 443963 416115 347512 336010 376690
8331 376690 465897 474109 362248 324168 251502 218960 342054 325998 269511 282207 195023
8320 195023 118396 131726 132826 158026 241672 293442 225918 176217 230135 312108 206301 168787
8308 168787 164312 183225 258421 261134 231452 111843 142574 241598 189902 148292 142791 57933
8296 57933 98533 72523 126026 171213 135993 155110 130606 24686 13078 56709 122992 124527
8284 124527 76116 47234 31076 84391 83157 190738 155981 57124 109726 72909 28162 95068
8272 95068 121108 80931 108178 -71777 -127130 -42641 7150 -23885 -115162 -143054 7495
8261 7495 -12969 -4755 12258 23014 20471 -7511 -11765 -143 -53871 -121576 -56870 -91620 -89875
8248 -89875 -129469 -82651 -4225 -82535 -76461 -1361 -40435 -59965 6384 43972 -3784 80633
8236 80633 26832 36822 49924 27990 25856 26911 -5606 63545 -34806 102320 246365 154927
8224 154927 225089 252777 234763 114166 183498 179446 131033 -3670 41373 89239 114667
8213 114667 130559 58084 13197 74833 23531 42040 98118 103573 39842 -14743 -50777 -19760
8201 -19760 35340 13046 50586 68099 21044 113230 343559 363130 482619 -788291 -995971
8190 -995971 -315187 -262354 -113664 -150446 -15590 -132789 -180003 -17228 66446 -104027
8180 -104027 -90296 -47552 -33861 -108606 -51234 16954 -63950 -140830 -179199 -111290 -63796 -103789
8168 -103789 -117965 -118931 -70135 4809 -62675 -94505 -49587 -12622 -41778 -12342 18194 8077
8156 8077 8705 -78482 -167097 -20684 -14671 -59443 -48115 -128423 -80721 -48678 -101024 -86927
8144 -86927 -96008 -182391 -146879 -150515 -21457 64664 17685 -23852 -37748 -81687 -97980 -152660
8132 -152660 -103202 -58569 -21532 -101953 -201439 -213166 -159863 -121078 -147351 -29544 -1266
8121 -1266 -44053 -10519 -68857 -115086 -140947 -222075 -74681 -97163 -46985 -87545 -25559 4768
8109 4768 -104911 -160743 -138093 -83737 -72979 -1435 1029 -95170 -90750 -125211 -166284 -82003
8097 -82003 -58041 -159385 -222720 -147308 -80929 -148850 -213782 -110148 -111778 -153878 -74451 -87213
8085 -87213 -118266 -74969 -33499 -158362 -154188 -70599 -69855 -161993 -101257 -25276 -30727 -13524
8073 -13524 -64166 -106666 -68049 -24694 6313 -140311 -149168 -99021 -115797 -106326 -115687 -70979
8061 -70979 -181419 -171798 -150778 -93093 -181541 -150983 -179241 -113791 9598 -10982 -140551
8050 -140551 -142127 -130467 -113443 -102969 -156350 -140180 -74899 -159087 -162259 8506 57560 -40362
8038 -40362 -111214 -93320 -140799 -109770 39613 -34765 -133316 -82887 -5354 -22946 -127923
8027 -127923 -202617 -183916 -114068 -77713 -121998 -110274 -69539 -82838 -39139 -65630 -20076 -18017
8015 -18017 -11258 -41521 -98203 -30537 -81789 -123277 -95313 -197014 -42089 13835 -74006 -140293
8003 -140293 -21541 122339 -34242 -120666 -64266 -87721 -52166 -133211 -73411 -39383 -96799
7992 -96799 -114481 -145720 -144383 -196663 -157222 -125263 -168134 -138228 -115738 -136856 -111155 -132635
7980 -132635 -66132 -53138 -102233 -62459 -94788 -55864 -74860 -102767 27811 102249 -73749
7969 -73749 -147359 -31325 -71218 -57812 -126353 -128796 -66665 -55416 -140088 -92916 -197804 -175847
7957 -175847 -168343 -136581 -144787 -124765 -86958 -129559 -100745 -92615 -67670 -83093 -79726 -31286
7945 -31286 -63902 -129778 32958 -48397 -166432 -121210 -86141 -96414 -116911 -42561 -90768
7934 -90768 -56157 -108299 -267364 -239493 -228105 -240320 -166686 -72107 -134630 -263370 -251401
7923 -251401 -95102 -100041 -140060 -133187 -41514 -87979 -122497 -69076 -23248 -91153 -51765 -11943
7911 -11943 -123720 -191848 -106336 -99948 -147176 -33035 -74883 -129198 -171885 -149679 -127471 -32856
7899 -32856 -10941 -82255 -69440 -36099 -40482 -137124 -99441 15674 -10980 -73303 -123511 -155474
7887 -155474 -158840 -76143 -39247 -80141 -146390 -239492 -153628 -91160 -96633 -195750 -178303 -169215
7875 -169215 -126547 -51294 -54028 17158 -32227 -59968 -100181 -128386 -142621 -79561 -1615 -91399
7863 -91399 -166764 -186505 -158091 -138624 -143834 -138992 -79231 -154628 -147592 -190788 -229670 -139191
7851 -139191 -120758 -98095 -64229 -164049 -152791 -177036 -171114 -70614 -141124 -207537 -168645 -224710
7839 -224710 -85743 49558 -40580 -173178 -153310 -141913 -175309 -111728 -145191 -104750 -155114
7828 -155114 -198302 -198888 -135758 -92037 -64247 -95961 -120858 -144617 -142004 -57866 -61918 -71118 -189809
7815 -189809 -205821 -41163 1114 24966 127609 230994 -28622 -154295 -102394 -34286 -163683
7804 -163683 -171217 -28273 46782 664 -107543 -32936 -30934 -28002 -121465 -138906 -107311 -85084
7792 -85084 -154657 -114757 -30675 -57304 7514 -14087 -73024 -91377 -193748 -160607 -124863 -127352
7780 -127352 -133899 -96120 -58002 -36810 -119556 -131494 -20133 -103182 -16910 2820 -69566 -173821
7768 -173821 -8470 -32304 -167576 -52724 -42985 -146667 -192960 -102022 -69286 -183871 -215135
7757 -215135 -219526 -190971 -174727 -161397 -187429 -90965 -65431 -80894 -144283 -41741 -35370 -127562
7745 -127562 -151659 -140085 -64439 -16897 27819 -23709 -35226 -68148 -61451 -136060 -108421 -83020
7733 -83020 -76785 -172690 -127418 -214895 -251072 -87285 36020 101321 8250 -57748 -94976 -124177
7721 -124177 -98085 -87759 -61537 45421 -100316 -170606 -154241 -136787 -90163 -57034 -23289
7710 -23289 -53473 -57182 -96428 -142707 -154665 -101081 -189922 -101233 7791 -90223 -103792 12878
7698 12878 50342 -93892 -145177 -84817 -128923 -226327 -276155 -180178 -151423 -74993 -66253 -23795
7686 -23795 35513 -31718 -107578 -123634 -122276 -112236 -119967 -63737 -78500 -81001 -114177 -124496
7674 -124496 -164437 -76951 -90200 -68403 -18078 -79563 -24187 -9427 -49639 -17336 -15739 -62052
7662 -62052 -45243 -88796 -64938 -66377 -46941 -68852 -10955 -2423 -8220 -22133 -18760 -47063 -35798
7649 -35798 29832 -43496 -116199 -95617 -5884 39895 33000 -45073 -201540 -109509 -76465 -86129
7637 -86129 -131450 -24374 -6701 -45429 -46191 -155355 -190999 -181409 -131873 -154485 -140419 -48457
7625 -48457 -11292 -110152 -100767 -5605 20557 7701 -47105 -181125 -206256 -95164 -118398 -141560
7613 -141560 -154835 -152821 -28374 -49836 -36301 -60345 -67535 -246144 -236977 -97346 -18307 -21851
7601 -21851 -12859 -75071 -69189 47693 -62306 22353 -15923 -90165 -127779 -215680 -133932 -78471
7589 -78471 -86531 -102422 -51407 -143413 -170294 -69251 -61543 16091 -48266 14801 52536 32616
7577 32616 -101664 -78485 -70775 -69518 -95546 -96114 22516 -50493 -90539 -13351 -14435 5659
7565 5659 -47814 -155905 -87972 -57608 -136297 -150045 -126599 -209879 -98460 -131731 -209739 -88500
7553 -88500 -36548 -32146 -74268 -19569 -126535 -36602 -15527 -51835 -8768 -47458 -89065 -51347
7541 -51347 -69623 -93710 -73163 -153547 -98358 -47896 -107171 -97633 -139408 -66142 -4879 -151892
7529 -151892 -50696 36899 -38175 -121272 -201489 -99890 -121408 -197983 -67806 -192963 -149567
7518 -149567 -179852 -106046 -42164 -10795 -20155 -134895 -11167 10794 -3564 1082 48738 45415
7506 45415 5935 2016 18014 41865 122218 63294 25626 197728 223749 112889 126202 115504
7494 115504 71527 39284 53033 69812 -49377 35139 73184 107499 98007 136078 112694 46874
7482 46874 -23067 -21240 2615 -26569 -79999 -182252 -107743 -41987 -62010 -66243 -72162 -29064
7470 -29064 110288 93256 5724 -122318 -137410 -45417 -65083 -61348 -65597 -114042 -80935 -44215
7458 -44215 19117 12904 -47892 -35623 -81763 -127005 -110673 -36665 -69051 -61216 -73736 -48286
7446 -48286 -45881 -96186 -144833 -75461 -51750 -156413 -96399 -54019 17425 -8547 -67444 -136063
7434 -136063 -82421 -104049 -113230 -51497 -22928 -95273 -91525 -87854 -167339 -120897 -95580 -102448
7422 -102448 -171683 -72723 -21017 66211 -28327 -117533 -114720 -116576 -18215 -84461 -32098 -111150
7410 -111150 -86637 -70759 -66840 58213 -4433 -105709 -110873 -37608 -49428 -52995 -123244 -98915
7398 -98915 -96722 4930 -43220 3139 -1630 -55433 -135313 -138248 -86177 -179152 -183820 -170791
7386 -170791 -93360 -93301 -13320 -3842 -54316 -148872 -76417 -198549 -216643 -139757 -117636 -126346
7374 -126346 -82128 -119938 -171779 22729 143963 -42951 -119355 -74519 -114570 -81275 -71593
7363 -71593 -162326 -243279 -122816 -26732 -22223 -34371 -47125 10456 -839 18669 -55100 -190776
7351 -190776 -194436 -97323 -52556 -59323 -17461 3797 8188 45564 -46060 -123200 -125790 -126446 -88677
7338 -88677 -74738 -109618 -37345 -108469 -139014 -123808 -110745 -80325 -28306 28659 -67999 -6352
7326 -6352 7525 25109 -371 -27202 -111171 12256 -23877 -18042 -48978 -66980 -144494 -141845
7314 -141845 -101641 -72657 7497 -26323 -30367 -64832 -60788 -108476 -112351 -91198 -44579 -69219
7302 -69219 -161539 -78312 -117690 -148053 -147929 -155940 -102956 -53113 -80474 -67304 -17213 -43038
7290 -43038 -4968 -84839 -80859 -23942 28170 -43468 -68823 -92533 -23000 31274 -39147 -96234
7278 -96234 -57524 -1612 10324 -2463 20412 50813 36234 -14769 -105161 -26049 24910 3980
7266 3980 11782 -76408 17695 12131 -60390 -28930 3157 15704 59488 92349 77380 35294
7254 35294 -14220 -30045 92982 141303 159262 164948 61528 42925 -89087 -785 22128
7243 22128 -85764 -119435 -132597 -74138 -43148 -38681 -62692 -96969 -35648 -32138 22172 31714
7231 31714 -99270 -5174 87406 44337 -10616 30261 113422 56517 -67342 30770 36344 10435
7219 10435 -22426 -29808 -5783 -26600 -1984 4084 81527 109653 120912 35712 22543 58707
7207 58707 17482 -6823 -47633 -104448 -2446 -6055 -55184 -82908 -87067 -90564 -86597 -2992
7195 -2992 -14717 38826 88110 -55024 -35128 60152 -3822 -39805 -7343 31302 -44719 38838
7183 38838 41970 -40176 8338 -50662 -14394 -86181 -11050 142118 144211 76450 15335 -67683
7171 -67683 -73496 -9336 18052 -10396 -47425 -32338 -36843 -12194 -23832 4545 -643 41133
7159 41133 -16141 -77501 -54278 -5936 -11645 26076 95143 100216 109935 116660 245308 126123
7147 126123 82251 105089 -56700 -54355 61973 -15605 -4860 93718 77673 38648 -6192
7136 -6192 -89179 -110309 -31111 36021 141103 50373 22998 59884 108481 105809 102895 161714
7124 161714 83773 82931 63645 4015 45311 9138 -53246 3109 60974 6145 23819 12553
7112 12553 52297 59775 -31954 14139 132468 82429 10002 54919 61844 133394 55727 -32175
7100 -32175 86307 215906 159023 94497 121954 146473 142985 56639 148855 191911 83270
7089 83270 55401 113029 86768 57240 79199 208578 158967 265990 242896 204190 176867
7078 176867 269441 196470 115774 149082 146948 112162 106180 271760 324839 325254 164752 166977
7066 166977 225732 357223 201695 201186 294982 345695 436047 381994 306769 301496 361398 313868
7054 313868 356068 348062 263407 321993 327057 324945 312569 244046 213846 320288 411510 398743
7042 398743 246438 299078 402347 374131 447815 480971 388486 370016 423886 386050 409492
7031 409492 508441 472639 553778 580081 559151 613096 650903 716326 683488 624296 707386 628241
7019 628241 725050 700207 757941 905832 864292 847972 836840 1006252 1063733 1031812 1052805
7008 1052805 1004770 1015307 1089456 1137816 1171008 1216653 1216066 1243140 1361042 1331746 1371414 1442129
6996 1442129 1586547 1698475 1812155 1921942 1976171 2090043 2280170 2398346 2503615 2635479
6986 2635479 3097308 3488999 3705371 3987975 4207995 4426084 4725776 4874545 4876533 4837840
6976 4837840 4685603 4482193 4200876 4036107 4055850 3978002 3976339 4000542 4032048 4061874 4091240
6965 4091240 4124213 4191035 4405860 4572877 4772738 5072576 5426367 5789516 6285550 6755237
6955 6755237 7336541 8033690 8861035 9758569 10843865 12152486 13394112 14624963 15582661
6946 15582661 15835431 15370533 14539572 13436582 12232468 11129193 10318191 9570256 8962442
6937 8962442 8563305 8117317 7918064 7827076 7705830 7681129 7725006 7809358 7968855 8194190
6927 8194190 8583367 9031177 9457610 9998298 10748379 11601532 12602331 13978850 15361225
6918 15361225 17049273 19052489 21249229 23037551 24188343 24279427 23182883 21440234
6910 21440234 19267003 17332979 15482406 13815222 12468985 11370021 10452631 9816272
6902 9816272 9234660 8797333 8485875 8261159 8047200 7825725 7902455 7946638 7903064 8058917
6892 8058917 8192896 8546224 8903167 9351758 9891947 10541423 11454680 12485985 13668755
6883 13668755 14908064 16044227 16765169 16825161 16137640 14905840 13500670 11861058 10468897
6874 10468897 9463639 8450509 7644180 6978832 6337305 5846591 5514829 5192855 4934878
6865 4934878 4699878 4419118 4337457 4325415 4230812 4074040 4026094 4137195 4141505 4051862 4007267
6854 4007267 4054109 4247120 4523178 4756831 5015846 5313222 5388686 5296262 5078160 4722343
6844 4722343 4307271 3888757 3542202 3118368 2704944 2548342 2425423 2258062 2037480 1858699
6834 1858699 1806495 1751070 1695719 1520167 1538006 1445372 1381384 1222048 1141248 1045265 1017560
6823 1017560 1012301 1012183 972539 959173 820488 814109 911511 882062 833763 862770 838445 758525
6811 758525 771594 760604 683959 705469 709392 754157 719564 617613 545056 524903 622000 560641
6799 560641 490702 546265 560873 427522 527567 478869 489078 530815 536026 482745 434122
6788 434122 424133 396762 371300 344342 440493 335279 322697 323008 328084 365619 354127 370615
6776 370615 264448 270766 284082 264108 166624 249234 174234 197802 108095 118878 145122 112453
6764 112453 163687 144678 134788 69205 124678 132405 149092 123819 142528 177142 137364 172551
6752 172551 118537 -56415 11982 210499 242332 254685 261907 204984 130047 129200 67228 101287
6740 101287 201878 206284 162900 132952 214101 90220 162911 193085 122128 190173 196228 91105
6728 91105 140639 152127 69783 97903 32505 79721 11128 42522 54894 91150 144867 158221
6716 158221 167764 217546 75341 9785 -89684 -71020 -40155 -76061 65748 82870 34309
6705 34309 148757 189804 74034 101709 -35708 -45303 38717 92950 174693 193600 33416
6694 33416 20191 -12088 41870 -7302 -114294 -130987 -66176 -87673 -51692 -10460 -1154 -69497
6682 -69497 -154939 12847 52433 55734 37315 27207 -5303 -35468 -31292 8208 379 96906
6670 96906 78024 132807 150973 46507 5428 -110913 -45203 36937 22800 36882 -25625
6659 -25625 -73993 -17910 89217 39484 13395 97273 117614 106953 79292 103664 36444 124538
6647 124538 128226 68546 94530 10873 -48712 -145430 -110967 -51296 -77162 8771 -4410 -92567
6635 -92567 -58811 -2038 47909 37070 40824 60635 24418 17349 -60559 -10567 31683 18096
6623 18096 86871 12853 -69844 -27483 -44355 43695 -42615 74048 81082 136339 82373 96129
6611 96129 160684 30281 71702 162827 148325 202233 172619 110391 133622 107779 92502 63332
6599 63332 -36578 32555 79528 -8857 37770 101373 -19696 -44749 14883 -27573 54929 -14851
6587 -14851 -5695 90373 73685 69589 59276 15125 51539 -48041 -77099 9247 151301 182236
6575 182236 210648 235998 236651 271125 216698 109053 187205 63843 31442 -35677 78320
6564 78320 54927 42649 73322 112790 47897 -29248 68053 75926 141160 159757 108992 2788
6552 2788 -4069 9234 26520 30681 15558 -108831 -16902 -37386 -77182 29842 -2423 -43354
6540 -43354 -33206 94385 -18089 33643 46984 44567 -26053 -71522 20234 -30616 -46002 12583
6528 12583 -32657 -60793 -21009 9434 16877 -39488 77631 80378 22816 -39514 -153028 -87992
6516 -87992 29026 94775 -2471 -99443 -39531 74799 7279 -50828 -39742 -25916 -11597
6505 -11597 8894 70709 -31534 -27271 28146 -22066 -33999 58313 43350 23576 -43881 -25819
6493 -25819 -106360 22356 70195 45962 41294 19241 70924 30428 31777 33334 6416 4077
6481 4077 64086 57822 25236 54444 27415 61683 -44160 -136646 -95787 -37580 -125340 -136917
6469 -136917 -136818 -66438 -41542 -63509 -146350 -166621 -155738 -127497 -46382 -79519 -39661 -7841
6457 -7841 1173 -57044 -48807 -21216 52696 69662 -36614 -138999 -117544 -189425 -136651 -44801
6445 -44801 -47900 1157 -103286 -197836 -172122 -101307 -11246 -55780 -88031 -178922 -112778 -94602
6433 -94602 -103757 -35870 -4789 539 -137172 -110131 -86016 59655 141659 -2552 -116174
6422 -116174 -14043 56468 -58760 -39376 -26247 -29945 12397 -86557 -66842 -47863 -116575
6411 -116575 -79442 -13164 50883 92852 49623 14945 72484 -66654 -50556 256 -7995 -65472
6399 -65472 -36425 -38026 -70948 -51299 -93898 -85299 -162894 -41068 -27750 -90496 -13745 15163
6387 15163 -86990 -102730 -58636 -98625 -101098 -46272 -87598 -63765 49575 58048 84454 148211
6375 148211 151677 -34800 -382 58027 93156 126100 156864 103937 100134 57021 21144 79138
6363 79138 149121 197354 209537 188937 133385 141059 132613 167115 91941 -67559 -72885 -98526
6351 -98526 -98350 19993 2193 -3035 58812 67472 89836 37722 44977 -65401 -9932 64821
6339 64821 55495 72383 -19170 39461 61978 25146 66775 156934 202230 248306 111109 62340
6327 62340 80182 69006 -8978 -59561 38875 72412 52137 -23562 9230 7343 -76690 12277
6315 12277 78286 40489 90678 81352 -48101 122866 107589 -955 8884 7047 34448 152765
6303 152765 47453 -3911 17945 24689 73845 -11863 -22483 35776 40130 18588 106248 15160
6291 15160 -36008 44483 -10872 24945 -27561 -115538 -60028 19017 70024 80147 -24431 -117834
6279 -117834 23281 -19373 -74425 -59012 -2455 3749 96198 62151 2065 111321 -9065
6268 -9065 21795 79508 -8375 -83770 -57554 -1614 -115017 -132103 -219 135439 2923
6257 2923 -5608 68181 64272 88061 101719 138571 99801 23599 -28325 5835 -10465 111228
6245 111228 142177 90991 106942 20446 55533 -7165 -7132 56067 -53913 77212 149756 136384
6233 136384 9519 -106840 -26031 68028 130403 47998 44432 70262 -1001 77223 97009
6222 97009 24115 82136 135223 85406 88582 58166 -33417 -32220 80013 83535 65911 97793
6210 97793 90970 -15679 -14087 31866 -5665 -3330 -10475 -77570 -48981 -16352 76922 83805 -2620
6197 -2620 -34693 -14188 48640 -2801 35065 43245 98544 116799 78781 10346 -46035 -110666
6185 -110666 -105036 50940 208991 49069 -25806 40454 58085 32426 98176 97185 76269 120536
6173 120536 89531 47205 83111 2691 -67769 -18005 -2979 13841 4569 31417 182156 87503
6161 87503 20333 31966 52288 74421 46084 104214 145186 138997 170126 159415 178785 212940
6149 212940 185249 253861 295709 209208 145330 223639 191651 88831 144352 258109 249128
6138 249128 271639 95644 88646 141896 219708 189203 197130 161464 163405 121325 123433 272086
6126 272086 227427 192926 305916 335191 170770 274457 339270 248446 250102 356644 471781
6115 471781 315170 353729 350645 360826 299751 304916 238079 220345 274146 246489 233450 233908
6103 233908 329807 288472 283004 251232 309299 271477 281524 317838 303297 249525 280607 360387
6091 360387 356682 359862 479614 457702 436077 459472 515096 529281 429881 343857 383631 422714
6079 422714 498479 513095 509732 365892 295452 286533 311643 315149 292716 320355 221356 302780
6067 302780 286324 281411 228440 300119 341875 379657 417458 402244 316348 343048 428965 422860
6055 422860 437966 376837 444382 548957 667934 725702 711285 630216 573498 498452 453918
6044 453918 441083 491639 511929 506722 528757 513390 460690 401742 463662 568888 538539 570017
6032 570017 524757 551399 492552 466825 474029 459677 522685 514301 543099 623826 704890 645641
6020 645641 694269 709784 714115 607466 671671 534437 478400 495701 497642 477082 393109 460606
6008 460606 554556 612988 563696 575980 634262 649121 584825 626743 605714 614104 559081 658711
5996 658711 747315 605663 593229 694549 721810 790491 718006 693546 725725 763573 774064
5985 774064 719442 683111 676137 668898 603877 671033 745079 645413 603749 607723 687264 750506
5973 750506 723716 677069 732977 638860 708199 766708 764893 762477 590014 612870 707254 731133
5961 731133 768717 836621 772970 793783 721108 684215 697266 735469 770805 714142 810144 894736
5949 894736 756895 652424 723897 749957 866963 829741 793591 871755 808679 884603 804409
5938 804409 842245 782316 811708 849043 889615 900755 895148 957252 988244 993588 1007820 1097264
5926 1097264 1125017 1098904 1154793 1168778 1297530 1242851 1204937 1329671 1350319 1338480 1375019
5915 1375019 1271196 1346277 1418077 1487781 1386040 1381339 1546086 1537810 1586923 1620866 1734151
5904 1734151 1692442 1715884 1637162 1737717 1859722 1884869 1861304 1945655 2053526 2059578 2103728
5893 2103728 2203649 2263720 2281030 2198141 2344712 2519643 2582966 2638184 2724438 2751748 2780289
5882 2780289 2923129 2981905 3142732 3289418 3287339 3293515 3407095 3546117 3626396 3660544 3836520
5871 3836520 4035478 4164522 4371508 4358910 4551721 4701210 4849917 5051229 5288502 5393994
5861 5393994 5539536 5933298 6091528 6230246 6510066 6841600 7130392 7523158 7850867 8206401
5851 8206401 8602208 9115349 9681718 10308922 11101870 11866208 12816911 13857406 15099955
5842 15099955 16611986 18425300 20372676 22406663 24466273 26011422 26731441 26662815 26379888
5833 26379888 25758919 25204909 24699375 24313999 23936272 23207719 22445712 21776378 21094086
5824 21094086 20435044 20024968 19976871 20074807 20341902 20918599 21802774 22949525 24265787
5815 24265787 25960374 27887383 30077682 32465603 34826672 37019112 39143079 41335957
5807 41335957 44019096 46904506 50082704 52594764 53527016 52679382 50223831 46954474
5799 46954474 43624916 40365529 37366462 34726425 32287128 30092963 27943971 26101146
5791 26101146 24384517 23078226 22020353 21305491 20718139 20519071 20518788 20710513 21233329
5782 21233329 21945436 22853949 23906663 25320536 26694999 28058855 29217787 30134134 30962299
5773 30962299 31923834 33008759 34037727 34326936 33450462 31594427 29114142 26403222 23581736
5764 23581736 21134080 19003163 17092763 15391564 14144038 13259859 12375728 11539862 10891745
5755 10891745 10330938 9847617 9437773 9099644 8727918 8358845 8123191 7897776 7690867
5746 7690867 7448235 7337173 7133512 6923216 6901311 6811802 6732674 6676797 6547680 6415490
5736 6415490 6420477 6444378 6450288 6413225 6382974 6384835 6340945 6344344 6533056 6493198 6628961 6724797
5724 6724797 6803554 6836260 6873950 7026502 7218882 7393567 7538245 7751302 7798946 7968388
5714 7968388 8117068 8420681 8672479 8841072 9143833 9486731 9842335 10279771 10706954 11211650
5704 11211650 11791199 12438308 13118641 14047904 15200833 16523824 17942600 19600751 21477931
5695 21477931 23768090 26357549 29190315 32196203 34811259 36341057 36716698 35986678
5687 35986678 34777551 33594169 32632924 31733126 30819772 29678012 28276139 26629577 25138856
5678 25138856 23912221 22826751 22236190 21802151 21769996 22016042 22419042 23137202 24322202
5669 24322202 25622303 27237682 29407348 31838884 34390358 36894893 39368845 42110092
5661 42110092 45021358 48303485 51590332 54175754 54954813 53643050 50820401 47303508
5653 47303508 43889600 40830419 38091822 35449880 32560000 29850313 27370427 25083886
5645 25083886 23115881 21598271 20530896 19620356 19027575 18617604 18451368 18460082 18803640
5636 18803640 19355456 20072980 20725649 21274411 21888763 22304524 22611603 22845492 23201800
5627 23201800 23705288 24375272 24511440 23959640 22595814 20592849 18513321 16520018 14729551
5618 14729551 13206867 12017380 10983770 10115189 9399782 8756444 8168680 7721163 7168273
5609 7168273 6859377 6440818 6132218 5995048 5595098 5370779 5170340 4983371 4762947 4495610
5599 4495610 4428204 4323031 4187689 4121778 3960036 3846010 3757366 3650269 3541996 3453644
5589 3453644 3502480 3473260 3301332 3200600 3109892 3063517 2988002 2916663 2818790 2824032 2940145
5578 2940145 2858076 2855269 2878818 2876578 2772225 2815166 2870237 2747758 2691697 2656110 2568546
5567 2568546 2503912 2395776 2452173 2497827 2502002 2465974 2413383 2391026 2375050 2441721 2486103
5556 2486103 2371464 2339581 2322044 2289228 2280047 2316582 2401705 2448202 2520320 2515662 2599965 2713102
5544 2713102 2866175 2948590 2904270 2733379 2644581 2479832 2252814 2230348 2201319 2168659 2193390
5533 2193390 2150636 2050007 2028875 1858954 1849224 1834270 1818791 1819181 1766287 1728393 1680883 1645979
5521 1645979 1614141 1717956 1653853 1602999 1727924 1733503 1718148 1710677 1603201 1480161 1448368
5510 1448368 1367370 1302405 1241937 1165700 1130190 1026545 1063676 1080783 1085611 952087 930984
5499 930984 905079 941760 994701 925865 885414 900729 909153 917987 915831 909432 860741 847276
5487 847276 912288 888892 841385 830420 818732 856327 838507 807060 729360 632649 574151 665680
5475 665680 667050 701274 618101 506885 489667 463132 491943 556479 468769 408290 339800 482504
5463 482504 591608 523665 525534 492219 519355 610261 600553 592888 629726 594804 624679 488308
5451 488308 470449 435912 502429 578638 579071 568930 543975 414242 314807 288093 243589 318132
5439 318132 406994 380778 244021 270840 280870 283926 383360 331959 285828 289758 306533 242819
5427 242819 213352 292183 293707 182903 252543 286375 324639 336337 374252 309640 302273 301096
5415 301096 237950 207954 188143 135049 164573 255056 249205 249722 290918 281668 206588 183579
5403 183579 206582 355701 301646 298765 273764 202766 253460 223622 321050 276134 200771 81949
5391 81949 211997 229383 219054 211761 189340 203067 220532 331377 217770 128806 174265
5380 174265 216346 179913 135192 220895 325615 226679 321949 310041 157602 233399 215341
5369 215341 172215 199020 197295 265231 308606 232469 97673 170408 233757 295862 339030 265326
5357 265326 338936 316893 282689 316321 329498 351515 258150 243885 355329 372655 275515
5346 275515 242394 276731 275056 238936 215796 239240 279434 299126 366013 325404 257701 193305
5334 193305 190255 244449 203439 171082 242782 361088 305646 211175 335713 368224 321677
5323 321677 346390 364222 377721 400641 409648 446276 356542 342705 380558 401770 412597 296895
5311 296895 259832 366804 380791 372142 286178 164032 159618 259401 234001 148152 157030 210736
5299 210736 162247 213653 218211 211434 202118 194504 228566 295735 322730 337991 286538 282222 272590
5286 272590 211634 155178 265984 313347 223907 237288 156773 154893 172431 60423 80624
5275 80624 155141 111902 99012 85438 167803 120328 186768 172091 149129 191392 198496 189454
5263 189454 181209 226035 190580 137440 122959 13504 98530 137219 135265 166951 138735 105143
5251 105143 174022 142013 177455 179064 194040 188719 204631 237467 164332 92047 83798 12710
5239 12710 38181 37331 45172 59564 148288 135346 14200 42701 77483 42202 -80818 77262
5227 77262 84633 93937 42062 -74357 55937 128769 204969 221832 212765 156016 59425 63349
5215 63349 22772 37557 75787 63152 39622 -25536 33169 98610 29778 62690 42120 19529
5203 19529 24022 45405 8901 166568 40204 54576 69672 74314 88784 117517 175186 173270
5191 173270 129153 105619 93329 137290 166631 86030 94324 7185 41913 202751 153961 149153
5179 149153 71954 -10911 110019 88481 128980 227685 227987 98645 104181 29842 23099 67614
5167 67614 171026 187736 77203 30269 111619 77790 99239 89495 175742 108693 48030 93449
5155 93449 58168 119049 50498 39102 132350 -30676 18152 31251 31557 94087 18697 78243
5143 78243 -22080 2502 70332 113046 141872 98525 73347 147105 169597 11711 -18339
5132 -18339 -23821 -59190 -86090 -106754 -17777 21388 27161 11131 10668 -14582 -53719 -50179 30622
5119 30622 47725 50533 68399 -8719 -24183 -70771 -137145 -30887 45972 100985 21429 -2067
5107 -2067 87530 11827 -13533 13205 152 -8465 -19371 -3404 37184 21909 20475 -19799
5095 -19799 -74341 -56684 -62088 58246 94529 62274 87217 57962 46875 72903 -5570 -31231
5083 -31231 23964 40336 -38922 -70565 830 42083 89578 106218 92930 60160 31290 13770
5071 13770 100311 94585 -67655 66732 122037 47577 -7343 33554 146939 115457 21165
5060 21165 -69630 8782 8873 22810 87407 51398 67999 63897 -4591 30830 62061 74539 38121
5047 38121 20711 86669 69275 128033 130307 123137 101797 135562 144571 191815 131330 97952
5035 97952 124201 128134 167445 163423 102440 89824 20059 22065 98158 98119 151491 130003 56836
5022 56836 107351 213260 198877 203754 172637 181950 90113 60305 46174 86303 175741 204588
5010 204588 119501 78422 79399 52737 95538 116662 81577 53871 64376 16579 22222 99567
4998 99567 130994 175861 133435 177500 123677 47529 -69453 7828 85227 111425 226474
4987 226474 224615 70543 48974 206488 164875 176864 249114 206141 167697 100579 146655
4976 146655 219831 189305 182631 175489 138275 56298 132947 121039 97447 222283 292135 175968
4964 175968 161854 138276 171878 332895 303591 269383 170376 111120 205365 135116 67288
4953 67288 104440 118214 208433 212689 112883 75057 107721 272437 246840 126574 156534 176855
4941 176855 152475 131331 144635 161479 113964 149397 185983 117095 195256 182309 172477 241314
4929 241314 267761 304436 192700 131678 166114 243554 291801 235888 270123 275724 272228 292164
4917 292164 257576 244748 335466 399052 340153 334615 432397 362103 304430 335064 323090 284779
4905 284779 403966 416125 309223 347519 432641 434027 480459 373246 361709 467096 497670
4894 497670 503700 445511 445833 373352 455235 526078 560253 603321 730710 687329 765907 842799
4882 842799 925334 1015945 1059318 1141911 1322045 1441763 1641851 1861846 2083740 2402691
4872 2402691 2826996 3388239 4075630 4579969 4554883 4105698 3473435 2838212 2338677 1981969
4862 1981969 1663575 1488725 1306006 1105721 1059448 973475 797873 770033 723213 731455 625944
4851 625944 636262 706378 518840 498183 520396 506801 495771 511983 503811 409968 370456 414212
4839 414212 391151 404758 434527 453695 460579 487539 516468 356500 308811 278687 254016 279890
4827 279890 293891 201330 294444 272342 201540 226949 275518 298485 238748 267234 239166 274960
4815 274960 311765 335427 290761 261960 289499 304312 282189 194444 222089 250720 222427 165949
4803 165949 192576 148307 92004 72099 46610 36204 148333 232676 163185 118672 193874
4792 193874 254356 228383 176222 122700 222722 197041 100091 210350 242119 212866 180952
4781 180952 143043 65278 102458 229199 160681 261150 296428 246777 310522 314108 336159
4770 336159 262506 212886 150067 242023 245791 244279 297841 228826 139886 175246 285200 147365
4758 147365 170469 188874 81059 106523 177703 195884 171413 212038 263688 200558 212436
4747 212436 197163 180570 288689 235494 201919 190867 161639 203057 142356 114206 87303
4736 87303 187064 196585 223221 196699 69711 75166 152645 189024 133177 162094 181558 87466
4724 87466 100115 79033 150701 264171 162809 189577 215456 176103 273172 211653 122481
4713 122481 160381 161080 173969 145598 148898 170196 229677 236619 195284 197828 220174 280924 260970
4700 260970 131509 61962 126362 171114 173640 229973 240463 199713 175692 167704 191514 213449
4688 213449 163487 195065 205805 178873 233998 291624 256014 195410 151241 216524 239513 313969
4676 313969 332732 298725 279177 214878 179998 272889 269583 145039 249630 305300 304491 291160
4664 291160 173938 170761 335362 295666 320631 343785 260243 213508 220232 225666 256059 296510
4652 296510 301113 285884 256693 296940 286863 205140 276555 196616 208987 270354 254715 232835
4640 232835 325998 405928 307114 283450 290944 247220 322501 351342 327907 421658 450866 385614
4628 385614 289974 244043 260207 362621 337536 299256 250986 302157 313233 257928 288631
4617 288631 278559 329325 349402 299907 270477 263675 213796 167101 244699 194163 268520 319798
4605 319798 302725 272318 288194 377244 397020 197744 264561 369570 311251 327545 271141
4594 271141 299397 310774 441173 444731 393870 416261 430331 416472 481248 456719 384296 387786
4582 387786 362523 432196 440575 481616 444343 436499 475155 544944 443148 432155 514587 487217
4570 487217 473549 458638 420653 420782 439813 413607 411841 357679 418288 438649 408778 417987
4558 417987 424009 482171 528038 483954 448730 358339 388290 453847 427067 387865 400234 320881
4546 320881 383966 443225 475577 523550 448396 498473 461157 437636 477845 428174 404679 557537
4534 557537 597970 582860 555748 495074 508851 505122 563330 625860 684554 615169 603710 523764
4522 523764 473658 453676 423471 488951 630674 566189 579078 599528 598884 509730 381853 433872
4510 433872 444944 471017 601675 581816 632537 587517 458470 541275 470418 483505 598488
4499 598488 594062 586945 629999 519648 529127 502180 360772 417399 480375 457405 514671 455847
4487 455847 545522 633893 575231 625810 677924 685371 762691 646292 587385 549769 505890 534351
4475 534351 608803 714330 729273 691977 754177 706049 653204 727073 718324 791626 800013 703933
4463 703933 695999 746854 744275 780071 843729 732127 792735 771003 745208 714888 811273 790281
4451 790281 863451 878683 799740 746303 645319 684532 725040 807379 715924 612607 676599
4440 676599 732092 689384 702208 674362 640210 568837 691985 749567 738438 694777 692038 741281
4428 741281 809887 723322 586028 634626 703051 718680 701732 739417 877331 883735 915742
4417 915742 929536 972733 982672 1047236 916307 880123 893382 857821 870872 842452 881677 881729
4405 881729 844377 880019 794298 771509 925335 919791 899132 853199 932830 864064 838000 843155
4393 843155 892664 845906 787902 842276 952617 948378 969110 945477 886819 932339 921812 952190
4381 952190 949202 1049549 1093158 1085345 1021302 1033303 1057770 1156245 1103351 1044413 1017631 1103124
4369 1103124 1108940 1038066 990579 951830 971084 889360 963046 1007373 938000 998989 1008970 984878
4357 984878 986831 922834 918678 881786 914573 988122 945296 918773 941371 869274 967106 960267
4345 960267 887404 969898 1043559 967566 903115 985973 973314 890412 929899 952992 976556 953922
4333 953922 822618 809781 774509 796404 881977 817496 718193 700983 685065 694095 766646 873539
4321 873539 866149 889412 799168 743814 717110 732733 798825 781535 829452 841118 845523 743690
4309 743690 800897 882660 830150 785581 848050 996443 1039344 980331 984148 925801 995030 922808
4297 922808 843075 845005 824466 762988 771022 773662 799381 902544 846116 828513 801337 826986
4285 826986 775954 863959 935425 881135 1019065 1037388 1036019 857667 862555 842079 1005034
4274 1005034 1070301 909790 1009805 982607 952131 879701 948338 998584 922801 972463 1102802
4263 1102802 1111061 1112424 1041179 1053622 1103657 1213626 1214368 1222862 1245339 1201521 1273559 1291582
4251 1291582 1279922 1332049 1344209 1258601 1353246 1252980 1289379 1331221 1366675 1253396 1233681
4240 1233681 1315357 1341071 1359526 1398069 1420686 1453728 1490914 1497141 1549530 1430124 1367876
4229 1367876 1342279 1480252 1507901 1468370 1415670 1551467 1684225 1637491 1689339 1750215 1724281
4218 1724281 1657469 1672190 1700595 1672508 1643195 1614760 1738279 1729702 1786776 1873452 1913940
4207 1913940 1888640 1914199 1828856 1897258 1887273 1935655 1954746 1977262 1994673 2048481 2120281 2191950
4195 2191950 2378917 2316193 2321538 2526749 2682131 2834925 2830674 2773377 2839236 2743581 2651669
4184 2651669 2631044 2578012 2539403 2525854 2603233 2668903 2681241 2662617 2735661 2784916 2771581
4173 2771581 2783138 2837858 2856555 2865670 2920404 2920465 2907474 2920510 2974640 3060795 3187017 3336375
4161 3336375 3428453 3316553 3496828 3486600 3525110 3609927 3701152 3791600 3953390 3958814 3911752
4150 3911752 4061893 4169720 4303727 4397145 4601367 4750866 4800551 4825768 5011727 5149194
4140 5149194 5300728 5403329 5479828 5702959 5891669 6034667 6271860 6566224 6724084 6952060
4130 6952060 7180193 7312794 7516548 7615371 7736624 7941408 8231091 8403140 8664337 8992966
4120 8992966 9171528 9462225 9698691 10232390 10771773 11198799 11576144 12130164 12632857 13177662
4110 13177662 13855266 14449710 15145826 15857485 16596303 17432018 18274134 19260835 20340390
4101 20340390 21437158 22635724 23832198 25002879 26364918 27739010 29039311 30439430
4093 30439430 31933215 33410277 34917134 36488955 38144505 39776679 41423014 43172306
4085 43172306 44944208 46656339 48508395 50251342 52038704 53673607 55194006 56794920
4077 56794920 58151160 59463630 60589373 61733195 62853605 63898810 64822280 65731244
4069 65731244 66662217 67346565 67848272 68184483 68302094 68184613 67920115 67417308 66858198
4060 66858198 66223572 65506027 64656531 63712411 62780104 61736858 60569512 59342924 58011357
4051 58011357 56589515 55172258 53483531 51748094 49903532 48225283 46261564 44466352
4043 44466352 42741395 40983544 39407061 37770292 36209732 34647982 33094855 31621973
4035 31621973 30150578 28684345 27171608 25803428 24543418 23190948 22038433 21015080
4027 21015080 19817505 18843383 17952141 17056627 16165317 15363117 14657784 13869724 13304427
4018 13304427 12747559 12259292 11681983 11210527 10862628 10454997 10087517 9695881 9360525
4009 9360525 9035781 8765441 8434313 8217591 7953151 7769640 7593704 7360289 7225659 7077316
3999 7077316 6875284 6728645 6570569 6501523 6391995 6221347 6092221 5938808 5796572 5670398
3989 5670398 5659911 5589856 5476500 5497320 5504823 5307812 5278172 5247364 5183827 5120397 5108287
3978 5108287 5069138 5029757 4997023 4860278 4753349 4764202 4742297 4713232 4665744 4636381 4650388
3967 4650388 4703953 4666124 4725406 4556895 4547197 4494018 4609799 4708593 4636158 4643067 4730713
3956 4730713 4686400 4714202 4849403 4851526 4825827 4892783 4912020 4914858 5053132 5106405 5269940
3945 5269940 5174830 5257366 5340511 5438391 5479230 5583358 5616946 5725442 5731762 5919710 6023104
3934 6023104 6092698 6305961 6390632 6452627 6491869 6668746 6725613 6840715 7026729 7006878 7026503
3923 7026503 7238566 7359518 7415074 7518308 7505597 7572466 7647177 7580541 7576231 7674383 7797597
3912 7797597 7832728 7807629 7760202 7879413 7819012 7873933 7921286 8075379 8248486 8406123 8600606
3901 8600606 8637770 8819559 8970108 9103960 9043829 9146871 9140795 8889524 8832991 8682599
3891 8682599 8617509 8427785 8288358 8251860 8221212 8163198 8124445 7969957 7812004 7747850 7615571
3880 7615571 7407744 7065815 6760896 6516830 6345594 6052477 5819443 5571076 5369344 5252223
3870 5252223 5154874 5044566 4905331 4833038 4805495 4734663 4600982 4622865 4598750 4517887 4536624
3859 4536624 4573552 4513058 4390366 4449624 4469537 4434902 4437441 4525193 4616434 4601013 4551146
3848 4551146 4608337 4698944 4818753 4859845 4965426 5043472 4998752 4919268 4912232 4892252 4830289
3837 4830289 4821129 4799413 4887761 5028438 5062277 5153745 5260511 5355161 5473588 5389079 5433995
3826 5433995 5465601 5528179 5497259 5466195 5467269 5693764 5800413 5784210 5851236 5934208 6219688
3815 6219688 6467782 6625154 6616740 6556720 6410039 6304205 6157673 6121725 6068890 6017661 6122609
3804 6122609 6125034 6141961 6321473 6415886 6460458 6591820 6397021 6504414 6509333 6541522 6543991
3793 6543991 6564236 6541982 6652191 6749411 6843459 6832418 6841590 7030374 7091027 7190442 7251790
3782 7251790 7357660 7350997 7345573 7275192 7371358 7367097 7475013 7655492 7724032 7705053 7829491
3771 7829491 7905117 8014129 8051655 8175483 8309813 8454354 8619592 8626627 8737950 8920509
3761 8920509 9067971 9191790 9389233 9523724 9677263 9864872 10078414 10305116 10553332 10722505
3751 10722505 10897563 11090143 11229493 11639783 11944850 12325983 12621197 12933576 13411594
3742 13411594 13755442 14172543 14690353 15256304 15831610 16338576 16920806 17532591 18353873
3733 18353873 19104561 19868399 20783881 21624555 22420587 23386152 24250611 25157158 25830624
3724 25830624 26612054 27445367 28175563 28880139 29636826 30426916 31085540 31795063 32528472
3715 32528472 33235096 33863461 34430289 34808509 35104302 35271986 35501868 35635458 35754197
3706 35754197 35915710 36040162 36141703 36367783 36616778 36798164 37053821 37227923 37577008
3697 37577008 37961101 38125707 38360115 38685827 39233389 39718702 40375959 41072637 41870910
3688 41870910 42737634 43914803 45102949 46479852 48065189 49770143 51658514 53639459
3680 53639459 55763973 58338027 61111410 64080214 67166732 70385643 73828437 77322287
3672 77322287 80797933 84504629 88202657 91732992 95472811 99183905 103026607 106911741
3664 106911741 110964409 115194531 119572585 124254439 128976620 133939570 139110060 144408454
3656 144408454 149942748 155725517 161870844 168496495 175824721 183980148 192916512 202783881
3648 202783881 213528256 224930444 236555303 247803925 258042591 266871503 273788759
3641 273788759 278652871 281414403 282445771 282277077 281108575 279692095 278273912 276989132
3633 276989132 276107957 275442310 274729821 273606564 271452420 267832862 262252105 254671849
3625 254671849 245162283 234231142 222203475 209878433 197632310 185633232 174401027
3618 174401027 164021202 154411029 145600071 137546221 130113374 123233272 116959584 111020558
3610 111020558 105587275 100561201 95866683 91387247 87034216 82841491 78694496 74772164
3602 74772164 71027260 67440138 63918457 60761428 57863872 55200170 52843258 50692530
3594 50692530 48778508 47201343 45750919 44293093 43195806 42240581 41480960 40876421 40325268
3585 40325268 39743838 39371801 39082078 38703402 38459237 38059991 37598528 37227043 37022603
3576 37022603 36751992 36573278 36404989 36247071 36085183 36062766 35890878 35614100 35474173 35136486
3566 35136486 34753640 34303684 33691758 32977218 32339410 31551143 30805484 30020422 29258397
3557 29258397 28387494 27701540 27045974 26337632 25666233 25065640 24228139 23459643 22700886
3548 22700886 21986407 21199170 20384129 19581914 18901873 18302729 17626648 17083559 16459963
3539 16459963 15905176 15425177 15113177 14659439 14195455 13885542 13647226 13408897 13060140
3530 13060140 12729375 12487285 12236760 12081282 11821342 11671200 11487261 11172992 11114396 11057453
3520 11057453 10815370 10620504 10476319 10381947 10234967 10066922 9931278 9937903 9800403 9566172
3510 9566172 9419920 9402514 9346593 9256892 9135504 9100881 8955700 8865913 8850640 8763597 8738798
3499 8738798 8814416 8668583 8467701 8522488 8515343 8481183 8435414 8347914 8284272 8227183 8137792
3488 8137792 8078228 8030676 7853965 7764487 7751310 7594993 7491549 7576860 7441317 7362383 7337134
3477 7337134 7141722 7144223 7081297 7138325 7087273 7002392 6966720 6936660 6975992 6919039 6909336 6934816
3465 6934816 6913701 6814194 6731848 6636373 6652995 6716490 6710259 6690408 6719055 6692581 6658358 6607509
3453 6607509 6555349 6586812 6615536 6438156 6413825 6503629 6602938 6596868 6501500 6517908 6579055
3442 6579055 6579045 6609766 6575780 6559241 6587097 6608961 6702321 6719473 6690802 6769064 6822888 6756787
3430 6756787 6774101 6858834 6876851 6818571 6859827 6955765 6869103 6881279 7045799 7019190 7060387
3419 7060387 7037863 7047961 7011554 7027885 7036912 7028592 7112388 7321272 7319535 7236919 7278839 7332152
3407 7332152 7349926 7251494 7377847 7582932 7523003 7540781 7501692 7576874 7634076 7693374 7815512
3396 7815512 7885806 7852919 8048465 8147083 8149348 8170392 8181351 8282484 8261970 8401208 8458331
3385 8458331 8422427 8521100 8554798 8744955 8766770 8877028 8999393 9034265 9211770 9320837
3375 9320837 9362934 9533234 9674495 9805468 9950070 10026506 10144004 10265613 10298883 10522485
3365 10522485 10747025 10894749 11125956 11114065 11317092 11505013 11668454 11795492 12009616 12292241
3355 12292241 12389501 12413900 12614746 12747642 12961106 13069749 13206740 13407075 13558706 13655103
3345 13655103 13731202 13964433 14250558 14457055 14690976 14834460 15105887 15360086 15484706 15484426
3335 15484426 15679318 15915776 16233650 16383903 16539183 16607264 16808819 17158108 17397319 17585871
3325 17585871 17778864 17988751 18262349 18459649 18671863 19021111 19237027 19625968 20010958
3316 20010958 20308881 20694629 21128900 21404350 21934011 22444140 22877169 23385115 23837183
3307 23837183 24382966 25014877 25646560 26493415 27164737 27934921 28883620 29813896 30836271
3298 30836271 31980426 33210726 34566980 36048852 37794253 39582435 41378275 43405705
3290 43405705 45442850 47504259 49764800 51988931 54204465 56267599 57880290 59040572
3282 59040572 59663935 59590982 58637593 56935936 54763966 52225892 49732206 47257323 44873643
3273 44873643 42742078 40888114 39300296 37833510 36526236 35269010 34204386 33302263
3265 33302263 32375204 31542899 30857375 30140023 29443676 28857905 28256295 27694106 27218536
3256 27218536 26727386 26339053 25851465 25269881 24805142 24375786 23933294 23476238 23121361
3247 23121361 22658517 22142535 21729525 21336315 20833354 20306518 19955587 19621463 19172574
3238 19172574 18682149 18280134 17942766 17522525 17188094 16897087 16545385 16166733 15905679
3229 15905679 15676579 15400698 15097645 14881593 14635696 14423280 14284203 14163475 14019968
3220 14019968 13737743 13486793 13242692 13074462 12938078 12792438 12665398 12392313 12246111
3211 12246111 12224585 12101918 11899631 11737461 11597718 11432783 11315666 11210336 11059547 10898884
3201 10898884 10756073 10659606 10554730 10449348 10480365 10348541 10291968 10114461 10001698 9929845
3191 9929845 9759362 9665976 9538580 9483344 9386011 9345959 9253423 9229150 9274857 9140756 8976047
3180 8976047 8856027 8843686 8801404 8706461 8547565 8549836 8449810 8361124 8371928 8241708 8092255
3169 8092255 8001920 7938894 7976515 7915956 7863342 7788915 7761345 7744333 7614371 7511610 7550223
3158 7550223 7509722 7395195 7395443 7437988 7390586 7290366 7234892 7208236 7192313 7072236 7063465
3147 7063465 7043637 6978660 7009259 6872695 6842079 6884747 6885805 6999309 6845386 6778082 6787529
3136 6787529 6694375 6591897 6548433 6627897 6699501 6686047 6575615 6524768 6536162 6552695 6627839
3125 6627839 6507364 6497177 6460777 6520175 6510164 6381104 6286633 6268515 6291788 6284285 6285852
3114 6285852 6261929 6197597 6116536 6181986 6179754 6097265 5956783 5889967 5862489 5910016 5858793
3103 5858793 5836518 5757445 5765574 5731315 5595513 5566377 5585696 5566979 5655407 5733358 5659269
3092 5659269 5602643 5538290 5420803 5381671 5440845 5420828 5407751 5320627 5342457 5311429 5278648
3081 5278648 5280101 5243807 5269290 5274840 5203244 5132684 5120399 5114224 5078206 5089488 5101609 5026093
3069 5026093 5059249 4999588 4919973 4978712 5009417 4987831 4877586 4907976 4952842 4968867 4979465
3058 4979465 5037174 5049692 5110978 5185323 5080455 5113353 5217757 5138699 5148147 5184696 5228115
3047 5228115 5320893 5406444 5355192 5401960 5490278 5587443 5566269 5430869 5464254 5508054 5533083
3036 5533083 5546134 5517571 5578295 5620779 5582526 5506328 5612858 5635029 5668071 5871855 5956101
3025 5956101 5957701 5970173 6153507 6184252 6279551 6421570 6434415 6494088 6680143 6791297 6858871
3014 6858871 6958421 7025841 7046535 7123765 7231963 7312841 7477703 7481575 7546596 7580973 7637110
3003 7637110 7667225 7760782 7816160 7877686 7905760 8008673 8042669 8027935 8171918 8093464 8143278
2992 8143278 8443328 8596682 8627807 8845636 8989497 9164779 9432165 9607629 9846930 10131630
2982 10131630 10284774 10544580 10811960 11082072 11436405 11852833 12122678 12471239 12769968
2973 12769968 12927827 13066018 13288470 13472845 13577213 13702532 13841872 13886570 14141806 14206804
2963 14206804 14345947 14471036 14533068 14751531 14974347 15252272 15581238 15984863 16428427 16928553
2953 16928553 17482500 17961844 18562372 19202834 19877577 20655550 21418821 22084575 22661204
2944 22661204 23160007 23436154 23411741 23191901 22701547 22160877 21463206 20848659 20339102 19968045
2934 19968045 19781642 19611438 19531529 19581794 19714995 19910165 20264335 20585401 20961995 21332396
2924 21332396 21742276 22048410 22599491 22999157 23436918 23890773 24091072 24259779 24411526
2915 24411526 24311006 23981681 23480440 22890466 22368899 21691775 20931490 20294617 19530514
2906 19530514 18855892 18454723 18104541 17674993 17500173 17349693 17220446 17253860 17182034 17056051
2896 17056051 17111044 17069986 16883359 16720414 16570763 16340228 16041422 15733460 15265800 14740672
2886 14740672 14214421 13700535 13178341 12564178 12047857 11672807 11258187 10807396 10448470
2877 10448470 10059846 9628490 9386284 9173901 8976787 8808549 8562447 8279542 8053825
2868 8053825 7931439 7815053 7651977 7548617 7290759 7140086 7085394 6876927 6716904 6470128
2858 6470128 6368746 6159023 6072853 5953676 5723299 5579601 5450085 5295870 5233803 5218189
2848 5218189 5101754 5047022 4881747 4795106 4748059 4586680 4474659 4375029 4214684 4218157 4187713
2837 4187713 4112533 4044548 3980131 3986198 3913065 3889257 3753157 3735451 3701929 3592643 3531330
2826 3531330 3455480 3366819 3522625 3450183 3306277 3283660 3299082 3258734 3117256 2991593 2906320
2815 2906320 2906951 2845948 2860711 2789940 2752974 2659012 2692980 2635843 2550758 2551936 2614066 2529372
2803 2529372 2462051 2450233 2328346 2288924 2256517 2248356 2256642 2219781 2196794 2136644 2160157 2090086
2791 2090086 1957819 1972879 1992307 1874092 1816922 1820163 1805867 1831224 1715652 1651117 1729618
2780 1729618 1668247 1649986 1611021 1556935 1422754 1487420 1488343 1525814 1551266 1530596 1522412 1432365
2768 1432365 1311996 1289517 1285783 1326208 1388324 1398742 1370622 1297536 1252510 1218763 1201441
2757 1201441 1193045 1254420 1206077 1166553 1263587 1153546 1119419 1149961 1080085 1169395 1173035 1219093
2745 1219093 1086762 1009210 1008860 1029185 1099689 1031333 1027512 986756 927641 961746 981947 808235
2733 808235 830472 885848 970908 961449 938801 1006968 1006710 994312 1045044 947220 911223 950470
2721 950470 920048 929237 822393 721824 779746 879745 880848 899954 862500 866549 808816 809702
2709 809702 796295 775730 830899 887064 788336 850466 757404 753107 802017 924465 880323 876590
2697 876590 814965 819396 849732 793507 719430 672801 636486 750735 753858 724553 855678 793621
2685 793621 701217 706004 760114 799667 771553 763739 770517 729327 860409 747221 775393 857822
2673 857822 847070 848699 836303 808816 864069 850770 823359 892906 786785 873372 820238 809559
2661 809559 709631 622016 773230 800702 802167 841544 809293 787143 814446 782817 748837 728148
2649 728148 768907 858456 887166 865218 863235 749316 829927 830383 769128 789731 797586 778289
2637 778289 832126 892716 815165 806503 939734 953804 845444 775018 790690 813868 778378
2626 778378 783765 901797 780946 760046 788386 777021 782253 744603 757524 762651 757530 711356
2614 711356 614083 716879 728952 707578 692743 678592 645728 664317 687822 648870 622109
2603 622109 646116 635337 600161 520987 441338 495891 585235 554739 507172 527295 593124 597106
2591 597106 401635 430980 470073 563236 527094 528944 473260 502912 562421 491706 462966 506301
2579 506301 498570 368909 323339 334994 336841 350966 366280 418307 453665 358764 350539 376925
2567 376925 420273 337097 384266 445867 398859 300960 237594 191291 238378 289698 264880 222668
2555 222668 297320 362248 313627 338672 286893 222645 233214 308833 270083 211540 261258 314066
2543 314066 215473 167199 198167 286682 307918 389916 259596 164118 198716 173072 263976
2532 263976 194252 149862 171829 163581 248318 107003 103728 220788 221877 232219 240533 151442
2520 151442 236888 175947 69281 75975 23404 99499 206138 275512 309915 314747 256304 203305
2508 203305 140751 42477 96929 155290 114141 115183 119803 139129 39873 76753 44027 130071
2496 130071 183504 173327 131225 28417 48438 160413 212893 192900 79727 141705 158620
2485 158620 120612 80289 40773 72526 63040 194211 160327 171748 239429 226469 222747 191939
2473 191939 98199 23052 56692 83795 125600 23916 -58941 2134 29051 113448 118880 127946
2461 127946 99462 44555 132448 103196 110150 122035 191144 151048 73982 77093 134826 224962
2449 224962 235681 181841 116828 131952 108265 54407 45863 46908 -81478 65980 84548 32339
2437 32339 25084 -27031 47943 7327 109634 110145 -3674 12405 121097 98793 -576 1014
2425 1014 111561 143778 130400 110180 125553 297984 250800 61512 101055 223239 167486
2414 167486 273476 275149 160844 97780 190734 108099 92212 166400 218234 163204 140352
2403 140352 69203 31159 98642 154451 206779 160000 139019 85578 83084 98851 150606 68366
2391 68366 16462 -44003 -16267 72809 73742 21274 128456 85752 47282 80646 125188 141628
2379 141628 141767 120726 33990 -16336 106304 181432 74542 59335 55633 19850 11235 -8310
2367 -8310 48350 40801 43999 112976 108344 106344 113058 76893 55958 158173 153733 83108 80274
2354 80274 46180 23724 2121 -6665 -21460 -94491 85036 122792 144944 157004 121168 116283
2342 116283 143559 134323 110917 101303 99261 137690 184613 71793 -7198 65983 127204 166152
2330 166152 164734 190547 181083 111317 144633 174987 118048 123846 197492 223089 134494 95902
2318 95902 71728 46507 113045 157055 148266 34977 24137 145603 188186 184111 143975 121579
2306 121579 129915 145654 27343 96222 175750 101650 121647 -24128 -21139 37587 32330 10764
2294 10764 5239 118680 81902 151110 173186 152730 225000 154848 40951 73768 145503 203976
2282 203976 40481 12754 25341 51872 108960 272819 328839 231926 207622 258821 304187
2271 304187 291661 160980 180378 158476 156218 194034 190232 174019 174919 284343 328417 297661
2259 297661 324763 237844 123569 260265 284742 193432 148069 137933 145927 185823 242557
2248 242557 283707 288149 388961 359585 326128 369281 348843 367821 407261 423407 445515 408493
2236 408493 396945 434890 624680 548436 501698 529139 489665 576307 606474 685910 743312
2225 743312 732568 770895 736751 738800 786154 690879 751349 868782 823828 912691 926259 887781
2213 887781 835072 964579 1081995 1148091 1151046 1076517 1139462 1120495 1167758 1258341 1286275
2202 1286275 1371943 1439203 1473214 1539628 1478886 1535028 1581844 1594151 1624639 1700827 1805890
2191 1805890 1881952 1912366 1874317 1944702 1969411 1967161 2076742 2209629 2368914 2492651 2613597
2180 2613597 2667490 2781493 2860068 2959661 3229566 3346177 3421238 3672339 3889025 3969306
2170 3969306 4174883 4373122 4621699 4928357 5100064 5345125 5687739 6001311 6605264 7364711
2160 7364711 8080028 8737975 9287435 9902971 10727283 11680017 12979823 14528727 16407004
2151 16407004 19037314 22355415 26075243 31017257 38422433 48077177 54665899 52322023
2143 52322023 44795336 37308389 30279838 24689705 20311187 16961393 14451759 12576459
2135 12576459 11360052 10401610 9533835 8927795 8508104 7958195 7412616 6892224 6458722
2126 6458722 5987706 5561158 5130228 4745015 4364333 4128653 3941215 3668401 3389083 3164595
2116 3164595 2937696 2790450 2678678 2688508 2622316 2433106 2395150 2281288 2193592 2144102 1960053
2105 1960053 1852779 1807420 1836399 1876804 1857075 1717292 1475271 1329633 1394547 1330429 1231373
2094 1231373 1241251 1243552 1176791 1122239 988014 978148 987199 1006767 934832 935749 991757 982761 901646
2081 901646 929517 912081 851792 941187 924101 804619 795629 721807 619921 621856 626871 730485
2069 730485 770536 693588 580277 591513 598003 711361 581368 419320 356318 308334 457047
2058 457047 502031 416450 345804 300156 325191 399048 359155 360547 381326 392414 418421 420347
2046 420347 370740 436489 410681 351361 258135 295774 349639 316026 377229 376900 283976 273143
2034 273143 278996 226917 315635 206455 212368 190966 313743 288171 252860 346950 266031 188558
2022 188558 140806 156980 111144 122952 198223 141170 85059 76906 133276 172147 216618 155199
2010 155199 192057 204964 168528 167934 100362 180149 244532 157220 111581 143769 232790 172831
1998 172831 187142 193373 166899 149535 42800 39478 -23821 66534 164912 182040 42822 56964
1986 56964 121420 150614 192008 39270 11811 21869 42250 115164 90248 -11918 42182
1975 42182 -4443 3832 41994 65619 119042 51576 85252 132444 117710 148536 14404 46894
1963 46894 61353 118350 91379 -8193 7490 19931 42705 -106571 -44572 79803 108012
1952 108012 21368 42905 95087 78731 20620 43864 85909 52819 119970 65935 36576 111370
1940 111370 25280 56499 44196 28217 139582 91781 4519 74972 108870 124220 91131
1929 91131 100770 50815 15257 5830 45250 32172 -8938 -10706 98088 151153 113351 51090
1917 51090 -1894 67541 87879 59043 1999 15783 120620 17118 -34940 -66814 -17512
1906 -17512 26134 -17684 27509 34527 92200 70740 32137 -27163 -39127 -26219 -27996 729
1894 729 83215 116775 19744 11825 61208 12716 -69648 31467 41599 -18821 48873 -15175
1882 -15175 35669 101702 225460 195934 251686 250204 263305 290781 225010 98819 106320 132035
1870 132035 66269 78139 106056 160670 130647 180410 169572 116756 61970 6730 17265 -24589
1858 -24589 16723 71076 -45106 -53292 -57066 -27210 -21441 -91350 -50050 23964 48057 99775
1846 99775 56215 26528 511 41558 24555 -15276 -18434 -88790 13216 -2984 -7705 -60257
1834 -60257 2122 94094 34401 64454 36450 38101 62820 41514 -131114 -50958 18291 -81660
1822 -81660 -168838 -99313 33669 80708 7067 -16085 320 -38286 92192 49911 56551 11652
1810 11652 1113 -36501 -69706 -93985 -87857 -71280 -54875 -103627 -96206 -46359 -64332 100540
1798 100540 -20292 -18021 -34519 -47527 -38160 52488 99672 41928 55631 -13670 -77669 -133249
1786 -133249 -91720 -152931 -88204 -68732 -40815 -21264 -88372 -51177 -39513 -8707 -62479 -120347
1774 -120347 -108689 28665 -4069 -1487 91807 44458 17757 33320 -550 -21314 28997 59424
1762 59424 159614 83837 -25215 3795 -37917 -92982 -75185 -85629 -103350 -44562 -70873
1751 -70873 4608 25928 -12988 -104181 -51275 6750 -32893 -74096 -46166 -44334 -59787 -6750
1739 -6750 13521 22078 -32928 35918 -25529 -17839 -12479 -27914 -46887 -81445 -124960 -129206 -259994
1726 -259994 -193611 -148148 -77384 -23503 13835 -86409 -107242 -131373 -159591 -40452 17966
1715 17966 35333 -9445 -66777 -122511 -48617 -31202 -54683 -130014 -20034 62834 6545 -82079
1703 -82079 -73884 -33855 -12980 -75368 -13852 25894 66433 39057 -52166 -18108 23768 -30199
1691 -30199 -42889 -89046 -109768 -53665 -105759 -9910 12133 31453 -57629 12417 52216 -20997
1679 -20997 -47900 34197 35832 -127548 -112449 -73211 -134588 -78892 -61401 -139305 -138478 -25661
1667 -25661 -21925 -69106 -67270 -124770 -73749 -100331 -63333 -3567 -43364 -91567 -70435 -22097
1655 -22097 -16935 9486 -13165 25435 59568 13987 -12520 19689 62767 19398 44529 -25614
1643 -25614 -74711 -166699 -151318 -84438 -49206 -90529 47800 46198 -82494 -95214 -184165 -90006
1631 -90006 2950 -86372 -119154 -163024 -129453 -147131 -87676 -74935 -43574 -61171 -34108 56259
1619 56259 -86743 -123855 -13623 -9558 -55441 -25194 -60490 -7066 -65006 -87663 -42369 -12036
1607 -12036 -54931 -173632 -203062 -267425 -202532 -215890 -101990 -3534 -26519 -74337 -66022 -7075
1595 -7075 29412 -4569 -7270 -5696 69874 51665 -136175 -114581 -158387 -203715 -180861 -128286
1583 -128286 -133976 -120342 -79566 -110873 -83948 -33565 -122146 -130566 -90864 -8566 -4533 2850
1571 2850 -22501 -46217 -87031 11419 37968 29240 32797 -91532 -100769 -25207 20045 65516
1559 65516 14379 -36772 -104166 -14527 1549 -44710 -17595 22661 -44255 -120782 -112457 -12964
1547 -12964 5042 7379 -11523 24840 -39699 -49464 35017 -9722 13979 -16596 -65846 -34055
1535 -34055 -7925 101762 -23625 -140042 -63582 -82668 -37751 -48431 5122 10944 42552
1524 42552 8800 8912 -49125 -82402 36968 42325 -46029 39130 12991 -67852 -66765 -48341
1512 -48341 53984 45010 52443 -23847 -41280 -33118 -133180 -61866 -10602 -33123 -65823 -348
1500 -348 52771 86803 102930 47181 77667 101818 9237 -41457 -65438 -56420 -50359 13714 50299
1487 50299 43612 13594 -6557 44227 -28927 -87012 -102699 -71301 2479 -68915 -63423 -37485
1475 -37485 -30133 11814 -43229 -74065 -81011 -187135 -148531 -39138 -104685 -87749 -64871 -22750
1463 -22750 102216 87523 647 -108207 -58964 -13584 -13655 16341 -73300 -27160 5773 -42163
1451 -42163 -4986 -37108 -14738 -64243 -89549 21432 56552 4675 -41989 -132622 -80789 -61825
1439 -61825 -60153 -92835 -170335 -205181 -136091 -73196 -29762 -14753 82573 90228 -6783 -25139
1427 -25139 -4205 -7073 -80165 -61648 -14878 62804 -12879 -34931 -160690 -127955 -76436 -86789
1415 -86789 -56310 -89813 -121165 -120732 -128444 -120249 -103973 -75611 -78793 -39422 -33556 -68924 -44863
1402 -44863 -41502 -25804 -46635 -40455 17377 4807 -53318 -103646 -125917 -79036 -21026 -17753
1390 -17753 25067 66177 43462 -50724 -105237 -9064 -84680 -108353 -30137 -16832 -31929 -70689
1378 -70689 -113753 2365 69007 -2993 73317 36980 -22182 -11964 -4585 -26050 -72453 -87652
1366 -87652 -55582 28204 -72175 -92032 -43973 -59000 -28972 -99922 -69244 -100549 21614
1355 21614 -30970 -82767 15260 55315 18251 -13101 -37943 -31533 -11855 -16118 58008 109714
1343 109714 33204 26213 15553 -66892 46027 17209 9858 -24870 78001 -6161 -29149 28740
1331 28740 -69687 -106380 -80487 -40305 -7600 6841 33949 40622 57785 11599 -24814 -28128
1319 -28128 -65436 21761 -32160 -57218 39991 3150 19521 -49284 -59759 -8169 5294 4663
1307 4663 -54733 -11131 -94065 25907 -28489 6775 7626 -108538 -116741 -74971 -71158 -38375
1295 -38375 -6602 37663 26930 -93692 -142079 -77952 48681 -8347 -48453 -59004 -88191
1284 -88191 4576 -10355 -40702 6629 -48733 -8726 -65390 -3637 -77786 29151 -39566 -201079
1272 -201079 -62567 5523 -24595 -3986 -113710 -218005 -135984 3342 -12672 -97952 -29234
1261 -29234 63067 70604 25608 19214 -50512 -75612 -33124 -51179 42977 22969 -117668 -91190
1249 -91190 -6999 -2954 6688 16196 -90308 -68219 -26159 -33605 -35229 -41573 -75984 -67390 -61786
1236 -61786 -43207 -19003 -25955 43818 26734 7703 -3164 -35656 -41817 -19857 9227 -52549
1224 -52549 -51189 2578 -659 -8424 -4258 -20934 31411 -23830 -12873 29354 -32375 -113537 -58236
1211 -58236 -75899 -113406 -119574 -14214 15238 -22759 -42390 3422 -28514 -84743 -144283 -120822
1199 -120822 -54925 59135 64221 -61577 -50637 -59844 -39750 -66031 -7987 -64030 -75127 3680
1187 3680 81393 80084 108960 158354 86157 32139 87831 35997 -24001 -5274 33163 80257
1175 80257 77101 55091 -4402 14866 24921 -14498 1351 18221 39748 41326 -1821 95254
1163 95254 111426 48846 19665 -4030 -30059 -58811 -22032 28586 -44292 -66380 -43004 -9692
1151 -9692 3200 -59776 -39353 -38752 -1040 41690 -44652 -155006 -103123 -25849 -26633 -84007 -41661
1138 -41661 -59160 -113064 -69282 28121 77225 43727 -56948 -59647 -21874 18750 -19465 -14148
1126 -14148 -65989 -13892 -57258 -109601 -147055 -125662 -59784 -33843 -67180 -13785 -4771 -47312
1114 -47312 -32582 -14612 49082 -85074 -21017 115276 96342 66945 100473 85665 24672
1103 24672 -33993 -74422 7500 -4088 -52951 -38584 -50617 -55487 -134589 25159 13052 61687
1091 61687 56339 -50017 -108256 30258 30442 20815 -37631 -74533 19251 -78492 6894 795
1079 795 -36580 24118 20065 120827 105685 111368 4609 -67835 -44164 -149433 -65768 51927
1067 51927 -9727 1999 -53944 -25912 6257 -55517 -45517 -82880 -139570 -45366 57889 87662
1055 87662 30641 45124 17317 -74177 26120 24602 -15279 -16498 65590 24183 -53229 -39940
1043 -39940 -55687 -63832 -64503 -96527 -25440 -24725 64344 3425 -37360 5383 -19912 22285 14324
1030 14324 13988 60961 9728 14994 40862 98394 141204 111252 104883 44541 -10514 38211 -32853
1017 -32853 -10481 -83935 -44634 -31784 -47535 -21858 -105392 -159149 -100529 -68991 -40749 -60393
1005 -60393 -89645 -14434 -23436 -42950 -74135 -32909 -85909 -87853 -85842 -61797 -39377 -58050
993 -58050 -95864 -28904 -33656 -80570 -1747 -19424 -94774 -74412 -56398 -16598 18837 -55812
981 -55812 36700 12850 -33272 -75402 -133005 -4529 -67810 -46131 -42026 -46730 68509 78625
969 78625 -24911 -70154 -70173 -81996 -69645 -46907 50611 30647 3497 -43655 -34843 -50653 -60147
956 -60147 16558 22503 34457 26911 95098 21960 -2879 -34825 -123093 -107505 -25545 7106
944 7106 26032 80280 44332 -11473 -16778 86079 145147 134671 68956 32598 -3915 -51009
932 -51009 -73803 -133977 -65356 -63033 -46717 -75911 -6373 -7129 -40712 -45199 -40593 7217 -17991
919 -17991 -33222 -101955 -80769 -39620 -66590 -41413 710 -10104 3896 -4722 92881 189436
907 189436 -30212 -61281 -66162 -59994 6274 -48695 2327 -13093 55604 80526 -37972 -16863
895 -16863 -7520 -20189 -2488 95908 78004 25643 36901 66985 -9338 -79749 -47928 32655
883 32655 71685 39310 22957 27759 323 17867 37524 -34509 -80612 -55434 -8806 -13286
871 -13286 -74898 -64495 7984 33937 103265 55114 -2747 -47694 32448 26744 -5774 26924
859 26924 76469 -9851 22428 -35693 -41167 -101166 -15554 -4565 743 2306 -46967 -40648 -74329
846 -74329 -60051 33175 7686 8131 7109 -8486 -48189 -17582 87455 -66961 -75953 -121132
834 -121132 -148025 -90704 -7859 -15013 5875 -27380 -27795 12596 -83144 -2727 -56858 -19540
822 -19540 48689 1600 16251 11893 -7067 52537 167001 103483 -3060 -76581 -55771 46701
810 46701 10621 -335 41160 -102003 -74569 -50285 105989 -24321 -22852 -1372 -42360 -112566
798 -112566 -152605 18538 67026 53603 -13650 26516 -17361 23641 12515 22955 -4587 -47343
786 -47343 45353 20765 -20036 33980 14917 -30358 51771 91650 53345 44623 118057 60615
774 60615 73315 84069 160603 115193 -48095 -29075 -25094 -62360 -114484 -67065 -27943 -150368
762 -150368 -91410 -59421 87420 176907 74015 104788 101194 56534 -773 -43827 553 36816
750 36816 34584 8984 25618 -63904 -101316 33121 1144 -16270 -4111 -6920 -49079 25357
738 25357 -206 -51858 26722 53596 73724 59879 39527 69738 39304 13114 41559 62765
726 62765 26321 13921 -58051 -92881 -41330 5279 107068 24979 -113152 -91137 -35923 -7615
714 -7615 -16471 38145 -43742 -491 57139 71349 37910 -17148 -28945 -139073 -59733 -25350
702 -25350 -44112 -38328 45448 -11168 -70934 22407 -41223 -41173 53032 -2924 50110 74152 4227
689 4227 57391 12287 -21315 50914 30233 -724 23482 -27843 43713 -22727 -31388 -4543
677 -4543 -61788 5201 -31386 -18519 -557 18667 79340 133354 88000 -4919 -55153 -12058
665 -12058 54898 42945 37205 -16613 -84477 2658 -2838 -181238 -69876 -33228 -51433 55370
653 55370 53165 51899 30863 115856 66178 23633 100891 155677 195515 101941 25734 -23089
641 -23089 -1310 29536 28780 -24095 13118 103558 132623 119046 123605 31106 -43346 -81225 33409
628 33409 104577 22191 21651 115572 85512 -854 114627 178265 136088 115211 92190 124013
616 124013 84571 73369 22607 -387 18511 -16821 -82382 -50137 101618 100297 10234 25243
604 25243 93012 109802 65731 83201 138232 57654 18744 79037 48516 21371 88422 108291
592 108291 139667 92923 21881 6310 59120 -14130 -19064 -55375 52497 49854 82006 85890
580 85890 161354 80937 30476 99835 60559 16294 -22515 136499 54817 -13263 -34195 -66715
568 -66715 -12506 38934 30458 -480 30840 -5349 -21081 -10682 114144 139083 58507 66796
556 66796 104366 36599 48887 80588 24796 -43275 -31032 -22944 -24883 40774 52204 44545 -2669
543 -2669 -40743 -89276 -60869 7707 -25595 12763 55504 -55982 -1307 8060 66314 -8023
531 -8023 -1939 41072 -1394 -9292 -4872 13608 -11 -14457 16381 72581 111357 38000 68262
518 68262 28857 3736 51242 21368 71603 79776 61760 63185 43402 39667 -41738 29826 128768
505 128768 70273 -4356 24679 75127 51837 59083 151025 133074 -8780 -23899 -21797 -15775
493 -15775 -49585 -73788 -82311 -106914 -70217 -74923 -77979 -76366 -35138 12575 -3649 61453 -40181
480 -40181 78048 83124 43760 66484 -115396 -128540 -122478 12855 32061 70911 76714 -3024
468 -3024 -65304 -62478 -6112 -58734 -57966 2026 49865 69715 74920 114934 70377 94160 67023
455 67023 60428 35081 14770 105760 103015 70745 12308 -46182 -159784 -37866 31541 75047
443 75047 76090 81737 -53322 31567 10414 38470 24459 40129 138764 63799 -4934 -64142
431 -64142 -59333 -43224 -3996 39836 11718 -16851 -26574 -9016 44418 113719 125499 29879
419 29879 15343 3789 18077 78238 55386 823 14311 61743 107774 97517 195753 169134
407 169134 76965 45784 181581 206825 155396 180150 89939 74799 63488 114348 111035 85857
395 85857 111352 84639 138621 101254 118535 181237 128615 95341 112112 49913 102899 114857
383 114857 95479 118316 84491 48259 24217 56223 167754 132580 89418 77417 94146 103130
371 103130 201641 194699 186843 127444 14418 51873 48067 31214 170588 100515 93373 98217
359 98217 29289 147793 186135 106290 116377 112680 143029 180474 209653 199749 118833 74547
347 74547 90628 79468 106368 109922 118590 231717 186423 84024 50793 81531 75686 103341
335 103341 100462 110632 75693 87762 71887 73404 136116 136199 167967 166977 192167 217034 154213
322 154213 159305 160994 198829 68775 193556 211972 147021 159403 89943 53622 53450 198241
310 198241 125807 121618 188134 156173 147288 219167 253665 209269 165153 104150 97486 135758
298 135758 185477 34841 13793 -228 39047 66598 52779 6721 44120 205349 181075
287 181075 194352 180276 57504 -14971 22633 28047 -35427 120262 153473 127450 107161 116002
275 116002 186663 147897 168196 174648 87487 124596 134714 21117 -5181 97735 198874
264 198874 229109 77048 148772 101136 89006 124882 128673 202946 138019 163230 105036 48923
252 48923 115933 215873 152630 150310 140245 71225 175264 176412 93355 154474 113148 100644
240 100644 203603 249424 212239 124804 115762 190820 71462 59873 84893 95173 66057 159657
228 159657 239286 208225 84663 88240 81035 18801 -40349 -36585 105951 100144 134495 178783
216 178783 169919 148738 99155 137815 113705 100080 28295 74532 135092 78778 34080 -18708
204 -18708 85981 151801 153190 169232 131394 181363 220840 276224 225936 213483 214249 208607 193177
191 193177 181707 147772 118035 113651 43203 -25061 -21281 38603 216325 183222 123001 214020
179 214020 185548 156531 171371 175129 205092 204389 205234 156204 95564 113084 95570 73865 73429
166 73429 113903 49460 94615 124764 165185 176830 79397 -37347 60657 60883 148773 219746
154 219746 95645 144049 177122 135568 96593 58384 77927 84064 136857 77825 104507 54911
142 54911 70611 98357 44351 63258 138464 146599 162704 161670 125321 172735 155889 162513 140643
129 140643 171952 190411 120239 91367 120074 180437 249779 182784 230787 187327 172718 186524
117 186524 196148 157793 179341 172458 174255 144042 163511 163306 101081 140533 59882 118327 75053
104 75053 40243 104017 200358 183515 223989 178794 109498 101336 20007 35741 118414 103269
92 103269 49740 77281 86759 24798 137849 173175 149254 159976 135883 178184 197659 37218
80 37218 36552 122323 156650 202784 178677 157665 142302 100873 61862 115820 160288 190043 163924
67 163924 127400 73508 88838 94301 141493 156787 202896 175628 156955 176364 109122 67889
55 67889 150251 130936 187834 141567 85355 153703 118696 124301 116005 118233 129650 153852 152705
42 152705 122655 191277 219087 221968 194224 115833 107554 152251 149757 187845 188296 76397 129856
29 129856 124691 171583 182745 144848 53149 26920 154157 157525 96344 121589 136535 156078
17 156078 152605 165825 185842 176346 135196 173353 156274 124878 131943 125744 167310 104159 96008
4 96008 114892 152335 154290 82340
0 82340
$$ Imaginary data points
##PAGE= N=2
##DATA TABLE= (X++(I..I)), XYDATA
16383 -1085229 -1070421 -996094 -1008129 -1015146 -1002738 -915870 -873311 -832284 -897138 -840675 -837298 -856565
16371 -856565 -801907 -794029 -766903 -690559 -623798 -613190 -637462 -625443 -584060 -533446 -595825 -628116
16359 -628116 -528755 -501559 -509867 -546145 -521024 -510003 -525943 -451698 -447078 -445259 -446171 -438178 -295468
16346 -295468 -314571 -336125 -397340 -400641 -363966 -264351 -249732 -264024 -223366 -217731 -237313 -176392
16334 -176392 -173385 -117769 3200 1141 -119954 -63482 -36665 -38060 4989 17388 56010 51376
16322 51376 53769 79664 179707 80972 123580 217327 236099 248856 154873 152182 249958 259030
16310 259030 262948 295743 297048 337999 342489 363127 393679 442508 455155 417221 435944 511046
16298 511046 571514 511190 545254 598235 564308 542301 563194 588232 623692 612296 596579
16287 596579 655018 685163 667572 625381 670247 742787 766681 798640 756618 705526 637761
16276 637761 672313 773972 747844 769091 810096 915807 890135 860435 902971 977814 983934
16265 983934 907095 985433 1018879 1069819 1019580 1002901 1059105 1058578 1026685 1074217 1094749 1082898
16253 1082898 1048570 1111488 1127881 1195932 1245135 1197442 1252505 1181443 1253892 1281858 1295246
16242 1295246 1280270 1278241 1156660 1176010 1219200 1178435 1243757 1332026 1342888 1342918 1311349 1246014
16230 1246014 1263221 1347879 1386556 1340692 1313370 1329151 1241404 1370737 1464990 1395052 1372448
16219 1372448 1382862 1370680 1419128 1378083 1433957 1521119 1489705 1543213 1470463 1469809 1429329 1539758
16207 1539758 1608459 1606485 1634342 1702004 1590378 1449897 1501879 1592747 1628832 1642248 1655832
16196 1655832 1694260 1578235 1541946 1534616 1596977 1668511 1615367 1616460 1681670 1685819 1645726 1748317
16184 1748317 1769739 1731004 1753339 1758664 1770422 1700187 1674551 1735060 1757562 1742480 1753632
16173 1753632 1718429 1727464 1751053 1737980 1793127 1810606 1851803 1842249 1739306 1821096 1892545
16162 1892545 1760595 1721758 1727140 1775263 1817626 1791135 1854789 1814144 1833861 1854334 1918596
16151 1918596 1908473 1809291 1862820 1798992 1785312 1935373 1863876 1891320 2028423 2054307 2012865
16140 2012865 1969855 2050734 1948638 1916351 2049122 2047238 1982554 1977938 1996780 1990065 2018257
16129 2018257 1913533 1932231 1886829 1869156 1868253 1891449 1997788 1992976 1999370 1987236 1956738 1955816
16117 1955816 1966911 2018657 2010904 1984642 2020856 1999611 2021731 2019888 1959045 1982971 1964458 1954507
16105 1954507 2002834 1980022 2099186 2076681 2011202 2062472 1962511 1852254 1957749 2011966 2057839
16094 2057839 1991150 2023218 1905298 1878203 1898884 1924388 1931230 2074104 2045923 1964119 1972208
16083 1972208 1912978 1929135 1948894 1935050 2010708 2009807 1914951 1926526 2066961 2084350 2050168
16072 2050168 2084469 2077192 2120385 1977622 1969187 1969461 2009654 2045161 2021885 2073708 1962376 2006949
16060 2006949 1971325 2072957 2065234 2017904 2041963 2027537 2040312 2052416 2030849 2103705 2060162
16049 2060162 1989638 2068270 2090190 2118857 1984346 1998296 1948686 1918759 1924790 1899331 2015871
16038 2015871 2086877 1956421 2007465 2102905 2078578 2029227 2090016 2031612 2054590 2025494 2053923
16027 2053923 1981379 2039872 2103720 2179509 2120622 2042978 2030497 2043584 2011993 2039509 2033612
16016 2033612 2029522 2049758 2033160 2011464 2001424 2013849 2056930 2064218 1896702 1909258 1918322 1930936
16004 1930936 1898810 1896161 1980912 2042340 2048344 2117921 2126812 2108541 2046571 2027979 2038758 1972181
15992 1972181 1989335 1976119 1941607 1986871 2110952 2119034 2058994 2080648 2000160 2034511 1987645
15981 1987645 2057380 2190345 2158787 2153796 2125996 2148460 2113436 1971973 1980261 2045170 1965402
15970 1965402 1915120 1945808 1989494 1994380 1992451 1973513 1996241 2060410 2034474 2119668 2154690 2073091
15958 2073091 1995412 2043692 2084490 2046717 2006064 1991165 2044093 2036629 2056764 2110318 1985412
15947 1985412 1991283 2063565 2051774 2079041 2087242 1994344 2006639 2009813 2053795 2103566 2086321 2131163
15935 2131163 2092845 1974611 1946677 1915583 1961780 2025219 2035313 1987755 2065379 2228359 2128398
15924 2128398 2074374 2015900 1988558 2092572 2128764 2014782 2034626 2067932 2068010 2097156 2034563
15913 2034563 2025760 2076661 2084146 2085806 2104349 2040257 2044513 2017131 2037044 1971230 1970729 2039666
15901 2039666 1989473 2026074 1968344 2042016 2174441 2134282 2131426 2108161 2047319 2106261 2118922
15890 2118922 2173139 2144190 2164214 2129376 2086038 2151513 2187293 2082851 2168243 2183843 2142075
15879 2142075 2064739 2063398 2072459 2047322 1986573 1980475 2097887 2082823 2102990 2138532 2116318 2032580
15867 2032580 1965694 2074438 2151269 2158314 2097887 2087323 2211973 2163823 2088656 2086341 1986258
15856 1986258 2003327 2007694 1986291 2086557 2132399 2129378 2141492 2109995 2016917 2029241 2035546 2040527
15844 2040527 2026295 2045015 2059363 2015635 2039007 2095195 2178004 2172729 2025800 2168032 2142673
15833 2142673 2086483 2078909 2094710 2134381 2121062 2012382 1984907 1976474 2013890 2065741 2105126
15822 2105126 2168780 2153535 2091221 2026690 1956334 2039167 2115147 2125448 2142305 2216621 2255159
15811 2255159 2223741 2263425 2233342 2195642 2134684 2092418 2113136 2060388 2103090 2061654 2162421
15800 2162421 2185728 2081418 2075045 2016941 2016899 2024197 2094658 2117302 2135016 2106877 2072911 2064185
15788 2064185 2107888 2155497 2086530 2106366 2056006 2080054 2125382 2095268 2067716 2134309 2270408
15777 2270408 2212392 2216667 2208858 2113142 2027853 2091258 2153925 2169742 2106097 2183085 2030006
15766 2030006 1975677 2005660 2019321 2129406 2120325 2081161 2042819 2007402 2067834 2076519 2121761
15755 2121761 2195095 2278750 2285357 2164240 2122664 2152189 2103294 2006674 2078652 2029500 2065042
15744 2065042 2154740 2092833 2144059 2122957 2108151 2126613 2106896 2147569 2115551 2118890 2055376
15733 2055376 2132348 2075663 2067066 2118482 2110441 2131087 2118081 2166628 2151840 2177489 2173952 2183785
15721 2183785 2124696 2048608 2199979 2058514 2028162 2165070 2149743 2138744 2150198 2125562 2070145
15710 2070145 2117617 2161108 2149346 1988203 1992285 2092405 2146421 2029042 2099172 2061400 2081713
15699 2081713 2087392 2140454 2172192 2137700 2100703 2026591 2132977 2179538 2199281 2197846 2106018
15688 2106018 2053901 2140982 2168606 2196460 2095365 2123263 2153409 2167278 2237198 2112945 2086190
15677 2086190 2115301 2153540 2179656 2134851 2119530 2168508 2115600 2110408 2135489 2062635 2076430
15666 2076430 2194980 2105613 2113806 2183509 2156807 2170796 2124210 2216265 2179183 2178308 2146128 2018348
15654 2018348 2057471 2140332 2121371 2115519 2134495 2143784 2107216 2070494 2075550 2062714 2113430 2055392
15642 2055392 2138689 2207252 2169002 2148194 2161799 2089877 2085259 2152261 2133941 2174773 2124051
15631 2124051 2103443 2037074 2004567 2036366 2060912 2048249 2135599 2050317 2024439 2012258 2110809
15620 2110809 2197110 2231421 2093772 2113164 2128690 2096843 2126217 2106831 2114232 2095156 2084845
15609 2084845 2089715 2092505 2051177 2001950 2006335 1986806 2032072 2106668 2089098 2139679 2150097 2165562
15597 2165562 2179562 2250055 2194777 2201390 2167581 2062737 2073565 2121225 2137015 2223003 2162284
15586 2162284 2157625 2224577 2265336 2248710 2111669 2165341 2190098 2139856 2135167 2067514 2040512
15575 2040512 2075952 2068966 2003123 2085347 2035070 1979191 2038800 2022940 2127713 2174102 2173855 2146779
15563 2146779 2027258 2099628 2076444 2003688 2057819 2094290 2118964 2192112 2220978 2194644 2161066
15552 2161066 2085815 2079744 2115607 2213630 2133761 2148506 2173395 2296991 2206563 2027481 2075556
15541 2075556 2213027 2259704 2220439 2251764 2188132 2170016 2187813 2124517 2200581 2197596 2165720
15530 2165720 2229664 2151163 2141512 2065941 2156329 2195046 2216111 2206325 2187179 2191281 2224184 2244697
15518 2244697 2137394 2177453 2135531 2120066 2166484 2225579 2151176 2067025 2111403 2160539 2141031
15507 2141031 2051599 2114143 2163411 2209375 2248785 2271575 2278458 2237531 2266187 2255115 2306068
15496 2306068 2334235 2221194 2242260 2217248 2159039 2136881 2200026 2183371 2185810 2109748 2113485
15485 2113485 2151941 2177010 2218787 2218687 2160644 2126872 2054479 2117213 2220545 2133938 2075126
15474 2075126 2023616 2084951 2188158 2067706 2147181 2126511 2116321 2103420 2104392 2173122 2168102
15463 2168102 2238800 2192595 2109842 2121308 2166942 2204665 2223892 2185543 2211556 2227548 2196583
15452 2196583 2148296 2223482 2092611 2048481 2133438 2189144 2125790 2146892 2190066 2215121 2157018
15441 2157018 2163686 2052712 2112609 2248495 2223164 2298462 2174508 2159639 2167042 2226635 2258203
15430 2258203 2201733 2155178 2073271 2121919 2160345 2088233 2077080 2076505 2130527 2146314 2205506 2128868
15418 2128868 2043120 2105856 2106159 2136468 2123866 2135004 2110327 2201540 2355099 2272149 2213411
15407 2213411 2219207 2253094 2245875 2146147 2151290 2113410 2249924 2230863 2169447 2084175 2157326 2204756
15395 2204756 2155552 2107843 2129979 2132709 2214359 2199969 2205181 2244241 2140080 2136261 2113619 2206812
15383 2206812 2203842 2131237 2209801 2248210 2143482 2217763 2225563 2196500 2261443 2264511 2268407 2162679
15371 2162679 2068252 2112464 2122789 2245808 2206441 2174623 2211508 2213550 2279744 2243689 2252706
15360 2252706 2239327 2205768 2184353 2056784 2138979 2271833 2182676 2161302 2117579 2131916 2161105
15349 2161105 2222085 2224283 2180526 2174598 2143999 2065366 2099514 2204389 2188152 2284937 2250083
15338 2250083 2259642 2268469 2085960 2121755 2154029 2059245 2232042 2141668 2049454 2162861 2199618
15327 2199618 2184521 2125460 2192644 2230356 2327523 2263077 2195056 2187881 2163105 2171739 2105366 2237058
15315 2237058 2260637 2228942 2201213 2199267 2175860 2114949 2145119 2119373 2142122 2220860 2260925
15304 2260925 2253458 2232951 2218370 2182500 2258919 2237457 2149749 2185159 2225509 2187651 2331378
15293 2331378 2396374 2308239 2217065 2237866 2228466 2225383 2191554 2183808 2205056 2206932 2222010 2275434
15281 2275434 2283923 2196253 2195772 2250306 2221747 2193149 2165767 2226962 2303604 2310193 2213442 2143835
15269 2143835 2204005 2172473 2210842 2250786 2207421 2205481 2255393 2325675 2178287 2165780 2294773
15258 2294773 2265621 2277836 2196929 2163593 2174355 2305131 2257435 2232886 2153181 2134975 2073976
15247 2073976 2171028 2222928 2235518 2247068 2169949 2241323 2245803 2258751 2202893 2132846 2223168
15236 2223168 2230963 2256685 2178994 2253599 2285344 2171118 2328290 2335074 2365372 2397121 2312627
15225 2312627 2293778 2258305 2225248 2260183 2234634 2235799 2380183 2368600 2274816 2244394 2244476 2256542
15213 2256542 2253877 2273536 2340006 2439018 2306131 2245604 2233232 2313471 2254533 2237284 2230549
15202 2230549 2218259 2207200 2177884 2156026 2141069 2173363 2238782 2308993 2214379 2140188 2253965
15191 2253965 2303081 2232666 2202993 2257114 2269584 2216148 2342986 2311124 2262810 2232137 2305511
15180 2305511 2271343 2315565 2252211 2159575 2242238 2249443 2291841 2256116 2356359 2350632 2295994
15169 2295994 2299989 2279304 2289423 2356190 2330151 2303602 2327213 2310603 2328961 2351272 2279817
15158 2279817 2272001 2290822 2316050 2331145 2203699 2175092 2249407 2289893 2277677 2257866 2160952
15147 2160952 2147861 2211291 2268860 2263755 2202761 2238395 2153021 2170607 2108291 2109466 2162047 2246620
15135 2246620 2328379 2269525 2193950 2124066 2202343 2316531 2329788 2286472 2257347 2180885 2196084
15124 2196084 2207833 2239105 2140836 2143008 2122980 2136262 2185493 2242147 2221589 2287814 2196165
15113 2196165 2190909 2213647 2166115 2329112 2344259 2336993 2272340 2280194 2310894 2185549 2142709
15102 2142709 2189274 2220241 2346490 2404658 2359926 2316072 2315052 2282451 2299222 2318249 2329817
15091 2329817 2333520 2331272 2369305 2411617 2331195 2299376 2311304 2242345 2267118 2307149 2449456
15080 2449456 2341041 2313776 2282841 2283586 2377767 2278465 2251533 2261530 2253845 2181831 2217904 2240609
15068 2240609 2321127 2372349 2229493 2169457 2233498 2222626 2265107 2329026 2403032 2355447 2234641
15057 2234641 2209016 2243202 2252330 2231346 2246951 2222213 2171465 2235004 2289652 2252367 2240023
15046 2240023 2200423 2232391 2295725 2339201 2333934 2256387 2260838 2316688 2394313 2360148 2357266 2261001
15034 2261001 2236648 2177804 2235053 2324387 2390226 2282403 2230850 2279003 2264138 2211134 2188831
15023 2188831 2241007 2256400 2238895 2203237 2270930 2293473 2278368 2292297 2403448 2360527 2307286
15012 2307286 2291279 2352720 2364671 2338296 2287906 2246020 2367443 2376773 2269755 2243092 2255668
15001 2255668 2214950 2299748 2360153 2378333 2255166 2242051 2295752 2325320 2344702 2364409 2350302
14990 2350302 2354673 2306279 2353657 2247120 2217587 2327125 2303628 2323775 2264794 2299706 2298914
14979 2298914 2341806 2274553 2254354 2306956 2227826 2270180 2381121 2274939 2286908 2308852 2329413
14968 2329413 2283512 2379019 2322529 2156220 2178777 2230062 2251011 2311086 2309274 2321775 2322897
14957 2322897 2301033 2347866 2361191 2245357 2266502 2229302 2207709 2238921 2302381 2369480 2242982
14946 2242982 2274665 2281752 2277174 2309727 2319483 2384053 2296485 2273869 2255889 2296608 2367297 2325549
14934 2325549 2277482 2276855 2218169 2243791 2331994 2341590 2322107 2290337 2260879 2296650 2310989 2323998
14922 2323998 2381630 2340695 2286563 2341834 2345493 2288799 2191465 2239405 2257919 2293343 2378498
14911 2378498 2431995 2463169 2439045 2419545 2476927 2542057 2419049 2354715 2337873 2425442 2438132
14900 2438132 2390129 2280131 2248073 2260912 2373633 2420350 2365122 2324932 2268165 2238468 2320882
14889 2320882 2254987 2347976 2380687 2388473 2344573 2362309 2492418 2324037 2326020 2310839 2279571
14878 2279571 2309075 2260929 2292552 2366007 2404636 2362946 2352238 2232357 2379282 2369109 2399781
14867 2399781 2380603 2314646 2343940 2290135 2355388 2370050 2415848 2432027 2395070 2376753 2373921
14856 2373921 2464340 2441790 2366521 2380582 2359820 2338491 2324079 2374060 2372070 2456306 2380158
14845 2380158 2288336 2278965 2299430 2380158 2347927 2282406 2421306 2421616 2384839 2352588 2424167 2355784
14833 2355784 2355967 2332767 2256896 2266096 2368085 2329828 2243589 2289223 2341359 2421188 2262896
14822 2262896 2288509 2278540 2329980 2376748 2274038 2268278 2353913 2352158 2375989 2329153 2320584 2393418
14810 2393418 2232938 2343092 2384462 2340006 2314814 2288824 2308079 2245347 2330097 2410593 2406232
14799 2406232 2492528 2475351 2461665 2382302 2323280 2401395 2416264 2372291 2316235 2354042 2410784
14788 2410784 2432376 2334021 2302208 2333278 2404359 2431164 2454686 2405131 2411235 2334962 2407847
14777 2407847 2444335 2445853 2397368 2506570 2482840 2343043 2393350 2391885 2406395 2472667 2492809
14766 2492809 2404160 2361817 2368498 2430329 2390314 2453656 2377516 2297509 2343396 2366948 2364531 2256803
14754 2256803 2301219 2361795 2383671 2377137 2391377 2434560 2402757 2373169 2406351 2417956 2379453
14743 2379453 2420225 2334218 2349172 2361471 2435809 2432704 2365655 2427350 2394615 2413134 2389660
14732 2389660 2271342 2321948 2381096 2363210 2295451 2293914 2383737 2418307 2437054 2419618 2405604
14721 2405604 2381840 2353995 2408340 2433885 2515287 2462461 2439781 2531388 2480900 2426667 2470166
14710 2470166 2463431 2397038 2279427 2362349 2423736 2399250 2441085 2451628 2371751 2340589 2412509
14699 2412509 2364372 2356476 2489268 2492944 2437744 2443388 2404556 2429930 2369529 2403584 2432232 2389030
14687 2389030 2396182 2428563 2452688 2408044 2345019 2415388 2434374 2393232 2399307 2382312 2382301 2381081
14675 2381081 2338528 2411232 2404693 2401507 2419064 2439284 2412595 2359033 2457715 2452507 2355052 2262406
14663 2262406 2360868 2377005 2489585 2390089 2326146 2318825 2332051 2409561 2348755 2468233 2492649
14652 2492649 2395660 2439669 2475730 2478427 2510472 2516766 2455030 2438344 2393475 2440346 2371544 2285948
14640 2285948 2302436 2265219 2334301 2401809 2389471 2444227 2492917 2475304 2474090 2343662 2427244
14629 2427244 2450406 2433972 2385151 2362222 2344195 2376354 2442539 2355121 2376099 2524818 2473187
14618 2473187 2426708 2373887 2480155 2521190 2474351 2508827 2485409 2365617 2396184 2415193 2366293
14607 2366293 2332233 2367146 2389573 2440278 2443459 2474570 2562668 2566726 2508399 2494878 2447961 2397376
14595 2397376 2409252 2417569 2457558 2389879 2397541 2312783 2333372 2411943 2484845 2454912 2379699 2390114
14583 2390114 2465708 2445720 2465209 2456850 2400852 2503360 2426965 2332370 2442895 2407350 2377078
14572 2377078 2444961 2523169 2440848 2374641 2487315 2417458 2371667 2379535 2398965 2407493 2404436 2377756
14560 2377756 2471731 2445291 2424577 2438813 2389644 2455892 2438165 2406012 2357161 2285586 2356948
14549 2356948 2332949 2389929 2475605 2527477 2525361 2408673 2351270 2281899 2356634 2352706 2323852
14538 2323852 2311401 2419568 2456942 2499263 2425557 2462955 2491823 2499630 2512177 2508673 2515659 2532432
14526 2532432 2492627 2512769 2491243 2531194 2413893 2399356 2493631 2426424 2437334 2354588 2491179
14515 2491179 2489614 2418006 2444511 2514746 2466485 2434699 2414906 2488830 2456553 2478703 2446502
14504 2446502 2419132 2499652 2499141 2444403 2329666 2406230 2404905 2405426 2409259 2447778 2391100 2352518
14492 2352518 2426986 2492828 2533083 2449094 2404718 2368178 2422070 2504779 2539792 2573854 2539078
14481 2539078 2484788 2506260 2489367 2548325 2416143 2429997 2510742 2433946 2380028 2474184 2507610
14470 2507610 2361570 2427822 2430742 2405336 2412047 2426611 2509847 2526102 2525533 2458978 2444728 2524425
14458 2524425 2505063 2548608 2470581 2429625 2399649 2413879 2513984 2567027 2528911 2502552 2524837
$$ [...]
##END NTUPLES=NMR SPECTRUM
##END=
