##TITLE=1H_EC-3287(2-1)Hex2 
 CDCl3
 8 sc, 
 13.12.2022
##JCAMPDX= 6.0         $$ Bruker NMR JCAMP-DX V2.0
##DATA TYPE= NMR SPECTRUM
##DATA CLASS= NTUPLES
##ORIGIN= UXNMR, Bruker Analytische Messtechnik GmbH
##OWNER= root
$$ XWIN-NMR		Version 3.5
$$ Tue Dec 13 14:14:50 2022 Russian Standard Time (UT+4h)  she@DPX200
##.OBSERVE FREQUENCY= 200.13135
##.OBSERVE NUCLEUS= ^1H
##.ACQUISITION MODE= SIMULTANEOUS
##.ACQUISITION SCHEME= undefined
##.AVERAGES= 8
##.DIGITISER RES= 18
##SPECTROMETER/DATA SYSTEM= spect
##.PULSE SEQUENCE= zg30
##.SOLVENT NAME= CDCl3
##.SHIFT REFERENCE= (INTERNAL, CDCl3, 0, 15.7039)
##AUDIT TRAIL= $$ (NUMBER, WHEN, WHO, WHERE, WHAT)
$$ ##TITLE= Audit trail, XWIN-NMR		Version 3.5
$$ ##JCAMPDX= 5.01
$$ ##ORIGIN= Bruker BioSpin GmbH
$$ ##OWNER= she
$$ F:/spectra/data/she/nmr/H-F/1/pdata/1/auditp.txt
$$ ##AUDIT TRAIL=  $$ (NUMBER, WHEN, WHO, WHERE, WHAT)
(   1,<2022-12-13 14:13:15.42 +0400>,<she>,<DPX200>,
      <created by zg, POWCHK disabled, PULCHK disabled
       configuration hash MD5:
       00 E9 B6 7A A2 85 ED C7 34 08 36 98 17 FE 4E 26
       data hash MD5: 16K
       1C B4 C3 2D 9D 8D D3 3E DB 5D 8D 71 DB 11 37 54>)
(   2,<2022-12-13 14:13:41.62 +0400>,<she>,<DPX200>,
      <Start of raw data processing
       efp BC_mod = 2 LB = 0.24 FT_mod = 6 PKNL = 1 PHC0 = -19115.45 PHC1 = 13.40072 SI = 16K 
       data hash MD5: 16K
       D2 9F 1A 17 3C DB E5 02 9D 33 9C D8 E2 41 CD 2A>)
(   3,<2022-12-13 14:14:04.06 +0400>,<she>,<DPX200>,
      <pk PHC0 = 2.845835 PHC1 = -4.2 
       data hash MD5: 16K
       1B 44 19 C3 14 13 27 76 C0 3B 43 95 EF 0F 68 CF>)
(   4,<2022-12-13 14:14:07.28 +0400>,<she>,<DPX200>,
      <abs ABSG = 5 
       data hash MD5: 16K
       4A 78 1A E7 10 FF C1 22 8B 60 99 33 6D 10 14 1D>)
$$ ##END=
$$ 
$$ hash MD5
$$ A4 6D 7A A6 96 A9 C4 A8 90 FA 42 42 22 7C B5 83
##$RELAX= 
##$RELAX= 
##$RELAX= 
##$RELAX= 
##$RELAX= 
##$RELAX= 
$$ Bruker specific parameters
$$ --------------------------
##$DU= <F:/spectra>
##$EXPNO= 1
##$NAME= <H-F>
##$PROCNO= 1
##$TYPE= <nmr>
##$USER= <she>
##$AMP= (0..31)
100 100 100 100 100 100 100 100 100 100 100 100 100 100 100 100 100 100 
100 100 100 100 100 100 100 100 100 100 100 100 100 100 
##$AQSEQ= 0
##$AQ_mod= 1
##$AUNM= <au_zg>
##$AUTOPOS= <>
##$BF1= 200.13
##$BF2= 200.13
##$BF3= 200.13
##$BF4= 200.13
##$BF5= 200.13
##$BF6= 200.13
##$BF7= 200.13
##$BF8= 200.13
##$BYTORDA= 1
##$CFDGTYP= 0
##$CFRGTYP= 5
##$CHEMSTR= <none>
##$CNST= (0..31)
1 1 145 1 1 1 1 1 1 1 1 1 1 1 1 1 1 1 1 1 1 1 1 1 1 1 1 1 1 1 1 1 
##$CPDPRG= <>
##$CPDPRG1= <>
##$CPDPRG2= <>
##$CPDPRG3= <>
##$CPDPRG4= <mlev>
##$CPDPRG5= <mlev>
##$CPDPRG6= <mlev>
##$CPDPRG7= <mlev>
##$CPDPRG8= <mlev>
##$CPDPRGB= <>
##$CPDPRGT= <>
##$D= (0..31)
0 1.2 0 0 0 0 0 0 0 0.06 0 0.03 0 0 0 0 0.0002 0 0 0 0 0 0 0 0 0 0 0 0 
0 0 0 
##$DATE= 1670926394
##$DBL= (0..7)
120 120 120 120 120 120 120 120 
##$DBP= (0..7)
150 150 150 150 150 150 150 150 
##$DBP07= 0
##$DBPNAM0= <>
##$DBPNAM1= <>
##$DBPNAM2= <>
##$DBPNAM3= <>
##$DBPNAM4= <>
$$ [...]
##$SUBNAM3= <"">
##$SUBNAM4= <"">
##$SUBNAM5= <"">
##$SUBNAM6= <"">
##$SUBNAM7= <"">
##$SUBNAM8= <"">
##$SUBNAM9= <"">
##$SW= 18.05172834244
##$SWIBOX= (0..15)
0 0 2 0 0 0 0 0 0 0 0 0 0 0 0 0 
##$SW_h= 3612.71676300578
##$TD= 16384
##$TD0= 1
##$TE= 0
##$TE2= 300
##$TE3= 300
##$TEG= 300
##$TL= (0..7)
0 120 120 120 120 120 120 120 
##$TP= (0..7)
150 150 150 150 150 150 150 150 
##$TP07= 0
##$TPNAME0= <>
##$TPNAME1= <>
##$TPNAME2= <>
##$TPNAME3= <>
##$TPNAME4= <>
##$TPNAME5= <>
##$TPNAME6= <>
##$TPNAME7= <>
##$TPOAL= (0..7)
0.5 0.5 0.5 0.5 0.5 0.5 0.5 0.5 
##$TPOFFS= (0..7)
0 0 0 0 0 0 0 0 
##$TUNHIN= 0
##$TUNHOUT= 0
##$TUNXOUT= 0
##$USERA1= <user>
##$USERA2= <user>
##$USERA3= <user>
##$USERA4= <user>
##$USERA5= <user>
##$V9= 5
##$VALIST= <valist>
##$VCLIST= <CCCCCCCCCCCCCCC>
##$VD= 0
##$VDLIST= <DDDDDDDDDDDDDDD>
##$VPLIST= <PPPPPPPPPPPPPPP>
##$VTLIST= <TTTTTTTTTTTTTTT>
##$WBST= 1024
##$WBSW= 4
##$XGAIN= (0..3)
0 0 0 0 
##$XL= 0
##$YL= 0
##$YMAX_a= 224634
##$YMIN_a= -230886
##$ZGOPTNS= <>
##$ZL1= 120
##$ZL2= 120
##$ZL3= 120
##$ZL4= 120
##$ABSF1= 15.71604
##$ABSF2= -2.33581
##$ABSG= 5
##$ABSL= 3
##$ALPHA= 0
##$AQORDER= 0
##$ASSFAC= 0
##$ASSFACI= 0
##$ASSFACX= 0
##$ASSWID= 0
##$AUNMP= <proc_1d>
##$AZFE= 0.1
##$AZFW= 0.1
##$BCFW= 0
##$BC_mod= 2
##$BYTORDP= 0
##$COROFFS= 0
##$CY= -3
##$DATMOD= 1
##$DC= 0
##$DFILT= <>
##$DTYPP= 0
##$F1P= 0
##$F2P= 0
##$FCOR= 1
##$FTSIZE= 16384
##$FT_mod= 6
##$GAMMA= 0
##$GB= 0
##$INTBC= 1
##$INTSCL= 3.70164e-10
##$ISEN= 128
##$LB= 0.24
##$LEV0= 0
##$LPBIN= 0
##$MAXI= 10000
##$MC2= 0
##$MEAN= 0
##$ME_mod= 0
##$MI= 1.114404
##$NCOEF= 0
##$NC_proc= -7
##$NLEV= 6
##$NOISF1= 3.799351
##$NOISF2= 2.8
##$NSP= 0
##$NTH_PI= 0
##$NZP= 0
##$OFFSET= 15.70392
##$PC= 1
##$PHC0= -19112.6
##$PHC1= 9.20072
##$PH_mod= 1
##$PKNL= yes
##$PPARMOD= 0
##$PSCAL= 0
##$PSIGN= 0
##$REVERSE= no
##$SF= 200.130013533542
##$SI= 16384
##$SIGF1= 3
##$SIGF2= 2
##$SINO= 5.538805
##$SIOLD= 16384
##$SREGLST= <1H.CDCl3>
##$SSB= 0
##$STSI= 16384
##$STSR= 0
##$SW_p= 3612.71676300578
##$SYMM= 0
##$S_DEV= 0
##$TDeff= 16384
##$TDoff= 0
##$TI= <>
##$TILT= no
##$TM1= 0
##$TM2= 0
##$TOPLEV= 0
##$USERP1= <user>
##$USERP2= <user>
##$USERP3= <user>
##$USERP4= <user>
##$USERP5= <user>
##$WDW= 1
##$XDIM= 16384
##$YMAX_p= 494390644
##$YMIN_p= -1372762
$$ End of Bruker specific parameters
$$ ---------------------------------
##NTUPLES= NMR SPECTRUM
##VAR_NAME=  FREQUENCY,     SPECTRUM/REAL,   SPECTRUM/IMAG
##SYMBOL=    X,             R,               I
##VAR_TYPE=  INDEPENDENT,   DEPENDENT,       DEPENDENT
##VAR_FORM=  AFFN,          ASDF,            ASDF
##VAR_DIM=   16384,         16384,           16384
##UNITS=     HZ,            ARBITRARY UNITS, ARBITRARY UNITS
##FACTOR=    0.220516191357247, 1,           1
##FIRST=     3142.82579505301, 0,            0
##LAST=      -469.890967952768, 0,           0
##MIN=       -469.890967952768, -1372762,    0
##MAX=       3142.82579505301, 494390644,    0
$$ Real data points
##PAGE= N=1
##DATA TABLE= (X++(R..R)), XYDATA
$$ [...]
6646a04549J81082m4816R7115o5248J5449j99427R4652m2740J1292M8533M6445
$$ -104549 76533 31717 128832 63584 79033 -120394 -25742 -68482 -57190 -8657 37788
6635C7788j09394K8319K4825M5517J17862j6149m1252K65736m6882j97218n0953
$$ 37788 -71606 -43287 -18462 27055 144917 128768 87516 353252 306370 109152 58199
6624E8199m5289j58361J11179O04J12477O930q3234o2976J02914R2903N7307N40
$$ 58199 12910 -145451 -34272 -33668 78809 85739 2505 -60471 42443 135346 192653 193193
6612A93193j39543J84214R1710m9717m7541q2159J6729J26433r5806j3938K9470
$$ 193193 53650 237864 329574 279857 232316 150157 166886 293319 197513 183575 213045
6601B13045m4848J20307m006j84206j53491L7158M140j8467k4221P8575J41022
$$ 213045 168197 288504 284498 100292 -53199 -16041 -11901 -30368 -54589 23986 165008
6590A65008r6481j10209J46639J39692j13660P2353L7389L5378k0609p8859o2581
$$ 165008 68527 -41682 104957 244649 130989 203342 240731 276109 255500 176641 114060
6579A14060q4002j6955l4439Q2781P4855L22007j46459r1328J07988L3789J9350
$$ 114060 30058 13103 -21336 61445 136300 458307 311848 220520 328508 362297 381647
6568C81647k11432j30231r4232O5349P0575k86380Q8959J16524p1944N3717K27517
$$ 381647 170215 39984 -54248 11101 81676 -204704 -115745 779 -71165 -17448 210069
6557B10069K7638o9642J18213j66034J39895k1454k5235L6666j0078P839p2382
$$ 210069 237707 168065 286278 120244 260139 238685 213450 250116 240038 247877 175495
6546A75495j67796m4489L3555j6361J6284J72491O2149p0854n7585j07948K5450
$$ 175495 7699 -36790 -3235 -19596 -3312 169179 231328 160474 102889 -5059 20391
6535B0391K7446o1312j19828J32053K47011q0624k43979r8508N5011J28853k7317
$$ 20391 47837 -13475 -133303 -1250 245761 165137 -78842 -177350 -122339 6514 -20803
6524b0803l952m4338q6622Q9870J60414m907k7330J05822j05272j17560j79389
$$ -20803 -24755 -69093 -155715 -65845 94569 89662 62332 168154 62882 -54678 -234067
6513b34067P6664J31001J854n7904R2142J20729J38095j95234j90055o7828R1049
$$ -234067 -157403 -26402 -24548 -82452 9690 130419 268514 73280 -116775 -184603 -93554
6502i3554P8289q561n6826n0617q9778K10688J47211k65797N4357Q023L4807r6531
$$ -93554 -15265 -23826 -80652 -131269 -221047 -10359 136852 -128945 -74588 -66565 -31758 -128289
6490a28289L2880R4912j77546p2116J5628M133n9960P4925l9730J23602N8401
$$ -128289 -95409 -497 -178043 -250159 -234531 -230398 -290358 -215433 -255163 -131561 -73160
6479g3160o4252p0658R7434R3381q1742K8937r8721K35873q350m8631R0193P2780
$$ -73160 -137412 -208070 -110636 -17255 -98997 -70060 -168781 67092 58742 10111 100304 173084
6467A73084J04927j52019j0308k02134j94421k4024K53776r0971R413K4525K2880
$$ 173084 278011 125992 115684 -86450 -280871 -304895 -51119 -142090 -132677 -108152 -85272
6456h5272J21679j26265J99183j04431j32079J35382j15249K94521j29634l08090
$$ -85272 36407 -89858 109325 4894 -127185 8197 -107052 187469 57835 -250255
6446b50255J70303N7883O5358Q3335r989j15814J67552J73859j96523p1092o0740
$$ -250255 -79952 -22069 43289 126624 116635 821 168373 342232 145709 74617 13877
6435A3877j55509p634J60303j55307J15761n3863l31512J58862J61574O6913Q7578
$$ 13877 -141632 -149266 11037 -144270 -28509 -82372 -413884 -255022 -93448 -26535 61043
6424F1043R9505q5995L7440L0677j45061j12840k67792N0462J37585P5728N4549
$$ 61043 160548 74553 111993 142670 -2391 -115231 -383023 -332561 -194976 -119248 -64699
6413f4699M1238J84987j57770j4528J1889q3706O964l0291m1223J61425q9927
$$ -64699 -23461 161526 3756 -10772 1117 -82589 -75625 -105916 -147139 14286 -75641
6402g5641j9808J40075J70259j17094K7312L9918K14486l93528j20837J11133
$$ -75641 -95449 44626 214885 97791 125103 165021 379507 -14021 -134858 -23725
6392b3725o0103j03443j21254J63301J02834J0117J70725k04362J17756L6449
$$ -23725 -83828 -187271 -308525 -145224 -42390 -32273 138452 -65910 51846 88295
6382H8295j09097J74745p3733K8011N5858j07814K38786k4463q1176j04320O8334
$$ 88295 -20802 153943 80210 108221 164079 56265 295051 270588 189412 85092 153426
6371A53426k4739p8949J00143N1212o7837J49809l7029j9281q2352k68658R4836
$$ 153426 128687 49738 149881 201093 133256 283065 246036 226755 144403 -124255 -29419
6360b9419K26369Q9392j26229j37953m0684O8094p6322J88277j92405j55520J25539
$$ -29419 196950 286342 160113 22160 -18524 49570 -26752 161525 -30880 -186400 -60861
6349f0861p0800m3573J53756K10409J28343j99016k57064l0165M16891j5250j91153
$$ -60861 -131661 -175234 -21478 188931 317274 118258 -138806 -168971 247920 232670 41517
6338D1517l8371J09805M0871L8589N8670J914J9827k06008j45933N7005k1586
$$ 41517 3146 112951 153822 192411 251081 252995 272822 66814 -79119 -22114 -43700
6327d3700K6047J55662K01661Q3116k65686m2175N575j51912J11493k9854Q537
$$ -43700 -17653 138009 339670 422786 157100 114925 120500 -31412 80081 50227 58764
6316E8764K6044O1626M9060O8933J8829j53432o5291J35977q8615K46476r3340
$$ 58764 84808 146434 195494 264427 283256 129824 64533 200510 111895 358371 265031
6305B65031M5686J02467k45948Q9679L6568j1663k00620n8218n1948m3798N78
$$ 265031 310717 413184 167236 256915 293483 281820 81200 22982 -28966 -72764 -72186
6294g2186K7537p0259l228L2264L26529J75041k07718J4475j25542J08310j69472
$$ -72186 -44649 -114908 -118136 -85872 240657 415698 207980 222455 96913 205223 35751
6283C5751Q4945K3824N9315l295k23577k6164l1674M7086J3139P7505P4708k38645
$$ 35751 120696 144520 203835 200540 -23037 -49201 -80875 -33789 -20650 56855 131563 -107082
6271a07082L86207n1302j47211O0670k74897M3633k215j74807K23728P991n1660
$$ -107082 279125 227823 80612 141282 -133615 -89982 -92197 -267004 -43276 -35285 -86945
6260h6945J57884J92227j75310j15831Q4965o1442J16267l8652j07998J72406
$$ -86945 70939 263166 87856 -27975 56990 -4452 111815 73163 -34835 137571
6250A37571j07364q5578l6320j7338Q7948K75480K9262l9716P3136j00312J9654
$$ 137571 30207 -55371 -91691 -109029 -21081 254399 283661 243945 317081 216769 236423
6239B36423j14600J55861j9750j91187K14763j38842Q8432R2354j58468j5570
$$ 236423 121823 277684 257934 66747 281510 142668 231100 323454 164986 149416
6229A49416J07053n5126j56503l1564J1815J16336j44559J52142j00659K7124
$$ 149416 256469 201343 44840 13276 25091 141427 -3132 149010 48351 75475
6219G5475M9895l0690J33051J36729j19375k2373R3911M9485j45590j4928k69320
$$ 75475 125370 94680 227731 364460 245085 222712 316623 366108 220518 205590 -63730
6208f3730J43570j9749j33607M5018N8713q0016J19910l6231K30402j2952j36274
$$ -63730 79840 60091 -73516 -28498 30215 -49801 70109 33878 264280 251328 115054
6197A15054p0963j56219J32234K01233j05704M6818q4901J71767Q8021k41233
$$ 115054 44091 -112128 20106 221339 115635 162453 77552 249319 337340 96107
6187I6107K6827P9570J5567o699k41695P9962J17933j40571o1695L1613N588J78854
$$ 96107 122934 202504 218071 211372 -30323 49639 167572 27001 -34694 -3081 2507 181361
6175A81361Q323l1550J59773Q088j58805R0984n2512j69971J65545N397j32292
$$ 181361 189684 158134 317907 325995 167190 258174 205662 35691 201236 206633 74341
6164G4341J53789J72866o6320j49278J0473N9201r8534J73224J01178Q5251j47857
$$ 74341 228130 400996 334676 185398 195871 255072 156538 329762 430940 516191 368334
6153C68334j11429P6830j2168O9291J62812L8094j11721m3244r2372Q0507K7343
$$ 368334 256905 333735 321567 390858 553670 591764 480043 436799 344427 424934 452277
6142D52277J15896q4471k06041K44595j57642p270K28114R1762k84537m5789K27386
$$ 452277 568173 483702 277661 522256 364614 357344 585458 677220 392683 346894 574280
6131E74280n6847J1126L586k21450J58285p4252J42121o8366M8487N4863K6395
$$ 574280 517433 528559 532145 310695 468980 394728 536849 468483 516970 571833 598228
6120E98228j77783R6102J05577o9827N5624L5865J9747j07710m8139J04887N4654
$$ 598228 420445 516547 622124 552297 607921 643786 663533 555823 507684 612571 667225
6109F67225R0384o5848m631j33281j5906J70913q2230K888n6804J21869m2181
$$ 667225 757609 691761 687130 553849 537943 708856 626626 629514 572710 694579 652398
6098F52398Q9531r6993l14219j00346J58311L44972j28912j38682q9639K05573
$$ 652398 741929 644936 330717 230371 388682 733654 604742 466060 376421 581994
6088E81994j0834R059L6733O4648p1535J32201O6330p1161q4969R9659j39037
$$ 581994 571160 580219 616952 681600 610065 742266 808596 737435 652466 752125 613088
6077F13088K0034J63278j32474J07708J73095j88311l7815J41223k00932q2538
$$ 613088 633122 796400 663926 771634 944729 756418 718603 859826 658894 576356
6067E76356J64366q1515o7465k5191M3279j25126q2950K47202o1013l2506J4863
$$ 576356 740722 659207 591742 566551 609830 484704 401754 648956 587943 555437 570300
6056E70300P5679J3615R6685R1356k02545n2821J83292J37955R5772m12375O1148
$$ 570300 645979 659594 756279 847635 645090 592269 775561 913516 1009288 596913 658061
6045F58061O3396M2314j28907R3572J88144j48228j12682R6123o4413J68314q4064
$$ 658061 721457 763771 634864 728436 916580 768352 655670 751793 687380 855694 771630
6034G71630j18744r8060M18609j9475j47872K5385M7574J53359k65114l616l0377
$$ 771630 652886 554826 973435 953960 806088 831473 879047 1032406 767292 763676 733299
6023G33299J52718K66274J92212j40823j41205J43235j52186p821Q4094n1725
$$ 733299 886017 1152291 1344503 1203680 1062475 1205710 1053524 1045703 1129797 1078072
6013A078072m2731P2374J01682j04211K3504J8892m9848j5860j38600J38393J6011
$$ 1078072 1035341 1107715 1209397 1105186 1128690 1147582 1097734 1081874 943274 1081667 1097678
6002A097678J03552J88671j16183n1349J45892M3602j38748J58036r2322m5250
$$ 1097678 1201230 1389901 1273718 1222369 1368261 1411863 1273115 1431151 1338829 1293579
5992A293579O5879K4399O1456j2897j03214K04454J13782O1732k1842k80625M2542
$$ 1293579 1359458 1383857 1445313 1432416 1329202 1533656 1647438 1709170 1687328 1406703 1449245
5981A449245J11499Q5833O0376j1350k07662k01469R6J22886Q3921P4290N5712
$$ 1449245 1560744 1646577 1706953 1695603 1487941 1286472 1286568 1409454 1493375 1567665 1623377
5970A623377l25663P2335K71131k0792j53275J0257J05135P9164J20619n6373
$$ 1623377 1297714 1370049 1641180 1620388 1467113 1477370 1582505 1661669 1782288 1725915
5960A725915P7883q3214k5567n0204r0485Q3784K16186p1867O360L4464j17013
$$ 1725915 1803798 1720584 1695017 1644813 1554328 1638112 1854298 1782431 1788791 1823255 1706242
5949A706242K40627J37902j82695j4535L4008Q8061J54023J7974J26381j68716
$$ 1706242 1946869 2084771 1902076 1887541 1921549 2009610 2163633 2181607 2307988 2139272
5939B139272k33830J79584P7485K5040q2350K16981J12237j52013k1462K07736
$$ 2139272 1905442 2085026 2162511 2187551 2105201 2322182 2434419 2282406 2260944 2468680
5929B468680N4390J8297j08131p3854K13445j91667K02495k0585p1925J31505
$$ 2468680 2523070 2541367 2433236 2359382 2572827 2381160 2583655 2563070 2491145 2622650
5919B622650j32989K71975J95393k12044M0451k1133J84248P514r7012R8437Q0441
$$ 2622650 2489661 2761636 2957029 2744985 2785436 2764303 2948551 2956065 2859053 2957490 3037931
5908C037931K28050J67091J01830P4500j44983m5866P3970K46594L2557n0618
$$ 3037931 3265981 3433072 3534902 3609402 3464419 3418553 3492523 3739117 3771674 3721056
5898C721056J30943J24997J02774K46390L5425m5926J03569L9083k3460K30599
$$ 3721056 3851999 3976996 4079770 4326160 4361585 4315659 4419228 4458311 4434851 4665450
5888D665450M10310Q0480L307K47086o9063J77119K14610M0790J70115K66155
$$ 4665450 5075760 5156240 5159547 5406633 5337570 5514689 5729299 5770089 5940204 6206359
5878F206359r728K11750J28276O2519K65269R3192L33186J40806R4382L11689
$$ 6206359 6196631 6408381 6536657 6599176 6864445 6957637 7290823 7431629 7526011 7837700
5868G837700K80487L75794J16613j11331K10086K75357L69408K89979K17780L86039
$$ 7837700 8118187 8493981 8610594 8499263 8709349 8984706 9354114 9644093 9861873 10247912
5858A0247912K93289K63392M61424M22065K66875K27859O09556M63097L28672
$$ 10247912 10541201 10804593 11266017 11688082 11954957 12182816 12792372 13255469 13584141
5849A3584141O01581P24374N46678L78975O72566N64871P75992J098931J052681
$$ 13584141 14185722 14910096 15456774 15835749 16508315 17073186 17849178 18948109 20000790
5840B0000790J010492J245314J247948J540578J966812J843226K297718K250692
$$ 20000790 21011282 22256596 23504544 25045122 27011934 28855160 31152878 33403570
5832C3403570K567713K773124K880485K600438J906470J272289O06971m21042
$$ 33403570 35971283 38744407 41624892 44225330 46131800 47404089 48011060 47590018
5824D7590018p10027q28955p61771m10268n77183q48657q04473r55042p34670
$$ 47590018 46879991 46051036 45289265 44878997 44301814 43453157 42648684 41693642 40958972
5815D0958972l16155l67285O0651M58538P31203J035788J726454K243694K297838
$$ 40958972 40642817 40275532 40336183 40794721 41525924 42561712 44288166 46531860 48829698
5806D8829698K673776L052679L517700L794784L735065L689585L680288L528911
$$ 48829698 51503474 54556153 58073853 61868637 65603702 69293287 72973575 76502486
5798G6502486L689311L601577K914330K478418P94930j285950l394561m862874
$$ 76502486 80191797 83793374 86707704 89186122 89981052 88695102 85300541 80437667
5790H0437667n253052m933489m458622m037665l908335l396202k968159l051781
$$ 80437667 75184615 70251126 65792504 61754839 57846504 54450302 51482143 48430362
5782D8430362k437757j942171j633105j042780q35278l30230L65636K04717O55300
$$ 48430362 45992605 44050434 42417329 41374549 40539271 40209041 40574677 40779394 41434694
5773D1434694J345345J412792J756093J921185K037519J897953J766560J453012
$$ 41434694 42780039 44192831 45948924 47870109 49907628 51805581 53572141 55025153
5765E5025153J092377P73394P74251N67472k62376j930180l143923l635637m034882
$$ 55025153 56117530 56890924 57665175 58232647 57970271 56040091 52896168 49260531 45225649
5756D5225649m167940l947932l235584k878680k248966k080481j728649j399496
$$ 45225649 41057709 37109777 33874193 30995513 28746547 26666066 24937417 23537921
5748B3537921j347315j195064p85833p63813o30928p85617n73614m71435l49299
$$ 23537921 22190606 20995542 20209709 19445896 18814968 18029351 17455737 16984302 16635003
5739A6635003k07248m01240m55612n36351j33739P1778k08710j62373k31179L9725
$$ 16635003 16427755 16026515 15570903 15034552 14900813 14972591 14763881 14601508 14370329 14410054
5729A4410054k62197n8247K1112q8547l0766j73025l1045J919K81742J83802q8079
$$ 14410054 14147857 14089610 14110722 14022175 13991409 13818384 13787339 13789258 14071000 14254802 14166723
5718A4166723N7173J90360P9151M04738L77262J16399J32824N24502L87208J84110
$$ 14166723 14223896 14414256 14493407 14898145 15275407 15391806 15524630 16049132 16436340 16620450
5708A6620450N62919N81812M93059N79031M82445O35160M77222O32189R31813
$$ 16620450 17183369 17765181 18258240 18837271 19319716 19954876 20432098 21064287 21996100
5699B1996100Q60269R15373J060095J151631J212161J565506J820397K072007
$$ 21996100 22856369 23771742 24831837 25983468 27195629 28761135 30581532 32653539
5691C2653539K241375K547700K986472L307618L762503L697124L822820L562096
$$ 32653539 34894914 37442614 40429086 43736704 47499207 51196331 55019151 58581247
5683E8581247L051817J811517K17216j064703j475696j880418j555346j436460
$$ 58581247 61633064 63444581 63661797 62597094 61121398 59240980 57685634 56249174
5675E6249174j456817j519427k160405j924575j983628j541955j315227p40053
$$ 56249174 54792357 53272930 51112525 49187950 47204322 45662367 44347140 43607087
5667D3607087J47202Q9771N80965J050681J673980K298031K374684K968869L240983
$$ 43607087 43754289 43844060 44425025 45475706 47149686 49447717 51822401 54791270 58032253
5658E8032253L736493M141576L984926L954003M075737M057684L531161L150237
$$ 58032253 61768746 65910322 69895248 73849251 77924988 81982672 85513833 88664070
5650H8664070J742447P1879k131472m222921n164498n385621m619454m564567
$$ 88664070 90406517 90478396 88346924 84124003 78959505 73573884 68954430 64389863
5642F4389863m286583m050381m240758l658924l505446k726730k191837j942264
$$ 64389863 60103280 56052899 51812141 48153217 44647771 41921041 39729204 37786940
5634C7786940j250085j043700l31832M1875J48973J17804P20689P08773R75132
$$ 37786940 36536855 35493155 35161323 35203198 35352171 35469975 36190664 36899437 37874569
5625C7874569J093665N33454O77013N91704J80307R4617K61484j57386m74380
$$ 37874569 38968234 39501688 40178701 40770405 40950712 41045329 41306813 41149427 40675047
5616D0675047j376873k431505k941007l156781k972185k556860k404259j978003
$$ 40675047 39298174 36866669 33925662 30768881 27796696 25239836 22835577 20857574
5608B0857574j677461j523275j074723q99037j065668q86434p47327o94526o25377
$$ 20857574 19180113 17656838 16582115 15683078 14617410 13730976 12983649 12289123 11663746
5599A1663746l88487n45216m91678o04851k07635k99437n42853k57343n8375k70042
$$ 11663746 11275259 10730043 10238365 9633514 9425879 9126442 8583589 8326246 8267871 7997829
5589G997829m89247j5782k79116k71152j74285k13349l15184j68739l13976j9016
$$ 7997829 7508582 7492800 7213684 6942532 6768247 6554898 6239714 6070975 5756999 5737983
5579E737983k24735k15508l38996j35140R0256k61934j87424j04148k52370J03849
$$ 5737983 5513248 5297740 4958744 4823604 4913860 4651926 4464502 4360354 4107984 4211833
5569D211833l8057j02545n1531j53511r4175j08489k10800L1519K8886P8505l19246
$$ 4211833 4173776 4071231 4019700 3866189 3772014 3663525 3452725 3484244 3513130 3591635 3272389
5558C272389j22310O003m8298n453k88619k05067M7277P8323l2098P8573l02993
$$ 3272389 3150079 3156082 3107784 3102331 2813712 2608645 2655922 2734245 2702147 2780720 2477727
5547B477727m2227P21l7843R702Q3049l96464P9611K32540j15633o4036j83375
$$ 2477727 2435500 2436221 2398378 2408080 2491129 2094665 2174276 2406816 2291183 2227147 2043772
5536B043772j4831J47295o3311j92518j72361K28542l4121n8265O764j24807K2901
$$ 2043772 2028941 2176236 2112925 1920407 1748046 1976588 1942467 1884202 1890966 1766159 1789060
5525A789060l00443J32468N9302o8525K05508j04533k79460J9375R7695l905N2500
$$ 1789060 1488617 1621085 1680387 1611862 1817370 1712837 1433377 1452752 1550447 1546542 1599042
5514A599042k88020j29766J89235K8306n7468M220P1087q0008n6523J55550P9666
$$ 1599042 1311022 1181256 1370491 1398797 1341329 1345549 1416636 1336628 1280105 1435655 1515321
5503A515321j03629j6895n5677q7783l8362k0680J73142J98015j21245k19501
$$ 1515321 1411692 1394797 1339120 1251337 1212975 1192295 1365437 1563452 1442207 1222706
5493A222706m6081j37480J4013K5103k6260j49261M3279L6349J37222J23959r8560
$$ 1222706 1176625 1039145 1053158 1078261 1052001 902740 946019 982368 1119590 1243549 1144989
5482A144989R7778K23208M0444j29935p0191P4655j01787j31085j35473k59445
$$ 1144989 1242767 1465975 1506419 1376484 1306293 1380948 1279161 1148076 1012603 753158
5472G53158K64056P5947k6527M3974m1941q9646n7568m8617j25908j81429J82245
$$ 753158 1017214 1093161 1066634 1110608 1068667 979021 921453 872836 746928 565499 747744
5461G47744K97774l4814j57497k8467l3537r1417J36109J92995j71702K8614m130
$$ 747744 1045518 1010704 853207 824740 791203 699786 835895 1028890 857188 885802 881672
5450H81672o5379J31520p2177P1272J13316j48947P9443N7275r7994r7794j25816
$$ 881672 816293 947813 875636 946908 1060224 911277 990720 1047995 950001 852207 726391
5439G26391k49974O6228K34205P236r4644J37044N046r5978J194k10710j23857
$$ 726391 476417 542645 776850 784086 689442 826486 831532 735554 736748 526038 402181
5428D02181J47500o651j8906Q8323M7506j7437j68593J15349q6170J64532p5294
$$ 402181 549681 543030 524124 612447 659953 642516 473923 589272 503102 667634 592340
5417E92340j49755R6275J61165r6298L448Q5138q0409j64848k2807M9079j02205
$$ 592340 442585 538860 700025 603727 607175 692313 611904 447056 424249 473328 371123
5406C71123n0118l9412P0564J30466p8630j44429M8945J24282J81199J31961k72738
$$ 371123 321005 281593 352157 482623 403993 259564 308509 432791 613990 745951 473213
5395D73213j33197L3326K44707J14570k38347J5575K2303j68929P3428o2044R0810
$$ 473213 340016 373342 618049 732619 494272 509847 532150 363221 436649 374605 465415
5384D65415J69342r4191J24376o271q7713k21502n8339J29786P4591j87165P2373
$$ 465415 634757 540566 664942 658671 570958 349456 291117 420903 495494 308329 380702
5373C80702M0708j23079J29634l7429j57184M7965J9700l1892N7277K38574l3794
$$ 380702 421410 298331 427965 390536 233352 281317 301017 269125 326402 564976 531182
5362E31182j98805M2352q7104l6421K637J13411R2698j54740J40360J61153p7351
$$ 531182 332377 374729 287625 251204 253841 367252 459950 305210 445570 606723 529372
5351E29372j2041K25608N6647k98291j43446J49763Q002k74911O488Q7872J09613
$$ 529372 517331 742939 799586 501295 357849 507612 515614 240703 247191 335063 444676
5340D44676J18415j63448M3723K4852N6063n2821r0959m027K907K862J2556J63231
$$ 444676 563091 399643 443366 468218 524281 471460 380501 376474 379381 382243 394799 558030
5328E58030l7413n9560k07205q2593J41373p275K15262k12448L5611J22346L5361
$$ 558030 520617 461057 253852 171259 312632 305357 520619 308171 343782 466128 501489
5317E01489J57053N1742r8055r1632J23833o7647P0983j53591j89614K9806K32250
$$ 501489 658542 710284 612229 520597 644430 576783 647766 494175 304561 334367 566617
5306E66617J20360j04770n9789q3896j21752L7675N2433J02720J12005l7057N6834
$$ 566617 686977 582207 522418 438522 316770 354445 406878 509598 621603 584546 641380
5295F41380j31730k8328j40035M0916J32180Q7323N4757k34505j86621J05758
$$ 641380 509650 481322 341287 382203 514383 601706 656463 421958 235337 341095
5285C41095j44583J59388J53613k2574j10015k90972K9452J21596J39688k9927
$$ 341095 196512 355900 509513 486939 376924 85952 115404 237000 376688 346761
5275C46761j49921O3708J90388j3505j08740m3610L0713j8328j91884o2822J33398
$$ 346761 196840 260548 450936 437431 328691 285081 315794 297466 105582 42760 176158
5264A76158J17264J25269k88434j33364P1317j8227R835K83893j96688k7198m3320
$$ 176158 293422 418691 130257 -3107 68210 49983 59818 343711 147023 119825 76505
5253G6505J77173r617J2802K4891o8455L97L1021q7698n4624K34011o332j0497
$$ 76505 253678 244061 256863 281754 213299 213696 244717 157019 102395 336406 330074 319577
5241C19577j6205k33648N887J25903j03596j43445J47961J15507k27636N0121
$$ 319577 303372 69724 75611 201514 97918 -45527 102434 217941 -9695 40426
5231D0426J79073q3034J8476M7930o2600o6735L0333J70368l5994J25371k59020
$$ 40426 219499 136465 154941 202871 140271 73536 103869 274237 238243 363614 104594
5220A04594m2377K62264k46122j56580L07851k7718n708L2628q8243J2132j29895
$$ 104594 62217 324481 78359 -78221 229630 201912 196204 228832 140589 152721 22826
5209B2826j38380J15967P7561J90505j11798k13208K48570l2136q4583L6228L4180
$$ 22826 -115554 413 77974 268479 156681 -56527 192043 159907 75324 111552 145732
5198A45732k47423J78597J08248m7299m7525j15776O7152l5655P0931K4281m7838
$$ 145732 -101691 76906 185154 137855 90330 -25446 41706 6051 76982 101263 53425
5187E3425O5803N9226r3967o8614K16032K26669m061k25835k67338M035o019K16316
$$ 53425 119228 178454 84487 15873 231905 458574 454513 228678 -38660 -34625 -40644 175672
5175A75672m7424j56993j67400J13102P8837J04806M1972Q0854k74085M1198O8139
$$ 175672 128248 -28745 -196145 -83043 -4206 100600 142572 223426 -50659 -9461 58678
5164E8678j29378K3799o422k5826L3066o8670N0650j6256J04901J02653n6863
$$ 58678 -70700 -46901 -53323 -79149 -46083 -114753 -64103 -80359 24542 127195 70332
5153G0332q6208p2431Q2813j6490O8047O697R7601L3393K14949k07308j5984K05439
$$ 70332 -15876 -88307 -5494 -21984 46063 52760 150361 183754 398703 191395 175411 380850
5141C80850j58169j04486r3715O894Q4155j1927J6789k9292N6985R5924j37926
$$ 380850 222681 118195 24480 31374 115529 103602 120391 91099 148084 244008 106082
5130A06082k0782J6022J2180j06304j49727L149K28240P3634k26344N1287o8461
$$ 106082 85300 101322 113502 7198 -142529 -139380 88860 162494 -63850 -12563 -81024
5119h1024J29680N5717J68649J08417p2369k15887L3057J0912k32261K36877J07462
$$ -81024 48656 104373 273022 381439 309070 93183 126240 137152 -95109 141768 249230
5108B49230k94788O5629j5446k04319r6429J71301k06929M7764J34924J06739
$$ 249230 -45558 20071 4625 -199694 -296123 -124822 -331751 -283987 -149063 -42324
5098d2324J73751N4945p0890k2788o9660m5640k2354J68416j875j38373J05185
$$ -42324 131427 186372 115482 92694 23034 -22606 -44960 123456 121581 -16792 88393
5087H8393K0910j46712j057K9485M850j24513Q2221J24349r8777k0994k45474
$$ 88393 109303 -37409 -38466 -8981 -4131 -128644 -46423 77926 -20851 -41845 -287319
5076b87319M0961m4794J55352J99669L5178p6132m6349J88053K4346l7106j49407
$$ -287319 -246358 -291152 -135800 63869 99047 22915 -23434 164619 188965 151859 2452
5065B452j97705R4483k8046J50526J9798J83140k13526k2289J99836k12107m2597
$$ 2452 -195253 -100770 -128816 21710 41508 224648 11122 -11167 188669 -23438 -66035
5054f6035N609j3500J56968K1843j54779l4804N3975L8244L570n9220R0180r0415
$$ -66035 -60426 -73926 83042 104885 -49894 -84698 -30723 7521 11091 -48129 42051 -48364
5042d8364n40k2052l2040R8561J07646j47696o9085P0328R5291j13906k00403
$$ -48364 -48904 -70956 -102996 -4435 103211 -44485 -113570 -43242 52049 -61857 -262260
5031b62260L0647J84186J1341k5448J36992J1373M0012J1572M3869k7462k86250
$$ -262260 -231613 -47427 -36086 -61534 75458 86831 126843 138415 182284 154822 -131428
5020a31428Q0505P7292j16356O8792J14253M5615j46502k7593k4820Q7584P0300
$$ -131428 -50923 26369 -89987 -21195 93058 138673 -7829 -35422 -60242 27342 97642
5009I7642m1627p8211J8880J04835J93069K0302k01372j37283K2107J1418N3094
$$ 97642 56015 -22196 -3316 101519 294588 314890 113518 -23765 -1658 9760 62854
4998F2854N332j50971N4014P3154P9280J26078J05062k71336o7375M7078r6706
$$ 62854 68186 -82785 -28771 44383 123663 249741 354803 83467 16092 63170 -33536
4987c3536P6024L3332o9697L2761K13870j97205K15276J6557j87001n4656J16254
$$ -33536 42488 75820 6123 38884 252754 55549 270825 287382 100381 45725 161979
4976A61979Q6232o6924p4372j51662J8655J54814o3755N7037k5421q5209r0532
$$ 161979 248211 181287 106915 -44747 -26092 128722 64967 122004 96583 11374 -79158
4965g9158P6694K8235L4464j5695J32328L2051J4141o5918r3615M2528o1293J32929
$$ -79158 -2464 25771 60235 44540 176868 208919 223060 157142 63527 106055 44762 177691
4953A77691j63471q425m5941l0114J11745J72628p6219k05820J60913J11680O5396
$$ 177691 14220 5795 -40146 -70260 41485 214113 137894 -67926 92987 204667 270063
4942B70063q7470j23781M2498R5996j19984n7778J76517n6633J09277Q2940q7601
$$ 270063 182593 58812 101310 197306 77322 19544 196061 139428 248705 331645 244044
4931B44044p7937l7162R4244k09286j06422L4787m7381L29989M3863k16208m5018
$$ 244044 166107 128945 223189 13903 -92519 -57732 -105113 224876 268739 52531 7513
4920G513J35352j82948R2358N8820l0108J12923J38019j43369m7645J6474k05267
$$ 7513 142865 -40083 52275 111095 80987 193910 331929 188560 140915 157389 -47878
4909d7878J28456n9362N0637j07744o7044L3298J82094N2139l9344p6728J49102
$$ -47878 80578 21216 71853 -35891 -102935 -69637 112457 164596 125252 48524 197626
4898A97626N2154k8260J61902o2147O6835j98095K5004j7179J51458O3598N6243
$$ 197626 249780 221520 383422 321275 388110 190015 215019 197840 349298 412896 469139
4887D69139j37995J03187l7072j34440J50162J74206O4914m7425j14668L7372
$$ 469139 331144 434331 397259 262819 412981 587187 652101 604676 490008 527380
4877E27380Q5597R3711J60015j04771m5176J19944K05138N3668j7657o691K42772
$$ 527380 612977 706688 866703 761932 716756 836700 1041838 1095506 1077849 1071158 1313930
4866A313930K9067n2416L303r8131n9203j12688j85037j56662r6856L2275M2648
$$ 1313930 1342997 1290581 1293884 1195753 1136550 1023862 838825 682163 585307 617582 660230
4855F60230q0316j00474J20586l4154j66835j3487n0l9257R1762L420k20554r6675
$$ 660230 579914 479440 600026 565872 399037 385550 385500 346243 438005 441425 220871 124196
4843A24196J80002j46956j26304J19547L8103M804Q9986j56580J41600O6919l30441
$$ 124196 304198 157242 30938 150485 188588 193392 283378 126798 268398 335317 4876
4832D876j1218K57169P6859N7889r1213j4820M1400k5376R558j65409j49346K57634
$$ 4876 -6342 250827 327686 385575 294362 279542 320942 295566 305124 139715 -9631 248003
4820B48003j16065p0740J33468Q9748o697q4493l7216n0699L5540M3331p9393
$$ 248003 131938 61198 194666 284414 277717 193224 156008 105309 140849 184180 104787
4809A04787L2673O3296j08111J22321L1666J1142j74833J01694r561n9256J5169
$$ 104787 137460 200756 92645 214966 246632 257774 82941 184635 175074 115818 130987
4798A30987M0682r4939J29372N5001m8058j0941J05829n5474K844J1091o2225
$$ 130987 171669 76730 206102 261103 213045 202104 307933 252459 255303 266394 204169
4787B04169R9100o3917n6938j36817m2025K23297Q6642k9522O4460k7903k47523
$$ 204169 303269 239352 182414 45597 3572 226869 313511 283989 348449 320546 73023
4776G3023j17469N2241j51003J01728J08755K16382j29653k44363Q4876L7510
$$ 73023 -44446 7795 -143208 -41480 67275 283657 154004 -90359 -5483 32027
4766C2027J1264J42162J00130j63089o0723J77977m8300P2579j31093J1334l237
$$ 32027 43291 185453 285583 122494 61771 239748 191448 264027 132934 144268 141031
4755A41031r028O2851j46575K21686J8771J35053j17243o5934q4525q0856M7210
$$ 141031 132003 194854 48279 269965 288736 423789 306546 240612 156087 75231 122441
4744A22441l2438q580J82496J00749n583o1550j42266n8710O1664j66223Q1087
$$ 122441 90003 81423 263919 364668 359085 297535 155269 96559 158223 -8000 73087
4733G3087n1667k08088K7452O2150J88357p9981p3820O4523J40784n0360j3685
$$ 73087 21420 -186668 -159216 -97066 91291 11310 -62510 2013 142797 92437 78752
4722G8752M4683Q7515K29125n4412j62485r3589N6211N1757j29750N2907n0509
$$ 78752 123435 210950 440075 385663 223178 129589 185800 237557 107807 160714 110205
4711A10205j18384J07213J42370k09909r145j11278J12586R2316J4112P106j5297
$$ 110205 -8179 99034 241404 31495 22350 -88928 23658 115974 130086 137192 121895
4700A21895J53743m0056M9551j60677j6614K1604M4520N6939n5115P138j27957
$$ 121895 275638 235582 285133 124456 107842 129446 173966 230905 175790 182928 54971
4689E4971J22443p794J07129j56442K6540J24005r0085M2003K763L3317r2609
$$ 54971 177414 169620 276749 120307 146847 270852 180767 222770 225533 258850 166241
4678A66241J23824o7047j12395o6818R5327j05635J50897q7719k0774Q3438J0607
$$ 166241 290065 223018 110623 43805 139132 33497 184394 96675 75901 159339 169946
4667A69946Q9167P8084p8790O028J16272j39356N2302m7723j89200l9321K9277
$$ 169946 259113 337197 258407 264435 380707 241351 293653 245930 56730 17409 46686
4656D6686J66311n521r7095Q3580j87201K4572j45630K78611L5930j42093Q9959
$$ 46686 212997 207476 110381 193961 6760 31332 -114298 164313 200243 58150 148109
4645A48109j4558o9720J00791R9976j20089R0004J01988k5334J84804k08807j53383
$$ 148109 133551 63831 164622 264598 144509 234513 336501 311167 495971 287164 133781
4634A33781j117R0834O9590N323j03511M6557o50k8525J63773r7838K6009j80078
$$ 133781 132664 223498 293088 298411 194900 241457 240807 212282 376055 278217 304226 124148
4622A24148j33218J55277J12468n8574n5893l8025J95293J59510k01517j59378
$$ 124148 -9070 146207 258675 200101 144208 106183 301476 460986 259469 100091
4612A00091o2663j18453J11639Q6064m1390l4320j6853L5340j3050j71635J79949
$$ 100091 37428 -81025 30614 116678 75288 40968 24115 59455 46405 -125230 54719
4601E4719L08753J494j67103J79229k6355n8471J2539J83707j81140n4874Q4019
$$ 54719 363472 364966 197863 377092 350737 292266 304805 488512 307372 252498 336517
4590C36517R0980j0428j48574o0262m6601j3073J05496L3053k12490K23281L5367
$$ 336517 427497 417069 268495 208233 161632 148559 254055 287108 74618 297899 333266
4579C33266j02638m7342n6752J00383k193j1211J79035r5493r3842K66420o6563
$$ 333266 230628 183286 126534 226917 224724 213513 392548 297055 203213 469633 403070
4568D03070k57760N6706L7438j3674l595N4750M6167p0335J05822j51961k19429
$$ 403070 145310 202016 239454 225780 222185 276935 323102 252767 358589 206628 -12801
4557a2801J9479R8492J42017N4014O8940r2529m5803j52833n4580K08033Q5219
$$ -12801 6678 105170 247187 301201 370141 277612 231809 78976 24396 232429 317648
4546C17648N6982Q3154L941j13491J5444P242m2159m0052j7426j89638J76299
$$ 317648 374630 457784 461725 348234 363678 370920 328761 288709 271283 81645 257944
4535B57944R8173p7416p947K6221L3532J4034J45713m0696j33532j0266q1722
$$ 257944 356117 278701 270754 296975 330507 344541 490254 449558 316026 305760 224038
4524B24038P647L02080n0665j28533p7046J46856m26j7744q5528n2112j69907
$$ 224038 231685 533765 483100 354567 277521 424377 423951 406207 320679 268567 98660
4513I8660O6715l6831K63472M61k38982M4422J86334m0128J01591o8962P8088
$$ 98660 165375 128544 392016 392477 153495 197917 384251 344123 445714 376752 454840
4502D54840J3765R6091K487j04034j9678Q946L8407k41118J83780p500j00523
$$ 454840 468605 564696 567183 463149 443471 452417 490824 249706 433486 425986 325463
4491C25463j09199M025Q9125J5764j53891M7627J07555o6876M4347m4797q0092
$$ 325463 216264 220289 309414 325178 171287 218914 326469 259593 303940 259143 179051
4480A79051K55064J45191l4488j14466N9340j84986O3102k3486j19764K34060
$$ 179051 434115 579306 544818 430352 489692 304706 367808 344322 224558 458618
4470D58618m0999L6696J14789K2150j95786l57476O7444L57592N3961P302n355
$$ 458618 417619 454315 569104 591254 395468 37992 105436 463028 516989 524291 518936
4459E18936P079J00147J1068P499k89981J79741K04638O0849q5955k8811J29826
$$ 518936 526015 626162 637230 644729 354748 534489 739127 799976 714021 685210 815036
4448H15036l5377J360K6663r9369q2896r5321K0702r2294J96976L3057o6016L4466
$$ 815036 779659 781019 807682 708313 625417 530096 550798 458504 655480 688537 622521 656987
4436F56987L8646K23720k65789k55062J73808J83357O8237J30668k54553j9789
$$ 656987 695633 919353 653564 398502 572310 755667 823904 954572 700019 680230
4426F80230j7089m3095J7712l8863M4287q666j2156m7894L3939Q905K33158o3578
$$ 680230 663141 620046 637758 598895 643182 634516 622360 574466 608405 617310 850468 786890
4414G86890M0655j69752M1206P3827R6235j33647l9822J23506j04974K2157K39583
$$ 786890 827545 657793 698999 772826 869061 735414 695592 819098 714124 736281 975864
4403I75864j09207k15527M1961N0074M3987j0331Q6153j45262l6466K09078R2135
$$ 975864 866657 651130 693091 743165 787152 776821 862974 717712 681246 890324 982459
4392I82459r8072j5072L7548O9611R020m3175o0158J1065j82085J22110L14113
$$ 982459 884387 869315 906863 976474 985494 942319 882161 893226 711141 833251 1147364
4381A147364J28005j50776R7002K2818q7677j28614m1701J13320R6403j42806
$$ 1147364 1275369 1124593 1221595 1244413 1156736 1028122 986421 1099741 1196144 1053338
4371A053338m0673R1085J81959N4867J33511n5663r500p1931m3131Q7071j79220
$$ 1053338 1012665 1103750 1285709 1340576 1474087 1418424 1408924 1336993 1293862 1380933 1201713
4360A201713P2229J71882j30496J09497L3663l1632k42016K39526N6081j26209
$$ 1201713 1273942 1445824 1315328 1424825 1458488 1426856 1184840 1424366 1480447 1354238
4350A354238j53494L3811M6463j17841J3706m9157M66399q9078j22640j49989
$$ 1354238 1200744 1234555 1281018 1163177 1176883 1127726 1594125 1505047 1382407 1232418
4340A232418m3269J5056J4043K62426j38628k88832K87014J02600k35428O9690
$$ 1232418 1189149 1204205 1218248 1480674 1342046 1053214 1340228 1442828 1207400 1277090
4330A277090l3388k1686j16307k11135q697J80521J8377J22803j8620j99493J13377
$$ 1277090 1243702 1222016 1105709 894574 885877 1066398 1084775 1207578 1188958 989465 1102842
4319A102842J70455k7607o5545j65360J22694O1713j2620j56462J54463k1917
$$ 1102842 1273297 1245690 1180145 1014785 1137479 1199192 1186572 1030110 1184573 1162656
4309A162656j89200J93035n5836k609P2292L2113j95480K88262k37315M412P763
$$ 1162656 973456 1166491 1110655 1108046 1180338 1212451 1016971 1305233 1067918 1072330 1080093
4298A080093J90798q1509N4368Q6962j87319J25315P5185N6849j04995L1833O2400
$$ 1080093 1270891 1189382 1243750 1330712 1143393 1268708 1343893 1400742 1295747 1327580 1389980
4287A389980n5260Q935l8792Q0865k5874J8996o4331J54304k2263k06520K04958
$$ 1389980 1334720 1343655 1304863 1385728 1359854 1378850 1314519 1468823 1446560 1240040 1444998
4276A444998K15516O3038k49803k59242r5925K33020L0471K8416p1287O3889J24255
$$ 1444998 1660514 1723552 1473749 1214507 1118582 1351602 1382073 1410489 1339202 1403091 1527346
4265A527346j07228k09338L2995J18889p3024J01554L14394O9495J7881q1348
$$ 1527346 1420118 1210780 1243775 1362664 1289640 1391194 1705588 1775083 1792964 1711616
4255A711616j01036J76406l3905j5205M2322R0735l5777p7412j60120K05980J52444
$$ 1711616 1610580 1786986 1753081 1737876 1780198 1870933 1835156 1757744 1597624 1803604 1956048
4244A956048q3035p3572J49833m163q9119L00756J48153q4775M0808K0217m370
$$ 1956048 1873013 1799441 1949274 1945111 1855992 2156748 2304901 2220126 2260934 2281151 2276781
4233B276781j74425J11805J03447J30998j95010k03037J80939j23124J19767K8578
$$ 2276781 2102356 2214161 2317608 2448606 2253596 2050559 2231498 2108374 2228141 2256719
4223B256719O0735K6778J05169L1434n6735l3771J66361j1457j16875l6857J35055
$$ 2256719 2317454 2344232 2449401 2480835 2424100 2390329 2556690 2545233 2428358 2391501 2526556
4212B526556J99169j14069j7226K29606K1681Q939J95632k2365r6856M7313m36
$$ 2526556 2725725 2611656 2594430 2824036 2845717 2854656 3050288 3027923 2931067 2978380 2977944
4201B977944J11357j14486j3761K38178K3005J1247J72691M8238M1686J71315
$$ 2977944 3089301 2974815 2961054 3199232 3222237 3233484 3406175 3454413 3496099 3667414
4191C667414J53971K5364j61202l6352o6835J30819J80994N7857o546O7537P0565
$$ 3667414 3821385 3846749 3685547 3649195 3582360 3713179 3894173 3952030 3945484 4013021 4083586
4180D083586r0529J15965j88606M59363L39157j82494R0273J05506j7868K62129
$$ 4083586 3993057 4109022 3920416 4379779 4718936 4536442 4626715 4732221 4714353 4976482
4170D976482m1168n8683L39528O7595L3335N7496K01889J61328K00366K2079J89635
$$ 4976482 4935314 4876631 5216159 5283754 5317089 5374585 5576474 5737802 5938168 5960247 6149882
4159F149882Q3797O6862J71495J71942L1816J7510L05573J38005J23285K07537
$$ 6149882 6233679 6300541 6472036 6643978 6675794 6693304 6998877 7136882 7260167 7467704
4149G467704K71410R1715J68444N6049O0843N9806L63986L08501J05606J76505
$$ 7467704 7739114 7830829 7999273 8055322 8116165 8175971 8539957 8848458 8954064 9130569
4139I130569K52536J11783K95062L23764L59350J34415J17545L21783M06625L87358
$$ 9130569 9383105 9494888 9789950 10113714 10473064 10607479 10725024 11046807 11453432 11840790
4129A1840790J61551M06738L52067M59397M21092L88011L69605M79732L15009
$$ 11840790 12002341 12409079 12761146 13220543 13641635 14029646 14399251 14878983 15193992
4120A5193992M27297M16907N83382O04974M09422N04966O99088J008509N94883
$$ 15193992 15621289 16038196 16621578 17226552 17635974 18140940 18840028 19848537 20443420
4111B0443420P07337Q66145N86176P67014J063316J123110R90145J238045J098649
$$ 20443420 21150757 22016902 22603078 23370092 24433408 25556518 26546663 27784708 28883357
4102B8883357J125702J392738J375539J610407J618178J807984J803273J920825
$$ 28883357 30009059 31401797 32777336 34387743 36005921 37813905 39617178 41538003
4094D1538003J934983J899519K294855K398161K484119K392629K177528K128715
$$ 41538003 43472986 45372505 47667360 50065521 52549640 54942269 57119797 59248512
4086E9248512K523429K863091K640168K771468K566797K572580L020578K785872
$$ 59248512 61771941 64635032 67275200 70046668 72613465 75186045 78206623 80992495
4078H0992495K971112K878838L026818K817675K729698K698871K560088K183001
$$ 80992495 83963607 86842445 89869263 92686938 95416636 98115507 100675595 102858596
4070A02858596K248712K069675J938779J620885J487439J735635J511607J169043
$$ 102858596 105107308 107176983 109115762 110736647 112224086 113959721 115471328 116640371
4062A16640371J081072N87082M51885K96079P5969j82426o63811q23023j073683
$$ 116640371 117721443 118308525 118760410 119056489 119132458 118950032 118286221 117463198 116389515
4053A16389515j159446j621336j516048j575257j925251k192283k026265k180527
$$ 116389515 115230069 113608733 112092685 110517428 108592177 106399894 104373629 102193102
4045A02193102k431323k529128k698764k746122l005227l103179l234504l240486
$$ 102193102 99761779 97232651 94533887 91787765 88782538 85679359 82444855 79204369
4037G9204369l239385k879288k692373k907189l052114k830128k397968k560546
$$ 79204369 75964984 73085696 70393323 67486134 64434020 61603892 59205924 56645378
4029E6645378k910891k728572k602220k379896k239776k328689k093490k064563
$$ 56645378 53734487 51005915 48403695 46023799 43784023 41455334 39361844 37297281
4021C7297281k087458j827706j626095j585261j545154j473968j230129j383670
$$ 37297281 35209823 33382117 31756022 30170761 28625607 27151639 25921510 24537840
4013B4537840j054778j115513r46604p56476j088480r16665p86539q68001n74469
$$ 24537840 23483062 22367549 21420945 20664469 19575989 18659324 17872785 17004784 16430315
4004A6430315m85710o03838o88466o30032l02400m28761l88062l79012l07058
$$ 16430315 15944605 15340767 14652301 14022269 13719869 13291108 12903046 12524034 12216976
3995A2216976j88285l72180l07428l43353l28640m20819l36029k41370n2329j92580
$$ 12216976 12028691 11656511 11349083 11005730 10677090 10256271 9920242 9678872 9626543 9433963
3985I433963k4692l21746l11545j71500k16252j70540o9252p1176l00453P146
$$ 9433963 9409271 9087525 8775980 8604480 8388228 8217688 8148436 8077260 7776807 7783953
3975G783953J15742m4802j56750j71484j48800l82634r5134O3756j99931L8956
$$ 7783953 7899695 7854893 7698143 7526659 7377859 6995225 6900091 6963847 6763916 6802872
3965F802872j45462k28469K7455Q101j22121m8672K7424o0101k7979L4645p2110
$$ 6802872 6657410 6428941 6456396 6464497 6342376 6293704 6321128 6261027 6233048 6267693 6195583
3954F195583j0376M7348J99434j57596j99328M9934r973j40153J33161N3261M8088
$$ 6195583 6185207 6232555 6431989 6274393 6075065 6124999 6115026 5974873 6108034 6161295 6209383
3943F209383K22750n4733j07612J132M4273n6204L8173j92731j0120K15107M38291
$$ 6209383 6432133 6377400 6269788 6270920 6315193 6258989 6297162 6104431 6094311 6309418 6747709
3932F747709K6196r9351P7226q9303L46887l8531M7361J04155P8906J05059k3909
$$ 6747709 6773905 6674554 6751780 6662477 7009364 6970833 7018194 7122349 7201255 7306314 7282405
3921G282405N3966J91492K07334l0150j47999J24957J15574n0558K7056Q0159
$$ 7282405 7336371 7527863 7735197 7705047 7557048 7682005 7797579 7747021 7774077 7854236
3911G854236J53495k2673j12368m8979K5695K03452M1207l9060J8915j42096K22009
$$ 7854236 8007731 7985058 7872690 7823711 7849406 8052858 8094065 8055005 8073920 7931824 8153833
3900H153833J16574r8361O7400P8006J42797l9973j65744J36940m5144k67644
$$ 8153833 8270407 8172046 8239446 8317452 8460249 8420276 8254532 8391472 8346328 8078684
3890H078684j27087L31104L0784j74453j24086L6277j4412o7101N8114J90137
$$ 8078684 7951597 8282701 8313485 8139032 8014946 8051223 8036811 7969710 8027824 8217961
3880H217961m878l4713Q1555M6863J25740J132J76186p1083K4129J84117m3843
$$ 8217961 8213083 8178370 8259925 8306788 8432528 8433660 8609846 8538763 8562892 8747009 8703166
3869H703166J79611L21681K46125J52927K40979K64672o621L48133J10090M77740
$$ 8703166 8882777 9204458 9450583 9603510 9844489 10109161 10102540 10450673 10560763 11038503
3859A1038503L84561L42487M54359J34472M45579N05318K95819J63130J22110
$$ 11038503 11423064 11765551 12219910 12354382 12799961 13305279 13601098 13764228 13886338
3850A3886338L92942J69533K42433L2110P8753k1495j21266O5499l68755l07523
$$ 13886338 14279280 14448813 14691246 14723356 14802109 14780614 14659348 14724847 14356092 14048569
3840A4048569l11032k32337k65079m08140l88753j72189k12578m36484m93356
$$ 14048569 13737537 13505200 13240121 12831981 12443228 12271039 12058461 11621977 11128621
3831A1128621j55456q118l21643j92485r5022n0272j98526j68724o9317j22996
$$ 11128621 10973165 10965047 10643404 10450919 10355897 10305625 10107099 9938375 9869058 9746062
3821I746062o6427n8321l59009J31349M0915l3772N8966k99873J10349N9605k050
$$ 9746062 9679635 9621314 9262305 9393654 9434569 9400797 9459763 9159890 9270239 9329844 9327794
3810I327794j3174J4022j08062L04492Q1755L2269j16293J0207J54794K39373
$$ 9327794 9314620 9328642 9220580 9525072 9606827 9639096 9522803 9533010 9687804 9927177
3800I927177P0512k4712J78736P9924R1428N209M44136P3567J43066P7326L5257
$$ 9927177 9997689 9972977 10151713 10231637 10323065 10328274 10772410 10845977 10989043 11066369 11101626
3789A1101626J62390o0210Q7942L6362J53938J61980J60817Q7395K62831K7007
$$ 11101626 11264016 11203806 11291748 11328110 11482048 11644028 11804845 11892240 12155071 12182078
3779A2182078J78497L31537K41628R3390J07899L80836J41508K74900l6497K0550
$$ 12182078 12360575 12692112 12933740 13027130 13135029 13515865 13657373 13932273 13895776 13916326
3769A3916326N36547K68278J5194P1365L15304L67443K80928J23985L58063K24011
$$ 13916326 14452873 14721151 14736345 14807710 15123014 15490457 15771385 15895370 16253433 16477444
3759A6477444K30710N01260L05523J58794L17980M71778J45859J46350K89236
$$ 16477444 16708154 17209414 17514937 17673731 17991711 18463489 18609348 18755698 19044934
3750A9044934N00072M63408N30477L29554L63777N10040N07519L87248N93160
$$ 19044934 19545006 20008414 20538891 20868445 21232222 21742262 22249781 22637029 23230189
3741B3230189O80641N47380L27493O92696Q00722R96673P88077P23073R75700
$$ 23230189 23910830 24458210 24785703 25478399 26279121 27275794 28063871 28786944 29762644
3732B9762644R26968J135458J081911J199960J023063J449291J409624J401119
$$ 29762644 30689612 31825070 32906981 34106941 35130004 36579295 37988919 39390038
3724C9390038J623448J521670J437393J456591J358563J447150J445458J550679
$$ 39390038 41013486 42535156 43972549 45429140 46787703 48234853 49680311 51230990
3716E1230990J259043J336671J523258J488413J255011J261208J348304J248058
$$ 51230990 52490033 53826704 55349962 56838375 58093386 59354594 60702898 61950956
3708F1950956J238805R98922Q30588J026680Q08331M44424N34265O63734M50671
$$ 61950956 63189761 64188683 65019271 66045951 66854282 67298706 67832971 68496705 68947376
3699F8947376J89141M44080O83169N87427P37004O58972O30648O90983Q19513
$$ 68947376 69136517 69580597 70263766 70851193 71588197 72247169 72877817 73568800 74388313
3690G4388313P95793R50174R87172R72016J238699J205433J469452J747579J704469
$$ 74388313 75184106 76134280 77121452 78093468 79332167 80537600 82007052 83754631 85459100
3681H5459100K226684K429538K522658K676101L009908L197843L574805M192067
$$ 85459100 87685784 90115322 92637980 95314081 98323989 101521832 105096637 109288704
3673A09288704M259753M807135M983161N344589N560320N860113O045755O127243
$$ 109288704 113548457 118355592 123338753 128683342 134243662 140103775 146149530 152276773
3665A52276773O367103O805421O531819O668829O792560O734386P104102P366996
$$ 152276773 158643876 165449297 171981116 178649945 185442505 192176891 199280993 206647989
3657B06647989P454086P695774Q017601Q183632Q597126R033991R156540R431440
$$ 206647989 214102075 221797849 229815450 237999082 246596208 255630199 264786739 274218179
3649B74218179R532514J0378800J1049739J1605293J2495688J3405412J4554637
$$ 274218179 283750693 294129493 305179232 316784525 329280213 342685625 357240262
3642C57240262J5792249J6801280J7386561J7176846J6562432J5589891J3343374
$$ 357240262 373032511 389833791 407220352 424397198 440959630 456549521 469892895
3635D69892895J0583358P594263M404806J915322l10931j926384k780902l222316
$$ 469892895 480476253 488070516 492475322 494390644 494079713 492153329 489372427 486150111
3627D86150111l075289k874075l014014l219752m041274n536324p698688j0195894
$$ 486150111 483074822 480200747 477186733 473966981 469925707 464389383 456690695 446494801
3619D46494801j2773212j5433077j7816287j9359909k0494836k0414865j9712175
$$ 446494801 433721589 418288512 400472225 381112316 360617480 340202615 320490440
3612C20490440j8945930j7783249j6528127j5223907j4396727j3194345j1956443
$$ 320490440 301544510 283761261 267233134 252009227 237612500 224418155 212461712
3605B12461712j0878735j0286442r567969q838972q441844q146893p362561p480220
$$ 212461712 201582977 191296535 181728566 172889594 164447750 156300857 148938296 141458076
3597A41458076p115578o880546o439295o115015n549630n258612m799392m341512
$$ 141458076 134342498 127461952 121022657 114907642 109358012 104099400 99300008 94958496
3589I4958496m019498l625953l366033k687360k482057k324641j926437j541395
$$ 94958496 90938998 87313045 83947012 81259652 78777595 76452954 74526517 72985122
3581G2985122j322532j262261j369676r04858j026981p99560n73696q83557r74868
$$ 72985122 71662590 70400329 69030653 68125795 67098814 66299254 65725558 64842001 63867133
3572F3867133o74070o07545p06821o10750m99296m09863m69056o64951m00675
$$ 63867133 63193063 62585518 61878697 61267947 60768651 60358788 59889732 59224781 58824106
3563E8824106m65438o44015p85713q49135j125591j318915j091439j295703j425727
$$ 58824106 58358668 57714653 56928940 56079805 54954214 53635299 52543860 51248157 49822430
3554D9822430j296092j364981j426977j467260j214571j332939j316938j197650
$$ 49822430 48526338 47161357 45734380 44267120 43052549 41719610 40402672 39205022
3546C9205022j277663j144766j519882j242209j454408j414111j280198j136196
$$ 39205022 37927359 36782593 35262711 34020502 32566094 31151983 29871785 28735589
3538B8735589j254073j220378q96316j029701j037271q04634p14194q58127o50885
$$ 28735589 27481516 26261138 25364822 24335121 23297850 22493216 21779022 20920895 20270010
3529B0270010n89610o25225o13654m42782m74873n58539p56962o70352l25881
$$ 20270010 19680400 19055175 18441521 17998739 17523866 16965327 16208365 15538013 15212132
3520A5212132j79619m19553l07037k40077k99790l09465k74214l27654l76177
$$ 15212132 15032513 14612960 14305923 14065846 13766056 13456591 13182377 12854723 12478546
3511A2478546j94116j81833m12321j60228k05197k55002l57110k60755J62282
$$ 12478546 12284430 12102597 11690276 11530048 11324851 11069849 10712739 10451984 10614266
3502A0614266k41104l50425l16785k68093j1223k8641j13917j93998j01893m1539
$$ 10614266 10373162 10022737 9705952 9437859 9426636 9397995 9284078 9090080 8988187 8946648
3492H946648m40087j19907k74125n4497j68138m32161J45023m5069j53997j21165
$$ 8946648 8506561 8386654 8112529 8058032 7889894 7457733 7602756 7557687 7403690 7282525
3482G282525J2059j47034l40065J74585N6768q2712j63914q7809r6046M2082r7013
$$ 7282525 7294584 7147550 6807485 6982070 7038838 6956126 6792212 6704403 6608357 6650439 6553426
3471F553426j29967j38193l3061j95318j03580r8445j77520j4051r1335J5792
$$ 6553426 6423459 6285266 6252205 6056887 5953307 5854862 5677342 5663291 5571956 5587748
3461E587748k5151j25629L9978J69744K8995J12424k04924n4653r6655J4123m2566
$$ 5587748 5562597 5436968 5476946 5646690 5675685 5788109 5583185 5528532 5431877 5446000 5403434
3450E403434M4614j25225l2564K9512M5024j07807j86505j4607L3311N4694O1374
$$ 5403434 5448048 5322823 5290259 5319771 5364795 5256988 5070483 5055876 5089187 5143881 5205255
3439E205255R9722J0238j91188N0828L06508J21403K10489O8255J3528J34341
$$ 5205255 5304977 5315215 5124027 5174855 5481363 5602766 5813255 5881510 5895038 6029379
3429F029379L35612K62118K18164K25166M27767K95224k57291j28286l11065n26951
$$ 6029379 6364991 6627109 6845273 7070439 7498206 7793430 7536139 7407853 7096788 6569837
3419F569837o34340l88109q8606k59114k46849j57741r7903j31404k5485Q764
$$ 6569837 5935497 5547388 5458782 5199668 4952819 4795078 4697175 4565771 4540286 4549050
3409D549050n6792m2999J3609j76080k16810o0750j84591j23516O8156K54512
$$ 4549050 4492258 4449259 4462868 4286788 4069978 4009228 3824637 3701121 3769277 4023789
3399D023789r0156m8585K52815j64759q0206r971Q1250j09206J03230n4347j61692
$$ 4023789 3933633 3885048 4137863 3973104 3892898 3882927 3964177 3854971 3958201 3903854 3742162
3388C742162K15739n7669O2867P6823q4507P9726J03369P723O4085N8387J04619
$$ 3742162 3957901 3900232 3963099 4039922 3955415 4035141 4138510 4146233 4210318 4268705 4373324
3377D373324K39762K42293l2584j5295J5066r5319N2755M7408J10377Q3614J7419
$$ 4373324 4613086 4855379 4822795 4807500 4822566 4727247 4780002 4827410 4937787 5021401 5038820
3366E038820J11892k2939M6866M25837J7217j9193J84073O0873J98669L4182L02532
$$ 5038820 5150712 5127773 5174639 5600476 5617693 5598500 5782573 5843446 6042115 6076297 6378829
3355F378829p8594n2695J19834J86770K96835N6667J16539O3983J79431P7021
$$ 6378829 6300235 6247540 6367374 6554144 6850979 6907646 7024185 7088168 7267599 7344620
3345G344620q0213n8816N4466K35446j7039J04090J76159q984j07430J39166K17003
$$ 7344620 7264407 7205591 7260057 7495503 7478464 7582554 7758713 7749729 7642299 7781465 7998468
3334G998468o728L24866O6005J17668R3891J7066p422k6981P3773j26139J85594
$$ 7998468 7991740 8316606 8382611 8500279 8594170 8611236 8603814 8576833 8650606 8524467 8710061
3323H710061P5686j18583N5650J13328K9760N2287K03612l26N208P1497J56430
$$ 8710061 8785747 8667164 8722814 8836142 8865902 8918189 9121801 9121475 9126683 9198180 9354610
3312I354610K69265O4899J96582J82922K73846J97956J32995M67012J24174J82618
$$ 9354610 9623875 9688774 9885356 10068278 10342124 10540080 10673075 11140087 11264261 11446879
3302A1446879M73127K90369K66676K59108R2542K13322O23816N63838K47378N73049
$$ 11446879 11920006 12210375 12477051 12736159 12828701 13042023 13665839 14229677 14477055 15050104
3292A5050104N35475O59675P24512M42570P57116Q51434R43599P12592Q07942
$$ 15050104 15585579 16245254 16969766 17412336 18169452 19020886 19964485 20677077 21485019
3283B1485019P00573M95825O39664N8375r6801m4522l47665m73797n46664n87614
$$ 21485019 22185592 22681417 23321081 23379456 23282655 23238133 22890468 22416671 21870007 21282393
3273B1282393q27399p04532o52196o83580m73171o08378p93100n40779n59215
$$ 21282393 20454994 19750462 19098266 18414686 17941515 17333137 16540037 15999258 15440043
3264A5440043r65893n14122o28082p15122o39134n93145n80344l95716m78848
$$ 15440043 14474150 13960028 13331946 12616824 11977690 11384545 10804201 10408485 9929637
3255I929637l23121l67194m45329n15903l59040r1044l45844m04711m74993n3033
$$ 9929637 9606516 9239322 8793993 8278090 7919050 7828006 7482162 7077451 6602458 6549425
3245F549425j28846k65087j54919j98833l03567k04480k56269j79582m5595j73812
$$ 6549425 6420579 6155492 6000573 5801740 5498173 5293693 5037424 4857842 4812247 4638435
3235D638435n6052j55196l0608n6787j26845j12758j92562j61328j56435L0451
$$ 4638435 4582383 4427187 4396579 4339792 4212947 4100189 3907627 3746299 3589864 3620315
3225C620315r5625k11381R0562m4718j95533l34858O3552J05508j02567l8425
$$ 3620315 3524690 3313309 3403871 3359153 3163620 2828762 2892314 2997822 2895255 2856830
3215B856830k40613o8996j633r6325j88937p461j7374Q391m349j31015O5129m9495
$$ 2856830 2616217 2547221 2545588 2449263 2260326 2252865 2235491 2243882 2239533 2108518 2173647 2124152
3203B124152j26969k11693j9809J62841P1267k26554J46543o9052j84001J15364
$$ 2124152 1997183 1785490 1765681 1928522 1999789 1773235 1919778 1850726 1666725 1782089
3193A782089P468M4889k26967p1300L5035J08802k41677J5406j79248J04262J7471
$$ 1782089 1789557 1834446 1607479 1536179 1571214 1680016 1438339 1453745 1274497 1378759 1396230
3182A396230l8454M858J11317J51592j69425k12245M6086N7307m7960j37616k04829
$$ 1396230 1357776 1362634 1473951 1625543 1456118 1243873 1289959 1347266 1299306 1161690 956861
3171I56861K13899j03165R8678J67941j59927m8802j8572j00301j08081J10467
$$ 956861 1170760 1067595 1166273 1334214 1174287 1125485 1106913 1006612 898531 1008998
3161A008998k203P486k08657q6113J65950J04610j47690J1886J9513j17493p0444
$$ 1008998 1006795 1014281 805624 719511 885461 990071 842381 854267 873780 756287 685843
3150F85843M5930J57111l2215J70144J2144j00750j22512m8039J11475R6661M5094
$$ 685843 731773 888884 856669 1026813 1038957 938207 815695 767656 879131 975792 1020886
3139A020886k89921n2166Q1573j32339o8713M6394K11440R8258J5387j97528j59232
$$ 1020886 730965 678799 760372 628033 559320 605714 817154 915412 930799 733271 574039
3128E74039J76775K4255n0165q0019j0076N5277K5617l1974R2280k3143j36160
$$ 574039 750814 775069 724904 644885 634809 690086 715703 683729 776009 752866 616706
3117F16706K26239M5233j6675n7297j51Q8862k88704k3124J36461j60975O2906
$$ 616706 842945 888178 871503 814206 814055 902917 614213 591089 727550 566575 629481
3106F29481P0808j07499k3785N4408P7071L5483R0037N9132n0175p5936P4375
$$ 629481 700289 592790 569005 623413 700484 735967 826004 885136 834961 759025 833400
3095H33400J23735k43256j4653j02660K13816k6749k926n4722M500l8019M8129
$$ 833400 957135 713879 699226 596566 810382 783633 780707 725985 730485 692466 740595
3084G40595L7192J6287j79669K19115n5165L489J56754m5502j97507j68260J44602
$$ 740595 777787 794074 614405 833520 778355 781844 938598 893096 695589 527329 671931
3073F71931J83056j15413n7188N5653j94481K28351l1863J04845n1250N8034j37579
$$ 671931 854987 739574 682386 738039 543558 771909 740046 844891 793641 851675 714096
3062G14096N7498J10814j61422R665m7328J04475J60883k76340J75621J76179
$$ 714096 771594 882408 720986 730651 683323 787798 948681 672341 847962 1024141
3052A024141k00846O2535K49758j06814P1711J22131L8517k5662j21986N0327
$$ 1024141 823295 885830 1135588 1028774 1100485 1222616 1261133 1235471 1113485 1163812
3042A163812k7700q9411J44642r6295m5690J360J65968j70069P2016J06745M9456
$$ 1163812 1136112 1046701 1191343 1095048 1049358 1050718 1216686 1046617 1118633 1225378 1274834
3031A274834K77682j29090k35223J21819K36195k43027J08919P9722J25347K30974
$$ 1274834 1552516 1423426 1188203 1310022 1546217 1303190 1412109 1491831 1617178 1848152
3021A848152o4675j6173M110k17849N7624L37914j62657j11743j5861N4064o0520
$$ 1848152 1783477 1767304 1771414 1553565 1611189 1949103 1786446 1674703 1658842 1712906 1652386
3010A652386j08563J27175J95555J76369j69143J58068J16005P7240M1127J1411
$$ 1652386 1543823 1670998 1866553 2042922 1873779 2031847 2147852 2225092 2266219 2277630
3000B277630L1407R3638L781J06080Q7695J22430P5414N2838L4069Q3196J8885
$$ 2277630 2309037 2402675 2406456 2512536 2600231 2722661 2798075 2850913 2884982 2968178 2987063
2989B987063M3376j19834J15606J33849M5873R4910L24206J23203M0545l0271
$$ 2987063 3030439 2910605 3026211 3160060 3205933 3300843 3625049 3748252 3788797 3758526
2979C758526L42680R7645q9125J20997J28406J51991K55818L99781K94656L03271
$$ 3758526 4101206 4198851 4109726 4230723 4359129 4511120 4766938 5166719 5461375 5764646
2969E764646L83098L44778J18128N87021J52402M45152L14510K54580K79846Q7126
$$ 5764646 6147744 6492522 6610650 7197671 7350073 7795225 8109735 8364315 8644161 8731287
2959H731287J12957K08732m5364Q5628Q5060K6289k7811N4271O2264O1921N3944
$$ 8731287 8844244 9052976 9007612 9093240 9178300 9204589 9176778 9231049 9293313 9355234 9409178
2948I409178R1606J80488o6278J5403N80292K35256K33998K86215L18304L80236
$$ 9409178 9500784 9681272 9614994 9630397 10210689 10445945 10679943 10966158 11284462 11664698
2938A1664698M11497P20997Q49985N51112N68409P13716M59580K49799n94775
$$ 11664698 12076195 12797192 13647177 14198289 14766698 15480414 15939994 16189793 15595018
2929A5595018j189008j028966q42263q86078o91635o31110m82872m63442l70668
$$ 15595018 14406010 13377044 12534781 11648703 10957068 10325958 9843086 9379644 9008976
2920I008976l87124l06567k06892k74887K8447k77872q1122m5284K12729K67325
$$ 9008976 8621852 8315285 8108393 7833506 7861953 7584081 7502959 7457675 7670404 7937729
2910G937729k83549o4711m8433J62783j4629L28111J35543k07060J15686r6838
$$ 7937729 7654180 7589469 7541036 7703819 7689190 8017301 8152844 7945784 8061470 7964632
2900G964632l91799l49676j86235l13027m72585m66492n47912k48127j00265l28846
$$ 7964632 7572833 7223157 7036922 6723895 6251310 5784818 5236906 4988779 4888514 4559668
2890D559668j91267k99280r7642k31024j86974j34707j49650j58109j96193M5657
$$ 4559668 4368401 4069121 3971479 3740455 3553481 3418774 3269124 3111015 2914822 2960479
2880B960479p3860r4188j13042j12047j8582n7744j47838j22894k8508k49659
$$ 2960479 2886619 2792431 2679389 2567342 2548760 2491016 2343178 2220284 2191776 1942117
2870A942117J7637K1192m3829L0116k66866k22845J3583l3142k04535l4069k43298
$$ 1942117 1959754 1980946 1937117 1967233 1700367 1477522 1491105 1457963 1253428 1219359 976061
2859I76061J18607q2420N3443M2677J62763j94726P3071Q479R5719j21619k40780
$$ 976061 1094668 1012248 1065691 1108368 1271131 1076405 1149476 1157955 1253674 1132055 891275
2848H91275j08968j05084o8043J22484K00725k3354k04941j7274m2177j14203
$$ 891275 782307 677223 609180 731664 932389 909035 704094 686820 644643 530440
2838E30440O7128O6490k8744j347j39914R0604K9987J25530r3122j22114M359
$$ 530440 597568 664058 635314 633967 494053 584657 614644 740174 647052 524938 529297
2827E29297j10887K8348j76068J07226j43445J7515K8939M6835r0047K38413j77944
$$ 529297 418410 446758 270690 377916 234471 251986 280925 327760 237713 476126 298182
2816B98182k5347k6803o7489J97922k58485j8179L28999j82119O6853l8183n2204
$$ 298182 272835 246032 178543 376465 117980 99801 428800 246681 313534 275351 223147
2805B23147Q2894M9658j18234p205j78382P1069M1832j1740J06702r6899L6185
$$ 223147 306041 355699 237465 230260 51878 122947 164779 153039 259741 162842 199027
2794A99027p5802j38978M3763n9079m1521O5773r7754k4202L5686J02431P5857
$$ 199027 123225 -15753 28010 -31069 -72590 -6817 -104571 -128773 -93087 9344 85201
2783H5201j97665J0681J28492J23354j39600j6637L4242R7361j71089m027L1811
$$ 85201 -112464 -101783 26709 150063 10463 -6174 28068 125429 -45660 -49687 -17876
2772a7876j25461J04851M8019K25780n5848n4033l06991j01739j80115J80763
$$ -17876 -143337 -38486 9533 235313 179465 125432 -181559 -283298 -463413 -282650
2762b82650K84675m7075J82491j24191j9156J4502j79629n3075J49402K14327
$$ -282650 2025 -45050 137441 13250 -5906 8596 -171033 -224108 -74706 139621
2752A39621J5469m9924l8479j3793q4524O9370J1762j1959j80265P5774N7862
$$ 139621 155090 105166 66687 52894 -31630 37740 49502 37543 -142722 -66948 -9086
2741i086j5345o4958k0354J11452r2863p8467M3397r7111P0769J06321k6788j01271
$$ -9086 -24431 -89389 -109743 1709 -91154 -169621 -126224 -223335 -152566 -46245 -73033 -174304
2729a74304R1391P1374r8979J13557Q3295M4185k78335O4816K02051r373k05559
$$ -174304 -82913 -11539 -110518 3039 86334 130519 -147816 -83000 119051 109678 -95881
2718i5881j07070Q3123q5232J32424J35297q2020q0524L3770k6092n3125K62341
$$ -95881 -202951 -119828 -205060 -72636 62661 -19359 -99883 -66113 -92205 -145330 117011
2707A17011J09109k57009j39148p715O5163l7873J96441m3650j35869Q6220j24235
$$ 117011 226120 -30889 -170037 -177752 -112589 -150462 45979 2329 -133540 -47320 -171555
2696a71555L32037J62382p6945k33336J57J01429j59789m806j6032K0038L7485
$$ -171555 160482 322864 245919 12583 12740 114169 -45620 -50426 -66458 -46420 -8935
2685h935J85038l0849p7399j60247j29883J59153M4888N2267j35034j23776M3214
$$ -8935 176103 145254 67855 -92392 -222275 -63122 -18234 34033 -101001 -224777 -181563
2674a81563J81417J44034j59114o4598m6126J21204L8996J7410K8280r8585O016
$$ -181563 -146 143888 -15226 -79824 -125950 -4746 34250 51660 79940 -18645 -12629
2663a2629J15518k44826m1175K67035m483J3804o2000m9187k5622p2943M9339
$$ -12629 102889 -141937 -183112 83923 79440 93244 31244 -17943 -43565 -116508 -67169
2652f7169N7145m890j25408l4166J59586L9292l7963k2218j4484J40122j71450
$$ -67169 -10024 -14914 -140322 -174488 -14902 24390 -13573 -35791 -50275 89847 -81603
2641h1603Q9413J9359R908Q2302k22511O4627k2553J35098Q5005r0543j5143K31602
$$ -81603 7810 27169 37077 119379 -103132 -38505 -61058 74040 159045 68502 53359 284961
2629B84961j92430J7842p574k49717j32523M9943R4532n4318n4672K07066J8984
$$ 284961 92531 110373 102799 -146918 -279441 -229498 -134966 -189284 -243956 -36890 -17906
2618a7906p1607K48795K7915j10593r5325J50663n1115R6193k87834m933K2529
$$ -17906 -89513 159282 187197 76604 -18721 131942 80827 177020 -110814 -115747 -93218
2607i3218p7707j5758j11868J45841L3887j5246K57J7595m4552p2391L7022J62247
$$ -93218 -170925 -186683 -298551 -152710 -118823 -134069 -133812 -116217 -160769 -233160 -196138 -33891
2595c3891J65546j30299j19091q0833L6949K38853L5072k42066j48787J77078
$$ -33891 131655 1356 -117735 -198568 -161619 77234 112306 -129760 -278547 -101469
2585a01469J29272k27952j04876M2278J10465J92534o4143n3551J14731n6723
$$ -101469 27803 -200149 -305025 -262747 -152282 40252 -23891 -77442 37289 -19434
2575a9434j57126K47215J1714r4881j70522J27926n2878m7294L3909r2973R4119
$$ -19434 -176560 70655 82369 -12512 -183034 -55108 -107986 -155280 -121371 -214344 -120225
2564a20225j8836q4022R3927J9856k7048j42156L41780L2666k9527n8645j36492
$$ -120225 -139061 -223083 -129156 -109300 -136348 -278504 63276 95942 66415 7770 -128722
2553a28722j05090J11772P4870j48064R890j6250N4973O4005p5366P9140J83127
$$ -128722 -233812 -122040 -47170 -195234 -185344 -201594 -146621 -82616 -157982 -78842 104285
2542A04285k55265J289o1723l1854J20949K7044J1689J2971J178K1523j78510
$$ 104285 -150980 -149691 -211414 -243268 -122319 -95275 -83586 -70615 -69437 -47914 -226424
2531b26424q0475J18584J5558K18125n4709j68801L04805j62206j45835J13618
$$ -226424 -306899 -188315 -172757 45368 -9341 -178142 126663 -35543 -181378 -67760
2521f7760p0644J05199K2816q9233L7214J07526l1610j62288P5662k523l1838
$$ -67760 -138404 -33205 -10389 -99622 -62408 45118 13508 -148780 -73118 -75641 -107479
2510a07479K1893R4716n1627J08264k5420o5067j17120m52j49604o1088L00763
$$ -107479 -85586 9130 -42497 65767 40347 -24720 -141840 -142292 -291896 -352984 -52221
2499e2221O7038k9033J1697k0596n4919P8049o4579m2345m2938M5754O1460J11898
$$ -52221 14817 -14216 -2519 -23115 -78034 15 -64564 -106909 -149847 -104093 -42633 69265
2487F9265K2238l07411j53953R0230J13009o067Q5154m1293q6194J28898J65419
$$ 69265 91503 -215908 -369861 -279631 -166622 -172689 -87535 -128828 -215022 -86124 79295
2476G9295p4818O4413p4775l8157j31443R6829m3794o3801o1575n5013J4377J4871
$$ 79295 4477 68890 -5885 -44042 -175485 -78656 -122450 -186251 -247826 -302839 -288462 -273591
2464b73591P4173j15050K3823K8874L6747j53983K83399J42532r5853j95664N4861
$$ -273591 -199418 -314468 -290645 -261771 -225024 -379007 -95608 46924 -48929 -244593 -189732
2453a89732J21611L819J81704M5921p3370k24622N4521J66455q0337j33568J88255
$$ -189732 -68121 -64302 117402 163323 89953 -134669 -80148 86307 5970 -127598 60657
2442F0657J0674m7795K7017j85770K6655N5155j28670k6152K02321K02795j8439
$$ 60657 71331 23536 50553 -135217 -108562 -53407 -182077 -208229 -5908 196887 178448
2431A78448M2145l8828j55937J45233j46099J19706m0704j34856L1162j7766L5168
$$ 178448 220593 181765 25828 171061 24962 144668 103964 -30892 270 -17496 17672
2420A7672N2677J2777J16312L6863k01310m4054J05744Q421r2579l3985J84136
$$ 17672 70349 83126 199438 236301 34991 -9063 96681 105102 12523 -21462 162674
2409A62674l1501j05815k2925l1905K18115J05297m6430M007Q5012R1808J60928
$$ 162674 131173 25358 2433 -29472 188643 293940 247510 251517 336529 428337 589265
2398E89265j04905j27620p9892p093R9811j87281m2058j21302N0181J22585R203
$$ 589265 484360 356740 276848 269755 369566 182285 140227 18925 69106 191691 200894
2387B00894l72097M8510O912j9424J74096R7208j41128P6556j9444j50384P0961
$$ 200894 -171203 -122693 -115781 -135205 38891 136099 -5029 71527 52083 -98301 -27340
2376b7340O1459m8373j40067Q5586K59637o4334j7637Q8355j69926J61249m3039
$$ -27340 34119 -14254 -154321 -68735 190902 126568 108931 197286 27360 188609 145570
2365A45570j0672J86106p9941k20802Q1783j6965P0451m1572j88640N2669K93527
$$ 145570 134898 321004 241063 20261 102044 85079 155530 113958 -74682 -22013 271514
2354B71514p8214r2322K82262l9759m3517q5388k38302O6944J12226J14275m0620
$$ 271514 193300 100978 383240 343481 299964 214576 -23726 43218 155444 269719 229099
2343B29099m80j59218m7153N476Q762k9621J96600J076j89087J5494l9885k4092
$$ 229099 228619 69401 22248 27724 36486 6865 203465 204541 15454 30948 -8937 -33029
2331c3029P3394J09092J24906j32339K34541J28786k42671p334j45265J90324
$$ -33029 40365 149457 274363 142024 376565 505351 262680 255346 110081 300405
2321C00405K50169j14776p3623k9007j66563r1659J72951j97371j7054J85392
$$ 300405 550574 435798 362175 333168 166605 74946 247897 50526 33472 218864
2311B18864Q4357O4483p812L1999k9402j03984p9793o7322K81876L585R2500j02033
$$ 218864 303221 367704 359892 391891 362489 258505 178712 111390 393266 396851 489351 387318
2299C87318j8646j05420r7346J59643j02801j1397j82908K53569J96043k19214
$$ 387318 368672 263252 165906 325549 222748 211351 28443 282012 478055 258841
2289B58841m0673r7632j2368p947Q5606J64712K26844l5533n0009L3188n0395
$$ 258841 218168 120536 108168 100221 185827 350539 577383 541850 491841 525029 474634
2278D74634l2804k84370J51255O0743k1504R027O6334p9936P3930K9531J43823
$$ 474634 441830 157460 308715 369458 347954 356981 423315 343379 417309 446840 590663
2267E90663j11811p7542J02201M8346j4580m7669J55759J53925p9068K5584M9308
$$ 590663 478852 401310 503511 551857 537277 489608 645367 799292 720224 745808 795116
2256G95116k9429m0258J22955q6422j06290q8629K19182o5850O1987O9188n0737
$$ 795116 765687 725429 848384 761962 655672 567043 786225 720375 782362 851550 800813
2245H00813Q2175O6868j46435j12478K40170m0397j25199L3047O8663P7940N8933
$$ 800813 882988 949856 803421 690943 931113 890716 765517 798564 867227 945167 1004100
2234A004100j33519J20987K93821j35453J51340J20813L7637j07564k19401K26360
$$ 1004100 870581 991568 1285389 1149936 1301276 1422089 1459726 1352162 1132761 1359121
2224A359121K97056k8444j09481k8517p3215m0421M4308K12372l514K19259K01467
$$ 1359121 1656177 1627733 1518252 1489735 1416520 1376099 1420407 1632779 1629265 1848524 2049991
2213B049991j7644O2546R7097j36655J78122m5158j9706J605j9365O3933K55912
$$ 2049991 2032347 2094893 2191990 2055335 2233457 2188299 2168593 2170198 2150833 2214766 2470678
2202B470678K14252O8836M9409j7339l6852N8521P9750N1012K07691Q9466J42515
$$ 2470678 2684930 2753766 2803175 2785836 2748984 2807505 2887255 2938267 3145958 3235424 3377939
2191C377939O8869q8181J28781K69663M1849J58301k9547Q8752K70889n2294M269
$$ 3377939 3446808 3358627 3487408 3757071 3798920 3957221 3927674 4016426 4287315 4235021 4239290
2180D239290L87385P9570Q3912K95830J38471J09614J46329J18234l7998M18160
$$ 4239290 4626675 4706245 4790157 5085987 5224458 5334072 5480401 5598635 5560637 5978797
2170E978797J77454J96387M64823L80690K11924L70499O2314M39523J78770M28160
$$ 5978797 6156251 6352638 6817461 7198151 7410075 7780574 7842888 8282411 8461181 8889341
2160H889341P63735L09503N32589N78724N92147N26745P10734Q90470M90274J015115
$$ 8889341 9653076 9962579 10495168 11073892 11666039 12192784 12903518 13793988 14284262 15299377
2150A5299377J125498J081712J407950J387019J266087J226164J394197J719686
$$ 15299377 16424875 17506587 18914537 20301556 21567643 22793807 24188004 25907690
2142B5907690K162485K855080L318605L898636N228609N979784P403937P921518
$$ 25907690 28070175 30925255 34243860 38142496 43371105 49350889 56754826 64676344
2134F4676344P225132Q613743P737434J720410n422745j1537060j2383758j0741529
$$ 64676344 71901476 80515219 88252653 89973063 84550318 73013258 60629500 49887971
2126D9887971q107204o010440m517053l682826k899256k116301j778801j536071
$$ 49887971 41780767 35770327 31253274 27570448 24671192 22554891 20776090 19240019
2118A9240019j548090j171471j142485q40938j240676j118636p40840o47857m42503
$$ 19240019 17691929 16520458 15377973 14537035 13296359 12177723 11436883 10789026 10346523
2109A0346523p65691o31766m65060n85641k85114m24613l95957l41595k92616
$$ 10346523 9580832 8949066 8484006 7898365 7613251 7188638 6792681 6451086 6158470
2100F158470k23572m26260j91180m65520l20243o7887j40842j27945j08898k13179
$$ 6158470 5934898 5508638 5317458 4851938 4531695 4463808 4322966 4195021 4086123 3872944
2090C872944k61350q3211k11415p733l9426k92054j06418J4770j40274L3765k61221
$$ 3872944 3611594 3528383 3316968 3309235 3269809 2977755 2871337 2886107 2745833 2779598 2518377
2079B518377Q9391o5763j64377R81r8687K36293q4398L5712j40680l5990J7109
$$ 2518377 2607768 2542005 2377628 2378609 2279922 2516215 2431817 2467529 2326849 2290859 2307968
2068B307968j29858j59994J9458j62711j23993j75169j68093K31853m8201k09137
$$ 2307968 2178110 2018116 2037574 1874863 1750870 1575701 1407608 1639461 1591260 1382123
2058A382123j67272J95732j37856j27253l5080P2264p7461o1621l6881J07576
$$ 1382123 1214851 1410583 1272727 1145474 1110394 1182658 1105197 1043576 1006695 1114271
2048A114271n2564o7148p0137p9717j41380o187p3551M0279J90590j99964q7201
$$ 1114271 1061707 994559 924422 844705 703325 697138 623587 663866 854456 654492 567291
2037E67291q9144O3653J05047n6651J26002J84443k07636k44581L5976N5466k4081
$$ 567291 478147 541800 646847 590196 716198 900641 693005 448424 484400 539866 515785
2026E15785j1992j2420J12015O6949P1682j59630k5254j8805J54454n0633k07643
$$ 515785 503793 491373 603388 670337 742019 582389 557135 538330 692784 642151 434508
2015D34508m0117K1133j81463N394n2603Q0950O3049k5843J3278k41o1545n0079
$$ 434508 394391 415524 234061 239455 186852 267802 330851 305008 318286 318045 256500 206421
2003B06421r3140r747N5818J37377J42161j29552J76880J27788j88950k17952
$$ 206421 113281 103534 159352 296729 438890 309338 486218 614006 425056 207104
1993B07104j57292o3485J59244J67679j04478Q3030n4216J71288K802k90215J69373
$$ 207104 49812 -13673 145571 313250 208772 291802 237586 408874 411676 121461 290834
1982B90834P644k61940j61109R599J87082J76021J76079R8317j60467k58066k1887
$$ 290834 298478 36538 -124571 -114972 72110 248131 424210 522527 362060 103994 82107
1971H2107P5123l9397J23340q6959R2640k70892l521j25971L9270J41981Q7415
$$ 82107 157230 117833 241173 154214 246854 -24038 -27559 -153530 -114260 27721 115136
1960A15136j60445J48351L7332K4482j12797r2251Q5736j1802O1363p3919R0206
$$ 115136 -45309 103042 140374 164856 52059 -40192 45544 33742 95105 21186 111392
1949A11392j59648R4242o4883R6472Q759P5805O1560R4454J38912r4863R324k01200
$$ 111392 -48256 45986 -18897 77575 86334 162139 223699 318153 457065 362202 371526 170326
1937A70326p6908J23568M5713j2895j79304k4600N3015N5513M5612o6752j80845
$$ 170326 93418 216986 262699 249804 70500 45900 98915 154428 200040 133288 -47557
1926d7557K25769J25121K9509n0853l04460j08445P8764J37723J60751j7714j4383
$$ -47557 178212 303333 332842 281989 -22471 -130916 -52152 85571 246322 228608 214225
1915B14225r0685M3455L1174j64571J22402p9253o8763l9924l5293o2786r0676
$$ 214225 123540 166995 198169 33598 156000 76747 7984 -31940 -67233 -130019 -220695
1904b20695O1277p817J56590r3281L4201J17448j2990r4044q3994N8601j976Q0464
$$ -220695 -159418 -167235 -10645 -103926 -69725 47723 34733 -59311 -143305 -84704 -86680 -6216
1892f216P1450N2619r6147J90565M2327L661j64250l26980R1107J63781Q7197
$$ -6216 65234 117853 21706 212271 254598 258259 94009 -232971 -141864 21917 109114
1881A09114J37569m9610m9090j82228J56973j0452m8385K7901n6592J20354R1501
$$ 109114 246683 197073 147983 -34245 122728 112276 63891 91792 35200 155554 247055
1870B47055o5149L2546l0081J56208j20252j04718J88401j3160L8752J88935q6194
$$ 247055 181906 214452 184371 340579 220327 115609 304010 290850 329602 518537 432343
1859D32343O5003j33974Q0922J04381k56291r849j39594O1425l8673o5370p4169
$$ 432343 497346 363372 444294 548675 292384 282535 142941 204366 165693 100323 26154
1848B6154J07236N9661q1795J1866J10781j68320p6223r0479j20523k683J0123
$$ 26154 133390 193051 111256 123122 233903 65583 -10640 -101119 -221642 -224325 -214202
1837b14202k13761M0796J60189R6862p2331J55518P0195k4706k1893n2051k02560
$$ -214202 -427963 -387167 -226978 -130116 -202447 -46929 23266 -1440 -23333 -75384 -277944
1826b77944O5326K15168p6123n0791O2279k74737J51388M8633m8755K12932J7732
$$ -277944 -212618 2550 -73573 -124364 -62085 -336822 -185434 -136801 -185556 27376 45108
1815D5108o3747N8013j02583k25445K5285K1402j53032J59864K84234K2677L1572
$$ 45108 -18639 39374 -63209 -288654 -263369 -241967 -394999 -235135 49099 71776 103348
1804A03348J28561j30841l19503J54057O2998q1203L6860J31085k55523j33161
$$ 103348 231909 101068 -218435 -64378 -1380 -82583 -45723 85362 -170161 -303322
1794c03322R8104R2198J91679M4725J5526l8913j62239L8700K0690q9469J26031
$$ -303322 -205218 -113020 78659 123384 138910 99997 -62242 -23542 -2852 -92321 33710
1783C3710J02661j31733p166j6801O156o5424J50412l1369m0329J32952k57171
$$ 33710 136371 4638 -2528 -19329 -13173 -78597 71815 40446 117 133069 -124102
1772a24102l2209R7270N1206j00355J18689J46722k39373j22452M5232K6165K3649
$$ -124102 -156311 -59041 -7835 -108190 10499 157221 -82152 -204604 -159372 -133207 -109558
1761a09558Q725J3637l9198J68017k16514j83466J31358r5837M4891M9792o5841
$$ -109558 -100833 -87196 -126394 41623 -174891 -358357 -226999 -322836 -277945 -228153 -293994
1750b93994j1979J12237j93632Q9497K07281J71353j16105j7274K6791J58571
$$ -293994 -305973 -193736 -387368 -297871 -90590 80763 -35342 -52616 -25825 132746
1740A32746q6831m2585n8004k57765N7894J57218K1412j1878q9871m0260J13419
$$ 132746 45915 3330 -54674 -312439 -254545 -97327 -75915 -87793 -177664 -217924 -104505
1729a04505L4053k48924J41786J68435r8898j27329n623R6059J80544n340j07138
$$ -104505 -70452 -319376 -177590 -9155 -108053 -235382 -241005 -144946 35598 30258 -76880
1718g6880j25483j62590J83066P2405L5638o3690j24738K05889M320O6525M4415
$$ -76880 -202363 -364953 -181887 -109482 -73844 -137534 -262272 -56383 -52063 14462 58877
1707E8877r7589j11503j15779J10202J33162q5823L4352L9563k524M7758Q8999
$$ 58877 -38712 -150215 -265994 -155792 -22630 -108453 -74101 -34538 -37062 10696 99695
1696I9695J1419k5939r0607k43193J01635J11723p6868j15363P6373K1573N6566
$$ 99695 111114 85175 -5432 -248625 -146990 -35267 -112135 -227498 -151125 -129552 -72986
1685g2986j52044J14873R8390j8084P1974m7119m1453r5437m697J47135Q0035
$$ -72986 -225030 -110157 -11767 -29851 42123 -4996 -46449 -141886 -146583 552 80587
1674H0587J19161j70926l9067q2586p1106q0982m1984N1049J7102O6308n9011
$$ 80587 199748 28822 -10245 -92831 -163937 -244919 -286903 -235854 -218752 -152444 -211455
1663b11455j60286J9637M0695L2076j52461K37806J5530R7294L8611k1361j12570
$$ -211455 -371741 -352104 -311409 -279333 -431794 -193988 -178458 -81164 -42553 -63914 -176484
1652a76484J5248l4641J82279K4233j48910J12315N4465l6199Q567O6481q6895
$$ -176484 -161236 -195877 -13598 10635 -138275 -25960 28505 -7694 873 67354 -19541
1641a9541n1481r262r121P2102j5988j93956n5640J76061j9638k9629J94349L4204
$$ -19541 -71022 -80284 -89405 -17303 -33291 -227247 -282887 -106826 -126464 -156093 38256 72460
1629G2460L8683j73052m8097l08096K34714O6066N5366J22875j38561l935o2118
$$ 72460 111143 -61909 -110006 -418102 -183388 -117322 -61956 60919 -77642 -81577 -143695
1618a43695Q8982J44956o0455k8300J8602O2722j57782j38658Q9293K45240N2067
$$ -143695 -54713 90243 29788 1488 20090 82812 -74970 -213628 -124335 120905 172972
1607A72972j75305r1681p7721J2934m0607k5882j3338K0356K9293J68766J08807
$$ 172972 -2333 -94014 -171735 -158801 -199408 -225290 -238628 -218272 -188979 -20213 88594
1596H8594j56867p8678k53458J97751J39691J14166J14444k16612q2951M3338
$$ 88594 -68273 -146951 -400409 -202658 -62967 51199 165643 -50969 -133920 -90582
1586i0582j46099j7829K16675N9139M2164q5305L2038N5587L16j05739j27581
$$ -90582 -236681 -254510 -37835 21304 63468 -21837 10201 65788 66104 -39635 -167216
1575a67216L8837l3843J61642R55o5907j49338r0833M2774J27629j34391k4257
$$ -167216 -128379 -162222 -580 375 -65532 -214870 -305703 -262929 -135300 -269691 -293948
1564b93948j2507N9749K12447J1867l6272J3471R4642K2721j22767k8710n6898
$$ -293948 -306455 -246706 -34259 -22392 -58664 -45193 49449 72170 -50597 -79307 -136205
1553a36205n231m9486j1329Q3230p7057j2628J24176N5644j57617r008J52722
$$ -136205 -141436 -190922 -202251 -119021 -196078 -208706 -84530 -28886 -186503 -195511 -42789
1542d2789j28695N9108P8653P1030J42996n1103o9255k00741j30162L40588j27387
$$ -42789 -171484 -112376 -33723 37307 180303 129200 59945 -140796 -270958 69630 -57757
1531e7757k12238J85429j96799Q7556K2273J60755j53266p1419o439J34630k2880
$$ -57757 -269995 -84566 -281365 -193809 -171536 -10781 -164047 -235466 -241905 -107275 -130155
1520a30155J30329k1698l379o1755k5629J00697L2358J41689O8888j56775j7168
$$ -130155 174 -21524 -24903 -86658 -112287 -11590 20768 162457 231345 74570 57402
1509E7402Q797k80980J81985J41278p6811k8674l1442Q4641j43340j02032J40044
$$ 57402 66199 -214781 -32796 108482 31671 2997 -28445 56196 -87144 -189176 -49132
1498d9132m4917m531J5619R817O8706j55479k07382J1696J63865J409N0802r491
$$ -49132 -94049 -98580 -82961 -73144 -4438 -159917 -367299 -355603 -191738 -190329 -139527 -149018
1486a49018r307j2686k5992o3R9783L8177L0317k5126k30952J01966o2037n8737
$$ -149018 -158325 -171011 -197003 -197066 -97283 -59106 -28789 -53915 -284867 -182901 -244938 -303675
1474c03675J08645K19005O4554j27910o9687M5246j31554j02934k3695L4530N8460
$$ -303675 -195030 23975 88529 -39381 -109068 -63822 -195376 -298310 -322005 -287475 -229015
1463b29015M4950J2128o8635J89609J18517q1099j15583N1837J10260r7102N6702
$$ -229015 -184065 -171937 -240572 -50963 67554 -13545 -129128 -77291 32969 -64133 -7431
1452g431J6581k03867J16762j9915l7604J8927J35579M6151k31325j09845P8248
$$ -7431 9150 -194717 -77955 -97870 -135474 -116547 19032 65183 -166142 -275987 -197739
1441a97739L0522O0301J38369j41620L1772J622J36699k9786J7535L2511p7290
$$ -197739 -167217 -106916 31453 -110167 -78395 -76773 59926 30140 47675 80186 2896
1430B896p9397k3477q7176q7943Q0023P1664J6938j52195J05062k2742O3022m7232
$$ 2896 -76501 -99978 -187154 -275097 -195074 -123410 -106472 -258667 -153605 -176347 -113325 -160557
1418a60557k28543J39428P6909k114R5394j9410O7176j51140j11810J20461j31793
$$ -160557 -389100 -249672 -172763 -174877 -79483 -98893 -31717 -182857 -294667 -174206 -305999
1407c05999N2297K38367j39976n5005J92061j85283R0772J57627q9701r0109n3491
$$ -305999 -253702 -15335 -155311 -210316 -18255 -203538 -112766 44861 -44840 -134949 -188440
1396a88440O919J62410j31844J52122Q4506L5049k34330j9558O7017J15258j77454
$$ -188440 -181521 -19111 -150955 1167 85673 120722 -113608 -133166 -66149 49109 -128345
1385a28345n9972j6309j20596K65690J25045O6642k0683M7172l69878j19662K57713
$$ -128345 -188317 -204626 -325222 -59532 65513 132155 111472 158644 -211234 -330896 -73183
1374g3183J38899k39919O935J60310N6423J32871o7712k44652j19620o6992m4346
$$ -73183 65716 -174203 -167268 -6958 49465 182336 114624 -130028 -249648 -316640 -360986
1363c60986J25792L5825M2824M6566O6631k6830n7727J33189r5490N0011J39009
$$ -360986 -235194 -199369 -156545 -109979 -43348 -70178 -127905 5284 -90206 -40195 98814
1352I8814j05798m8696M190j50454J62478o4121j34672N2740J95874k1844j83978
$$ 98814 -6984 -55680 -51490 -201944 -39466 -103587 -238259 -185519 10355 -11489 -195467
1341a95467l7755q6030j5634J39473K00647L7065k1367J8432j1599J27265k7959
$$ -195467 -233222 -319252 -334886 -195413 5234 42299 20932 39364 27765 155030 127071
1330A27071j38580k92134j9837o5784J52273j24195J45816Q1076k18884J56314
$$ 127071 -11509 -303643 -323480 -389264 -236991 -361186 -215370 -134294 -353178 -196864
1320a96864N2298R7715j14513J76349m734k01130L5952M3165J09875m4134j13180
$$ -196864 -144566 -46851 -161364 14985 10251 -190879 -154927 -111762 -1887 -46021 -159201
1309a59201k1992J76582J62971m5264j62307j94254J780K6694N4277K18787K25485
$$ -159201 -181193 -4611 158360 113096 -49211 -243465 -241685 -214991 -160714 58073 283558
1298B83558k98007j74600J42034m2062r7636Q4882q6934K034J48613J07684O5031
$$ 283558 -14449 -189049 -47015 -89077 -186713 -101831 -188765 -186731 -38118 69566 134597
1287A34597k8953o7171j31403Q1382r7957r641N3035Q4198k4856j8324K1170p8598
$$ 134597 105644 38473 -92930 -11548 -109505 -119146 -66111 18087 -6769 -25093 -3923 -82521
1275h2521m0153M3114N4235p1928R637R4875k3230k06529O4874R2152R105q7046
$$ -82521 -122674 -79560 -25325 -97253 -87616 7259 -15971 -222500 -157626 -65474 -56369 -143415
1263a43415J29019j06708q9351o4057J75759m838N3959J56610j57243j40720J63941
$$ -143415 -14396 -121104 -210455 -274512 -98753 -103591 -49632 106978 -50265 -190985 -27044
1252b7044n1934M7031J56793l86218K15231O8378j52173p3931J7547J51078j71595
$$ -27044 -78978 -31947 124846 -261372 -46141 22237 -129936 -203867 -186320 -35242 -206837
1241b06837J26491k31889J22855K37499J05101l9237n2529N8164j63004L6226
$$ -206837 -80346 -312235 -189380 48119 153220 113983 61454 119618 -43386 -7160
1231g160k6402l8899K33837k9969k71426K16271P5935J42852n86k23667l5487
$$ -7160 -33562 -72461 161376 131407 -140019 76252 152187 295039 294453 70786 35299
1220C5299m7110J27619o0517k66206N9539L41933j11533l20759J32151M0942P8651
$$ 35299 -11811 115808 55291 -210915 -151376 190557 79024 -241735 -109584 -68642 10009
1209A0009M7456L58l7673r771L9031j46480j43368j6505q648K55320M4532q8285
$$ 10009 57465 57823 20150 10379 49410 -97070 -240438 -256943 -265591 -10271 34261 -54024
1197e4024M1574j05727K8551o6374P6138m3674O6223J02228j04788J01158j55113
$$ -54024 -12450 -118177 -89626 -156000 -79862 -123536 -57313 44915 -59873 41285 -113828
1186a13828K27790J0584k10298j56328J50288j91735Q0113J01439q412J38916
$$ -113828 113962 124546 -85752 -242080 -91792 -283527 -203414 -101975 -110387 28529
1176B8529o7102K2812K53030j64563j92779n1393J26423J59227l30261O2127j3624
$$ 28529 -38573 -15761 237269 72706 -120073 -171466 -45043 114184 -216077 -153950 -167574
1165a67574P1703J22472k64958J56268J93827k94701J37026J59526o5459j27141
$$ -167574 -95871 26601 -238357 -82089 111738 -182963 -45937 113589 48130 -79011
1155g9011q675M9945L37p9247j01062k3561J20358n1143J3699Q5858O2418Q9811
$$ -79011 -87686 -37741 -37404 -116651 -217713 -241274 -120916 -172059 -158360 -72502 -10084 79727
1143G9727l7549m4612o1062j18755J9450r0046N3176K9438r5399L1199K07236
$$ 79727 42178 -2434 -63496 -182251 -162801 -252847 -199671 -170233 -265632 -234433 -27197
1132b7197L1360k24371j5907q862K61393m3978j24804K1066J48908l3539q0422
$$ -27197 4163 -220208 -236115 -244977 16416 -27562 -152366 -131300 17608 -15931 -96353
1121i6353K63427N100j29963r23L7708j09636M3162R917j98093l363M9165J44374
$$ -96353 167074 172174 42211 41288 78996 -30640 12522 22439 -175654 -179017 -129852 14522
1109A4522r8869q485R1843n7173J00335J8328Q0983j39874J36171k39659j73833
$$ 14522 -84347 -92832 -989 -58162 42173 60501 141484 1610 137781 -101878 -275711
1098b75711R9023P6466o3064q1088J35105N0529O9779J89897m1111k19391k6498
$$ -275711 -176688 -100222 -163286 -244374 -109269 -58740 11039 200936 159825 -59566 -86064
1087h6064K47754M1862j82372j54715k8155J53882n232K0723M0029r6271r473
$$ -86064 161690 203552 21180 -133535 -161690 -7808 -13040 7683 47712 -48559 -58032
1076e8032K87632j52117o1627J73107j25528q7366J6674J51981K6888j63058L7563
$$ -58032 229600 77483 15856 188963 63435 -23931 -7257 144724 171612 8554 46117
1065D6117O0674N3560j18449k10706L4611p2231j20764J67008K60682k7634L2968
$$ 46117 106791 160351 41902 -168804 -134193 -206424 -327188 -160180 100502 72868 105836
1054A05836k17875J2559Q4844o5441p6182k222N8472K3419j00415l5315J94097
$$ 105836 -112039 -99480 -14636 -80077 -156259 -158481 -100009 -76590 -177005 -212320 -18223
1043a8223J28271J33165k37705m6560o568M1188q7810P5809N6511O4819j4431
$$ -18223 110048 243213 5508 -41052 -47620 -6432 -94242 -18433 38078 102897 88466
1032H8466j42285j4234K11408k7859j77743k8590P702N2861j37914K8037O2350
$$ 88466 -53819 -68053 143355 115496 -62247 -90837 -83135 -30274 -168188 -140151 -77801
1021g7801o2490O7241N9189o6174r7818J39191O647J13850j72013k54208J65438
$$ -77801 -140291 -73050 -13861 -80035 -177853 -38662 -32015 81835 -90178 -344386 -178948
1010a78948P3948M3095O5192J03005j10971M816o0478M5037p7585j03013j4306
$$ -178948 -105000 -61905 3287 106292 -4679 137 -60341 -15304 -92889 -195902 -210208
999b10208J58138M6066p9986K23742j10304j22076o0995j8290K42764n6704m2265
$$ -210208 -52070 -6004 -85990 137752 27448 -94628 -155623 -173913 68851 12147 -30118
988c0118l5576K1122N6131k15322j30997K48513K33595k58885q0156J50304n653
$$ -30118 -65694 -44572 11559 -203763 -334760 -86247 147348 -111537 -191693 -41389 -47042
977d7042L0459j27394j01053J67297J15113k7093r9276J8352j00592J00219O9994
$$ -47042 -16583 -143977 -245030 -77733 37380 10287 -88989 -70637 -171229 -71010 -1016
966a016M447K56160N4821k49171L5460l08257P251K74177K1891o4140m8394R1650
$$ -1016 3431 259591 314412 65241 100701 -207556 -200305 73872 95763 31623 -16771 74879
954G4879M99J78126j2087M988k09029j19626J79688q3493j08034M0018k262J68606
$$ 74879 75378 253504 241417 246405 37376 -82250 97438 13945 -94089 -54071 -56333 112273
942A12273n0673J43050j037k35076o363J58554j18586r3135J09966J2195J71895
$$ 112273 61600 204650 203613 -31463 -37826 120728 2142 -90993 18973 31168 203063
931B03063j11175N8084q576P1671m7943j66682k4162o9450O0414N6736O4052M4951
$$ 203063 91888 149972 141396 213067 165124 -1558 -25720 -95170 -34756 21980 86032 130983
919A30983N125J02862m7885o0973L112j80909J13689L6651k5499J8599o4044j00079
$$ 130983 136108 238970 191085 130112 133224 -47685 66004 102655 77156 95755 31711 -68368
907f8368O5577j20747J20826Q6634N1255p4520j30086R9076j14756n4830j4284
$$ -68368 -2791 -123538 -2712 83922 135177 60657 -69429 29647 -85109 -139939 -154223
896a54223K4502j15775J38332J7824J89469M2367o4003J51958M2089j22015k33841
$$ -154223 -129721 -245496 -107164 -89340 100129 142496 78493 230451 272540 150525 -83316
885h3316n7690K4162P6415q1202J8486J64593N3802j44734M1055p0487J910K0081
$$ -83316 -141006 -116844 -40429 -121631 -103145 61448 115250 -29484 11571 -58916 -57006 -36925
873c6925j02988r304J43625m9242K2519j25724P6611J07124N870Q5741k6074O9490
$$ -36925 -139913 -149217 -5592 -54834 -32315 -158039 -81428 25696 31566 117307 91233 160723
861A60723m2321k01681J85802J35501j63631n9591l1030K5113K7157K55077j31232
$$ 160723 118402 -83279 102523 238024 74393 14802 -16228 8885 36042 291119 159887
850A59887n2794q1315j13747J38078Q9606j44406r2883J50466P793q0971L7708
$$ 159887 107093 25778 -87969 50109 139715 -4691 -97574 52892 60685 -20286 17422
839A7422N6863Q3700j29725n0114J14185j84050j7550J07749K6700p7684j71074
$$ 17422 74285 157985 28260 -21854 92331 -91719 -109269 -1520 25180 -52504 -223578
828b23578L73269N9903j6006j16211Q2352k03616m4448K39069K7086j21675p2222
$$ -223578 149691 209594 193588 77377 159729 -43887 -88335 150734 177820 56145 -16077
817a6077J8506j49075J90756j07773P4009O7560q1105j22560J60001k3903p7396
$$ -16077 2429 -146646 44110 -63663 10346 77906 -3199 -125759 34242 10339 -67057
806f7057J29357M3706l3689j85887J96287o76j91583L6259J20572k1212r5888
$$ -67057 62300 106006 72317 -113570 82717 82041 -109542 -73283 47289 26077 -69811
795f9811J4711j8543J1779j5677N4676k8425J42323K22092q9269j11231n4369
$$ -69811 -55100 -73643 -61864 -77541 -22865 -51290 91033 313125 223856 112625 58256
784E8256p2797l908J51120K0000J5243k30652n7327J44779J3111P5713k1730P5930
$$ 58256 -14541 -18449 132671 152671 167914 -62738 -120065 24714 37825 113538 91808 167738
772A67738j9686J06269O496n6287j22200n9077n6149J68399O9636j30790j1459
$$ 167738 148052 254321 260817 204530 82330 23253 -32896 135503 205139 74349 62890
761F2890p1587P5085j09775J9910O8401j17969n0381J77252l0979M9784K111N4044
$$ 62890 -8697 66388 -43387 -23477 44924 -73045 -123426 53826 22847 72631 74742 128786
749A28786j82733j92733J54938L3991J51575P2705K7454l7962J14663n7053l2592
$$ 128786 -53947 -246680 -91742 -57751 93824 166529 193983 156021 270684 213631 181039
738A81039j467j67082J58334j60930j41970J68641K6181r3540n4104J43856o5035
$$ 181039 179572 12490 170824 9894 -132076 36565 62746 -30794 -84898 58958 -6077
727f077l9272o9886J0616L6666j04891L04231J55665k50497m6188R060j01693
$$ -6077 -45349 -115235 -104619 -67953 -172844 131387 287052 36555 -9633 -573 -102266
716a02266L8228K8329P1796p948p7560O0381j9905M3557j08382j18625L2538J49458
$$ -102266 -64038 -35709 36087 28139 -49421 10960 -8945 34612 -73770 -192395 -159857 -10399
704a0399Q7346k33654J0189n4220J09897R4069N450J1813n892J05147m7998j44713
$$ -10399 76947 -156707 -146518 -200738 -90841 3228 8678 20491 14599 119746 71748 -72965
692g2965J69349J6169K3372n9093j18551L7512j12626J22061j12298J23166J81175
$$ -72965 96384 112553 135925 76832 -41719 -4207 -116833 5228 -107070 16096 197271
681A97271r4446k22926L2353j12015J60462K8797n6027j31675P1711K4320l0799
$$ 197271 102825 -120101 -87748 -199763 -39301 -10504 -66531 -198206 -126495 -102175 -132974
670a32974J61220r9739j22846J48551J6770j5440K7061J36352Q8244q4771j67044
$$ -132974 28246 -71493 -194339 -45788 -29018 -44458 -17397 118955 207199 122428 -44616
659d4616J4735K04919j44133M2445M9356K3002J88995m2004j05244r2583j48631
$$ -44616 -29881 175038 30905 73350 122706 145708 334703 292699 187455 94872 -53759
648e3759N9131m9269J53857L9725L7241j99257j56239R6017K54734J13463J8371
$$ -53759 5372 -43897 109960 149685 186926 -12331 -168570 -72553 182181 295644 314015
637C14015l9011l0056O4734j77179j27619K4382k95552K24735J08962l4816k9668
$$ 314015 275004 244948 309682 132503 4884 29266 -266286 -41551 67411 32595 2927
626B927K9274N0889j89067l1788J70118Q1363O2216N9164L1528q2103j6498O4836
$$ 2927 32201 83090 -105977 -137765 32353 113716 175932 235096 266624 184521 168023 232859
614B32859N5625j75630j13757J05491J17312j30277k08778J92590K1689J16254
$$ 232859 288484 112854 -903 104588 221900 91623 -117155 75435 97124 213378
604B13378j68087q3720M8430J20160j51439o4813L2839M8903Q2775K6132M7766
$$ 213378 45291 -38429 10001 130161 -21278 -86091 -53252 -4349 78426 104558 152324
593A52324j96460j09473L41955M4600l492J11068o4584j49467Q5918O7356j57908
$$ 152324 -44136 -153609 188346 232946 229454 340522 275938 126471 212389 279745 121837
582A21837J0115k12046n0644N7964Q2712J88625j13090P663J07033j06559r4893
$$ 121837 131952 -80094 -130738 -72774 9938 198563 85473 93136 200169 93610 -1283
571a283n2961k5170K44621o531R3685K73542k01037j6192k47870j80070J29016
$$ -1283 -54244 -79414 165207 158676 252361 525903 324866 308674 60804 -119266 9750
560I750j1662m6481K7096R9509j70644J45312J96079m3768K562L0198l1221O9445
$$ 9750 -1912 -48393 -21297 78212 -92432 52880 248959 205191 207753 237951 206730 276175
548B76175l3153n1785L515j07495k07302J03770J67335j47176R9037M2834j88085
$$ 276175 243022 191237 194752 87257 -120045 -16275 151060 3884 102921 145755 -42330
537d2330M7319r2692L9559j993J1968K91117Q0913j55387n0773j4913q5096j0495
$$ -42330 4989 -87703 -48144 -50137 -38169 252948 333861 178474 127701 112788 27692 17197
525A7197l5276P971l3147J53908j05337P8269q224Q0039L6781o3133L8453l2572
$$ 17197 -18079 -10108 -43255 110653 5316 83585 75361 155400 192181 129048 167501 134929
513A34929k37922j13210l0893K70197k5707P6456M9116j86313j31476J03359J09045
$$ 134929 -102993 -216203 -247096 23101 -2606 73850 122966 -63347 -194823 -91464 17581
502A7581k7492P2336p0272R742j03658l4994K08344k0405n2916r1617m7623J73341
$$ 17581 -9911 62425 -7847 1895 -101763 -136757 71587 51182 -1734 -93351 -140974 32367
490C2367k1999R8376q8153J06734l7637l5531J36850j89825J76531J08442j05385
$$ 32367 10368 108744 20591 127325 89688 54157 191007 1182 177713 286155 180770
$$ [...]
##END NTUPLES=NMR SPECTRUM
##END=
