##TITLE=1H_EC-3287(2-1)Hex
 CDCl3
 8 sc, 
 12.12.2022
##JCAMPDX= 6.0         $$ Bruker NMR JCAMP-DX V2.0
##DATA TYPE= NMR SPECTRUM
##DATA CLASS= NTUPLES
##ORIGIN= UXNMR, Bruker Analytische Messtechnik GmbH
##OWNER= root
$$ XWIN-NMR		Version 3.5
$$ Mon Dec 12 14:05:15 2022 Russian Standard Time (UT+4h)  she@DPX200
##.OBSERVE FREQUENCY= 200.13135
##.OBSERVE NUCLEUS= ^1H
##.ACQUISITION MODE= SIMULTANEOUS
##.ACQUISITION SCHEME= undefined
##.AVERAGES= 8
##.DIGITISER RES= 18
##SPECTROMETER/DATA SYSTEM= spect
##.PULSE SEQUENCE= zg30
##.SOLVENT NAME= CDCl3
##.SHIFT REFERENCE= (INTERNAL, CDCl3, 0, 15.716)
##AUDIT TRAIL= $$ (NUMBER, WHEN, WHO, WHERE, WHAT)
$$ ##TITLE= Audit trail, XWIN-NMR		Version 3.5
$$ ##JCAMPDX= 5.01
$$ ##ORIGIN= Bruker BioSpin GmbH
$$ ##OWNER= she
$$ F:/spectra/data/she/nmr/H-F/1/pdata/1/auditp.txt
$$ ##AUDIT TRAIL=  $$ (NUMBER, WHEN, WHO, WHERE, WHAT)
(   1,<2022-12-12 14:04:04.62 +0400>,<she>,<DPX200>,
      <created by zg, POWCHK disabled, PULCHK disabled
       configuration hash MD5:
       00 E9 B6 7A A2 85 ED C7 34 08 36 98 17 FE 4E 26
       data hash MD5: 16K
       55 E4 C2 B9 24 D4 5C F8 47 AC C3 35 F5 D9 04 0B>)
(   2,<2022-12-12 14:04:07.21 +0400>,<she>,<DPX200>,
      <Start of raw data processing
       efp BC_mod = 2 LB = 0.24 FT_mod = 6 PKNL = 1 PHC0 = -18746.43 PHC1 = 0.4007144 SI = 16K 
       data hash MD5: 16K
       B5 33 61 D3 3C DC FA D3 15 DD BC 29 16 1F 88 1F>)
(   3,<2022-12-12 14:04:24.79 +0400>,<she>,<DPX200>,
      <pk PHC0 = -8.584455 PHC1 = 10.6 
       data hash MD5: 16K
       7C D0 C1 19 34 60 C4 CC 2B 92 9E B1 1C 2A 14 90>)
(   4,<2022-12-12 14:04:28.35 +0400>,<she>,<DPX200>,
      <abs ABSG = 5 
       data hash MD5: 16K
       62 5D D8 00 A2 F8 28 DA 70 0F 7D BB 8F 6D 0A 30>)
$$ ##END=
$$ 
$$ hash MD5
$$ 9D 80 C6 27 EB F3 0A 53 08 63 B2 4C 4C 1B D0 48
##$RELAX= 
##$RELAX= 
##$RELAX= 
##$RELAX= 
##$RELAX= 
##$RELAX= 
$$ Bruker specific parameters
$$ --------------------------
##$DU= <F:/spectra>
##$EXPNO= 1
##$NAME= <H-F>
##$PROCNO= 1
##$TYPE= <nmr>
##$USER= <she>
##$AMP= (0..31)
100 100 100 100 100 100 100 100 100 100 100 100 100 100 100 100 100 100 
100 100 100 100 100 100 100 100 100 100 100 100 100 100 
##$AQSEQ= 0
##$AQ_mod= 1
##$AUNM= <au_zg>
##$AUTOPOS= <>
##$BF1= 200.13
##$BF2= 200.13
##$BF3= 200.13
##$BF4= 200.13
##$BF5= 200.13
##$BF6= 200.13
##$BF7= 200.13
##$BF8= 200.13
##$BYTORDA= 1
##$CFDGTYP= 0
##$CFRGTYP= 5
##$CHEMSTR= <none>
##$CNST= (0..31)
1 1 145 1 1 1 1 1 1 1 1 1 1 1 1 1 1 1 1 1 1 1 1 1 1 1 1 1 1 1 1 1 
##$CPDPRG= <>
##$CPDPRG1= <>
##$CPDPRG2= <>
##$CPDPRG3= <>
##$CPDPRG4= <mlev>
##$CPDPRG5= <mlev>
##$CPDPRG6= <mlev>
##$CPDPRG7= <mlev>
##$CPDPRG8= <mlev>
##$CPDPRGB= <>
##$CPDPRGT= <>
##$D= (0..31)
0 1.2 0 0 0 0 0 0 0 0.06 0 0.03 0 0 0 0 0.0002 0 0 0 0 0 0 0 0 0 0 0 0 
0 0 0 
##$DATE= 1670839444
##$DBL= (0..7)
120 120 120 120 120 120 120 120 
##$DBP= (0..7)
150 150 150 150 150 150 150 150 
##$DBP07= 0
##$DBPNAM0= <>
##$DBPNAM1= <>
##$DBPNAM2= <>
##$DBPNAM3= <>
##$DBPNAM4= <>
$$ [...]
##$SUBNAM3= <"">
##$SUBNAM4= <"">
##$SUBNAM5= <"">
##$SUBNAM6= <"">
##$SUBNAM7= <"">
##$SUBNAM8= <"">
##$SUBNAM9= <"">
##$SW= 18.05172834244
##$SWIBOX= (0..15)
0 0 2 0 0 0 0 0 0 0 0 0 0 0 0 0 
##$SW_h= 3612.71676300578
##$TD= 16384
##$TD0= 1
##$TE= 0
##$TE2= 300
##$TE3= 300
##$TEG= 300
##$TL= (0..7)
0 120 120 120 120 120 120 120 
##$TP= (0..7)
150 150 150 150 150 150 150 150 
##$TP07= 0
##$TPNAME0= <>
##$TPNAME1= <>
##$TPNAME2= <>
##$TPNAME3= <>
##$TPNAME4= <>
##$TPNAME5= <>
##$TPNAME6= <>
##$TPNAME7= <>
##$TPOAL= (0..7)
0.5 0.5 0.5 0.5 0.5 0.5 0.5 0.5 
##$TPOFFS= (0..7)
0 0 0 0 0 0 0 0 
##$TUNHIN= 0
##$TUNHOUT= 0
##$TUNXOUT= 0
##$USERA1= <user>
##$USERA2= <user>
##$USERA3= <user>
##$USERA4= <user>
##$USERA5= <user>
##$V9= 5
##$VALIST= <valist>
##$VCLIST= <CCCCCCCCCCCCCCC>
##$VD= 0
##$VDLIST= <DDDDDDDDDDDDDDD>
##$VPLIST= <PPPPPPPPPPPPPPP>
##$VTLIST= <TTTTTTTTTTTTTTT>
##$WBST= 1024
##$WBSW= 4
##$XGAIN= (0..3)
0 0 0 0 
##$XL= 0
##$YL= 0
##$YMAX_a= 86763
##$YMIN_a= -57665
##$ZGOPTNS= <>
##$ZL1= 120
##$ZL2= 120
##$ZL3= 120
##$ZL4= 120
##$ABSF1= 15.70392
##$ABSF2= -2.347929
##$ABSG= 5
##$ABSL= 3
##$ALPHA= 0
##$AQORDER= 0
##$ASSFAC= 0
##$ASSFACI= 0
##$ASSFACX= 0
##$ASSWID= 0
##$AUNMP= <proc_1d>
##$AZFE= 0.1
##$AZFW= 0.1
##$BCFW= 0
##$BC_mod= 2
##$BYTORDP= 0
##$COROFFS= 0
##$CY= -3
##$DATMOD= 1
##$DC= 0
##$DFILT= <>
##$DTYPP= 0
##$F1P= 0
##$F2P= 0
##$FCOR= 1
##$FTSIZE= 16384
##$FT_mod= 6
##$GAMMA= 0
##$GB= 0
##$INTBC= 1
##$INTSCL= 3.70164e-10
##$ISEN= 128
##$LB= 0.24
##$LEV0= 0
##$LPBIN= 0
##$MAXI= 10000
##$MC2= 0
##$MEAN= 0
##$ME_mod= 0
##$MI= 1.114404
##$NCOEF= 0
##$NC_proc= -9
##$NLEV= 6
##$NOISF1= 3.799351
##$NOISF2= 2.8
##$NSP= 0
##$NTH_PI= 0
##$NZP= 0
##$OFFSET= 15.71604
##$PC= 1
##$PHC0= -18755.01
##$PHC1= 11.00072
##$PH_mod= 1
##$PKNL= yes
##$PPARMOD= 0
##$PSCAL= 0
##$PSIGN= 0
##$REVERSE= no
##$SF= 200.130011107792
##$SI= 16384
##$SIGF1= 3
##$SIGF2= 2
##$SINO= 5.538805
##$SIOLD= 16384
##$SREGLST= <1H.CDCl3>
##$SSB= 0
##$STSI= 16384
##$STSR= 0
##$SW_p= 3612.71676300578
##$SYMM= 0
##$S_DEV= 0
##$TDeff= 16384
##$TDoff= 0
##$TI= <>
##$TILT= no
##$TM1= 0
##$TM2= 0
##$TOPLEV= 0
##$USERP1= <user>
##$USERP2= <user>
##$USERP3= <user>
##$USERP4= <user>
##$USERP5= <user>
##$WDW= 1
##$XDIM= 16384
##$YMAX_p= 286498476
##$YMIN_p= -2336296
$$ End of Bruker specific parameters
$$ ---------------------------------
##NTUPLES= NMR SPECTRUM
##VAR_NAME=  FREQUENCY,     SPECTRUM/REAL,   SPECTRUM/IMAG
##SYMBOL=    X,             R,               I
##VAR_TYPE=  INDEPENDENT,   DEPENDENT,       DEPENDENT
##VAR_FORM=  AFFN,          ASDF,            ASDF
##VAR_DIM=   16384,         16384,           16384
##UNITS=     HZ,            ARBITRARY UNITS, ARBITRARY UNITS
##FACTOR=    0.220516191357247, 1,           1
##FIRST=     3145.25119124454, 0,            0
##LAST=      -467.465571761239, 0,           0
##MIN=       -467.465571761239, -2336296,    0
##MAX=       3145.25119124454, 286498476,    0
$$ Real data points
##PAGE= N=1
##DATA TABLE= (X++(R..R)), XYDATA
$$ [...]
6161C29440M42543m74505n79104L45175p0739p5151J17602N6847K29387J8778
6151C40273j36286l84255n35565N93496k77334J56101j79818K71771j49155j79837
6141d80609N68313K46551k7241J72625O68884j022717M8664n06366q4707M98306
6131H1703n27405L61720p89413m49013O72715M52565l13996r2108q3683J61252
6121e25663O1968M63522P9536L46233q33060r56068O60208P04888p6816k04318
6111b79570m42866M47876N51565k17360n85519l11428R02348p9389K9316P8034
6101I3007j00079m83237r7675O96252q72550K4718K10776J30324L66960p82735
6091h14239m71113Q93384R6621o05253n2540J099480k93434K09351o66005m8758
$$ y = [329440, 771983, 297478, -281626, 63549, -7190, -82341, 35261, 92108, 321495, 340273, 203987, -180268, -715833, -122337, -399671, -243570, -423388, -151617, -300772, -480609, 87704, 334255, 307014, 479639, 1148523, 125806, 174470, -331896, -416603, 81703, -445702, -83982, -873395, -1322408, -649693, -197128, -511124, -603232, -686915, -525663, -463695, -173, 79363, 425596, -407464, -1363532, -703324, 1564, -75252, -279570, -722436, -274560, 277005, 59645, -525874, -837302, 65046, -14343, 14973, 93007, -7072, -490309, -587984, 108268, -764282, -739564, -528788, -398464, -31504, -814239, -1285352, -391968, -295347, -900600, -953140, 146340, -147094, 62257, -603748, -652506]
6081f52506O03066q7859J50606o39354k9372N7300K08836q2431O7018k56657m27492
6070a088845N21727N95052p60614k4635J98978r8564M14208K66563R6280R28962
6060A049112l52749n74406Q710m9432k41290Q02314n07120m80342K29741p79405
6050h94867R7779L7926R14447L19855n05591r572K81563n9427n31915L7918O53970
6039C42086l97641N66291j6371n77056L72501r8585m56725j29614p15067p46537
6029a856718L80657J000192P10198o7197j94858N51104k44413k224m83658J54572
6019e2345M24896n16401k25773j16494K73052o58745K25127k9082O1030q74743
6009a489478J293449J04598k84500P55385J60184J36629n61052O00057k01213
$$ y = [-652506, -49440, -137299, 13307, -626047, -655419, -598119, -389283, -471714, -404696, -661353, -1088845, -567118, 27934, -732680, -757315, -558337, -656901, -242693, 23870, 120150, 1049112, 696363, 121957, 130667, 81235, -160055, 642259, 135139, -345203, -115462, -894867, -797088, -759162, 155285, 475140, -30451, -40023, 241540, 182113, -349802, -311884, 342086, -55555, 510736, 494365, -82691, 289810, 191225, -265500, -395114, -1110181, -1856718, -1476061, -475869, 234329, 167132, -27726, 523378, 278965, 276741, -206917, -52345, 372551, -143850, -369623, -486117, -213065, -871810, -646683, -675765, -614735, -1489478, -196029, -91431, -375931, 379454, 539638, 676267, 115215, 715272, 514059]
6000E14059l13701l07066o81493M26125L62430K04629K40707k51867o25023N92193
5990A60993n57110K86530k24026m0037P99598j63529J75403K12413n93570J47496
5980B04161l51169O33753K06917q43765Q2814J09280O97374l37752k98599j11012
5970g998M6247P110l35874q6688K96018j59549n93797Q10454l38747q7617R05428
5959D54987J61580j14683j012189j56741O9581N47882L85317K18600j72244L71769
5949G53859k96787n66396J79286m29801J053319k36925k14205P2819N88257P9795
5939I83221p6543l98288J1056J32860n71337K18243m74106K08753k96808L45835
5929H2886R46221L24333J81449j57853r10877k67622k72740Q16203k33159J61802
$$ y = [514059, 200358, -106708, -788201, -362076, 354, 204983, 445690, 193823, -431200, 160993, -396117, -109587, -333613, -373650, 425948, 262419, 437822, 650235, 56665, 204161, -147008, 486745, 693662, -150103, -67289, 41991, 739365, 401613, 103014, -7998, 38249, 45359, -290515, -377203, -81185, -240734, -834531, -24077, -362824, -450441, 454987, 616567, 501884, -510305, -667046, -597465, -49583, 335734, 554334, 382090, 753859, 457072, -109324, 69962, -359839, 693480, 456555, 242350, 315169, 903426, 983221, 906678, 508390, 519446, 652306, 80969, 299212, -174894, 33859, -262949, 82886, 1029107, 1353440, 1534889, 1377036, 466159, 198537, -74203, 742000, 508841, 670643]
5919F70643o83814L21326j19621n5238j44725K49647l24193J01955j2782K5168
5909B8366j16992j84065R61179l91722O2258k88538k53421N37697M4596O11197
5899A010555O302O00265m36383J61924j89401l24188N39817n21018O3813J26571
5889A038257L47541o70756R3761K36035O09676n2335l5567k55327o33270L01320
5879I79335j19850o0682M39724N11831O94465k10238O11944J71068m92484k55052
5869B270061p9237J75679L86896l51423p11827M95450M0862J72207M40167m02875
5859B435960p15780K16715q7302K18119O62199J08842K43785L39387k41124k07016
5849B973785L06677J36488k38155J00895k3957m2294L67595j67883N83265o7081
$$ y = [670643, -13171, 308155, 188534, 133296, -11429, 238218, -85975, 15980, 3198, 28366, -88626, -272691, 688488, 296766, 359024, 70486, -182935, 354762, 399358, 1010555, 1016857, 1617122, 1180739, 1342663, 1153262, 829074, 1368891, 847873, 911686, 1038257, 1385798, 715042, 808803, 1044838, 1654514, 1602179, 1566612, 1311285, 678015, 979335, 859485, 798803, 1238527, 1750358, 2444823, 2234585, 2846529, 3017597, 2525113, 2270061, 2190824, 2366503, 2753399, 2401976, 1690149, 2185599, 2226461, 2398668, 2838835, 2435960, 1720180, 1936895, 1849593, 2067712, 2729911, 2838753, 3082538, 3421925, 3180801, 2973785, 3280462, 3416950, 3178795, 3279690, 3255733, 3213439, 3581034, 3413151, 3996416, 3929335]
5839C929335k58537j33217K1563J46408k2048K50986k52639K75563J53100J08987
5829D219501m4313n70601J57170q53882J47580j98345P31602L22317p2924l33693
5819C504412P16692M30549n21341m63301L07756O38048l56726m51072Q47675K34008
5809D886700M55645j045231l37137Q70959M95637O57972Q0146m42627n43813n17428
5799D560823j01610L58821M2705N4147n96394j53925O2320m7399k97512M23450
5789D305426R1258k05937k36237L30148m09706L86366O29669o18956j12849r6994
5779D062188L41805l73802J2151l25441p2195j0639m05402M00970o37277J12469
5769C104827j53938P5296r2802K10307K29116m58580J21240l35552j3701L30568
$$ y = [3929335, 3670798, 3537581, 3559144, 3705552, 3683504, 3934490, 3681851, 3957414, 4110514, 4219501, 4175188, 3604587, 3761757, 2907875, 3055455, 2857110, 3588712, 3911029, 3838105, 3504412, 4221104, 4651653, 4130312, 3667011, 3974767, 4612815, 4256089, 3805017, 4652692, 4886700, 5342345, 4297114, 3959977, 4830936, 5326573, 5984545, 6064691, 5622064, 5078251, 4560823, 4459213, 4818034, 4860739, 4914886, 4318492, 4164567, 4226887, 4179488, 3881976, 4305426, 4396684, 4190747, 3954510, 4284658, 3874952, 4261318, 4890987, 4272031, 4159182, 4062188, 4403993, 4030191, 4042342, 3716901, 3644706, 3634067, 3228665, 3629635, 2992358, 3104827, 2950889, 3026185, 2933383, 3143690, 3372806, 2914226, 3035466, 2699914, 2686213, 3016781]
5759C016781m04140k8914k83711P75845M527j93104k78938P34247l28148m47332
5749B567113l33703l03755L48393L2942J22317R35666o12604J63029m96726j63761
5739B258911P24980j10124j058879n47653R16537L19899O52745m90146l03729
5730B362541M74687K82102l07311o10267l38765J46027J1818N58515l82904J19183
5720B315626M58950j63754K3083O11781J20781j97568n91367l36121K43235k54346
5710B230300K13213M30817L83784P76106L16295P6995o34405l92597N90151J2000
5700D002659m30210L38450m45938P42797K6324n05791K66657K34014J228159N9701
5690E516822n43022n33474j21249N21548K1070p22817N68895M00569K57463K45595
$$ y = [3016781, 2612641, 2583727, 2300016, 3075861, 3080388, 2887284, 2608346, 3342593, 3014445, 2567113, 2233410, 1929655, 2278048, 2310990, 2433307, 3368973, 2756369, 2919398, 2422672, 2258911, 2983891, 2873767, 1814888, 1267235, 2183772, 2503671, 3156416, 2666270, 2362541, 2837228, 3119330, 2812019, 2201752, 1862987, 2009014, 2020832, 2579347, 2196443, 2315626, 2774576, 2610822, 2633905, 3245686, 3366467, 3168899, 2577532, 2241411, 2484646, 2230300, 2443513, 2874330, 3258114, 4034220, 4350515, 4427510, 3793105, 3400508, 3990659, 4002659, 3572449, 3910899, 3464961, 4207758, 4234082, 3728291, 3994948, 4228962, 5457121, 5516822, 4973800, 4440326, 4319077, 4840625, 4861695, 4138878, 4707773, 5108342, 5365805, 5611400]
5680E611400p50824m89993k19658J041420M21684K59102N66972o98515o28005
5671E113583j21475N21365n3914j85450M96353q6391N11118k68303p75639K55956
5661E407203O0210K10919o6426p30505o00389K25169R9562m81864J52993m62010
5651C814862R1569M01755K90192P0170n44687o26850K80056Q0497m36592O87982
5641D108954p42472K19302o38253J56044K73052o75823L42758j15815L72283N44002
5631C844032j121839m10486K61967O26107j66703p34515n03094j60455R27999
5622B563013l90658r86288m5764Q3209M06305J51185M60988k0457p57312N6188
5612A520409k99403J24036p76736j06118J116362P07855m21419l17140M21231
$$ y = [5611400, 4860576, 4370583, 4150925, 5192345, 5614029, 5873131, 6440103, 5741588, 5113583, 4992108, 5513473, 5459559, 5274109, 5770462, 5684071, 6195189, 5926886, 5151247, 5407203, 5467413, 5678332, 5611906, 4881401, 4281012, 4506181, 4605743, 4123879, 4276872, 3814862, 3906431, 4308186, 4598378, 4668548, 4123861, 3497011, 3777067, 3857564, 3420972, 4108954, 3366482, 3585784, 2947531, 3103575, 3376627, 2700804, 3043562, 2927747, 3300030, 3844032, 2722193, 2311707, 2573674, 3199781, 3033078, 2298563, 1795469, 1635014, 2563013, 2172355, 1186067, 1140303, 1223512, 1629817, 1781002, 2241990, 2221533, 1464221, 1520409, 1221006, 1345042, 568306, 462188, 1578550, 2286405, 1864986, 1547846, 1969077]
5603A969077m24461q77059K44315k94507L65199Q04059P28601j033298q78322
5594F03604K64883m3270k3405N98900m65480L9790K81100l99849o43472N63773
5584G76574O81124q43583l15658O20273k61131l98758l53243l1083k08616O25274
5574B91173K60244L32234Q9949j55028k77164j81167Q12657p82916N0439K83573
5564G23994l10337m2574N06604o83962k04218n8489O92191L22135l45939k37324
5554C62081l70461k86799K88318j50577O12479o9809O055M24343j011798l36536
5544e32704P39124M7961K14137J16740p09760J29739k02866K35434K94152k15443
5534A16514l93747p2906Q02780P2274m46846P59356m73041o3509J73813k72858
$$ y = [1969077, 1544616, 667557, 911872, 617365, 982564, 1786623, 2515224, 1481926, 603604, 868487, 825217, 801812, 1400712, 935232, 975022, 1256122, 856273, 212801, 776574, 1457698, 614115, 298457, 918730, 657599, 258841, -94402, -125485, -334101, 291173, 551417, 883651, 973600, 818572, 541408, 360241, 1172898, 389982, 440421, 723994, 413657, 371083, 877687, 193725, -10493, -68982, 623209, 945344, 599405, 362081, -8380, -295179, -6861, -157438, 455041, 385232, 391287, 815630, -196168, -532704, 206420, 254381, 468518, 585258, -124502, 5237, -197629, 37805, 331957, 116514, -277233, -350139, 452641, 524915, 78069, 837425, 364384, 300875, 474688, 201830]
5524B01830n32551Q5299N55257M06623M64m54252M12494j7390R7998q82619J48347
5513B1500M9215K60265L5519k75669k02989J004196k09870m86495J69968O14626
5503I80266K41847n6177j043879p42184M95542M0309P25608J01178p84056J87307
5493A45761O52274k95950m03878j53884q9614K39921K76997l90779n14539o07868
5483a141559J182567N27521j018836o1458l3639m40935J35795O5292K35163L77359
5473a72730J57682p373N59341k02047J22242L23228o59119K31444R8437k17422
5463B33683k77692k30221l46527L92887q7516l01768L62664k31712R0293N93045
5453A97136p69829K14903Q78585R610n49753l18655J84039n07632n45433O77015
$$ y = [201830, -330721, -245422, 309835, 716458, 716922, 262670, 675164, 657774, 755772, -126847, 21500, 70715, 330980, 366499, 90830, -112159, 892037, 682167, 195672, 365640, 980266, 1222113, 1165936, 122057, -620127, -124585, -84276, 641332, 742510, -41546, 145761, 798035, 502085, 98207, -55677, -145291, 94630, 371627, -19152, -533691, -1141559, 41008, 568529, -450307, -511765, -545404, -986339, -850544, -785252, -550089, -172730, -15048, -22421, 536920, 334873, 457115, 780343, 121224, 352668, 451105, 233683, -44009, -274230, -620757, -227870, -315386, -617154, -254490, -486202, -395909, 197136, -572693, -357790, 520795, 530405, -19348, -338003, -153964, -661596, -1207029, -530014]
5443e30014j93144J85929J66628r2541R2032o31375Q86252L31264j43667p53087
5433f81723P74141Q66203L11608J64581k73581j351182l15171N71434Q64362k15571
5423G15101k46836K65670K83615J11868j199132k14271R05716r23432O83531J046049
5413A427879n78251M3257m27204r19298L69157M14646J28771N0335J60968K0327
5403F90587m91661j4822R50635r49784k48334N0600J91166J86625l63658M57931
5393D59285L66220l38471K22360K46098o70531M35043n24014m72924K5526J274985
5383A023577l91145j056156J33041L95780K86733q4976r81027P3491N75346Q22159
5373G96823j065987o113M62820O26139K18104p96927P19968p381o06133n9682
$$ y = [-530014, -723158, -537229, -370601, -463142, -371110, -1002485, -116233, 215031, 71364, -681723, 92418, 958621, 1270229, 1434810, 1161229, -189953, -505124, 66310, 930672, 715101, 468265, 733935, 1017550, 1129418, -69714, -283985, 621731, -301701, 381830, 1427879, 849628, 892885, 465681, -453617, -84460, 330186, 458957, 509292, 670260, 690587, 198926, 184104, 1134739, 184955, -63379, -12779, 178387, 365012, 1354, 459285, 825505, 487034, 709394, 955492, 284961, 720004, 195990, -276934, -251408, 1023577, 632432, -423724, -290683, 105097, 391830, 306854, -674173, -600682, -25336, 796823, -269164, -275277, 187543, 813682, 1031786, 234859, 954827, 947446, 341313, 281631]
5363B81631l83002j89235k85221j1996K16973O1780j22951L64214J69692j16322
5353a4437J82925M58606k63664j140484L72328L26445j35951k10446O93024L35055
5343F03401r0029K7139M04825L0408Q8156o67696q79434q03825P77867J171549
5333F62361l9834J38400p68960J0404K8501l36045J89524K15249K54024l32262
5323B1362r0259O15650L75942j6659N87033K2931p67696J97463j14365O3248p76031
5312A18619k25446L25288J0444J20721m67817p6317L87161J06951K17269K92935
5302H09808q22104K60339M19653Q07126m59444K00730j98197p07180O14221l73589
5292E51363P5998K94257k75025m38106n0759k18231k96231J92383J36910J89273
$$ y = [281631, -101371, -290606, -575827, -587823, -370850, -309070, -432021, -67807, 101885, -14437, 168488, 627094, 363430, -777054, -404726, -78281, -214232, -424678, 268346, 603401, 513372, 540511, 945336, 975744, 1063900, 396204, -483230, -1287055, -509188, 662361, 622527, 760927, -8033, 2371, 30872, -305173, -115649, 99600, 353624, 21362, -68897, 546753, 922695, 906036, 1493069, 1516000, 748304, 945767, 831402, 894650, 118619, -106827, 218461, 228905, 349626, -118191, -194508, 192653, 299604, 516873, 809808, -12296, 248043, 667696, 1474822, 1015378, 1216108, 1017911, 310731, 924952, 551363, 627361, 921618, 646593, 208487, 157728, -60503, -356734, -164351, -27441, 161832]
5282A61832J25550p44098r8581j60269L61102K69317J45892l37982J58128O0855
5272e8254O43593o2668p44987j09366O16803K49843N99712K2239p66495p35930
5262c45510j76209N69697k10205M24704m41444j48908R82430o09593j84387J041106
5252I01681L82809j09067j631222n00962N82389k22740K93093k32364Q9335K34430
5242b12618K98057N41890p35564M12579k20778o74212M89208N97218M43698o10417
5232C29061n02270n04500k16072Q72626j62158O7232j70844R67626k47681o52670
5222b19650P07036M47292L66868o13913k09386l92016k33444M85259P23272o30148
5212D31170L86934K08142l98621L78010m77915O4433l25164k0975J30980q54261
$$ y = [161832, 287382, -456716, -555297, -715566, -354464, -85147, 60745, -277237, -119109, -58254, 585339, 522671, -222316, -331682, 285121, 534964, 1134676, 1156915, 390420, -345510, -521719, 47978, -162227, 262477, -178967, -327875, 654555, 44962, -139425, 901681, 1284490, 1175423, -455799, -956761, -374372, -597112, -304019, -536383, -447048, -212618, 85439, 627329, -108235, 304344, 83566, -590646, -101438, 495780, 939478, 329061, -173209, -677709, -893781, -21155, -183313, -116081, -286925, 680701, 433020, -219650, 487386, 934678, 1301546, 687633, 478247, 86231, -147213, 338046, 1061318, 431170, 818104, 1026246, 627625, 1005635, 527720, 592153, 266989, 246014, 376994, -477267]
5202d77267P27480k11390k42420M8688j33397p56097R0501L70825M53856J034351
5192I05130q8209l79758q92487l49755P28381P71320K98949l00188j161835o7056
5182e35508K89496R31611n23082l40894Q6651k50038L6820Q31860o27374K70514
5172A70056J26385o80323k61613M33292J45790l00806O47319J09042q7755l65516
5162f4129j91923l66004q88946R24691O47697l36046n34348N07792M56377j26057
5152B9104n74659O647Q02026N55041m62896k92777J30068j32824M01058p45485
5142b84697J99843M74152j28684o41718j63574J086133J69576j012957n34180
5133h36106k60554J032855n7428M71008q0853j58747N86662k75743L80539k34755
$$ y = [-477267, 250213, 38823, -203597, -154909, -288306, -1044403, -953902, -583077, -129221, 905130, 816921, 437163, -455324, -805079, -76698, 694622, 993571, 693383, -468452, -535508, -246012, 685599, 162517, -178377, -91726, -341764, -304944, 526916, -100458, 170056, 296441, -383882, -645495, -212203, -66413, -367219, 280100, 389142, 301387, -64129, -256052, -622056, -1511002, -586311, 61386, -274660, -809008, -301216, 155161, 29104, -545555, -538908, 263118, 818159, 355263, 62486, 192554, 59730, 460788, -284697, -84854, 389298, 260614, -381104, -544678, 541455, 711031, -301926, -836106, -1096660, -63805, -121233, 349775, 268922, 110175, 696837, 421094, 801633, 566878]
5123E66878j36421M393j43941K40149J24146j97463p87585M01794M98095j00289
5113D69756N8944n54501k49993N76329K6805k13824j15301M10169k40864j48230
5103A9290m85020l53881N37819j34771O73901Q78127K26286l48613k75303q63663
5093a25828j87599J195168l4577l64977l90562k76367q00751O46885J74698q74410
5083a038320J32157R60343K53126n09139J08784J84718k93049L32962k19108q5887
5073a73413R3370N40457l19883J7151O91896l35276m09042P87188K07361m35145
5063F64664j15079r1050m41715r91959O61441K37337R0216n67939n02016j4139
5053a070239N96518k26782O89130J50355n23662L69848l52537k74249k8969K24538
$$ y = [566878, 430457, 434850, 290909, 531058, 655204, 457741, -329844, 71950, 570045, 469756, 528700, -25801, -275794, 300535, 327340, 113516, -1785, 408384, 167520, 19290, -465730, -819611, -281792, -416563, 257338, 1135465, 1361751, 1013138, 737835, -125828, -313427, 881741, 847164, 482187, 91625, -184742, -985493, -338608, -163910, -1038320, -906163, 54180, 307306, -201833, -93049, 91669, -201380, 131582, -87526, -173413, -80043, 460414, 140531, 157682, 849578, 514302, 105260, 892448, 1099809, 664664, 549585, 458535, 16820, -975139, -313698, -76361, 13855, -554084, -1056100, -1070239, -473721, -700503, -11373, 138982, -384680, -14832, -367369, -641618, -670587, -446049]
5043d46049N06025j00560m45358O83248J82389l51542l13799K81001N07393k06320
5033B96428j67476j69628j24069O83928N89762m18505l28143J54763n85017q20495
5023h88452O88907l0135m00153m95925J002789J05742j45285n52711L72535L04480
5013c8208p41110L66266Q471k8141q3684R12342l82031K36121P00478p88219l37099
5002a74814l36886Q5249L77280L35058j21942r74257M09933L73926m51429m72236
4992i50118K81953L49951J357919l33813p51245p25537j31536L01589L57980O50622
4982D07765K85039N48681j314850p47962Q37741J039762r05459q79472Q06025
4973G7270L96492m35757L60653j28389l93909M45192J51534k85837j22177J99276
$$ y = [-446049, 59976, -40584, -485942, 197306, 379695, 28153, -285646, -4645, 502748, 296428, 128952, -40676, -164745, 519183, 1108945, 690440, 362297, 517060, -67957, -888452, -199545, -229680, -629833, -1125758, -122969, -17227, -162512, -715223, -342688, -38208, -779318, -413052, -404581, -432722, -516406, 395936, 13905, 250026, 950504, 162285, -174814, -511700, -426451, -49171, 285887, 163945, -810312, -400379, -26453, -477882, -950118, -668165, -318214, 1039705, 705892, -45353, -770890, -902426, -600837, -242857, 407765, 692804, 1241485, -73365, -821327, 16414, 1056176, 150717, -728755, 77270, 473762, 38005, 398658, 270269, -123640, 321552, 473086, 187249, 65072, 264348]
4963B64348k47154m1313K76056n44763l94664J05758L52700p8297k5837j05354
4953d38520P18545J6853k84011j51261M72696k7017M93814J10449p57435m71256
4943c17143L12990j9724N69585J98961p62567k12675n84087J067266q23575M85893
4933h5076M43339q39743l10081l0414Q09753J33395l45356M92282O41387j89324
4923G20162J27073o22893r5970k05630O38034m06679m2556L94579K46538l94533
4913C58125o76840J41516J83540o31580K93647J85551p80599o0061J022990R7393
4903A33682l65845J04626m76793O85518K75680o99M91301K76383q14438J70655
4893D80070o1193l67631K18837K62117m02360n88616k99409L64405k79923L33978
$$ y = [264348, 17194, -24119, 251937, -292826, -687490, -581732, -229032, -307329, -333166, -438520, 280025, 296878, 12867, -138394, 334302, 307285, 801099, 911548, 154113, -317143, -4153, -23877, 545708, 744669, -17898, -230573, -814660, 252606, -570969, -85076, 358263, -481480, -791561, -821975, -12222, 121173, -224183, 268099, 909486, 720162, 847235, 224342, 128372, -77258, 560776, 154097, 111541, 506120, 752658, 358125, -318715, -177199, 6341, -625239, -331592, -146041, -926640, -986701, 36289, 133682, -232163, -127537, -604330, 81188, 356868, 356169, 847470, 1123853, 309415, 480070, 418877, 51246, 270083, 532200, 129840, -458776, -758185, -393780, -673703, -339725]
4883c39725l1385M15697P0836j002667L05740J289087l20777m40115l43597M68821
4873G1915O53192k42429r74108K08078m6692N62733n3710j86358L60522P08258
4863A061401l55013r91532l17631N25292R56248L2957j157035o02501O26969M17365
4853A96520k94966O5530k54104K46296N97766J6697l48292j31648N78329m27079
4843B45049k09849J45862k2615o0847p9923k22720N14795K74789K10470p94606
4833D05j342746O62778M70565J16873Q3436k56913j83884p10360P72767k89062
4823f76141l92081N38254L82665K7919J048873k82803o25800j015956K52794J028461
4813B86185N7060q02909M66360J135407L53875l27142j95035l88224l77594k30965
$$ y = [-339725, -371110, 44587, 115423, -887244, -581504, 707583, 386806, -53309, -396906, 71915, 725107, 482678, -491430, -283352, -330044, 232689, 178979, -7379, 353143, 1061401, 706388, -285144, -602775, -77483, 878765, 911722, -245313, -847814, -220845, 196520, -98446, -32916, -287020, -40724, 557042, 573739, 225447, 93799, 672128, 245049, 35200, 181062, 158447, 97600, 17677, -205043, 309752, 584541, 795011, 405, -1342341, -679563, -208998, -92125, -8689, -265602, -449486, -1159846, -387079, -676141, -1068222, -529968, -147303, -119384, 929489, 646686, 20886, -995070, -742276, 286185, 343245, -459664, 6696, 1142103, 1495978, 1168836, 973801, 585577, 207983, -22982]
4803b2982N472N20196l64725O14120K69801m90560p76494k47139J019670K03810
4793G31169l56983q487J93490j116354J06884K98975J71576Q5341l11863M34306
4783B28054J39477M70015n08733q20530K7448Q87724j59883K54087k86652j74203
4773E6804M52750l22141m32617L49143m58524J85310m20667m73500J8750M84420
4763e60272j50378k42536J02832J20927p1618k58632N13005m10425M6824Q39819
4753g0454p65001m42800M47705M20026J24158r39228J65555M20666J228580k68057
4743C21150j97638j63721l14449l33370Q8998k56033J100757K39212j84308k05328
4733I5270L63978j70079j97939k90241M82700l15794o9460R91493m94941J73247
$$ y = [-22982, -17510, 502686, 137961, 752081, 1021882, 531322, -245172, -492311, 527359, 731169, 374186, 365699, 559189, -557165, -450281, -151306, 20270, 105611, -206252, 228054, 367531, 837546, 328813, -491717, -464269, 423455, 263572, 517659, 231007, 56804, 509554, 187413, -245204, 103939, -354585, -169275, -589942, -1063442, -1044692, -560272, -710650, -953186, -850354, -729427, -801045, -1059677, -546672, -957097, -910273, -70454, -835455, -1278255, -830550, -410524, -286366, -1225594, -1060039, -639373, 589207, 321150, 123512, -40209, -354658, -688028, -599030, -855063, 245694, 484906, 300598, 95270, 459248, 289169, 91230, -199011, 283689, -32105, -101565, 889928, 394987, 568234]
4723E68234n18359m7768k12880o03638L37911M51854j49849j19742q471m8052
4713c50760l79498O59949L4655L06846M82239K44851n94271o08787N88859j47298
4703B36785p04937k16795L44564L27076M18966l05520n62540j28072L33240n9020
4693c16253Q6915P8237p19945K37982K67848J65126K07591r36230Q84691R75235
4683I31197l05609q34402j52509L07051m61253M90017L30982k29442r09426J091550
4673B58156M04406p96237n66435m67361O70338N13292l15538L7542L47572o38591
4663e52856M1882J082403j48576n12196l07921l06768n50252P57045R26235O03134
4653A032130n94568l29929m10204L15225Q771J26220P12161J25216o6583Q50021
$$ y = [568234, 49875, 2107, -210773, -814411, -476500, -24646, -174495, -294237, -302708, -350760, -730258, -70309, -35654, 271192, 753431, 998282, 404011, -204776, 384083, 236785, -468152, -684947, -340383, -13307, 405659, 100139, -462401, -590473, -257233, -316253, -229338, -151101, -871046, -633064, -365216, -200090, 7501, -928729, -44038, 931197, 625588, -208814, -361323, -54272, -515525, -25508, 305474, 76032, -833394, 258156, 662562, -133675, -700110, -1167471, -497133, 16159, -299379, -261837, 85735, -552856, -510974, 571429, 422853, -89343, -397264, -704032, -1254284, -497239, 428996, 1032130, 437562, 107633, -302571, 12654, 21425, 147645, 859806, 985022, 918439, 1768460]
4643A768460j131185k29979M2597l39045n89724M18522L58555K01255k8094n23735
4633e2373M81814j505875M65605K05393k54791J188234k45530q69625K45931Q4436
4623b56781K98393p0530n57400J379678O14143l42632o65611n04466L54390J81134
4613D30318l6207O5946q48378l77429L75380M45042o698o33602O9420O77456o20956
4602d59708O16602M87384l27046j61991j53221n95389j90970N87965m55078M25908
4592b25544j47882Q62941L37952o02622n90122L34024k00968K51908K28951K91388
4582E40026k17638j01465k30722j009J54961Q3495o8443p7427M05865M79978j103547
4571a35926j11715j16543K55332o50937O15170J69120k71893p88362M25796K95421
$$ y = [1768460, 637275, 407296, 449893, 110848, -478876, -60354, 298201, 499456, 471362, -52373, 429441, -1076434, -610829, -405436, -660227, 528007, 282477, -587148, -341217, -256781, 41612, -28918, -586318, 793360, 1407503, 1064871, 399260, -105206, 249184, 430318, 394111, 460057, -388321, -765750, -390370, 54672, 47974, -585628, -516208, 161248, -459708, 156894, 644278, 317232, 155241, 2020, -593369, -784339, -196374, -651452, -225544, -373426, 489515, 827467, 224845, -365277, -31253, -232221, 19687, 248638, 540026, 322388, 220923, -9799, -10808, 144153, 227648, 159205, 81778, 487643, 967621, -135926, -247641, -364184, -108852, -759789, -144619, 24501, -247392, -1035754, -609958, -314537]
4561c14537l8312M05975k60504o95596N07263O09219m08561M06801L28443o28914
4551h8723l61687l01803l13054M63190P14699j67325r24819L11515M13638O21923
4541C67554l0910l30742M84654J05062l12055k64915N2488k28437k94477P3642
4531c78136P2427M05653j017478P04681K76695r07650o7273N02015N79135Q0364
4521B50433j27368J95958j87355j02277K79995K0063l52915K22532m61374j105990
4511a368298M7759J421450L28979m09548K12937K4270j105377O5146N31598L28501
4501G7417o6949m16992K11282M5251L82637O39182j1445J8642o6172j57904k45899
4490D09050m84748q68300J6405J92387L51803K76138O4055Q30814O16123k87282
$$ y = [-314537, -352849, 53126, -207378, -902974, -395711, 213508, -195053, 211748, 540191, -88723, -450410, -752213, -1065267, -602077, 112622, -54703, -979522, -668007, -254369, 367554, 336644, 5902, 490556, 595618, 283563, 18648, 71136, -157301, -451778, -378136, -305709, 99944, -917534, -212853, 63842, -843808, -911081, -409066, 170069, 250433, 123065, 319023, 131668, 29391, 309386, 329449, -23466, 199066, -262308, -1368298, -1320539, 100911, 429890, 20342, 233279, 257549, -847828, -782682, -251084, 77417, 10468, -406524, -195242, -149991, 232646, 871828, 860383, 879025, 812853, 654949, 409050, -75698, -943998, -927593, -735206, -383403, -107265, -43210, 787604, 1403727, 1116445]
4480A116445l75462k28456J8922l84954K10354n37618P42058L10657o82537j02606
4470H6803k87634K42215M95471l50909K06559M07772K52805J75682J22477l38909
4460A012332m87279j09601L99427l59009p04783Q56366j49738j1178k87665N84360
4450G43232J56749q35302L00530k18632m5840J94318P2752L00124k99487M59606
4440H28050J7795k48236K89468J30994J38348n76452O2287k51535k00403O85541
4430H75857m04104n94446l35231J21676M00383O57333J79132j96431O41651R1367
4420A437187l23902p20130l16154R51841M19079q5390k18599K70639l21851j037521
4410E5199J12898r10976k71619P68101J161244n36010n23210o7505n88138R18231
$$ y = [1116445, 740983, 512527, 531449, 146495, 356849, -180769, 561289, 871946, 189409, 86803, -200831, 41384, 536855, 185946, 392505, 800277, 1053082, 1228764, 1351241, 1012332, 525053, 415452, 814879, 455870, -248913, 607453, 457715, 446537, 158872, 743232, 899981, 64679, 365209, 146577, 100737, 295055, 367807, 667931, 368444, 828050, 845845, 597609, 887077, 1018071, 1156419, 579967, 642254, 390719, 190316, 875857, 471753, -122693, -457924, -336248, 64135, 721468, 900600, 704169, 1345820, 1437187, 1113285, 393155, 77001, 1028842, 1447921, 1362531, 1143932, 1414571, 1092720, 55199, 168097, -742879, -1014498, -246397, 914847, 378837, -144373, -211878, -800016, 118215]
4400A18215M72154m6453M13836O15966k74257o81086p01604j26108l24175L65686
4390a67826J43613O48502J52198l59918m1393j66850L58671M52657q64988P47220
4380I01886J4651l36003r18313n32382M02597R2535M05747K94869k49417M04716
4370D80886L74718n87364J56889J61447n62086O2816J036805k08322l75221N79216
4360A119784l79071R8353j93832j39425k05332m8247J80057p7926L4394o08460
4350b19705K54165L80377L7967n60221M99608O0334k03188k4092O08354j66859
4340F66740L93424M20955m28276j02376n16095k3416q069j55054N81214l57006
4330D72041K63866o78404j11899J17955n2496j10568k77826J66600L8555K86959
$$ y = [118215, 590369, 543916, 957752, 1573718, 1299461, 618375, -83229, -209337, -533512, -167826, -24213, 624289, 776487, 416569, 375176, 208326, 566997, 1019654, 154666, 901886, 916537, 580534, -337779, -870161, -467564, -375029, 30718, 325587, 76170, 480886, 855604, 268240, 425129, 586576, 24490, 87306, 1124111, 915789, 540568, 1119784, 740713, 839066, 645234, 505809, 300477, 252230, 432287, 354361, 388755, -219705, 34460, 414837, 452804, -107417, 392191, 452525, 249337, 225245, 833599, 666740, 1060164, 1481119, 1052843, 950467, 434372, 410956, 402887, 247833, 829047, 472041, 735907, 57503, -54396, 63559, 11063, -99505, -377331, -210731, -172176, 114783]
4320A14783K66088N97723n01110J6845m31673N73622J35658K84808p74488N7384
4310C39640N88656J59350m44084M13180K04760k78447l00435k39268J39968P1289
4300F54609o01439k95828M26668n68665R47555R58942q36090p72754m6861r7037
4290b30900Q65322M9517m44794K83632o02812l54179J080440J62031j56288k69
4280F51700r7692m97635k96874M56994k40091O82736L49205k29803K71272n49461
4270E00351r11803J50225J015159j75516j04673j24406M48435n60944O3156l88207
4260h8223k79033J39168Q36161o91285m62539O43919o3237J42059O82040l54071
4250E04959q96173J66544N94179L80820j96564K67027j95479k03797K30626k30034
$$ y = [114783, 380871, 978594, 477484, 494329, 62656, 636278, 771936, 1056744, 282256, 339640, 928296, 1087646, 643562, 1056742, 1261502, 983055, 682620, 443352, 583320, 654609, 53170, -242658, 184010, -384655, 562900, 1521842, 685752, -87002, -133863, -230900, 634422, 683939, 239145, 522777, -80035, -434214, 646226, 808257, 651969, 651700, 554008, 56373, -240501, 216493, -23598, 659138, 1008343, 778540, 1049812, 500351, -411452, -261227, 753932, 578416, 473743, 349337, 797772, 236828, 299984, -88223, -367256, -228088, 608073, -83212, -545751, 98168, 34931, 176990, 859030, 504959, -391214, -224670, 369509, 750329, 553765, 820792, 625313, 421516, 652142, 422108]
4240D22108L5442j13417L43726L38230K99211j107466k62987J081245M49953m95145
4230I90900m17160L83373M54687Q55403n89848l39248j62374O4234l86423j90973
4220F62571N78434l33682J342584M5124p95785M19296k14712p7920j55447q5904
4210A384559o13024L16222O481P949k78839R7127J23353j41134K83735j73729
4200A012700j78605P44743m92021n3163o544j68465L56993o18859q9624M79834
4190I86989P19041m41408q44466j19426j47921O44801N18957L19975o50178q56951
4180A29413J147011j64561L14395J3129N3560m06491k50402J208903m67424J7525
4170A595058l32695K31318J42607J0150q33919J27251P88882l73385m84913M53822
$$ y = [422108, 457550, 344133, 687859, 1026089, 1325300, 217834, -45153, 1036092, 1486045, 990900, 573740, 957113, 1411800, 2267203, 1677355, 1338107, 1175733, 1239967, 853544, 662571, 1241005, 907323, 2249907, 2295031, 1499246, 1918542, 1703830, 1625910, 1470463, 1384559, 771535, 1087757, 1094238, 1102187, 823348, 920475, 1043828, 902694, 1186429, 1012700, 834095, 1578838, 1086817, 1033654, 1027110, 858645, 1215638, 596779, 507155, 986989, 1706030, 1264622, 420156, 300730, 152809, 797610, 1316567, 1636542, 986364, 129413, 1276424, 1111863, 1426258, 1439387, 1492947, 1086456, 836054, 2044957, 1577533, 1595058, 1262363, 1493681, 1636288, 1646438, 812519, 939770, 1728652, 1355267, 870354, 1324176]
4160A324176J68265M14333L29832j47659n67788m60076M00292K78732m69642m55026
4150H15439q244K44072N94835k35789J18415j67626J24041R62550L05674N5273
4140B808640l80775q34467P71782N35553k07736K53113O64954r55662n19925M57046
4130B592523Q45175l04565o85264M48194r9641O1515k40385M37660m43054J30283
4120B742441O12426j34528n9422n92420P06054J03759J19997p24481M67648N82453
4110C823927Q59N25803M03696J60727k35267j33774P4374K14372r04815J142315
4100E072217K56028J138638K23371q689j18802K69839k70304J10244m02485J88444
4090F458501L29314L86160O98383J53983J1855p00610M56289P21637l35488n29738
$$ y = [1324176, 1492441, 1906774, 2236606, 2088947, 1521159, 1061083, 1461375, 1740107, 1270465, 815439, 807195, 1051267, 1646102, 1410313, 1528728, 1361102, 1485143, 2447693, 2753367, 2808640, 2427865, 1593398, 2365180, 2900733, 2692997, 2946110, 3611064, 2655402, 2135477, 2592523, 3437698, 3133133, 2447869, 2896063, 2796422, 2857937, 2617552, 3055212, 2612158, 2742441, 3354867, 3220339, 3160917, 2568497, 3274551, 3378310, 3498307, 2773826, 3241474, 3823927, 3824786, 4350589, 4754285, 4915012, 4679745, 4545971, 4620345, 4834717, 3929902, 5072217, 5328245, 6466883, 6690254, 6681565, 6562763, 6832602, 6562298, 6672542, 6270057, 6458501, 6787815, 7173975, 7872358, 8026341, 8038196, 7337586, 7793875, 8515512, 8180024, 7650286]
4080G650286J320469M61258L63751r03605m86660O17736N747K85243L30682j08600
4070I536307j11642R89N67744N73716k40838l79282R71868o11044K56310J55133
4060A0719261P3179j17287m07018L74936p14012l82466J73157J8465j46302M27428
4050A0019341j97585m78147j7515L0099N31533k46672K03650M45337j357367j563841
4040G368833J32068k50748M67363M3810m83255m38084M36579j59159M5867K47735
4030G411009r33375L33965q0559k10403n9565n14725o14177k87538J238599n20211
4020E763020o85554K2544j72722k14380m68572L17233L41498L65945q71003K96978
4010D694987l85537m69569P01784l23852R8856k34047K31237j37573k81542K87752
$$ y = [7650286, 8970755, 9432013, 9795764, 8892159, 8405499, 9023235, 9028982, 9314225, 9644907, 9536307, 9424665, 9425654, 9993398, 10567114, 10326276, 9946994, 10918862, 10307818, 10564128, 10719261, 10792440, 10675153, 10268135, 10643071, 9929059, 9546593, 9719750, 9738215, 9591913, 10019341, 9821756, 9343609, 9326094, 9356193, 9887726, 9641054, 9844704, 10290041, 8932674, 7368833, 7500901, 7250153, 7717516, 7761326, 7278071, 6839987, 7276566, 7117407, 7163274, 7411009, 6477634, 6811599, 6731040, 6520637, 6461072, 5946347, 5332170, 5044632, 6283231, 5763020, 5077466, 5100010, 4927288, 4712908, 4244336, 4561569, 4903067, 5269012, 4398009, 4694987, 4309450, 3839881, 4541665, 4217813, 4316669, 4082622, 4313859, 4176286, 3894744, 4182496]
4000D182496O15682j01077n79410m36452k05596m78766K30285R51525k13714r02196
3990C062777L24724M55933o95235L02894R81891m62011m45473l46121j01830l58226
3980B719323J62703N22778q46244N31544k16783j9891j73700Q9628M59776k32098
3970B997036m31021J57398Q0763N91307o44113o70233n36240L13535m0368K21238
3960B039302O25349o2431N61827l70877n6857k14410K40715k45079n85128P2072
3950B004483n31351O00602K64090Q68924L26867k37012M1736o79478m47679J18649
3940B329831K502M06298m88160K13203O16484l31841J52083J07290k82551l65146
3930B359993O386k35805k24087L82513l13813q3244M30536p5579m48982J16837
$$ y = [4182496, 4798178, 4697101, 4117691, 3681239, 3475643, 2996877, 3227162, 4178687, 3964973, 3062777, 3387501, 3843434, 3148199, 3451093, 4432984, 3970973, 3525500, 3179379, 3077549, 2719323, 2882026, 3404804, 2558560, 3090104, 2873321, 2853430, 2679730, 2769358, 3229134, 2997036, 2566015, 2723413, 2804176, 3395483, 2751370, 2081137, 1544897, 1858432, 1818064, 2039302, 2664651, 2602220, 3164047, 2793170, 2736313, 2521903, 2762618, 2517539, 1932411, 2004483, 1473132, 2073734, 2337824, 3206748, 3533615, 3296603, 3338339, 2658861, 2211182, 2329831, 2332333, 2738631, 2250471, 2463674, 3080158, 2748317, 2900400, 3007690, 2725139, 2359993, 2366379, 2130574, 1906487, 2289000, 1975187, 1891943, 2322479, 2246900, 1797918, 1914755]
3920A914755L60522J43575j34393j5574J55986P8533M58370o3221n53968j77458
3910B167127n11167L40558M28216J72947M36626l65240n32735K17224P92426k53268
3900B892714k1932j079331k81038J93231Q15905J080617q9688l98086q01061L2273
3890B343604q06282P26181K21903k66457j6477o83471K78017R64130J73804o00370
3880B334582m49543k22982P41385J94805O34364m10393r3233k43877j110984M23597
3870A797721J072417m21136L60233L73924o8625N29707n6124q30917j004676n5792
3860A696732O63001K835j32412N36194L68950o39715O9621m22648J35826K80196
3850B558580L35394L75686J77998p70402j8040K25347Q6961J58588k2524L01391
$$ y = [1914755, 2275277, 2418852, 2284459, 2268885, 2424871, 2503404, 2961774, 2898553, 2344585, 2167127, 1655960, 1996518, 2424734, 2597681, 3034307, 2669067, 2136332, 2353556, 3145982, 2892714, 2870782, 1791451, 1510413, 1703644, 2519549, 3600166, 3510478, 3112392, 2311331, 2343604, 1537322, 2263503, 2485406, 2218949, 2202472, 1519001, 1797018, 2761148, 2934952, 2334582, 1885039, 1662057, 2403442, 2598247, 3232611, 2822218, 2728985, 2485108, 1374124, 1797721, 2870138, 2449002, 2809235, 3183159, 3114534, 3644241, 3588117, 2757200, 1752524, 1696732, 2359733, 2362568, 2230156, 2766350, 3135300, 2495585, 2565206, 2142558, 2278384, 2558580, 2893974, 3269660, 3447658, 2677256, 2659216, 2884563, 2971524, 3130112, 3107588, 3408979]
3840C408979L63378l23269l68588k05149K96963k72907n36363k81256J052207
3831C133995j4357K09884K98715o33902j17511L53067M98497m98592k12849m0954
3821B975993Q6820m12989K5438O01113M14206M46487M45461p33590j028144O90560
3811C511355K72124J94342L07257k12815k32851o9890j00777m60977M77049l44421
3801C340396O56262P9981J51528J3742k86900l81753N2091k91478O3041Q29071
3791D225981P64357k83453n07402Q59281J32452p61951j32133L50897Q73945p95605
3781D726369m97560Q7287J23471m867K4737p3432L62242J12220K81447K72931
3771E414845L06670l61172J45923o03047j01426Q1606L96373P75036P53356K45907
$$ y = [3408979, 3772357, 3449088, 3080500, 2875351, 3172314, 2899407, 2363044, 2081788, 3133995, 3119638, 3329522, 3628237, 2994335, 2876824, 3229891, 3728388, 3229796, 3016947, 2975993, 3062813, 2649824, 2675262, 3276375, 3690581, 4137068, 4582529, 3848939, 2820795, 3511355, 3783479, 3977821, 4285078, 4072263, 3839412, 3769522, 3668745, 3207768, 3684817, 3340396, 3996658, 4076639, 4228167, 4241909, 3955009, 3573256, 3625347, 3333869, 3396910, 4225981, 4990338, 4706885, 4199483, 5058764, 5191216, 4429265, 4297132, 4648029, 5521974, 4726369, 4228809, 4316096, 4439567, 4434700, 4459437, 4386005, 4748247, 4860467, 5141914, 5414845, 5721515, 5360343, 5506266, 4903219, 4801793, 4883399, 5279772, 6054808, 6808164, 7054071]
3761G054071q19996N45493M8936r15228Q02016L61920n08370L27664j058920N21908
3751F359494J019548k43518k73164o10900K63087J281097j89829p90599J55848
3742F971064r7258J37073j20115J173O52198K9145n1578J200702n37994l15413
3732G868997R20750k23418N89379q79182M92955J016990j52420J88161K23156
3723A0045368J03670j12694m91556L44527Q6982P17637N74037p59540O96403o43312
3713A0561522p6000J741354O4015k12568j89824q0564J84395M62954J80813L85639
3703A3021736m24670R29186m27052O03893N73825r53278J00752N95488R15006
3694A4934886j4772l68704J3825L82860Q85846M47707J86444m67099K26561J445931
$$ y = [7054071, 6234075, 6779568, 6828504, 5913276, 6715292, 7077212, 6568842, 6896506, 5837586, 6359494, 7379042, 7135524, 6862360, 6251460, 6514547, 7795644, 7605815, 6815216, 6971064, 6873806, 7010879, 6890764, 6891937, 7544135, 7573280, 7521702, 8722404, 8184410, 7868997, 8789747, 8566329, 9155708, 8276526, 8769481, 9786471, 9634051, 9822212, 10045368, 10149038, 10036344, 9544788, 9889315, 9976297, 10693934, 11267971, 10508431, 11204834, 10561522, 10485522, 12226876, 12290891, 12078323, 11888499, 11807935, 11992330, 12455284, 12636097, 13021736, 12597066, 13526252, 13099200, 13703093, 14276918, 13323640, 13424392, 14019880, 14934886, 14920114, 14551410, 14565235, 14948095, 15833941, 16281648, 16468092, 16000993, 16227554, 17673485]
3684A7673485M44740N09137N37026k56985p4062K86728L35019O53955N43433L12285
3674B0964761o76719O66547J349940o5791P30445J019423P26136P07552P69363
3665B6191657R45764M86927P20324J291210M74663N03911O30449R50080Q34205
3656C3029190Q39328O83562K38900O47128J016939l9115N77920J084661K86598
3647C8365111M51404J118099J125240J47939K76863L09576O87119O33281m71201
3638D2643431k58223M30456L85680L81294M96028K84805o46573M92478j36026
3629D4073350n56693j08609j76618m99394K42290j459363j093876m22279N6607
3620D0055415K01682m54074m39645j525686O2354l8789j802170r21821k41036
$$ y = [17673485, 18118225, 18627362, 19164388, 18907403, 18833341, 19120069, 19455088, 20109043, 20652476, 20964761, 20288042, 20954589, 22304529, 22238738, 22969183, 23988606, 24714742, 25422294, 26191657, 27137421, 27624348, 28344672, 29635882, 30110545, 30614456, 31244905, 32194985, 33029190, 33868518, 34552080, 34790980, 35438108, 36455047, 36415932, 36993852, 38078513, 38365111, 38816515, 39934614, 41059854, 41207793, 41484656, 41794232, 42481351, 43114632, 42643431, 42385208, 42815664, 43201344, 43582638, 44078666, 44363471, 43716898, 44209376, 44073350, 43516657, 43408048, 43231430, 42732036, 42974326, 41514963, 40421087, 39998808, 40055415, 40257097, 39803023, 39363378, 37837692, 37900046, 37861257, 36059087, 35137266, 34896230]
3611C4896230N52063q37918j056986q72183K96371M88671j239116j73886m96778
3602C1556468j018874j21425o07437j643543L27444P21184p77523j133519m61085
3593B6841690O2745j081l90344N32485N6185j117396N54009n13174M09180k07990
3583B6226309k13238p46099l8267J074658l95429J60487P40769P43532l34142
3574B7218580o32861l43123J207213Q0406J16115J99946k02175Q29008Q74826
3565B9347935J56720m69594K03661L19841m20057R24556N98190L78888l60788
3556C0679352j8217N17265P93714O85833j69636k71201O06896k71941m50587J48875
3546C2250353m7780J163087q91238K94815M76686j110904k77213J75580n65854
$$ y = [34896230, 35448293, 34610375, 33553389, 32681206, 32977577, 33466248, 32227132, 32053246, 31556468, 30537594, 30416169, 29808732, 28165189, 28492633, 29213817, 28436294, 27302775, 26841690, 26904435, 26903354, 26513010, 27045495, 27101680, 25984284, 26538293, 26025119, 26434299, 26226309, 26013071, 25266972, 25228705, 26303363, 25907934, 26068421, 26809190, 27552722, 27218580, 26585719, 26242596, 27449809, 27530215, 27646330, 27846276, 27644101, 28473109, 29347935, 29504655, 29035061, 29238722, 29558563, 29138506, 30063062, 30661252, 31040140, 30679352, 30661135, 31178400, 31972114, 32657947, 32488311, 32217110, 32824006, 32552065, 32101478, 32250353, 32202573, 33365660, 32474422, 32769237, 33245923, 32135019, 31857806, 32033386, 31467532]
3537C1467532p9085M3541j177282p5488K56180L449j019806j42973l55534q39982
3527B8080552j058881L77527l21017o52920O19300p43217o10308o48239l03541
3518B4739256l50300j9531r74102j395920m68991Q33312J12639q92180n92209
3509B0991974j132826M93662l18614m46632r89723l8634L84952k58199K6102q23704
3499A7888358R01568m71508r4219j22679m01267P06098l27275m45803o78468N38100
3489A7492905j86759m41547N08205p94226l93906N08029J002658j036937p81080
3480A5877342k16764K40250P34732k23093n58129j43708J91833P62039L49562
3471A7014064K28695m66059j82561j31165M17166m90139k30881K94062K59291
$$ y = [31467532, 31388447, 31431988, 30254706, 30179218, 30435398, 30438847, 29419041, 29276068, 28920534, 28080552, 27021671, 27399198, 27078181, 26425261, 27044561, 26301344, 25691036, 25042797, 24739256, 24388956, 24369425, 23395323, 21999403, 21530412, 22363724, 22476363, 21584183, 20991974, 19859148, 20352810, 20034196, 19587564, 18597841, 18559207, 18944159, 18685960, 18712062, 17888358, 18789926, 18318418, 18224199, 18101520, 17700253, 18406351, 18079076, 17633273, 16954805, 17492905, 17306146, 16864599, 17372804, 16578578, 16184672, 16692701, 17695359, 16658422, 15877342, 15660578, 15900828, 16635560, 16412467, 15854338, 15710630, 15902463, 16664502, 17014064, 17242759, 16776700, 16594139, 16462974, 16880140, 16390001, 16159120, 16453182, 16712473]
3462A6712473k1921m98679L25206l44317L33684K8597J71461K0587J0681O06905
3452A7344677J020198l61117N30051q89043L0086N42520M6739M1863N9792n01951
3442A7863815o4461J76516k48485O16957P98469Q8973j77435j98161P87759J73453
3432A9817400M21968Q66353k52200L09562N36703J98950k65817K13155L2462K53689
3422B2132225J77224J125479L30560N52085L42644j47642K15760J79135N10876
3413B5418346k92938m28669R00991L34958m61304K55574P19877J065596J048367
3404B8560798l93593n49465J251499K66204k02325K62272k58916Q02297M78573
3395C0217344J011969J7655K57559L41083M18439M44450L34073R69373J76255
$$ y = [16712473, 16690552, 16191873, 16517079, 16172762, 16506446, 16535043, 16706504, 16727091, 16737772, 17344677, 18364875, 18003758, 18533809, 17644766, 17674852, 18217372, 18264111, 18305974, 18365766, 17863815, 17799354, 17975870, 17727385, 18344342, 19142811, 19231784, 19054349, 18856188, 19643947, 19817400, 20239368, 21105721, 20853521, 21163083, 21699786, 21898736, 21632919, 21846074, 21878536, 22132225, 22309449, 23434928, 23765488, 24317573, 24660217, 24512575, 24728335, 24907470, 25418346, 25125408, 24696739, 25597730, 25932688, 25471384, 25726958, 26446835, 27512431, 28560798, 28167205, 27617740, 28869239, 29135443, 28933118, 29195390, 28936474, 29738771, 30217344, 31229313, 31246968, 31504527, 31845610, 32264049, 32708499, 33042572, 34011945, 34188200]
3386C4188200N80034Q82203L73938R80982O13202q004J37522N89155P56348J036470
3376D0130050J229139Q44822K26286L84056J094058J769126Q70973R89478R46407
3367D8484395N79392Q49825Q45856J970851J195785K02215N94617J425807Q65801
3358E7014544J187266J518701J296641N67558J159014P50315J054226J932752
3350F6481017J004803J127608J698671J531806R60032R94836J746144J653179
3342G7198096Q01769J141724J736165J291970J676803J047069R86652J634973
3334H7515221J954124J126861J762559K517783K631934J719042J673972J505850
3326A02407346J438225K384461K371295K085964L504367J614371K297642L760875
$$ y = [34188200, 34768234, 35650437, 36024375, 37005357, 37618559, 37610555, 37748077, 38337232, 39093580, 40130050, 41359189, 42204011, 42430297, 42814353, 43908411, 45677537, 46548510, 47537988, 48484395, 49063787, 49913612, 50759468, 52730319, 53926104, 54128319, 54722936, 56148743, 57014544, 58201810, 59720511, 61017152, 61584710, 62743724, 63494039, 64548265, 66481017, 67485820, 68613428, 70312099, 71843905, 72803937, 73798773, 75544917, 77198096, 77999865, 79141589, 80877754, 82169724, 83846527, 84893596, 85880248, 87515221, 89469345, 90596206, 92358765, 94876548, 97508482, 99227524, 100901496, 102407346, 103845571, 106230032, 108601327, 110687291, 114191658, 115806029, 118103671, 121864546]
3318A21864546K514373K292260L017579K602299J742598L226077L126801K786238
3310A43172771K070320L275220L109392L899093L013248K937762L396005M201849
3302A69075660M149061L566381M140291L284705L845233M115199L462253M131531
3294A99770314M066749M226954M472801M804663M103369L724362L239103N788951
3286B34197266M448527L662374N562561L618625M198336M148153L726928M348140
3278B67910910L011981L310390L689575L273313K122925J275272P37880K40220
3270B85572466R26010r86626j556145j325976k982196k714217l135045m188137
3262B69610134l558157m774464m941988m546951n697912o474920n839591o619145
$$ y = [121864546, 124378919, 126671179, 129688758, 132291057, 134033655, 137259732, 140386533, 143172771, 145243091, 148518311, 151627703, 155526796, 158540044, 161477806, 164873811, 169075660, 173224721, 176791102, 180931393, 184216098, 188061331, 192176530, 195638783, 199770314, 203837063, 208064017, 212536818, 217341481, 221444850, 225169212, 228408315, 234197266, 238645793, 242308167, 247870728, 251489353, 255687689, 259835842, 263562770, 267910910, 270922891, 274233281, 277922856, 281196169, 283319094, 284594366, 285332246, 285572466, 286498476, 285511850, 283955705, 282629729, 279647533, 276933316, 273798271, 269610134, 266051977, 261277513, 256335525, 251788574, 246090662, 239615742, 233776151, 227157006]
3254B27157006o654813o461793o008422o472062o717836n837496n415780o287608
3246A77301196n410454n635485o218808n542622m911196n641548n747447m797785
3238A33395851m428290l806659m336777l985063l571887l355560l821632k875821
3230A03214162l888696k577807k294492m322400j833811k390214k782243l095641
3222H0028858j855145k136792j793706k420950j598205k055036k517503p44486
3214F4907035j107932j918070j556475j146201j540206k025636j287031j261313
3206E3064171j487596o69280j387946j419915o97156k31506j952273j141917q68937
3197D3207645p25019l24001j018801j064161j630150j417023n73873k42264n40545
$$ y = [227157006, 220502193, 214040400, 208031978, 201559916, 194842080, 189004584, 183588804, 177301196, 171890742, 166255257, 160036449, 154493827, 149582631, 143941083, 138193636, 133395851, 128967561, 125160902, 120824125, 116839062, 113267175, 109911615, 106089983, 103214162, 99325466, 96747659, 94453167, 90130767, 88296956, 85906742, 83124499, 80028858, 78173713, 76036921, 74243215, 71822265, 70224060, 68169024, 65651521, 64907035, 63799103, 61881033, 60324558, 59178357, 57638151, 55612515, 54325484, 53064171, 51576575, 50907295, 49519349, 48099434, 47402278, 47170772, 45218499, 44076582, 43207645, 42482626, 42158625, 41139824, 40075663, 38445513, 37028490, 36454617, 36212353, 35671808]
3188C5671808j213022p1073o85254k65839o34518n65187m21037q03912q54971
3179C0156995n67064M18791j77941n10878N5871r73462j439689k75084K35543
3170B6923082l27823L1799k91071N9721j78218p10695l92906J3566q16483J62871
3160B4473843q54306n38893N610k32903p11178l21155m74812J0428P45411j52186
3150B1949859k95835J15042o6329o59723n42653o09021L95811L89996K63580q71954
3140B0068773L24079O1169j156232m58690L29625k44612l61934m14971Q54681
3131A9001888o52899L65240R2747n43558L69461l04840n2454j98002J99663o49795
3121A7627451p0180L42039K4441k61549L62177k37094j529750R95439L32023k95438
$$ y = [35671808, 34458786, 34387713, 33702459, 33436620, 32802102, 32236915, 31815878, 31011966, 30156995, 29589931, 30008722, 29830781, 29319903, 29375774, 28402312, 26962623, 26687539, 26923082, 26595259, 26627058, 26335987, 26395708, 26217490, 25506795, 25113889, 25127455, 24310972, 24473843, 23619537, 23080644, 23086254, 22853351, 22142173, 21821018, 21346206, 21356634, 22102045, 21949859, 21654024, 21769066, 21702737, 21043014, 20500361, 19891340, 20287151, 20677147, 20940727, 20068773, 20392852, 20454021, 19297789, 18839099, 19168724, 18924112, 18562178, 18147207, 19001888, 18348989, 18714229, 18806976, 18263418, 18632879, 18328039, 18275585, 18077583, 18277246, 17627451, 17557271, 17899310, 17923751, 17662202, 18024379, 17787285, 16257535, 17252974, 17584997, 17289559]
3111A7289559k08472J10752l03268O74544Q7488j107760q60503J02907P18530
3102A6503777m88845Q34996N24737o38881n73550L47043n0219J29214K0300Q61736
3092A7470308Q4283m27339m82760l80245m1869O00486j33699L16587o1327K42092
3082A7186517K51015n42110O58384o4383L32187n23351O84352O66701m01902k82070
3072A7965340K11076K24927J013839p69006J95076j31811l34848J471808L57409
3063B0203810k10496j02013j17644r3843l26142o2556j72576P81448M25209o24263
3053A9700934K38944J004239J135782q78916K12443L24943N19823R35355N13523
3044B3707070j72055j86079Q61783L04638K94168K58830K96940M72239J98320
$$ y = [17289559, 17081087, 17191839, 16888571, 17563115, 17650603, 16542843, 15682340, 15785247, 16503777, 16014932, 16849928, 17374665, 16735784, 16162234, 16509277, 16459058, 16588272, 16608572, 17470308, 17554591, 17127252, 16644492, 16264247, 16222378, 16822864, 16689165, 17005752, 16944425, 17186517, 17437532, 16895422, 17553806, 17489423, 17821610, 17298259, 17982611, 18649312, 18247410, 17965340, 18176416, 18401343, 19415182, 18646176, 18841252, 18709441, 18374593, 19846401, 20203810, 19993314, 19891301, 19773657, 19679814, 19353672, 19291116, 19118540, 19899988, 20325197, 19700934, 19939878, 20944117, 22079899, 21200983, 21413426, 21738369, 22258192, 23193547, 23707070, 23535015, 23348936, 24210719, 24515357, 24809525, 25068355, 25365295, 25837534, 26035854]
3035B6035854P28737L08632k2507L91206P90273N96178O8873L74989J277973J79350
3025C0729558J31065L48435Q97514N50579k49443M55341J251298L95704R64919
3016C5474970R3261M95104m1730M14255J431003N87791K21119P52059J695842
3007D1123674L60103P24057R06726P65954M37612Q96928Q31615J238518J75034
2998D7460221P18323J550081J386203O45056P40302N38018J191010J871051J107945
2989E7208210J154214R70676J373665J047618J332174J136071J815098J617461
2981F7655187J290954K239894K545406J742317J825274J915521J268794K236853
2973H2720200J955584J176473K798336K862171L021055K396596K221045L145235
$$ y = [26035854, 26764591, 27073223, 27050716, 27441922, 28232195, 28828373, 28897246, 29272235, 30550208, 30729558, 30860623, 31209058, 32106572, 32657151, 32407708, 32863049, 34114347, 34510051, 35474970, 35568231, 36063335, 36021605, 36435860, 37866863, 38454654, 38675773, 39427832, 41123674, 41483777, 42207834, 43114560, 43880514, 44318126, 45215054, 46046669, 47285187, 47460221, 48178544, 49728625, 51114828, 51759884, 52500186, 53038204, 54229214, 56100265, 57208210, 58362424, 59333100, 60706765, 61754383, 63086557, 64222628, 66037726, 67655187, 68946141, 71186035, 73731441, 75473758, 77299032, 79214553, 80483347, 82720200, 84675784, 85852257, 88650593, 91512764, 94533819, 96930415, 99151460, 102296695]
2965A02296695K606183K013081L070076M526608K936286K654669K624273L494358
2957A26222229L287771K894995L565096K673068L178934K653557L114096L229630
2949A50819376K888445K474561K366161K583621K517412K522834K725299J782881
2941A70680590J610511K049528J514299J705781J271091K100386J913612K263506
2933A85109304K264003J067679K025278K327690J169228J205472J310106J307522
2925A97786282N24260P79079J02387q23885j544934j39374j725516j761283j898125
2916A91298891j756973k316806k904202l068980l305775k682777l155384m046751
2908A68061243l812598l564112l685561l284534l849829k473118k577492k622171
$$ y = [102296695, 104902878, 106915959, 109986035, 114512643, 117448929, 120103598, 122727871, 126222229, 129510000, 132404995, 135970091, 138643159, 141822093, 144475650, 147589746, 150819376, 153707821, 156182382, 158548543, 161132164, 163649576, 166172410, 168897709, 170680590, 172291101, 174340629, 175854928, 177560709, 178831800, 180932186, 182845798, 185109304, 187373307, 188440986, 190466264, 192793954, 193963182, 195168654, 196478760, 197786282, 198310542, 199089621, 199192008, 198368123, 196823189, 196683815, 194958299, 193197016, 191298891, 189541918, 187225112, 184320910, 181251930, 177946155, 175263378, 172107994, 168061243, 164248645, 160684533, 156998972, 153714438, 149864609, 147391491, 144813999, 142191828]
2900A42191828k450089k669144k322709k009345j518636j826850l603016k703526
2892A23088513k328009k371630k528993k737257k506149j856910k145373l462261
2884A03151931l767248k724636l073582k566632k573745k898954l114598l147022
2876G9285514j437502k360648k582589l040100k848650j990379k323861j206825
2868F1494960k482641j957171j933846j818247k249661j524696j076693j391641
2860D7060364k259390j613211o55362j576106p95558j702474j299463m45239j665032
2851C5048529p69904n95212j358698o21603q79673j51648l52565j163191j163659
2842B7992376j591662P8477p13870p13453L08894j113563q31533n81116q35205
$$ y = [142191828, 139741739, 137072595, 134749886, 132740541, 131221905, 129395055, 125792039, 123088513, 120760504, 118388874, 115859881, 113122624, 110616475, 108759565, 106614192, 103151931, 99384683, 96660047, 93586465, 91019833, 88446088, 85547134, 82432536, 79285514, 77848012, 75487364, 72904775, 69864675, 67016025, 65025646, 62701785, 61494960, 59012319, 57055148, 55121302, 53303055, 51053394, 49528698, 48452005, 47060364, 44800974, 43187763, 42532401, 40956295, 40160737, 38458263, 37158800, 36713561, 35048529, 34278625, 33683413, 32324715, 31703112, 30823439, 30671791, 30319226, 29156035, 27992376, 26400714, 26479191, 25765321, 25051868, 25360762, 24247199, 23415666, 22834550, 21999345]
2833B1999345p43123p3959r41285o4651k25437p20476J63571K16549l72522m60073
2823A8777939m53996m91519j538342K4507l69871o51734k29944k65960p992l81813
2813A4411275n3994M46163p27531r37602m90507k52305K83669m99432q2751j47002
2803A1949983j21699j60964l74171j247444M98865K82278q26057l42738r5076
2794I562977K97100J059632m65629l14974k21836o53362m9409K4258O89133K3934
2784I951824q36548j34591l91339M93662n36l97216M4973m42831l62739l38486
2774G586173k34848q33930O7772J324085L56826l71758K11696l70778n10521k53715
2764F971002N25719K80797J02852n92681O1636o3865O294l75799r3283P0813l37565
$$ y = [21999345, 21256222, 21182263, 20240978, 20176327, 19950890, 19230414, 19393985, 19610534, 19238012, 18777939, 18323943, 17832424, 16294082, 16318589, 15948718, 15296984, 15067040, 14801080, 14793088, 14411275, 14357281, 14803444, 14075913, 13138311, 12647804, 12395499, 12679168, 12179736, 12096985, 11949983, 11828284, 11667320, 11293149, 10045705, 10544570, 10826848, 10000791, 9658053, 9562977, 9860077, 10919709, 10454080, 10139106, 9917270, 9263908, 9214499, 9238757, 9927890, 9951824, 9115276, 8980685, 8589346, 9083008, 9082472, 8685256, 8730229, 8287398, 7924659, 7586173, 7351325, 6517395, 6585167, 7909252, 8266078, 7894320, 8106016, 7735238, 7224717, 6971002, 7496721, 7777518, 7880370, 7287689, 7349325, 7285460, 7291754, 6915955, 6822672, 6893485, 6555920]
2753F555920K28523q20605j062755J0550K68256J49202L83354N40514j28287l52467
2743E772205J93434o5053p77316P9732j04024k05710Q9812m62627J83252M16396
2733E120101k47830p1794m82401N76814o39563n0509Q82639j067756p60993M35376
2723C694084K14704j06315Q11831J86176M8669j060517L82328M54753o08595k33325
2713C783793L6646k38038k12664l50894L10548l26945P1955L22664J17734J23813
2703C638612K07660K14632N17806n99753p59875p45851N98983P13159l40046N95137
2693D040464R0746L25143q6321j899o25415J24545j379031J66028Q56024K2292
2683C532576o99232o3924M49469M41003q82158n56518J340515L86879l92517m38162
$$ y = [6555920, 6784443, 5963838, 4901083, 4911633, 5179889, 5329091, 5712445, 6252959, 6124672, 5772205, 5965639, 5900586, 5123270, 5203002, 5098978, 4893268, 4983080, 4520453, 4703705, 5120101, 4872271, 4800477, 4318076, 4894890, 4255327, 4204818, 5087457, 4019701, 3258708, 3694084, 3908788, 3802473, 4614304, 4800480, 4849149, 3788632, 4170960, 4625713, 4017118, 3783793, 3820439, 3582401, 3369737, 3018843, 3329391, 3002446, 3074401, 3397065, 3514799, 3638612, 3846272, 4060904, 4578710, 3978957, 3219082, 2473231, 3072214, 3785373, 3445327, 4040464, 4131210, 4456353, 4370032, 4368133, 3742718, 3867263, 2488232, 2654260, 3510284, 3532576, 2833344, 2769420, 3218889, 3659892, 2777734, 2221216, 3561731, 3948610, 3556093, 3117931]
2673C117931j12409l13940M81785K62766k45329J02975K1938j70401r1235N72756
2663C626837q10167Q1112R25871M5062l1257l41258o07101Q05981L7711r14993
2653B817798p50715N38924P15864q44506l6963k85342J81615J28202N44691r1965
2643B917603K78525l96597k10983M81775j48898N9580K93792p0714m69917j95116
2633B539050R68922k94203n15011K59307P3049J55509l33564J4443P6559j53706
2623B790355L94925n56698L41552o50463j54447M67131l71549n62518K21459L97184
2613B316931R13449k38268o91037J74841L5878L6995o002k89692o79035m96327
2603A077733K05885j15254n45476L43566P82399P8371N9505J17784J65208p8197
$$ y = [3117931, 3005522, 2691582, 3173367, 3436133, 3190804, 3293779, 3315717, 3145316, 3054081, 3626837, 2816670, 2897782, 3823653, 3868715, 3837458, 3496200, 2889099, 3695080, 3732791, 2817798, 2067083, 2606007, 3321871, 2477365, 2440402, 2155060, 2336675, 2464877, 3009568, 2917603, 3196128, 2799531, 2588548, 3070323, 2921425, 2981005, 3274797, 3204083, 2734166, 2539050, 3507972, 3213769, 2698758, 2958065, 3031114, 3186623, 2853059, 2867502, 2944061, 2790355, 3185280, 2628582, 2970134, 2319671, 2165224, 2632355, 2260806, 1698288, 1919747, 2316931, 3230380, 2992112, 2301075, 2475916, 2511794, 2548789, 2542787, 2253095, 1574060, 1077733, 1283618, 1168364, 622888, 966454, 1748853, 1827224, 1886729, 2004513, 2169721, 2091524]
2593B091524P02674l90036M67221n32183m05868o3985n50219j47136j96636O51402
2583A626758M75202m65882m545P41963m92454M99904m85791r9299k06620K07454
2573A796690k50264p98049n32974J125228K72286o64831J37683j07922n92713
2564C85134Q19812K52459L6088j59259M76831o62721j11241K20224N17793j38314
2554A636806l83543k14225J82979l10525Q06863k48690p16509N93861k40002O72882
2544A779897K93585m09446p25131k62219r9144o6049Q84362k62655n26576K81850
2534H88474L06889P1787J419L343K61093L335m70973K463K48254j96755J93346
2523A312675p51781K77613o2003K41545O38562l13432M09439o24651J42443k73195
$$ y = [2091524, 2794198, 2404162, 2871383, 2339200, 1933332, 1869347, 1319128, 1171992, 975356, 1626758, 2101960, 1636078, 1631533, 2373496, 1881042, 2380946, 1895155, 1795856, 1589236, 1796690, 1546426, 748377, 215403, 1340631, 1612917, 948086, 1085769, 977847, 385134, 1204946, 1457405, 1493493, 1334234, 1811065, 1148344, 1037103, 1257327, 1775120, 1636806, 1253263, 1039038, 1222017, 911492, 1718355, 1469665, 753156, 1347017, 1107015, 1779897, 2073482, 1664036, 938905, 676686, 577542, 511493, 1395855, 1133200, 606624, 888474, 1195363, 1267150, 1268569, 1271912, 1533005, 1536340, 1065367, 1067830, 1316084, 1119329, 1312675, 560894, 838507, 776504, 1018049, 1656611, 1343179, 1752618, 1127967, 1270410, 997215]
2513I97215k18526L05910K06759m31963J78735k1832L09980r6858m4502K9027
2503A213945o17457M7685M27002m60081k30454L748K28267Q4142R06238q9372
2493A513663j036755N5802k06583L9181M64193P2475k98049m56862j39921j74761
2483a67617N82688O67266L72523m12041n94277M81023N87722n06105o31457p5909
2473C03816J25734O2667l09705J109631L91208j71215n84788k29423J39696l13396
2463E24225K82380n24986J66992R9782L42372l01755k25404j28476M11943P7555
2453G24628j65602j87858Q26629l34324J07831Q4139k06856M8905J10512K88248
2443A296252l68706k34365J92695L89884m27095J23119k32246m33240Q89253N3515
$$ y = [997215, 778689, 1084599, 1291358, 859395, 1038130, 1016298, 1326278, 1229420, 1184918, 1213945, 596488, 644173, 1071175, 611094, 380640, 384388, 612655, 696797, 1603035, 1513663, 476908, 532710, 326127, 365308, 829501, 901976, 603927, 147065, 7144, -167617, 415071, 1082337, 1454860, 1042819, 448542, 929565, 1517287, 1011182, 379725, 303816, 429550, 492217, 182512, 1292143, 1683351, 1512136, 927348, 697925, 837621, 524225, 806605, 281619, 448611, 548393, 890765, 589010, 363606, 235130, 647073, 724628, 559026, 371168, 1197797, 863473, 971304, 1055443, 848587, 897492, 1008004, 1296252, 927546, 693181, 885876, 1275760, 848665, 971784, 739538, 306298, 1195551, 1249066]
2433A249066j22202n6308k72444j71796R135N39859o95117J89359k49813L05544
2423G25283R31717n25818j50229K8487O1749R7462j43209M30390K16641l28789
2413A343684k7728j73734l75809M99575L10030L69325n15559p04506J035387L73576
2403B134241j157476m12826O9572J35094R5299J95857L28526M71070n54877N23159
2393A827639Q84474j149575N1532N89560l95502L05576M00801j10953m98638j30386
2383A774528L38068L29293m14260n37824N44928P1499j99529j91497N08559N96207
2373B819972R2661j101210n39026K87620j59563n47635M32235J605046j000844
2364A889256r28835m83303M53452P37315n41115l66469J402015O66358p29915
$$ y = [1249066, 1126864, 1070556, 798112, 626316, 635451, 1175310, 480193, 669552, 419739, 725283, 1657000, 1131182, 980953, 1009440, 1071189, 1168651, 1025442, 1455832, 1672473, 1343684, 1315956, 1142222, 766413, 1265988, 1576018, 1945343, 1429784, 725278, 1760665, 2134241, 976765, 563939, 633511, 768605, 863904, 1059761, 1388287, 1859357, 1304480, 1827639, 2712113, 1562538, 1614070, 2203630, 1808128, 2113704, 2514505, 2403552, 1904914, 1774528, 2112596, 2441889, 2027629, 1489805, 2034733, 2106232, 1906703, 1715206, 2223765, 2819972, 2912633, 1811423, 1272397, 1560017, 1400454, 852819, 1285054, 2890100, 1889256, 960421, 477118, 930570, 1667885, 1126770, 760301, 2162316, 2828674, 2098759]
2355B098759j45555N2036J11499Q42445k42117q09688Q45753L04727q03443K74196
2345B528612k16827m33755K6896J32136L40548m34601j098778O19690M22677m65926
2335A420672k3160P88075L61576k40927M24033O58059m55369r8802l34535q49072
2325A650550K40390J48802j35002n84900n77302Q65818J040486L18426j90844
2316B776424R6708q00998j38094K14370l82432J35780J6280Q43803m22906l9247
2306B299688J93689k79708n80386O0771O84510O20219K56327n5705L60968R2726
2296C653099r86489k22511o3687J13515J22108J04098K5892J88330O36300j041449
2286B529206m7486L77115J34717j39096P67845m1121j047973L19591n72778M47095
$$ y = [2098759, 1953204, 2005240, 2116739, 2959184, 2717067, 1907379, 2753132, 3057859, 2254416, 2528612, 2311785, 1878030, 1904926, 2037062, 2377610, 1943009, 844231, 1463921, 1886598, 1420672, 1397512, 2185587, 2547163, 2306236, 2730269, 3388328, 2932959, 2834157, 2499622, 1650550, 1890940, 2039742, 1904740, 1319840, 742538, 1608356, 2648842, 2967268, 2776424, 2873132, 2072134, 1934040, 2148410, 1765978, 1901758, 1918038, 2761841, 2338935, 2299688, 2493377, 2213669, 1633283, 1694054, 2378564, 2998783, 3255110, 3199405, 3560373, 3653099, 2666610, 2444099, 2380412, 2493927, 2616035, 2720133, 2746025, 2934355, 3570655, 2529206, 2481720, 2858835, 2993552, 2854456, 3622301, 3581180, 2533207, 2852798, 2280020, 2727115]
2276B727115N05700p25968N62677M88664N7691R10546j06042m45599k04066J65287
2266C936005m95161J67152j69967j55646J10507N24641J007536l96713k76046
2257D252308l15217N2413o9309k14419P36201K155j79424p1091J050824N45983
2247E790424k41682o24792P34105O23793j62289r7758q9187J04682K13354L25215
2237F575865m23674J10295M1773J048052M24004j369491l08552P13843J93477
2228G005592J9575M75355j75643N05922P68870k17847l56868J01021m45917O49124
2218H329184M64112M72553q2128M39038Q71278m44135p9573j44363j36466N86439
2208A0275939J015692K30603J04573o6235M7523K31601K73624J21946l84570M30222
$$ y = [2727115, 3232815, 2506847, 3069524, 3558188, 3615879, 4526425, 4420383, 3974784, 3770718, 3936005, 3440844, 3607996, 3438029, 3282383, 3392890, 3917531, 4925067, 4528354, 4252308, 3937091, 3989504, 3920195, 3705776, 4441977, 4444132, 4264708, 4193617, 5244441, 5790424, 5548742, 4923950, 5658055, 6281848, 6119559, 6021801, 5932614, 6037296, 6250650, 6575865, 6152191, 6262486, 6304259, 7352311, 7776315, 6406824, 6098272, 6812115, 7005592, 7025167, 7500522, 7324879, 7830801, 8599671, 8381824, 8024956, 8125977, 7680060, 8329184, 8793296, 9265849, 9183721, 9622759, 10494037, 10049902, 9970329, 9825966, 9689500, 10275939, 11291631, 11522234, 11626807, 11560572, 11608095, 11839696, 12113320, 12235266, 11850696, 12280918]
2198A2280918R22263j69983n13429O08197P51612J24368K88724j03273M27376
2189A4616773K18000j90473P37892j09721J161624M8034L42348L90076N15756
2180A7730309J741330r7612Q7568N21486J004157N01002J09069P56485J153818
2171B3507612N02242j8294L01072P15508Q25597J143786O79660L29236j27854
2162B7858565J933590O11614K005184J391004O87315R28126J373487J136798J308379
2153C9234062K290043J798268J412500J381570J997033J364583K375586K911919
2145E4765564J167131K018716K219063K933441L249283J888552J835493K193948
2137G2271191K172398K192446K910265L149787J989718L487143L011258L004622
$$ y = [12280918, 13203181, 13033198, 12519769, 13127966, 13879578, 14003946, 14292670, 14189397, 14616773, 14834773, 14644300, 15382192, 15272471, 16434095, 16482129, 16824477, 17214553, 17730309, 19471639, 19374027, 19461595, 19983081, 20987238, 21488240, 21597309, 22353794, 23507612, 24009854, 23991560, 24292632, 25008140, 25833737, 26977523, 27657183, 27986419, 27858565, 29792155, 30403769, 32408953, 33799957, 34487272, 35415398, 36788885, 37925683, 39234062, 41524105, 43322373, 44734873, 46116443, 48113476, 49478059, 51853645, 54765564, 55932695, 57951411, 60170474, 63103915, 66353198, 68241750, 70077243, 72271191, 74443589, 76636035, 79546300, 82696087, 84685805, 88172948, 91184206, 94188828]
2129I4188828L791717K601795K644788L145063K605133K336067K652079K350137
2121A16315607O86674l28626j144479j84801j729043l293204j928415j881003
2113A06512710k758884l881708l090636k995321m342182m311963l760029m698413
2105G6673574l938710m419386l629019l665296l287284l827823k465443j712666
2097D9727947k555750k281444k273100k275714j460614j921110k024312j460118
2089C3475785j954154j308083j725634j473118j565940j323748r04271l06376
2081B2914461q86604j525027l36040n82994q34002m44387J36106j260584p81868
2072A6399061P3906n21405n82844j215693j08015j22039k72378m36423p33072
$$ y = [94188828, 97980545, 100582340, 103227128, 106372191, 108977324, 111313391, 113965470, 116315607, 117002281, 116673655, 115529176, 115344375, 113615332, 110322128, 108393713, 106512710, 103753826, 99872118, 96781482, 93786161, 89443979, 85132016, 81371987, 76673574, 72734864, 68315478, 64686459, 61021163, 57733879, 53906056, 51440613, 49727947, 47172197, 44890753, 42617653, 40341939, 38881325, 36960215, 34935903, 33475785, 31521631, 30213548, 28487914, 27014796, 25448856, 24125108, 23220837, 22914461, 22027857, 20502830, 20166790, 19583796, 18749794, 18305407, 18441513, 17180929, 16399061, 16472967, 15951562, 15368718, 14153025, 14045010, 13922971, 13650593, 13214170, 12481098]
2063A2481098N43685j395973M8733K3709o18941k64543J89231j66743k28367q79916
2053I731973k77171q3180M52121m15043m06903k94382O87077p21998r02817p63690
2043G005987j044169L10760N24900j8608m72047K80243M83371j13858m45206q99954
2033E611419l591j18391j84091k79970j50352N59151m29364O90079k90797l42379
2023E061714p5411o76902q06580O60471j07323K77622p3497j81863K42911l05906
2013D015236l51567k0331p3O79433J23615j25531l63937o28332L31625O01771
2003D261909n56654k07815j09127o52670O61615K45590k78809l30565n28987J06952
1993B611439M53429O14441q82770k55260J39487K02245O9108J59377l99546K79647
$$ y = [12481098, 13024783, 11628810, 11677543, 11701252, 11082311, 10817768, 11006999, 10840256, 10611889, 9731973, 9454802, 9371622, 9823743, 9408700, 9001797, 8707415, 9394492, 8672494, 7769677, 7005987, 5961818, 6272578, 6797478, 6778870, 6306823, 6587066, 7070437, 6956579, 6511373, 5611419, 5607828, 5489437, 5305346, 5025376, 4875024, 5434175, 5004811, 5694890, 5404093, 5061714, 4986303, 4309401, 3502821, 4163292, 4055969, 4333591, 4260094, 4078231, 4321142, 4015236, 3663669, 3643338, 3643265, 4322698, 4446313, 4320782, 3956845, 3328513, 3660138, 4261909, 3705255, 3497440, 3388313, 2735643, 3397258, 3642848, 3364039, 3033474, 2504487, 2611439, 3064868, 3679309, 2796539, 2541279, 2680766, 2883011, 2952119, 3111496, 2711950, 2991597]
1983B991597L78244n32824m25261m33566K01060P4571p83596R54151j01718o00194
1973A722464j9788k46793k90010K64503R29298k89777j78729J066154n31645k26231
1963B199446l27891j91498M58222r13166M59494J021568m99440m62197N73535
1954B318073n32112q6359L39750J15677L4504K50444j28197o66902q09314L73937
1944A209501j4243O7149P03064m21226j103800L90664O1684K06361N14825k98597
1934A315382O67933O6859j133399j207714K74560N43143J77137J4508K92429M42141
1924A452979o01469p1046L3221q26082Q0119R71144n12232p50776P75914K31719
1914G83491J29105L20849j46852l6595r68132n61697J019719O47357k86424m53802
$$ y = [2991597, 3369841, 2837017, 2411756, 1978190, 2179250, 2253821, 1470225, 2424376, 2322658, 1722464, 1702676, 1455883, 1165873, 1430376, 2359674, 2069897, 1891168, 2957322, 2425677, 2199446, 1871555, 1680057, 2138279, 1225113, 1684607, 2706175, 2206735, 1744538, 2318073, 1785961, 1699602, 2039352, 2155029, 2189533, 2439977, 2311780, 1644878, 835564, 1209501, 1195258, 1262407, 1965471, 1544245, 440445, 831109, 892793, 1099154, 1613979, 1315382, 1983315, 2050174, 916775, -290939, -16379, 526764, 703901, 718409, 1010838, 1452979, 851510, 780464, 813685, -12397, 67722, 1038866, 526634, -224142, 551772, 783491, 912596, 1233445, 1086593, 1049998, 81866, -479831, 539888, 1187245, 900821, 447019]
1904D47019k02240L25196K79575J79104L54100M92248j379566n22238L06479j73882
1894A05795R57630J64035p55808j23451l53454Q56008Q47734r26554l59896L67586
1884G79625K14280k63896m56357L84716l5237J04392J183858n89465m91282K46517
1874A077151j5732L96795l13408j91825P1693j51517k27450N1003k1019l63233
1864C12458Q17920l35959O8693K48165m74949J06095K36118P2399L16219l66778
1854A000381o49730J42702Q0804J8795j7099j0559l23750M51561O74465L57891
1844A725461m01676m42359p31860N03908l96577m75079M30472K92611J71121k05491
1834D70531m76434L66151R96887K6249j102902M24600K1683K19741J05082j034705
$$ y = [447019, 244779, 569975, 849550, 1028654, 1382754, 1875002, 495436, -26802, 279677, 105795, 1063425, 1227460, 471652, 348201, -5253, 850755, 1698489, 771935, 412039, 779625, 993905, 730009, 273652, 658368, 623131, 727523, 1911381, 1321916, 830634, 1077151, 1061419, 1458214, 1144806, 952981, 1024674, 873157, 645707, 696710, 675691, 312458, 1130378, 794419, 863112, 1111277, 636328, 742423, 978541, 1050940, 1367159, 1000381, 350651, 493353, 574157, 592952, 575853, 565294, 241544, 693105, 1367570, 1725461, 1323785, 881426, 149566, 653474, 256897, -218182, 212290, 504901, 676022, 470531, -5903, 360248, 1357135, 1383384, 280482, 705082, 726765, 946506, 1051588, 16883]
1824A6883k48580Q73498J25098M07817q39349l56791M7558l79809M04289N93689
1814F44303L85584j200682p113O8433N52519J48973M86133j276308J97046J73685
1804A72573R3846m95837n89209J47182N98140j98931o32557K01816J41341M14843
1794a46793L04575J71566l27843M65179J54948j130337m31763R97285o4178j83018
1784a90379K0966m3925J51664N6232k1825n59165M09931k69859K55862l29892
1774e20390k63582R42517l20139n92674L20784k24934Q52332O4938r0499J00044
1764B68397K08430j14811o57917K52783k48850R6191k21293K47883n7686j83734
1754d10607J70074M06999l65875J25944J03490J52537J8450O41202l95496m71144
$$ y = [16883, -231697, 641801, 766899, 1174716, 335367, -21424, 26134, -353675, 50614, 644303, 1029887, -170795, -177908, -109475, 443044, 592017, 1078150, -198158, -1112, 172573, 266419, -229418, -818627, -671445, -73305, -272236, -904793, -702977, -561636, -146793, 157782, 329348, 1505, 466684, 621632, -508705, -940468, 56817, -7361, -190379, -169413, -213338, -61674, -5442, -27267, -586432, -176501, -446360, -190498, -520390, -783972, 158545, -161594, -754268, -433484, -658418, 193914, 258852, 168353, 268397, 476827, 362016, -295901, -43118, -291968, -195777, -417070, -169187, -226873, -410607, -240533, 166466, -199409, -73465, 30025, 182562, 201012, 842214, 446718, -24426]
1744b4426m66298J67675O39636m1240j86923r2350J74321n53949K00201K06507
1734B3154m24338p85526M16443M87477J82451K82574q86262L50657K75198K36390
1724A58218n96523l53668P472K32245Q33640j06856R631j6667K61121Q6429J39496
1713F54538k19433l17038k82130p3432N92973L79438l58554j126590q2715P58328
1703g4615M68792l74364L37173R427m83087m20080j15436P44159j68273Q44983
1693G68679k81766K32908m10172j44030l0730l42315m88640J226629P60946j088012
1683B03497q6511l3494O72301m8325o94424K01591p44098j55548Q68027L12226
1673D95242j28273q2643l17413o38629p9812J86228L18507J38504j21272j30838
$$ y = [-24426, -490724, -323049, 316587, 275347, 88424, -3926, 170395, -383554, -183353, 23154, -401184, -1186710, -770267, -282790, -100339, 182235, -704027, -353370, -78172, 158218, -438305, -791973, -784501, -552256, 281384, 174528, 184159, 167492, 428613, 515042, 654538, 435105, 118067, -164063, -237495, 355478, 734916, 376362, -750228, -832943, -74615, 394177, 19813, 356986, 366413, -116674, -536754, -652190, 91969, -76304, 768679, 486913, 719821, 309649, 165619, 134889, -207426, -696066, 530563, 1291509, 203497, 116986, 83492, 755793, 707468, 13044, 214635, -529463, -685011, 183016, 495242, 366969, 284326, -33087, -671716, -751528, -565300, -246793, -108289, -229561, -360399]
1663c60399O59715p01581L45460o8929k523j51260o07342Q03161J075645n00478
1653D91469n30399J04398l85302k02695K01001l30092M06719K25226j170130K30653
1643i59152P98284J40745N3080m29353n51999j73194M73598j30073N8961j74341
1633h93444P308K86447L01724Q5793L48661K70877L4585k24337L77310J84932
1623G79856o39659L2327k71688l04041O20939R628l04439j13406j11948L11608
1613I177L12013k59883m20042J91336j53625K31072K10920o27837l70257k33636
1603a110762q7533R98648L44790l00238j234229K28341Q71994L58080q95532K34521
1593e91920Q01479N26341j55532n92115l05286j66188n58929M99700N41001p5852
$$ y = [-360399, 299316, -402265, -56805, -125734, -128257, -279517, -886859, -83698, 991947, 491469, -38930, 65468, -319834, -522529, -321528, -651620, -244901, -19675, -1189805, -959152, -160868, -20123, 32957, -396396, -948395, -1121589, -647991, -778064, -719103, -893444, -886136, -599689, -297965, -212172, 136489, 407366, 441951, 217614, 594924, 779856, 140197, 172524, -99164, -403205, 217734, 227362, -77077, -190483, -302431, 9177, 321190, 61307, -358735, -167399, -321024, -89952, 120968, -506869, -877126, -1110762, -1198295, -199647, 145143, -155095, -1389324, -1160983, -288989, 69091, -826441, -591920, 209559, 735900, 580368, -11747, -317033, -483221, -1042150, -542450, -1449, -77301]
1583g7301k88081K70122M9453p20368J55831n3076m80142m83788J292536L5804
1573b99010p71883O28572N06484O34054j77957O9702j2355m51718k61372k32199
1563c67682n63354K32055O36095l65821n31540P72345Q34726p47275o1408q54426
1553a016285R2969J018617l8734L8290l15700J73917l9542p20764J28760J62483
1543e15989K72411O43418j38951q34396N51556k44260j92764M63602P0963K14107
1533B89697k02628k21149j62017K19680k38265m5849l3075k57607J714309R1582
1523A154678n07167l06785m12274K14741J56651n18987m6891K99758L306m70623
1513d33593p0941P06804l79751M01064O30895l43884m51540k51900o65118P93288
$$ y = [-77301, -365382, -95260, -45807, -766175, -610344, -663420, -1143562, -1627350, -334814, -299010, -1070893, -442321, 64163, 698217, 520260, 589962, 577607, 125889, -135483, -367682, -931036, -698981, -62886, -428707, -960247, -187902, 646824, -100451, -161859, -1016285, -923316, 95301, 56567, 94857, -220843, -46926, -86468, -807232, -678472, -515989, -243578, 399840, 260889, -573507, -21951, -266211, -458975, 4627, 75590, 289697, 87069, -134080, -296097, -76417, -314682, -360531, -393606, -651213, 1063096, 1154678, 647511, 340726, -71548, 143193, 299844, -219143, -266034, 33724, 37030, -433593, -504534, 202270, -177481, 223583, 854478, 510594, 59054, -192846, -857964, -64676]
1503f4676O86463r5823j455756k7352N61591J36104l52397j45404q1178M97814
1493c40614L30495L27528K11734q69303P43359q67323Q9810k24893o0128M76380
1483a82955Q69116n73132r23138J49058k42255L86709M90244K63755K21772m19816
1473C9358l75444K29978J14942j33367J97995o08643J17177R51609J73430l39069
1463C67966m98484q5210n6339J84924R3434q6228J85051n12543r26590o1226O59242
1452g36003L42632j44149K09254O76730P21133o44859l31081N4865o7115m30087
1442c48680l22918k84448m94602K4879N18094L95512l1290J16684n10310j6630
1432i53709N10428M90574O78429m64684o48733n84497R72564o73906k94469P15145
$$ y = [-64676, 621787, 525964, -929792, -957144, -395553, -259449, -611846, -757250, -838428, -340614, -10119, 317409, 529143, -340160, 403199, -464124, -374314, -599207, -659335, -182955, 686161, 113029, -810109, -661051, -903306, -516597, -26353, 237402, 459174, 39358, -336086, -106108, 8834, -124533, 73462, -535181, -418004, 533605, 707035, 367966, -130518, -215728, -272067, -87143, 6291, -79937, 105114, -407429, -1334019, -1395245, -736003, -393371, -537520, -328266, 348464, 1069597, 424738, 93657, 148522, 81407, -348680, -671598, -956046, -1450648, -1425769, -907675, -512163, -543453, -426769, -937079, -953709, -443281, 47293, 725722, 261038, -387695, -972192, 372, -673534, -968003, -252858]
1422b52858m20532r5701j98695L40643N11382n2817K87409K97792m61948q71660
1412i16985k6052L86567K00752N22617l08294l44021N9802M63335k82459o28185
1402h72923L56372N32610L62980o99046Q5913K54333N13408N35231p52278p47243
1392d30643K42899M14996k54775J19640j43339J010411j031724l89557P34928
1383B72836r47205K91051R46287j82345p82766Q7793n02175N52270N58968o41806
1373c47092L70208O06238n02080k53152k58240l51934j31920L48973M2562k8753
1363e05190J48812M85271K45484n80173r3984l97634R0270K45111N3350L65159
1353E6476L62032M74580k55807j137855J09397p8392N54394P75878l01752n10121
$$ y = [-252858, -673390, -769091, -967786, -627143, -115761, -168578, 118831, 416623, -45325, -916985, -943037, -556470, -355718, 166899, -141395, -485416, -425614, 37721, -244738, -872923, -516551, 16059, 379039, -320007, -234094, 20239, 533647, 1068878, 316600, -430643, -187744, 227252, -27523, 92117, -51222, 959189, -72535, -462092, 272836, -674369, -383318, 562969, 380624, -402142, -314349, -816524, -264254, 294714, -347092, 23116, 629354, 127274, -125878, -384118, -736052, -867972, -518999, -476437, -505190, -356378, 128893, 374377, -205796, -299780, -697414, -607144, -362033, -308683, 56476, 418508, 893088, 637281, -500574, -391177, -469569, 84825, 860703, 558951, 48830]
1343D8830Q23279r04583K62500J2168j060979j90089R64221j80106k4786m93255
1333g42800j64980L67205j84689O79391L35404M88509j194529K01587K70174P71866
1323H27138k08632J37759l89388k91208l28922L14413K23993N806K07890k3667
1313D75182l16942m44722o22153N64311P00011o82191o83548M68935N20003N27145
1303E06031j28144o30324l43488k25751M38307n25969R6649K65318j57896J189696
1293D84429J73656K73554l68317r74693K65908K56898k36579l90289L01123N34179
1283C19869J190316r24717j016578k60040L59136P6091n19016M05968O58881Q8335
1273C78245o34174k10637j1557N35589j51085m79450j06935n31276O51067P7693
$$ y = [48830, 872109, -32474, 230026, 242194, -818785, -1008874, -44653, -224759, -249545, -742800, -907780, -540575, -725264, -45873, 289531, 778040, -416489, -214902, 55272, 827138, 618506, 756265, 366877, 75669, -253253, 61160, 285153, 290959, 498849, 475182, 158240, -286482, -908635, -344324, 355687, -326504, -1010052, -541117, -21114, 506031, 377887, -252437, -595925, -821676, -383369, -909338, -812689, -547371, -705267, 484429, 658085, 931639, 563322, -411371, -145463, 111435, -125144, -515433, -214310, 319869, 1510185, 585468, -431110, -691150, -332014, -255923, -774939, -368971, 289910, 378245, -255929, -466566, -478123, 57466, -93619, -573069, -680004, -1211280, -560213, -482520]
1263d82520k17741j31106M16334L7325K61030l30148N17090J67252j11014K51552
1253C78054l67858m17430K26376L63255K49302k95932J72667l28844K34653n95762
1243c81519O2533L74309k51462O68206L40054m62249p61499j85199q6004o64492
1233a347322J27889J42706n3041L08156J16617j87135j03287N15041K43654M10608
1223A73886L44115k45258p36021L04271l92646J99212Q31007k31028n35073J095837
1213H08302n70500k33789k5295m65445l83078r56383Q20478O98837l34718M53619
1203a87972Q1160Q0162L11712J17378r6297l57864o08347J95096n08776O18061
1193c55687P27140k68930m73364K97026m46953N26613j59974L38281j24381m58639
$$ y = [-482520, -700261, -831367, -415033, -377708, -116678, -446826, 70264, 237516, 126502, 378054, 10196, -407234, -180858, 182397, 431699, 135767, 308434, -20410, 214243, -381519, -318986, 55323, -196139, 472067, 812121, 349872, -411627, -596826, -682830, -1347322, -1219433, -1076727, -1129768, -821612, -704995, -892130, -995417, -480376, -236722, 173886, 518001, 272743, -463278, -159007, -551653, -352441, 478566, 247538, -287535, 808302, 237802, 4013, -21282, -486727, -869805, -1826188, -1005710, -306873, -641591, -187972, -106812, -26650, 285062, 402440, 306143, -51721, -660068, -464972, -973748, -355687, 371453, 102523, -370841, -73815, -520768, 5845, -154129, 184152, 59771, -398868]
1183c98868L20490j72350N55695j28517M039K1165j25K46143n65982l60962J13271
1172c66001M0364K03570m79271M85086J3282R32739l64726o61940L76362O3515
1162B42980M67875m67064O18200r6091n13775L25634j72661M33382k4797Q668
1152H22351j12251j15721l74932k79130L72471q7594o47958K96197J87149l80665
1142c20083m9296M97299P2589K04987k33546K5777O22047o40549K63912p20670
1132b77533j066172Q5598L98530J385767k39890k05133J13037O83385o12069l90258
1122a24738j17808L08565P88912p22618j25787j52580L28734m59982M72566O86499
1112H81763j153509P02417n72683L89959J64928J5931J16869o36725K1960j1381
$$ y = [-398868, -78378, -250728, 304967, 176450, 180489, 201654, 201529, 447672, -118310, -479272, -366001, -325637, -122067, -601338, -116252, -102970, 829769, 465043, -196897, 179465, 242980, 710855, 243791, 861991, 765900, 252125, 577759, 405098, 838480, 813683, 822351, 710100, 594379, 219447, -59683, 312788, 225194, -422764, -126567, 60582, -320083, -369379, 127920, 200509, 405496, 171950, 197727, 819774, 179225, 443137, -277533, -1343705, -1258107, -859577, 526190, 286300, 81167, 194204, 877589, 265520, -124738, -242546, 66019, 854931, 132313, 6526, -146054, 182680, -277302, 195264, 881763, -271746, 430671, -142012, 247947, 412875, 428806, 545675, -91050, -69090, -80471]
1102h0471N87292n79341k06214N2690N83630q448k07455K57195j24546j103861
1092h29529j0380K99138k23654k36187O65790K37463J41020n3973J49403M98234
1082F37325p5165k49016l87499J8525j33972J32483L73394m32957j43340o55427
1072i15649K12899L11781m4967L12659r1527n73990J74910L48480k07895n738
1062d79037j90442r4327K59113L04886p35036J111927m8109o143P84644l62574
1052E44902j024564k35130L80829L07648N88593L5162r70075j66012K50301K03094
1042h5252j42028L67701p96404q67640j44939J021864M05224n86183J63408M48463
1032b15786M77634o02850j66382O78218O00929r83639l30381K99209l70726l49557
$$ y = [-80471, 506821, -72520, -278734, -226044, 357586, 349138, 141683, 398878, 274332, -829529, -839909, -540771, -764425, -1000612, -334822, -97359, 43661, -10312, 139091, 637325, 562160, 313144, -74355, -55830, -189802, -57319, 316075, -116882, -260222, -915649, -702750, -390969, -435936, -123277, -214804, -788794, -613884, -265404, -473299, -479037, -669479, -763806, -504693, -199807, -934843, 177084, 128975, 122832, 907476, 544902, -479662, -714792, -333963, -26315, 562278, 597440, -372635, -538647, -288346, -85252, -227280, 140421, -655983, -1523623, -1668562, -646698, -241474, -827657, -664249, -215786, 261848, -341002, -507384, 170834, 771763, -211876, -542257, -243048, -613774, -963331]
1022i63331k11338N04219K6939n43103L99702l11124L27402k17420L81397J095174
1012D88517r91369o87970O39978M34279M10179j188628n82572M35888N70094J171204
1002F99600l88353J00083l9750r84967j53388J30222J80662l25155J2092P88332
992A9378L00095M32264m10152o00803m2840M75848o12901j89034L10503k560M85021
981A64819q02528L70609M44567m16792j087285l42919P74332O1333P67688k61279
971c27455o78344J18647K83490k42293o36690R20175J411159n89191p54440j70726
961f65668p08065R08322L80893J24533j090391k08177L09616L63382M01161o20109
951h04503P42421m68782q811N56647K70297M44454l16372j3787q73017J35748
$$ y = [-963331, -1174669, -670450, -643511, -1186614, -786912, -1098036, -770634, -988054, -606657, 488517, -502852, -1190822, -550844, -116565, 293614, -895014, -1477586, -1041698, -471604, 699600, 311247, 411330, 371580, -613387, -766775, -636553, -455891, -781046, -768954, 19378, 319473, 751737, 341585, -259218, -302058, 173790, -439111, -628145, -317642, -320202, 164819, -637709, -267100, 177467, -239325, -1326610, -1669529, -895197, -833864, -66176, -327455, -1005799, -887152, -603662, -845955, -1482645, -562470, 848689, 259498, -494942, -665668, -1373733, -465411, -84518, 40015, -1050376, -1258553, -948937, -585555, -184394, -804503, -62082, -530864, -539675, 16972, 287269, 731723, 415351, 401564, -471453, -335705]
941c35705j40564K55846m07200J60201P78972j25415k9538k97845N9400j51342
931b33190N60129j76403m35098M62250L75139K47537p95261q7908m47555J012575
921D82215Q72540j083557N69278n8088N3119n63206J67929n0693r12593l91152
911i14208K53924K48850O62580l42669J12945M0856k39878k85601P33156M10277
901F80232L8031j48307j123564m3561n8766M90065L56464r61853L86902J97592
891a86765N77697N09627o36376o3981K09945m12281m5961O04226k13927m19953
881g7749m45763r7915R51806L5240l44155K04808N01811j85388k53187l42666
871e3158j166721J013050j94124J77032M48755n4095p72863P67382P93049j16063
$$ y = [-335705, -476269, -220423, -627623, -467422, 311550, 186135, 156597, -141248, -81848, -233190, 326939, 150536, -284562, 177688, 552827, 800364, 5103, -82805, -530360, 482215, 1354755, 271198, 840476, 782388, 835507, 272301, 440230, 389537, -523056, -914208, -660284, -411434, 251146, -91523, 21422, 62278, -177600, -463201, 269955, 680232, 718263, 569956, -553608, -597169, -655935, -165870, 190594, -771259, -384357, -186765, 390932, 900559, 264183, 200202, 410147, -2134, -48095, 556131, 342204, -77749, -523512, -621427, 330379, 365619, 21464, 226272, 728083, 542695, 289508, -53158, -1219879, -206829, -400953, -223921, 224834, 170739, -602124, 165258, 958307, 842244]
861H42244o62479m18301j77709N04202j78656l3235p2493j33168n14776j81708
851a026079O09467l51717L79209R0435k87294k4731K58659P427K52039p5978K70859
840A02296J01342N18377j005405q2058l98491M1300O77821o9712q484Q0238n3172
829i5948L22169k59220j61820k41746j9342R2462k65504J28010J69345Q9863K7369
818b14362M39415k09434o05341J21287l15271L87552m29199j004213R54207j19934
808i95293M40347N39077J38280q29711n36873Q95294k06140k65335k24622J60029
798h84947M25604m4954L41041m01737K96599K35569J62906l67586m17204j60939
788h15648J68062M12135j091536J302725K27980n00644l08376N3981k40375O20113
$$ y = [842244, 179765, -238536, -416245, 87957, -90699, -123934, -196427, -329595, -844371, -1026079, -416612, -768329, -389120, -298685, -585979, -610710, -352051, -344624, -92585, -168563, 102296, 203638, 722015, -283390, -365448, -763939, -722639, -44818, -114530, -123014, -42776, -95948, 226221, -32999, -194819, -436565, -455907, -363445, -628949, -500939, -331594, -241731, -214362, 225053, 15619, -589722, -468435, -783706, -396154, -825353, -1829566, -875359, -995293, -554946, -15869, 122411, -707300, -1244173, -348879, -555019, -820354, -1044976, -884947, -459343, -504297, -163256, -564993, -268394, -32825, 130081, -237505, -654709, -815648, -647586, -235451, -1326987, -24262, 203718, -296926, -605302, -551321, -791696, -171583]
778a71583J05972N01583N98362q13058N86J71371k58854j88730m32759K78679
768b08431K64721n18172K36001K2521M42590O33813l72898o29018J5793k7395
758a40475l3055j82650M15969l68521O45247J63434m90766j57891J071703k46931
748F76064m90650R6707k68037o89450N68142K72329o09381j50506J203327m42803
738A65742L93526q5094p76921O13143N34727o00260m20202J81363l843j33312
728a31131L3989P52597l27593p82828L08361J41354k0682J32834p79939n9722
718g32760J232858R4482m4034j16105m47985n64828q3446P84369k75023K26016
708G3544Q5175J76309L25479Q9101k63611O6551o49683k06475N12113k91985m87845
$$ y = [-171583, -65611, 435972, 1034334, 221276, 221862, 393233, 134379, -54351, -487110, -208431, 56290, -461882, -225881, -203360, 239230, 873043, 500145, -128873, -113080, -140475, -173530, -356180, 59789, -308732, 336515, 499949, 9183, -148708, 922995, 676064, 185414, 282121, 14084, -675366, -107224, 165105, -444276, -594782, 608545, 165742, 559268, 474174, -302747, 310396, 845123, 244863, -175339, 6024, 2181, -131131, -97142, 655455, 327862, -454966, -146605, -5251, -25933, 106901, -673038, -732760, 500098, 594580, 550546, 434441, -13544, -578372, -661818, 122551, -152472, 73544, 158719, 335028, 660507, 749608, 485997, 552548, -97135, -303610, 208503, -83482, -571327]
697e71327m19257j20024P89049L82007o15979M03073n535l17987M58235K13260
687A95515P38045k05821j680749q5117K12456J75833P98618J86115O86157R8590
677A119642k34667L03251r30097o18884j28467l2229N46161j050217L79592q11434
667a457349Q20235O19831J88350k51737L34726o32431L88599N86282J60813J10538
657H67857L3718N15719j44257m03577N17858p29145o22630p7329Q14214p4693
647F97735r97844Q21256j164324N7398l71342R11324j7431M46775J14974L76546
637H75067k93650p14029L26545n5806n69211k28140M41970J88588n75148l02059
627i05873M87069j13507L93002O63997O73663O3506o58659k94637o74858L32373
$$ y = [-571327, -990584, -1110608, -321559, 60448, -555531, -152458, -157993, -475980, -17745, 195515, 933560, 727739, -953010, -1038127, -825671, -649838, 148780, 334895, 1021052, 1119642, 884975, 1188226, 258129, -360755, -489222, -521451, 24710, -1025507, -645915, -1457349, -637114, -17283, 171067, -80670, 254056, -378375, 10224, 596506, 757319, 867857, 901575, 1417294, 1273037, 869460, 1387318, 658173, 35543, -41786, 772428, 697735, -300109, 521147, -643177, -585779, -957121, -45797, -63228, 383547, 498521, 875067, 581417, -132612, 193933, 138127, -431084, -659224, -217254, -28666, -603814, -905873, -418804, -532311, -139309, 524688, 1198351, 1261857, 603198, 308561, -366297, -33924]
617c3924J63185p58468R64021O39570k48021n95234o7307L01446j95604l50534
607a80870N93546J34431q26040R4549R40754p49304j46436O65107j37716K35811
597F23832M22908j565302l93121M41075R26143K8719p37295L95752L70817J59092
587F72620m02039K81632p8013k55172j35868l88618M11765r9909p57232O58167
577i2667J48949o5861l77796K80042m954j89940n8822K43739l98056O72101n07060
566c50325j56255K33064L29581k54486l38615K08120K76641M6977L74801k23608
556A45895q19714J036337O47835n02372j103713m39668K12292M56718L60204Q5317
546G9131O3182o1208l06549m08061k72930K00808O38060j80392M0359N90064M86901
$$ y = [-33924, 129261, -629207, 334814, 974384, 726363, 131129, 63822, 365268, 169664, -180870, 412676, 547107, -278933, -184384, 756370, 7066, -139370, 525737, 388021, 623832, 1046740, -518562, -911683, -470608, 455535, 484254, -253041, 142711, 513528, 672620, 270581, 552213, 474200, 219028, 83160, -305458, 106307, 6398, -750834, -92667, 56282, -9579, -387375, -107333, -112287, -302227, -361049, -117310, -515366, 156735, -350325, -506580, -273516, 56065, -198421, -537036, -328916, -52275, -5298, 369503, 145895, -673819, 362518, 1010353, 507981, -595732, -1035400, -823108, -366390, -6186, 79131, 142313, 81105, -225444, -633505, -906435, -705627, -67567, -247959, -207600, 382464, 869365]
535H69365l7417p12347j21384m71521j27339M02629N82j23220L01092K22643m40286
524b37203K35140J23708n08810P81741O74497q50624j35018M9141l55217j49371
514c72016J64112Q05921k31455m29970p79397L18661J37870P0489Q26936o59388
504a48237k16164j46311M30997J26288r3818N91926R4087K84740o00792Q056L26287
493F57059r8179J0631n10521j04368j00620k8376P53813p42993o28342J01457
483f90439l1645j85132m61455P84667L87541j9119R8610l46228k00183J24550
473e38833L52897M43960J56034k9674O8832j35337M44294P38549n99193l12710
463E88819J39924n52247L65066l10307l34339j68410j53915K41084J33100J54233
$$ y = [869365, 831948, 119601, -1783, -473304, -600643, -198014, -197432, -320652, -19560, 203083, -237203, -2063, 121645, -387165, 394576, 1069073, 218449, 83431, 132572, -222645, -372016, -207904, 598017, 366562, -63408, -842805, -524144, -386274, -315785, 511151, -148237, -364401, -510712, -79715, 46573, -47245, 544681, 638768, 923508, 322716, 330772, 657059, 558880, 569511, 58990, -45378, -145998, -174374, 579439, -163554, -791896, -690439, -722084, -907216, -1368671, -584004, -196463, -215582, -116972, -463200, -663383, -538833, -185936, 258024, 414058, 384384, 453216, 317879, 762173, 1500722, 901529, 588819, 728743, 176496, 541562, 231255, -103084, -271494, -425409, -184325, -51225, 103008]
453A03008j63219L84531J69808M2941m62431k10297J581927o37993m01605p1672
443C34998j46078K8599k09469N498M24413K29384N43922p8412p05187k40990J64744
432C51422k7687L32096k67765k13410L42464o358M73954L21749o21j58118n70148
421E77578k00348q46340m32549J88904M40457N73807L7083l05133j20825R27926
411H40560K58402j83212k49609J63198q5215n51407k27739M5533j78010N05616
401C38117M00690k45377j15869R9151m22561q42124r5986P53023N88134o9120
$$ y = [103008, -60211, 324320, 494128, 537069, 74638, -135659, 1446268, 808275, 406670, 334998, 188920, 217519, 8050, 13548, 437961, 667345, 1211267, 1132855, 427668, 186678, 351422, 323735, 655831, 388066, 174656, 517120, 510762, 984716, 1306465, 1305844, 1147726, 577578, 377230, -469110, -901659, -712755, -272298, 301509, 338592, 33459, -87366, 840560, 1098962, 915750, 666141, 829339, 744124, 192717, -35022, 10511, -167499, 338117, 738807, 493430, 377561, 476712, 54151, -787973, -883959, -130936, 457198, 388078]
$$ [...]
##END NTUPLES=NMR SPECTRUM
##END=
