##TITLE=1H_EC-3286(III-1)
 CDCl3
 8 sc, 
 22.11.2022
##JCAMPDX= 6.0         $$ Bruker NMR JCAMP-DX V2.0
##DATA TYPE= NMR SPECTRUM
##DATA CLASS= NTUPLES
##ORIGIN= UXNMR, Bruker Analytische Messtechnik GmbH
##OWNER= root
$$ XWIN-NMR		Version 3.5
$$ Tue Nov 22 15:51:15 2022 Russian Standard Time (UT+4h)  she@DPX200
##.OBSERVE FREQUENCY= 200.1313499994
##.OBSERVE NUCLEUS= ^1H
##.ACQUISITION MODE= SIMULTANEOUS
##.ACQUISITION SCHEME= undefined
##.AVERAGES= 8
##.DIGITISER RES= 18
##SPECTROMETER/DATA SYSTEM= spect
##.PULSE SEQUENCE= zg30
##.SOLVENT NAME= CDCl3
##.SHIFT REFERENCE= (INTERNAL, CDCl3, 0, 15.7535)
##AUDIT TRAIL= $$ (NUMBER, WHEN, WHO, WHERE, WHAT)
$$ ##TITLE= Audit trail, XWIN-NMR		Version 3.5
$$ ##JCAMPDX= 5.01
$$ ##ORIGIN= Bruker BioSpin GmbH
$$ ##OWNER= she
$$ F:/spectra/data/she/nmr/H-F/1/pdata/1/auditp.txt
$$ ##AUDIT TRAIL=  $$ (NUMBER, WHEN, WHO, WHERE, WHAT)
(   1,<2022-11-22 15:49:48.14 +0400>,<she>,<DPX200>,
      <created by zg, POWCHK disabled, PULCHK disabled
       configuration hash MD5:
       00 E9 B6 7A A2 85 ED C7 34 08 36 98 17 FE 4E 26
       data hash MD5: 16K
       D6 D5 14 05 3F 2A 41 0E 48 52 65 6C 4C 94 3A F4>)
(   2,<2022-11-22 15:49:51.06 +0400>,<she>,<DPX200>,
      <Start of raw data processing
       efp BC_mod = 2 LB = 0.24 FT_mod = 6 PKNL = 1 PHC0 = -18048.46 PHC1 = 33.40071 SI = 16K 
       data hash MD5: 16K
       86 F5 56 E0 B2 ED 89 3C D1 A1 80 38 A6 B5 A9 A1>)
(   3,<2022-11-22 15:50:12.32 +0400>,<she>,<DPX200>,
      <pk PHC0 = 12.57252 PHC1 = -18.6 
       data hash MD5: 16K
       CA 9D 3A 64 07 BF 83 58 92 5D 34 59 9C BD 77 FA>)
(   4,<2022-11-22 15:50:15.09 +0400>,<she>,<DPX200>,
      <abs ABSG = 5 
       data hash MD5: 16K
       8F 12 3B 4D 5A 16 6F 7F 97 8F 6A F1 E3 FF 9D 2B>)
$$ ##END=
$$ 
$$ hash MD5
$$ 1B 48 7C 5C 07 7D 3D 17 5E 7B 2B BD 15 EA 4A 3C
##$RELAX= 
##$RELAX= 
##$RELAX= 
##$RELAX= 
##$RELAX= 
##$RELAX= 
$$ Bruker specific parameters
$$ --------------------------
##$DU= <F:/spectra>
##$EXPNO= 1
##$NAME= <H-F>
##$PROCNO= 1
##$TYPE= <nmr>
##$USER= <she>
##$AMP= (0..31)
100 100 100 100 100 100 100 100 100 100 100 100 100 100 100 100 100 100 
100 100 100 100 100 100 100 100 100 100 100 100 100 100 
##$AQSEQ= 0
##$AQ_mod= 1
##$AUNM= <au_zg>
##$AUTOPOS= <>
##$BF1= 200.13
##$BF2= 200.13
##$BF3= 200.13
##$BF4= 200.13
##$BF5= 200.13
##$BF6= 200.13
##$BF7= 200.13
##$BF8= 200.13
##$BYTORDA= 1
##$CFDGTYP= 0
##$CFRGTYP= 5
##$CHEMSTR= <none>
##$CNST= (0..31)
1 1 145 1 1 1 1 1 1 1 1 1 1 1 1 1 1 1 1 1 1 1 1 1 1 1 1 1 1 1 1 1 
##$CPDPRG= <>
##$CPDPRG1= <>
##$CPDPRG2= <>
##$CPDPRG3= <>
##$CPDPRG4= <mlev>
##$CPDPRG5= <mlev>
##$CPDPRG6= <mlev>
##$CPDPRG7= <mlev>
##$CPDPRG8= <mlev>
##$CPDPRGB= <>
##$CPDPRGT= <>
##$D= (0..31)
0 1.2 0 0 0 0 0 0 0 0.06 0 0.03 0 0 0 0 0.0002 0 0 0 0 0 0 0 0 0 0 0 0 
0 0 0 
##$DATE= 1669117787
##$DBL= (0..7)
120 120 120 120 120 120 120 120 
##$DBP= (0..7)
150 150 150 150 150 150 150 150 
##$DBP07= 0
##$DBPNAM0= <>
##$DBPNAM1= <>
##$DBPNAM2= <>
##$DBPNAM3= <>
##$DBPNAM4= <>
$$ [...]
##$SUBNAM3= <"">
##$SUBNAM4= <"">
##$SUBNAM5= <"">
##$SUBNAM6= <"">
##$SUBNAM7= <"">
##$SUBNAM8= <"">
##$SUBNAM9= <"">
##$SW= 18.0517283424941
##$SWIBOX= (0..15)
0 0 2 0 0 0 0 0 0 0 0 0 0 0 0 0 
##$SW_h= 3612.71676300578
##$TD= 16384
##$TD0= 1
##$TE= 0
##$TE2= 300
##$TE3= 300
##$TEG= 300
##$TL= (0..7)
0 120 120 120 120 120 120 120 
##$TP= (0..7)
150 150 150 150 150 150 150 150 
##$TP07= 0
##$TPNAME0= <>
##$TPNAME1= <>
##$TPNAME2= <>
##$TPNAME3= <>
##$TPNAME4= <>
##$TPNAME5= <>
##$TPNAME6= <>
##$TPNAME7= <>
##$TPOAL= (0..7)
0.5 0.5 0.5 0.5 0.5 0.5 0.5 0.5 
##$TPOFFS= (0..7)
0 0 0 0 0 0 0 0 
##$TUNHIN= 0
##$TUNHOUT= 0
##$TUNXOUT= 0
##$USERA1= <user>
##$USERA2= <user>
##$USERA3= <user>
##$USERA4= <user>
##$USERA5= <user>
##$V9= 5
##$VALIST= <valist>
##$VCLIST= <CCCCCCCCCCCCCCC>
##$VD= 0
##$VDLIST= <DDDDDDDDDDDDDDD>
##$VPLIST= <PPPPPPPPPPPPPPP>
##$VTLIST= <TTTTTTTTTTTTTTT>
##$WBST= 1024
##$WBSW= 4
##$XGAIN= (0..3)
0 0 0 0 
##$XL= 0
##$YL= 0
##$YMAX_a= 387533
##$YMIN_a= -503375
##$ZGOPTNS= <>
##$ZL1= 120
##$ZL2= 120
##$ZL3= 120
##$ZL4= 120
##$ABSF1= 15.73587
##$ABSF2= -2.315979
##$ABSG= 5
##$ABSL= 3
##$ALPHA= 0
##$AQORDER= 0
##$ASSFAC= 0
##$ASSFACI= 0
##$ASSFACX= 0
##$ASSWID= 0
##$AUNMP= <proc_1d>
##$AZFE= 0.1
##$AZFW= 0.1
##$BCFW= 0
##$BC_mod= 2
##$BYTORDP= 0
##$COROFFS= 0
##$CY= -3
##$DATMOD= 1
##$DC= 0
##$DFILT= <>
##$DTYPP= 0
##$F1P= 0
##$F2P= 0
##$FCOR= 1
##$FTSIZE= 16384
##$FT_mod= 6
##$GAMMA= 0
##$GB= 0
##$INTBC= 1
##$INTSCL= 3.70164e-10
##$ISEN= 128
##$LB= 0.24
##$LEV0= 0
##$LPBIN= 0
##$MAXI= 10000
##$MC2= 0
##$MEAN= 0
##$ME_mod= 0
##$MI= 1.114404
##$NCOEF= 0
##$NC_proc= -6
##$NLEV= 6
##$NOISF1= 3.799351
##$NOISF2= 2.8
##$NSP= 0
##$NTH_PI= 0
##$NZP= 0
##$OFFSET= 15.7535
##$PC= 1
##$PHC0= -18035.89
##$PHC1= 14.80071
##$PH_mod= 1
##$PKNL= yes
##$PPARMOD= 0
##$PSCAL= 0
##$PSIGN= 0
##$REVERSE= no
##$SF= 200.130003609618
##$SI= 16384
##$SIGF1= 3
##$SIGF2= 2
##$SINO= 5.538805
##$SIOLD= 16384
##$SREGLST= <1H.CDCl3>
##$SSB= 0
##$STSI= 16384
##$STSR= 0
##$SW_p= 3612.71676300578
##$SYMM= 0
##$S_DEV= 0
##$TDeff= 16384
##$TDoff= 0
##$TI= <>
##$TILT= no
##$TM1= 0
##$TM2= 0
##$TOPLEV= 0
##$USERP1= <user>
##$USERP2= <user>
##$USERP3= <user>
##$USERP4= <user>
##$USERP5= <user>
##$WDW= 1
##$XDIM= 16384
##$YMAX_p= 352574899
##$YMIN_p= -444690
$$ End of Bruker specific parameters
$$ ---------------------------------
##NTUPLES= NMR SPECTRUM
##VAR_NAME=  FREQUENCY,     SPECTRUM/REAL,   SPECTRUM/IMAG
##SYMBOL=    X,             R,               I
##VAR_TYPE=  INDEPENDENT,   DEPENDENT,       DEPENDENT
##VAR_FORM=  AFFN,          ASDF,            ASDF
##VAR_DIM=   16384,         16384,           16384
##UNITS=     HZ,            ARBITRARY UNITS, ARBITRARY UNITS
##FACTOR=    0.220516191357247, 1,           1
##FIRST=     3152.74800881038, 0,            0
##LAST=      -459.968754195404, 0,           0
##MIN=       -459.968754195404, -444690,     0
##MAX=       3152.74800881038, 352574899,    0
$$ Real data points
##PAGE= N=1
##DATA TABLE= (X++(R..R)), XYDATA
$$ [...]
10169 -51561 17363 87177 78409 30928 38531 -87489 -104140 24730 -51471 -157149 -20229
10158 -20229 -163260 -95644 -17365 -106020 -63393 -140292 -153687 71530 34303 30096 71322
10147 71322 -126236 -164460 -55007 -105978 35457 93689 57931 191654 78951 -55023
10137 -55023 -18180 83039 -7254 -28741 117228 241448 -12213 -129228 -173814 -232205 -113472
10126 -113472 -230135 -66921 137599 102664 56628 143288 -43102 -86822 -84532 70489 61609
10115 61609 -57090 -72099 -26660 40049 87435 -108219 -76093 66748 -39511 -66556 10420
10104 10420 58379 -14914 -169984 -165718 -138592 -132053 -71575 75746 135705 80242 -111651
10093 -111651 43177 50906 -17170 27237 -68744 12401 4903 -48800 -153143 -135806 -247040
10082 -247040 -94801 -55038 -16259 57141 -47608 -148498 -162306 -242845 -213808 -132258 -146201
10071 -146201 -35141 97107 -114571 -100133 -65762 -13272 -86046 -131325 -71139 -22741 53073
10060 53073 25665 -30943 -165891 48893 208281 87659 5069 114270 73770 -6988 191434
10049 191434 172067 70414 66043 113123 -54180 -133308 -25789 60102 129278 154805 30640
10038 30640 -108710 -48824 -21522 -99409 -11258 80006 43786 350 107942 119021 89380
10027 89380 214701 173077 96190 75385 115137 43345 141637 -6313 -120675 -192024 -181788
10016 -181788 -76489 6686 99830 173964 144095 -11519 -14082 57843 145263 65608 -42566
10005 -42566 190200 198191 -60136 -135867 14567 23442 45842 -49880 -154095 16779 -31245
9994 -31245 73911 79344 102662 -18789 -409 -15932 -140614 -100473 6366 73795 37036
9983 37036 7146 116872 149964 75986 -56183 3330 64292 -60531 65333 93842 -36969
9972 -36969 -15114 149623 4000 122926 106451 21855 -37506 -29427 46162 133891 74610
9961 74610 -102669 51738 134328 15641 -216396 -63429 90448 -1024 105658 160390
9951 160390 50887 178033 309657 170159 109906 74949 59591 96125 77755 56772 69689
9940 69689 113585 36125 106150 125399 -87528 80155 186783 181901 112166 114316 97669 68867
9928 68867 13243 94855 159007 34436 -65716 60954 222213 21941 -54646 -189324 12211
9917 12211 249615 109202 122431 134846 243477 236544 194799 162868 113126 19938 -1661
9906 -1661 132230 200354 237137 124946 143954 81568 103633 157835 114970 47234 84109 105443
9894 105443 192806 131102 106663 153057 77208 104352 113172 -99246 123679 99772 43833
9883 43833 159563 219603 121773 130974 101062 -49353 275307 276424 77215 48049 205454
9872 205454 200732 172385 95244 -41283 41841 -19414 39692 285328 155232 83135 289617
9861 289617 320306 174517 17476 36341 255138 197641 128215 72854 19049 306976 179930
9850 179930 122838 121220 97429 135786 152531 48906 30182 38428 42830 174104 235958 290506
9838 290506 109166 201652 138067 126937 81608 245949 312491 285559 233411 265531 292004
9827 292004 299534 481367 289352 233742 335472 255783 346341 353218 261412 2749 81798
9816 81798 67434 118119 105962 139157 148237 144080 229329 259587 196656 98370 112215 142484
9804 142484 149639 329682 300017 270569 459811 358628 399661 277064 290143 268068 234659
9793 234659 282867 407436 311192 271747 371854 421741 304642 344149 475369 511075 478108
9782 478108 458819 388229 483742 477478 428269 368484 330215 326316 492230 464025 200188 232086
9770 232086 366190 328029 307909 466934 409741 442925 386103 432126 432292 291984 201664
9759 201664 343643 383491 379636 517233 417281 348206 245218 253749 302345 337763 385079
9748 385079 378172 372683 371852 330137 338681 335825 280419 270596 177105 264721 402210 408341 374788
9735 374788 306392 307618 361298 252497 295163 387575 453885 312882 299292 365443 279065
9724 279065 236854 236301 237281 196561 162100 96054 155893 122166 339801 221351 279684 192959
9712 192959 311116 284685 410367 511225 310659 312918 231751 364731 465126 399974 304063
9701 304063 350798 252233 240804 240305 317522 393869 339817 320719 284855 335895 521571 319612
9689 319612 274627 307091 345115 268957 219316 262701 118394 266972 326024 327904 417105
9678 417105 416089 428949 535520 512871 420173 321246 242937 320389 399327 355420 275790 236154
9666 236154 289818 453766 482802 336275 427523 555463 341104 285540 341096 406965 372313
9655 372313 382478 386664 465303 505953 440558 335261 306357 349203 306184 454190 523307
9644 523307 424273 493187 530429 486793 475186 648346 527057 521218 545371 451035 452593 484593
9632 484593 523473 581279 518712 656213 727020 620737 487154 424902 521709 613698 566192
9621 566192 540056 619679 622601 626494 639448 709747 695580 689861 566060 449107 473377 607601
9609 607601 729637 798876 844640 717030 694210 691630 694631 741490 670914 631077 727270 755894
9597 755894 796291 816961 830424 846028 733966 830848 941797 940223 906505 955987 701369
9586 701369 619669 771111 833510 733531 659105 729780 807142 647723 628082 657615 703900
9575 703900 699487 656703 723394 742383 819273 777074 804694 760779 706760 912586 1019243
9564 1019243 1012830 956663 874646 746432 740097 720520 768305 775117 797708 717146 794796 864614
9552 864614 839927 911094 973015 883012 1047111 1044203 890543 1075921 940062 893363 941060
9541 941060 1040122 1067209 1021852 1098616 960557 973208 1223727 1219996 1056019 1034398 1094558
9530 1094558 1170328 1216980 1259559 1108531 1015952 1128091 1202928 1208228 1315347 1361525 1137314
9519 1137314 1193134 1292834 1309803 1354194 1241783 1245030 1261972 1170900 1250375 1335876 1433608
9508 1433608 1456679 1340942 1282703 1420126 1378431 1485012 1479386 1400965 1406878 1259371 1442439
9497 1442439 1462857 1576236 1631510 1579281 1559247 1462214 1595443 1586619 1627113 1558718 1493776
9486 1493776 1531477 1677396 1685660 1787361 1662010 1582140 1708896 1872719 1894905 1864873 1688030
9475 1688030 1660569 1804587 1804733 1948350 1940434 1939913 1979748 1907346 1903281 2032026 2084545 2097298
9463 2097298 2167233 2336446 2245596 2110719 2091548 2092431 2165881 2273099 2359302 2320828 2313421
9452 2313421 2306790 2384821 2511841 2465540 2419857 2481156 2528552 2614203 2819249 2978194 2881047
9441 2881047 2770502 2749054 2844259 2984611 3041662 3075051 3142579 3198733 3232529 3234059 3359473
9430 3359473 3413150 3469307 3566055 3511334 3617692 3707901 3816084 3811627 3738845 3774272 4011898
9419 4011898 4085891 4075972 4269770 4255748 4218051 4330063 4591371 4660913 4660231 4896149 4930856
9408 4930856 5145850 5473084 5391038 5558806 5760819 5805970 5902792 5967846 6224546 6336954
9398 6336954 6371931 6556603 6711828 6900981 7064197 7255927 7508083 7550137 7594065 7917856
9388 7917856 8243059 8468025 8784493 8959985 9187072 9365677 9675997 10064695 10307754 10624154
9378 10624154 11012826 11346261 11848832 12373167 12798125 13277058 13752885 14287392 14689564
9369 14689564 15251634 15890710 16432665 17223333 17968897 18776711 19645397 20696126 21735913
9360 21735913 22769417 23934911 25368411 26774953 28161935 29773568 31322848 33067996
9352 33067996 34783712 36588651 38460546 40409814 42350329 43981280 45730422 47066233
9344 47066233 48086946 49144337 49735310 49766293 49512587 48901579 48069875 46796941 45292154
9335 45292154 43680060 41812287 39946220 38064412 35929152 34031018 32276945 30560084
9327 30560084 28812977 27208328 25778302 24338864 23239347 22088129 21048857 20069924
9319 20069924 19272007 18530647 17799975 17153088 16475593 15962465 15450482 15069958 14743026
9310 14743026 14348868 14002984 13623975 13542438 13376635 13160035 12947933 12638731 12128712 11911739
9300 11911739 11671252 11256987 10975739 10757074 10465873 10401260 10368552 10205992 10024443 9866074
9290 9866074 9737385 9635167 9554742 9418493 9525253 9598236 9780525 9772188 9724133 9720464 9606067
9279 9606067 9408272 9343767 9313982 9161874 9167156 9083777 9050615 9022755 9056116 8984122 8930255
9268 8930255 8887662 9039353 9253183 9292209 9274548 9400225 9593754 9342453 9032076 8932898
9258 8932898 8910328 8765837 8830420 8844884 8640441 8885040 8982953 9095243 9171688 9339851
9248 9339851 9598585 9731989 9863194 10246765 10474460 10677652 10768692 10737786 10689859 10505884
9238 10505884 10453171 10316346 10266147 10310213 10240849 10282555 10545641 10697275 10787470 10968186
9228 10968186 11313108 11808228 12164627 12688239 13482953 14243197 14852303 15327291 15466808
9219 15466808 15204756 14665107 14169899 13880426 13448918 13238585 13253774 13337838 13174494 13015440
9209 13015440 12896273 12991703 13164313 13244876 13519514 14006232 14247661 14707307 15401503 15843605
9199 15843605 16120732 16086966 15859130 15511329 15029523 14793409 14583419 14433807 14423794 14585673
9189 14585673 14617047 14604023 14663071 14734372 14752798 15031937 15407330 15758798 16251369 16710718
9179 16710718 16657171 16256506 15481321 14694911 14075415 13583205 13240000 12857818 12412224 12200682
9169 12200682 12083231 11909884 12012799 12152682 12317178 12331713 12428561 12695803 12945744 13228776
9159 13228776 13634874 13811970 13790406 13475223 12903281 12261719 11529035 10686940 10157021 9670932
9149 9670932 9251929 9162551 8966147 8647980 8533644 8494366 8279071 8332482 8433014 8383599
9139 8383599 8310076 8219347 8189079 8137078 8208650 8325803 8430917 8476831 8482433 8550048 8623083
9128 8623083 8806501 8997245 9168969 9448877 9813882 10016503 10334330 10645743 11005383 11333770
9118 11333770 11711110 12125897 12444195 12703774 12822616 13009767 13042153 13159659 13064562 13006087
9108 13006087 12851753 12898807 12948162 13018537 12971955 12901001 12983954 13182336 13310307 13478475
9098 13478475 13924981 14333956 14680041 14841560 15136176 15318429 15614562 15919837 16068660
9089 16068660 16197505 16136687 16191720 16315501 16469573 16444583 16448112 16580009 16560498 16537149 16587616
9078 16587616 16557041 16457903 16536650 16543737 16671819 16739323 16606676 16368180 16195092 15773966
9068 15773966 15492367 15408960 15281011 15120903 14855270 14973814 14968750 14883002 14929559 15119725
9058 15119725 15203167 15223700 15142850 15032135 15075179 15076471 15200015 15009558 14727915 14463253
9048 14463253 14148286 13911787 13196347 12881168 12403887 11868303 11450608 11194889 10888640
9039 10888640 10384286 10116680 9881376 9614268 9353133 9167600 8828378 8664908 8436320
9030 8436320 8179652 8151523 8056463 7842769 7656410 7472696 7374586 7391801 7309672 7156624
9020 7156624 7092230 6980560 6881359 6665748 6327781 6051397 5917332 5852765 5783430 5580354
9010 5580354 5493916 5360251 5245221 5016021 4807730 4660444 4524670 4502026 4398974 4187303
9000 4187303 4202108 4211118 3935387 3829041 3820443 3654503 3541744 3549047 3496730 3401705 3458504
8989 3458504 3547503 3493787 3607458 3580275 3414625 3370445 3197151 3147736 3096722 2981174 2941497
8978 2941497 2794680 2889509 2969375 2922212 2927670 2941202 2799509 2755843 2774056 2585569 2542299
8967 2542299 2456007 2437334 2358138 2337006 2434258 2451095 2352228 2366815 2334479 2414137 2477938
8956 2477938 2361177 2356102 2201613 2213020 2365478 2356292 2364780 2236737 2299337 2351391 2191526
8945 2191526 2045630 2168132 2264192 2113832 2014863 2150184 2240639 2112376 2101819 2160917
8935 2160917 2048966 2021240 1962434 2074053 2197092 2197766 2150978 2023902 2059091 2041102 2112673
8924 2112673 2088104 2084024 2149118 2118203 2046563 2032180 2097466 1982200 1964456 2125516 2253283
8913 2253283 2285907 2240173 2245442 2167563 2115408 2108427 2220403 2332304 2359498 2366634 2475133
8902 2475133 2431114 2379837 2396066 2238653 2231237 2316755 2416005 2388653 2264140 2299860 2282135
8891 2282135 2301520 2325760 2258073 2208029 2252029 2181413 2268379 2314584 2388640 2466781 2371118
8880 2371118 2283560 2197217 2155600 2208609 2315905 2310613 2434177 2249721 2209984 2250448 2177648
8869 2177648 2245819 2218542 2189079 2190628 2431612 2331219 2277430 2235751 2162380 2200419 2339452
8858 2339452 2364611 2371385 2391239 2263393 2434794 2443463 2302064 2317464 2239817 2277749 2367520
8847 2367520 2454691 2363365 2360678 2347371 2413234 2310742 2134772 2311504 2397662 2305941 2426689
8836 2426689 2432563 2341540 2332195 2472936 2441356 2335270 2353958 2439409 2369622 2441572 2414747
8825 2414747 2418101 2562239 2591681 2508608 2553203 2888419 2885460 2707632 2824456 2843569 2753160
8814 2753160 2755104 2617886 2675144 2682356 2591151 2519114 2694448 2720618 2716484 2825699 2867122
8803 2867122 2863697 2788719 2759723 2856494 2837163 2897858 2912071 2843390 2791718 3052220 3084782
8792 3084782 3042841 2935532 3003838 3010301 3034822 3034969 3047277 3095640 3182573 3243170 3191699 3272492
8780 3272492 3395745 3359734 3308632 3292663 3354411 3627730 3740193 3739446 3820344 3907551 3942294
8769 3942294 4022885 4065264 4089908 4250823 4217238 4300772 4456500 4520999 4537625 4697194 4807849
8758 4807849 4791247 4767704 4904004 4942693 5050957 5119340 5219777 5210450 5343340 5618878 5561366
8747 5561366 5574695 5740935 5989624 6199366 6304337 6538774 6764357 6890558 7035703 7202713
8737 7202713 7564470 7646542 7907620 8333642 8451103 8782629 9414433 9794657 10304397 10627149
8727 10627149 11054357 11262501 11768488 12285677 12571462 13346456 13924615 14465341 15056721
8718 15056721 15861597 16784326 17954634 19172071 20590664 22549389 24509285 27049672
8710 27049672 30221394 33847100 38277831 43399098 49711452 57711967 68103576 81742051
8702 81742051 100183016 121537731 135049107 131518128 112418993 90753939 72679329
8695 72679329 58361108 47585210 39630597 34154432 30000678 26669745 23821173 21619407
8687 21619407 19622530 18051004 16588682 15436719 14498103 13712760 12868422 12187649 11519609
8678 11519609 10858078 10426103 10090319 9716665 9292711 9024662 8633508 8133458 7669021
8669 7669021 7407130 7284535 7048772 6946284 6710503 6418461 6140920 5941146 5743539 5499562
8659 5499562 5379518 5466700 5473321 5289130 5084356 4923046 4835842 4835925 4764809 4699096 4587065
8648 4587065 4611580 4734473 4594799 4554341 4359160 4318880 4293635 4048320 4084587 4326644
8638 4326644 4166051 4063695 4043179 3913624 4010450 4205285 4226259 4245201 4346302 4153519
8628 4153519 4205473 4096504 3987356 4046635 4132675 4188964 4145717 4095711 4108955 4067937 4052651
8617 4052651 4081936 4206555 4247045 4135748 4171990 4264828 4394587 4360940 4454058 4517844 4470193
8606 4470193 4409976 4415635 4459503 4612059 4569446 4565094 4678356 5022525 5119049 5069469 5037308
8595 5037308 5109688 5184022 5291485 5502412 5481709 5538138 5791826 5882737 5844941 5735396 5761912
8584 5761912 5927249 5939597 6189103 6290248 6485379 6669616 6713164 6785424 6982251 7280926
8574 7280926 7495577 7593355 8011830 8247399 8477425 8824046 9247864 9449331 9756082 10241757
8564 10241757 10700120 11093182 11541841 11732768 11725812 12027889 12234721 12578865 13127918 13598808
8554 13598808 14106509 14628804 15054183 15456723 15739208 16043687 16247096 16395165 16931592
8545 16931592 17389355 17822675 18505177 19369884 20183929 21130839 22305256 23590883 25152854
8536 25152854 26761333 28156025 29225133 29804571 29760713 29354063 28806786 28108068 27701497
8527 27701497 27179109 27028820 26966547 26738271 26620590 26445775 26227827 25959290 25670631 25481775
8517 25481775 25390997 25555274 25790391 25830867 25935057 26145317 26497659 26673767 26969433 27530905
8507 27530905 27854923 28355376 29413096 30326541 31524990 32767198 34246979 35830060 37504056
8498 37504056 39323106 41012069 42326883 43158278 43427816 43007164 42011818 40424360 38670547
8489 38670547 36803685 34997736 33254593 31791349 30688397 29508525 28434198 27352871
8481 27352871 26436177 25505724 24863046 24358190 23915525 23566467 23250103 23057417 22840957
8472 22840957 22545035 22484354 22339868 22396167 22434082 22350814 22351345 22607667 22806279 22989803 23160226
8461 23160226 23212557 23587817 23983242 24437481 24981731 25289037 25311795 24853200 24008095 22767718
8451 22767718 21384076 19981340 18680832 17546626 16526184 15779760 15186595 14692337 13998817
8442 13998817 13410357 13021324 12577115 12273273 11968239 11765672 11527470 11247327 10973588
8433 10973588 10718508 10387481 10096451 9816075 9619053 9394285 9204901 9042242 8765751
8424 8765751 8631957 8526750 8244830 7885470 7659696 7540733 7450228 7345919 7095025 6882647
8414 6882647 6743634 6569965 6419784 6153264 6148569 6070272 6052289 6048244 5980884 5685112 5526416
8403 5526416 5448570 5533564 5426817 5426619 5297907 5269650 5255612 5273502 5167639 5063964 4981999
8392 4981999 4974332 4927633 4785457 4721446 4593867 4584065 4452895 4218797 4262059 4169373 4134027
8381 4134027 4091770 3991358 3823923 3790000 3738810 3682808 3684675 3559740 3482033 3489676 3472877
8370 3472877 3370648 3284229 3240588 3213441 3132944 3049262 2953389 3031548 2943675 2818347 2719891
8359 2719891 2638848 2518412 2475178 2393962 2266339 2245442 2316568 2346580 2271313 2188166 2268095
8348 2268095 2169036 2065083 2074229 2035136 2025420 1883385 1852415 1913798 1799947 1849723 1893726
8337 1893726 2006928 1892708 1750124 1869659 2039131 1695780 1637597 1686110 1616187 1625459
8327 1625459 1573005 1645988 1679415 1692098 1486392 1363125 1281603 1371631 1248092 1235544 1336978
8316 1336978 1264895 1197414 1356850 1284037 1147801 1179444 1240594 1409272 1349938 1461806 1442938
8305 1442938 1423691 1272200 1221765 1222565 1263137 1310134 1241219 1196739 1184307 930175 976461
8294 976461 908730 861157 1032375 955694 948553 909274 825867 754054 813430 917875 1005073
8283 1005073 887415 808727 848127 784420 837706 870670 824013 894350 907344 912666 975948
8272 975948 773010 901261 891626 843629 990667 888737 877911 989668 919821 825449 780690
8261 780690 688302 726468 656189 740832 750378 800169 915106 846685 745532 713479 639703
8250 639703 673945 629431 629550 590455 713246 792602 621506 535017 610727 603273 718926 721004
8238 721004 662401 566136 691782 652695 644679 732520 732572 834082 622392 616761 935419 1013413
8226 1013413 1140306 1125261 978445 1175139 1233595 1186994 1058999 911419 896308 851287
8216 851287 863481 791118 713826 811252 733799 645481 632784 514174 469476 422148 455372
8205 455372 513649 476078 585877 491717 431717 408152 463851 473812 586508 612231 805351
8194 805351 603735 893416 570588 209086 345777 282215 325123 346066 386803 275652
8184 275652 381151 286346 221632 225237 212041 109476 262684 239712 225704 205400 311562
8173 311562 295110 266915 368449 427905 491773 519884 633069 500204 353585 400932 366139
8162 366139 447732 536818 632157 406979 343832 458925 511280 464068 404891 297567 359166
8151 359166 316382 264038 312803 348843 426042 368848 283555 474238 541549 302235 405124
8140 405124 470950 441794 454861 503247 535245 464683 446625 495883 436209 533205 494138 464268
8128 464268 538162 557517 527334 406196 565037 612278 563396 561837 745555 604573 564161
8117 564161 592221 443846 540265 610245 575875 602501 678574 630867 670323 704948 624692
8106 624692 805323 865731 476117 495592 470337 472018 539771 611398 470611 588761 482144
8095 482144 377314 366555 389357 482983 427209 424842 425726 555519 520317 427333 386378 352965
8083 352965 372015 297955 293041 330097 295993 336819 493586 295016 302845 284113 265755 169787
8071 169787 99052 57838 122150 199168 358071 404052 224965 103835 -73372 -23115 78693
8060 78693 45199 98794 170686 39278 90644 47797 154827 174765 221284 212048 189113 167517
8048 167517 66419 101690 227290 84141 177865 276207 247545 120773 -11305 -101641 31424
8037 31424 -17676 84766 39163 -24156 23769 83520 133812 186159 200815 139290 79639 62020
8025 62020 32392 144787 91333 199986 155398 -21494 -107628 -139701 41662 -7834 17877
8014 17877 -116121 44644 84709 142783 268145 310545 167872 -48577 158348 256199 22338
8003 22338 139085 58854 38730 79093 115921 223035 206309 118122 110872 -123214 -169477
7992 -169477 -192054 -237886 -159943 -15273 41177 76215 -22859 -110246 76570 113589 5279
7981 5279 949 -17623 106361 141858 253545 260601 -7659 52917 71029 161207 150229 409494
7969 409494 425466 11907 -18616 -36570 -87383 -69552 -24664 -55310 -136191 -48202 77981
7958 77981 183975 272713 183615 -53446 60303 -82073 -68491 167172 106245 28501 -26764
7947 -26764 -177248 -45581 39148 202738 185311 73935 -31667 -28514 -66849 -70003 -34086
7936 -34086 86283 233210 140819 88648 25858 187666 6856 -119735 -128571 4215 18834
7925 18834 57310 76908 93837 223076 170142 118273 74615 110588 92407 44876 -32828 41373
7913 41373 87171 78222 36712 -57128 42324 189142 18674 16876 2249 -95281 -56648 115055
7901 115055 235334 307195 261220 81027 126485 39404 26479 42314 51392 63472 181959
7890 181959 99144 123313 77977 32641 123454 76936 -19312 13372 193899 227046 198410
7879 198410 328116 201470 223905 221863 184507 152089 260967 367943 137321 43802 151030
7868 151030 375872 327149 270410 299753 284394 383817 305440 224771 242625 327423 182153
7857 182153 135111 217423 186564 164636 246475 306882 426952 411776 362802 330339 216391
7846 216391 332050 298037 393612 390109 281183 255458 332919 294408 265260 202366 280158
7835 280158 417832 543413 463578 387421 205589 252112 374527 198601 188105 208708 125787
7824 125787 190884 104833 168065 127767 47746 -1254 130215 98578 264858 167689 31237
7813 31237 291036 410897 243428 199178 214749 87133 370616 243402 271371 339478 350216
7802 350216 93136 62606 155359 255818 272173 155728 74964 144286 257693 274099 342252
7791 342252 334233 326306 179747 417691 493389 402904 431716 422919 398321 372324 377273 356278
7779 356278 344593 221168 235461 231365 156577 418529 566379 421055 455292 444274 253814
7768 253814 269868 549406 415472 460911 513791 499122 542244 531868 543765 557118 505763
7757 505763 629097 695600 762226 924900 932344 939868 978561 912507 819961 863258 977666
7746 977666 959431 1040679 898691 684053 788676 698503 630328 513664 430813 529963 601651
7735 601651 612060 579805 565354 527375 468028 608698 540408 508042 663214 610810 529481
7724 529481 555219 560714 465172 592306 518246 521022 487999 336922 325387 322908 405029 464628
7712 464628 391917 334422 240680 349850 426105 439840 342764 372645 509431 502901 692139
7701 692139 513775 568399 614532 542113 641085 707580 588312 620287 545654 620789 619826 867593
7689 867593 908507 865392 863614 1041945 1139150 1176395 1302475 1328554 1602197 1669136 1745328
7678 1745328 1838386 1916757 2103285 2153636 2006191 1885829 1992536 1941210 1853916 1983186
7668 1983186 1985676 1978289 1793902 1735922 1696503 1527223 1356238 1186007 989514 1017919 1037818
7657 1037818 1025970 1019118 987737 846183 782062 701257 794367 768668 703775 757749 553937
7646 553937 555839 561024 554553 584194 616257 609190 508160 542388 506967 478658 502535 416744
7634 416744 408829 530051 519716 553438 588800 599248 634192 697097 754519 761743 681213 527486
7622 527486 675572 675136 569388 574654 675336 678568 746135 744132 626168 778633 1106952
7611 1106952 1286467 1232146 1456936 1580067 1535359 1534910 1334455 1286470 1060524 930054 874652
7600 874652 727943 858346 797540 751855 556963 528243 612168 630879 750960 707493 723404
7589 723404 736409 664088 641128 503554 480556 633086 523855 556308 651180 573100 549987
7578 549987 642621 646382 685262 674535 656924 789226 752805 802279 866550 953755 880530 1058136
7566 1058136 1141054 1318447 1383120 1497344 1586594 1506660 1457883 1327085 1095980 961258
7556 961258 913525 848473 900987 941396 962788 880326 683840 667092 710871 598762 648303
7545 648303 551702 614328 518100 591108 654777 621222 625365 669249 617810 591089 745945 790729
7533 790729 711167 687827 716861 865448 892082 737911 698587 761464 616366 569957 646502
7522 646502 445480 339841 455038 501708 427990 418809 500512 497774 482636 306472 456795
7511 456795 594482 507338 487769 516352 521323 417677 468891 460810 403156 513362 536050
7500 536050 539507 529087 625617 597637 330459 479282 695869 707434 792264 865349 781442
7489 781442 819073 857757 1003334 959210 925782 938753 1065033 923164 885499 931012 823659
7478 823659 907740 911543 774084 753797 755601 664205 655637 455846 482651 750143 675264 631603
7466 631603 642254 726105 660834 403472 292553 338030 343337 330863 442801 554930 509463
7455 509463 412479 355833 547163 567841 535253 603041 600052 673928 548911 537431 426548
7444 426548 469193 524470 424927 371591 439840 417196 624140 600430 507503 601225 602743 614464
7432 614464 695781 478261 548937 646882 615094 628749 652620 553274 444883 547018 458796
7421 458796 417228 471184 521745 540739 628901 556169 663477 612024 535234 571398 669496
7410 669496 740003 648252 566818 587465 597613 612755 617483 606034 656426 713180 744238 645052
7398 645052 534362 756801 779793 736016 808461 833005 832145 693263 686283 757016 854799 792350
7386 792350 704163 753326 799168 838483 734125 754944 746616 990689 903850 879465 947866
7375 947866 961542 1070680 1131732 1084038 1065826 1105417 1090916 1013687 1107943 1153514 951280
7364 951280 1006628 1111941 1125211 1208337 1265714 1269489 1342664 1294304 1338976 1219163 1315951
7353 1315951 1346917 1533646 1529520 1568593 1621796 1557446 1603538 1651392 1515548 1596623 1667931
7342 1667931 1625433 1761691 1791885 1899785 1899612 2020959 2068827 2051969 2151701 2170360 2266792
7331 2266792 2208809 2303162 2407950 2473344 2389168 2434147 2537567 2677551 2722645 2681596 2844605
7320 2844605 2978828 2988615 2920286 2867058 2898996 3187879 3326670 3392510 3430908 3506584 3467392
7309 3467392 3599318 3582630 3786476 3847194 3814325 4091264 4358134 4310315 4167685 4444889
7299 4444889 4548723 4668412 5053891 5240568 5254372 5472655 5654323 5834179 6128357 6335069
7289 6335069 6575883 6873689 7225398 7614497 7897929 7981767 8083526 8179043 8413972 8588395
7279 8588395 8625227 8705590 8710963 8755360 8805260 8567490 8407090 8335819 8204348 7999918 7930242
7268 7930242 7751517 7441109 7171192 7094110 7018319 6917026 6925485 6845614 6772742 6652817 6682793
7257 6682793 6693824 6752396 6856697 6906976 6796857 6922834 6805338 6751234 6819591 6991924
7247 6991924 7126144 7200371 7470282 7480712 7711707 7883554 7966062 8142245 8176642 8288921
7237 8288921 8574460 8635244 8806286 9013523 9010936 9022666 9121375 9273441 9270185 9311197 9227100
7226 9227100 9156613 9072656 8918783 8754002 8521580 8457483 8273847 8060294 7922205 7668490
7216 7668490 7588112 7449603 7102670 6737929 6591458 6385982 6224743 6118497 5766965 5606507
7206 5606507 5470506 5377910 5159792 5077735 4972122 4821542 4776623 4585455 4390357 4415528
7196 4415528 4354953 4242432 4306506 4185692 4022265 4050895 3974449 3790292 3718341 3585565
7186 3585565 3634037 3445955 3237339 3189075 3179548 3236460 3155548 3062669 3124895 2986903 2880230
7175 2880230 2854353 2752428 2714443 2751259 2770376 2672583 2478622 2517739 2615009 2576665 2461280
7164 2461280 2265565 2319557 2282072 2262230 2334230 2210457 2240388 2393203 2259947 2147717
7154 2147717 2242113 2365537 2388372 2548436 2630170 2607552 2601307 2700818 2903992 2985794 2948231
7143 2948231 2973675 3023341 2915764 2934137 2922300 2793465 2648959 2736171 2780352 2445869 2350157
7132 2350157 2353734 2218803 2210326 2026294 1838104 1948365 2017541 1974815 1823664 1629236 1679589
7121 1679589 1657329 1445524 1629087 1562862 1449277 1345835 1292871 1509364 1467815 1558842
7111 1558842 1736275 1621173 1484268 1478300 1415908 1514500 1675244 1767589 1901713 2093304
7101 2093304 2087497 2140214 2104499 2052636 2084409 2079906 2173388 2190267 2195841 1973838 1797279 1964124
7089 1964124 2056337 1793134 1711838 1538879 1447544 1482707 1264518 1239527 1264788 1306618 1226434
7078 1226434 1224876 1149491 1103004 1170081 1142882 1043057 960245 1006672 1001012 978612 877848 844551
7066 844551 1007565 1181794 1013956 985325 908752 846904 964675 818717 849298 1013199
7056 1013199 1001512 946414 1044714 940994 776008 1029868 956429 1123489 1287707 1268695
7046 1268695 1289821 1340457 1365526 1377293 1467546 1440244 1609752 1610393 1647175 1719731 1617162
7035 1617162 1578079 1595550 1712117 1851423 1860203 1950167 1988266 2159523 2411544 2526040 2603427
7024 2603427 2573039 2643694 2537344 2558067 2572115 2359368 2518280 2502984 2457172 2380182 2278654
7013 2278654 2123507 1947126 1885212 1936219 1877400 1722726 1751952 1761850 1686306 1510157 1645988
7002 1645988 1643763 1627440 1655419 1522402 1488048 1419475 1383616 1355782 1453617 1265100 1189272
6991 1189272 1206253 1112779 1228002 1166731 990904 903046 866822 979873 978549 928554 784791
6980 784791 856285 782401 864873 813649 821856 758018 714400 800150 945919 885675 722806
6969 722806 659683 523479 686113 680955 642872 466947 565168 618311 567640 603775 659699
6958 659699 701183 620549 605613 486683 529929 636688 694126 722147 664657 781018 548746
6947 548746 439431 402324 462697 502952 386119 376286 332187 381216 481102 451996 416196
6936 416196 402995 315075 388485 472426 430156 484452 525196 472660 525623 487204 430039 450955
6924 450955 377790 480327 461146 453276 478808 489345 399067 449730 426874 403752 379955 470540
6912 470540 588802 475061 318742 390972 324302 180132 268269 449804 197508 402078
6902 402078 513312 295624 330273 520635 712228 562611 489173 408542 314743 438931
6892 438931 370406 388200 471777 443482 369281 287792 346659 366424 474894 451088 604393
6881 604393 513223 447051 383615 410703 414179 334807 618081 653724 376626 281215 293233
6870 293233 270571 232899 367875 393802 472250 411556 284590 334466 385549 419744 475054
6859 475054 569043 406125 370935 415796 536183 628341 606223 519388 541162 501793 419461
6848 419461 511252 595915 690599 480846 645789 655297 665725 564068 673894 603556 636176
6837 636176 723289 877203 710349 808254 893134 939870 1120024 970588 917038 944001 1034385
6826 1034385 1153058 1194498 1156827 1294928 1280963 1286995 1300891 1421760 1524856 1698392 1814041
6815 1814041 1821047 1966806 2128573 2267509 2424952 2340742 2397765 2565255 2903878 3166515
6805 3166515 3006266 3013944 3346690 3551971 3647607 3649097 3682514 3526862 3426896 3432009 3345381
6794 3345381 3280848 3033829 2904663 2727245 2584319 2450378 2149785 2089135 1961688 1886780
6784 1886780 1800930 1728654 1630475 1510220 1422847 1337615 1238940 1206033 1096130 1050363 1032735
6773 1032735 1064209 1029079 896899 813983 783815 645320 670455 590031 558207 603866 595249
6762 595249 540830 641028 615303 450871 402370 415011 300968 420978 512007 532474 502706
6751 502706 425935 315717 307294 306770 307460 280698 358072 313354 185931 170914 149715 68003
6739 68003 52468 2489 10868 196285 109632 222023 245038 360272 332395 419532 288559
6728 288559 289829 288434 237341 143713 117669 115353 262976 297043 123963 101090 47926 117872
6716 117872 103963 227655 148313 82705 79629 83200 156646 135715 126121 -3842 123627 150969
6704 150969 43524 14623 119878 -7772 53023 -16092 32546 183841 48968 43252 10142
6693 10142 36327 -35978 42623 99099 -38507 -107140 -46308 -27429 -148363 23859 52618
6682 52618 18117 118208 94320 7094 -8792 115440 137564 51069 97328 53307 -15810
6671 -15810 -102818 -162378 -12287 51490 130397 210869 127876 11318 -92918 -73107 37317
6660 37317 64442 147090 -137070 -115614 -84700 -60225 -134676 -86222 23514 -25363 56389
6649 56389 -26966 -7466 138834 115394 34034 131214 46779 -62298 -45582 -24141 12462
6638 12462 95758 36380 101625 42056 10125 35804 -63306 -110178 -48351 -58033 -167471 -99676
6626 -99676 -64038 -12709 -72367 -26596 92316 95715 37307 -23290 50582 54733 -42703 26916
6614 26916 125364 63712 55624 -56626 28385 -47809 -106606 80669 22825 13810 128595 78342
6602 78342 98133 81519 -74819 154 189291 117349 -29658 -81518 -42308 -42672 -76651 -16763
6590 -16763 1417 32473 -136718 49583 -37109 -204893 -127379 -120880 -198685 -208949 -136724
6579 -136724 -177094 -36150 -15630 -234124 8352 122092 118702 93018 20446 -93731 -24358
6568 -24358 22327 -84705 -183747 -47483 -87572 -156127 -21591 -21383 48069 8125 -133611
6557 -133611 -103547 -121558 -12435 39983 34532 10592 12293 82337 143661 29199 -20225 249096
6545 249096 125864 134091 24510 58447 -22081 -27820 -161212 -127990 -97003 154428 86627
6534 86627 33662 136481 44893 -87846 -111065 -109346 35591 58450 47573 77843 -52668
6523 -52668 -90816 -174382 -216687 -187955 -28415 -69425 -135895 -212448 -85072 7853 -13327
6512 -13327 -121855 -193652 -20490 -80610 -113787 -148807 -187066 -154386 -97581 -172028 -227152
6501 -227152 -170374 -91459 -41186 32029 -50448 -134501 -102632 32539 218899 38005 69977
6490 69977 -58580 -119106 -216445 -38511 52320 24226 30134 4632 -195563 -78885 28155
6479 28155 -5035 -95556 -41238 -173979 -279414 -116282 -34361 -80282 -181577 -15073 62613
6468 62613 77347 7222 25077 160010 608 771 100349 56918 56285 54574 -121855 -59522
6456 -59522 -58180 -69607 108126 45807 115126 150898 -55451 -228670 -94305 -21406 99437
6445 99437 67764 9525 69234 -64406 -105212 -152984 -211375 -77375 -111399 -65442 -33754
6434 -33754 123825 109595 -59313 -12062 40697 -592 79093 73695 -61617 -11841 10131
6423 10131 29333 31960 53537 72098 50814 49519 -143601 -137576 -88640 -43739 -213336 -176839
6411 -176839 -314588 -192534 -85834 -218234 -205065 -300847 -243543 -136048 6219 123596
6401 123596 117173 25354 5407 46323 21447 76709 -33938 -58216 -15885 -76298 -11502 47479
6389 47479 -77716 -90117 -33932 -106975 -117027 -212133 -72881 -69883 -46620 -3254 -137888
6378 -137888 -9911 -31340 -127021 -88665 83736 139500 22099 25624 57704 -92371 -52447
6367 -52447 202946 39991 -9101 6752 207414 73383 -51344 -54293 6522 20449 -15806
6356 -15806 -74688 -40746 -356 -114684 -100203 -24815 71385 62118 37185 128713 223866 206651
6344 206651 -45164 -83719 146021 228398 184557 106099 112640 56454 24749 -1605 52702
6333 52702 78392 -746 -124071 -158593 -21278 -45631 189924 106005 62115 66241 66300 -13673
6321 -13673 30298 210204 94248 -21758 -2615 130338 123075 35045 93661 159671 158423
6310 158423 247602 86326 149739 128484 93626 -24611 -102738 73638 159910 90272 31412
6299 31412 102335 101144 128057 118135 1720 -18922 -20060 18937 22892 221953 155888 -32948
6287 -32948 5335 136109 130125 214037 104463 -102766 -190774 -114702 -4676 105904 201623
6276 201623 427 -35492 62486 102893 -71014 108596 185346 47168 -7521 -3580 -31140
6265 -31140 -102363 -105417 -123910 44841 150655 165456 128968 -33311 -17657 129195 25852
6254 25852 9066 20111 -45321 -79524 -182346 -203221 -71345 -115669 -65917 44093 -68607
6243 -68607 50250 38847 40977 24826 130472 186874 112523 72103 178331 242038 143523
6232 143523 -31661 26525 154075 79458 240119 290264 -23719 -83348 35180 -27360 22045
6221 22045 7548 71592 32858 98054 13104 -37480 -14064 22645 -80701 1161 43840 183996
6209 183996 170655 90059 -100778 -148914 -49004 -88528 -47199 32390 193146 199166 82405
6198 82405 90638 36853 80110 210814 140492 90434 -107421 -36034 -36667 -5974 82882 116912
6186 116912 -84506 78631 24418 38953 -25659 50492 251233 199895 79754 44415 18872
6175 18872 -39946 153182 162131 111786 24459 -46675 51169 161521 186884 160054 107873 154952
6163 154952 145652 -67222 11232 84824 122870 124669 23540 61520 124796 176884 184572 265188
6151 265188 197852 326819 243769 227048 211739 116314 272978 139758 -89622 -85548 -16285
6140 -16285 -115542 187888 266679 155175 266576 113402 18245 30684 102199 -59471 94806
6129 94806 62647 -95244 -75044 -18657 255301 196064 56310 -1064 138863 205478 13633
6118 13633 4736 46073 169263 160230 209608 184587 248296 160943 -68951 -78980 -62399 87800
6106 87800 90163 56274 27113 19048 154633 196530 63492 78222 46890 57370 127138 3230
6094 3230 49947 94245 -62206 -41053 57794 116274 47358 55798 46593 186979 219574 184454
6082 184454 70348 146278 233496 118792 79806 120454 237275 276097 194983 135533 123180
6071 123180 115371 330978 341267 380453 184208 53499 211013 304401 164051 20170 68203
6060 68203 172229 113538 -14370 199795 234890 185082 296324 240888 214301 200610 86100
6049 86100 20448 81739 289474 295983 242225 164858 284515 272274 257438 320980 328693 258375
6037 258375 343971 481309 436551 409864 335347 277301 203269 374675 425674 464125 544462
6026 544462 423266 382676 459357 269961 249963 270742 167419 173473 225416 175069 233996
6015 233996 173937 276210 304490 384646 464447 344150 339375 270039 347008 301683 434594
6004 434594 439221 384237 309570 390887 266733 237377 503986 499564 503405 456900 443833 394247
5992 394247 364373 426341 372589 301066 327444 263164 378434 306268 281896 288477 99183
5981 99183 162211 265520 165243 138113 227967 275375 321021 396822 255973 169067 280603
5970 280603 300641 319505 310832 272109 397829 352794 324398 292826 380736 346013 308038 350871
5958 350871 245771 266909 417717 385672 290733 463139 456718 319406 241977 369466 368346
5947 368346 386127 346477 285722 441061 532298 431820 431373 345209 302861 208995 281632 257201
5935 257201 218765 337048 390069 346676 325963 311587 214534 262793 229449 227652 235007 335678
5923 335678 376354 213623 247343 382225 315333 381700 448917 447449 401549 250733 395648
5912 395648 421693 333740 252333 328941 161851 264951 268604 289781 324805 267177 264310 276545
5900 276545 372102 392131 408101 369177 415062 452491 547286 412626 409612 324366 415307 645184
5888 645184 426609 479241 596230 476969 535432 341947 455807 558894 600077 525246
5878 525246 458396 547882 618886 670386 683880 720312 662982 716020 589248 695652 847374
5867 847374 767819 661091 683328 717437 737748 743364 716600 668851 572519 466738 338528
5856 338528 524477 693321 634307 722508 897549 776039 777179 616021 679992 729999 772214
5845 772214 833322 874198 735504 853406 865462 725800 801474 677466 715927 792541 793388
5834 793388 720107 705844 773179 615769 735111 946117 1006672 896738 893120 971591 1019999
5823 1019999 1029660 942842 1043504 1180907 1190328 1127002 1274778 1259684 1318550 1214767 1299210
5812 1299210 1350419 1470593 1387892 1405693 1559188 1744581 1771435 1780560 1873825 1956774 2155011
5801 2155011 2244283 2256036 2362926 2497112 2692940 3040630 3617478 4343676 5114726 5487101
5791 5487101 5318280 4980150 4346935 3776936 3270145 2758365 2316478 2245441 2171728 2108128
5781 2108128 2025233 2148407 2040484 1984340 1894832 1794705 1896769 2005795 2071204 2110674
5771 2110674 2295056 2312275 2325578 2370418 2480929 2393471 2408947 2492745 2489531 2342508 2176084
5760 2176084 1941586 2017871 1971329 1839007 1823110 1646136 1538347 1530752 1657290 1487483
5750 1487483 1364879 1453217 1243178 1316540 1376045 1410103 1480339 1409683 1438172 1228776 1287326
5739 1287326 1323467 1320452 1386658 1395213 1536017 1498736 1383230 1413467 1321724 1231149 1302230
5728 1302230 1313876 1382492 1400164 1403896 1537385 1344452 1278799 1295528 1270175 1298181 1141048
5717 1141048 1273241 1233405 1179605 1108168 1129841 1188062 1116063 1031948 958438 1095496 1147066
5706 1147066 1179737 1182880 1093024 1152746 1152608 1123236 1180014 1224033 1132297 1115991 1115959 901738
5694 901738 877787 1078259 1032960 1188313 1208862 1236776 1071605 848894 921189 1023668 1159477
5683 1159477 961179 984362 980514 1130303 1075823 992411 948660 987244 1009196 970238 806732
5672 806732 873818 1007907 1086155 1025518 1092981 1005927 1020650 1179699 1094935 1142093 1159876
5661 1159876 1052685 974262 1002833 1044816 1119920 968406 1120946 1232723 1164046 1239412 1189074
5650 1189074 1132323 1144252 1215369 1200793 1131673 1190572 1312388 1163129 1200936 1140074 1018005
5639 1018005 1141982 1222834 1245913 1195344 1243240 1088213 1023204 1098386 1067327 1200685 1231227
5628 1231227 1274609 1422856 1364174 1347304 1225909 1307849 1335240 1373013 1393977 1351905 1448028
5617 1448028 1496563 1538638 1433658 1555466 1462971 1508995 1739691 1637877 1449658 1474784
5607 1474784 1533616 1607761 1738036 1688191 1465668 1487978 1756439 1891557 1905299 1856197 2011621
5596 2011621 1959515 1970863 1940081 2028150 2186789 2153383 2046088 2097451 2213413 2260135 2257322
5585 2257322 2649256 2799556 2859584 2859033 2927084 3072761 3033260 2928738 3000428 3174021 3296780
5574 3296780 3134169 3268715 3430169 3491982 3536913 3511253 3689491 3817172 3810797 3918601
5564 3918601 3992099 3875268 4063696 4176412 4206770 4212555 4192560 4262806 4277000 4276002 4460646
5553 4460646 4550639 4711604 4867621 5140121 5281098 5545546 5777391 5858517 6285997 6726226
5543 6726226 7265708 7896182 8598934 9678877 10160998 9832463 8912871 7925439 7102812
5534 7102812 6365477 5840749 5480524 5079524 4909992 4848749 4524989 4498535 4266851 4141911
5524 4141911 4075615 3993873 3901328 3705911 3753573 3683950 3688691 3645002 3570084 3516316 3661954
5513 3661954 3604742 3636083 3705223 3730929 3804484 3889825 3578195 3417731 3234109 3119239 3195598
5502 3195598 3025593 2940571 2776811 2796239 2899289 2638390 2618794 2670275 2625095 2650231 2640051
5491 2640051 2496627 2335579 2475002 2506800 2453257 2350589 2345988 2488811 2400252 2273260
5481 2273260 2336116 2408812 2327794 2270554 2305052 2373932 2252949 2270765 2520336 2597342 2762985
5470 2762985 2570505 2604620 2687708 2790385 2881030 3034909 3087055 3146403 3282442 3126261
5460 3126261 2992658 2795516 2766799 2700098 2508731 2439192 2308589 2566277 2633905 2632048 2583993
5449 2583993 2696540 2479374 2539064 2840826 2792274 2733906 2618073 2753287 2909727 3014413
5439 3014413 3004699 3035163 3287632 3433885 3398509 3607490 3690394 3781712 3767890 3664472 3717012
5428 3717012 3895065 3731804 3527079 3510961 3411148 3339820 3235249 3149645 3232705 3313142 3223316
5417 3223316 3051908 3084657 3156671 3289933 3419539 3412711 3405562 3543049 3454798 3413770 3434169
5406 3434169 3477853 3400757 3514468 3541358 3416072 3419516 3288069 3297613 3415712 3407152 3247181
5395 3247181 3179659 3185825 3097608 2946810 2903234 2822407 2862291 2977478 2982769 2904670 2929518
5384 2929518 2861582 2748752 2708786 2592327 2623967 2566831 2568107 2776580 2676591 2416888 2206513
5373 2206513 2188731 2269119 2183633 1943747 1934018 2073950 1981195 1866780 1913150 1702989 1757210
5362 1757210 1844109 1845392 1876373 1862059 1802310 1951497 1822511 1717877 1925379 1892481 1809101
5351 1809101 1787041 1784880 1866594 1868360 1738396 1762819 1736168 1636964 1711948 1843877 1721767
5340 1721767 1741452 1638357 1648211 1781170 1699844 1773625 1738499 1776913 1643543 1695234 1734558
5329 1734558 1750188 1689807 1647419 1856002 1637183 1714149 1683736 1684577 1619811 1620826 1681019 1723006
5317 1723006 1739906 1724722 1671957 1561102 1555902 1668850 1630080 1595117 1655186 1584558 1612217
5306 1612217 1686207 1807019 1782862 1643594 1541679 1553394 1677783 1610286 1609083 1559365 1680562
5295 1680562 1668679 1599402 1654173 1594265 1600748 1543647 1591369 1666027 1725714 1668073 1520191
5284 1520191 1609594 1680318 1679230 1744569 1645744 1737155 1572621 1482987 1483096 1409793 1503323 1446534
5272 1446534 1499246 1542116 1470878 1441414 1521997 1518154 1522685 1677151 1643676 1552652 1640967 1562321
5260 1562321 1524133 1557182 1555005 1648718 1658902 1712889 1663850 1854102 1823776 1896390 1804603
5249 1804603 1798635 1819002 1702328 1729670 1668853 1791433 1967870 2047832 1967084 1912809 2011825
5238 2011825 2188758 2207707 2298229 2350076 2328863 2389401 2471034 2349434 2399474 2561771 2895728
5227 2895728 3037357 3101951 3215107 3042488 3133515 3215289 3146788 3230375 3281921 3282888 2966060
5216 2966060 2849691 2614377 2449671 2174884 1991454 2003774 2130612 2147557 1948578 1861395
5206 1861395 1901028 1778527 1780199 1856168 1690413 1722069 1763215 1786102 1638925 1593608 1585653
5195 1585653 1745724 1772848 1858159 1663951 1574257 1527562 1453940 1451425 1471581 1502271 1518668
5184 1518668 1571105 1583388 1543413 1519348 1323555 1314885 1585973 1456238 1390360 1360599 1307150
5173 1307150 1256104 1438382 1715563 1688326 1492522 1331506 1361052 1430367 1407767 1560409
5163 1560409 1596371 1519272 1555761 1436831 1445692 1477764 1580712 1461459 1512655 1466388 1422844
5152 1422844 1434136 1367382 1391271 1439437 1382882 1449076 1614612 1576461 1504304 1475224 1546941
5141 1546941 1511550 1451414 1455951 1637031 1669156 1644966 1611945 1508090 1494148 1594105 1648477
5130 1648477 1660816 1645578 1748832 1842606 1799292 1937653 1997947 1957555 2050171 2144988 2266045
5119 2266045 2230690 2147438 2204817 2251096 2049011 1925825 2049205 2078796 2128423 2149356 2146424
5108 2146424 2154401 2228656 2255887 2403750 2489427 2436559 2479379 2343872 2357661 2366268 2491974
5097 2491974 2599280 2639264 2501984 2572598 2595927 2581847 2715394 2804788 2893674 2761000 2720643
5086 2720643 2857755 2867651 2891817 3052614 3185787 3283462 3410707 3683968 3940674 4029496
5076 4029496 4173588 4437749 4375850 3986609 3890100 3783998 3429505 3414430 3384891 3241385
5066 3241385 3059593 3050107 3022632 2928111 2987739 2954291 3013777 2923166 2927681 2911062 2837695 2920595
5054 2920595 2970674 2784013 2592781 2555707 2755156 2679177 2756258 2680879 2742014 2710863 2607126
5043 2607126 2747682 2682509 2572183 2576027 2797587 2700671 2585861 2549243 2486697 2426025 2472094
5032 2472094 2431140 2409961 2468451 2586555 2589315 2532426 2407315 2453345 2408077 2528438 2554653
5021 2554653 2413795 2473510 2632707 2628674 2797657 2756428 2998430 2973923 2856329 3027339
5011 3027339 3105369 3198111 3384235 3683614 3951407 4173649 4260826 4388122 4374594 4106021
5001 4106021 3903299 3665460 3561803 3512345 3329557 3137998 3161166 3143009 3050643 3102675
4991 3102675 3034547 3057191 3154440 3130946 3192213 3253310 3037232 3148309 3142511 3110101 3235645
4980 3235645 3349158 3348672 3379093 3449484 3549453 3677964 3834039 3861007 3989042 3912780 3839650
4969 3839650 3951983 4065113 4133928 4126252 4187454 4275306 4336612 4478218 4499661 4570770 4638721
4958 4638721 4627178 4658119 4699356 4753102 4709004 4704266 4859008 4894530 4991254 5025011 5003726
4947 5003726 5172875 5308592 5316379 5383708 5395938 5575310 5743780 5739769 5766360 5757131 5842059
4936 5842059 5812251 5613236 5461906 5485154 5544244 5635790 5566665 5496632 5573420 5592387 5579555
4925 5579555 5736372 5954120 5940201 5975494 5979110 5955976 6061423 6254115 6432882 6463950 6471583
4914 6471583 6468446 6569813 6614823 6559693 6659650 6734854 6726123 6900442 7063128 7213334 7296204
4903 7296204 7450292 7548380 7710258 7866810 8041420 8192478 8280630 8347280 8436344 8530551
4893 8530551 8926245 9272303 9680316 10097836 10475085 10872182 11536966 11873716 11978680 11803857
4883 11803857 11499008 11105521 10796216 10445949 10013587 10027125 9801959 9603952 9605854 9650862
4873 9650862 9703110 9832809 9937380 10079471 10241315 10313029 10118263 10032498 10065251 10061647 9901278
4862 9901278 10001436 9972212 9851274 9755042 9912606 9974345 10028945 9912443 10053277 10360964
4852 10360964 10460484 10536832 10483684 10759764 11049174 11204153 11331650 11465534 11651743 11968391
4842 11968391 12253336 12516570 12696666 13001596 13264794 13552247 13849154 14026230 14312543
4833 14312543 14590634 14858474 15044191 15264199 15632350 15913039 16138441 16388960 16707104
4824 16707104 16974899 17167808 17568426 17924097 18371572 18704087 19106039 19633373 19951864
4815 19951864 20418909 20769723 21095836 21374370 21779639 22070711 22471917 22886054 23223450
4806 23223450 23935323 24698931 25385371 25778812 26632250 27475118 28227311 29235986 30378836
4797 30378836 31556938 32804238 34020885 35285490 36676955 38168301 39710368 41242593
4789 41242593 43053500 44929167 46949471 49152878 51645338 54426499 57682829 61338372
4781 61338372 65409289 70341972 76083120 83056849 91294112 101106789 112446452 125332503
4773 125332503 140522139 158860239 180997212 208160904 241023684 278622341 316995667
4766 316995667 345797012 352574899 334101384 299062697 259056367 220950588 187851186
4759 187851186 161046239 140143075 123822211 110670831 100000876 91003339 83718803
4752 83718803 77331979 71978383 67718984 63871460 60551526 57983265 55700281 53519446
4744 53519446 51627893 49921639 48390173 47048583 45879726 44893017 43782315 42995841
4736 42995841 42202133 41845729 41546505 41073637 40847940 40950944 41052743 41102317 41533295 42140215
4726 42140215 42793548 43532609 44465463 45616804 46703114 47379379 47840415 48376041 49173245
4717 49173245 49950805 50849126 51948843 53418588 55107368 57066865 59407051 62008388
4709 62008388 64980699 68414135 72740396 78061452 84124237 91572398 100248504 110399513
4701 110399513 122709436 136982333 153834068 174011169 197968045 226168533 257678700
4694 257678700 289860499 316802552 329998017 324105153 301202363 268793675 233769244
4687 233769244 200910410 172502258 148852506 129597816 114163903 101557941 91004190
4680 91004190 82311068 74962604 68732072 63545700 59091320 55278097 52008157 49005530
4672 49005530 46336324 43716309 41492120 39359672 37299908 35427773 33740136 32114261
4664 32114261 30725748 29464464 28179614 27170834 26256496 25271462 24353844 23450795 22672617
4655 22672617 21658136 20823588 20089491 19513021 18959338 18384669 17906244 17452976 16894100
4646 16894100 16560754 16302676 15771226 15676183 15390046 15052262 14811940 14561939 14362243 14126349
4636 14126349 13782076 13664272 13368552 13261574 13081987 12775603 12441735 12104048 11948569
4627 11948569 11653866 11514402 11393332 11053201 10719526 10492105 10341138 10093796 9892361
4618 9892361 9583156 9366885 9175865 8975544 8749029 8564560 8425305 8055294 7910511 7837935
4608 7837935 7620161 7567695 7501186 7439591 7391526 7524553 7558430 7305907 7314201 7254881 7270463
4597 7270463 7132231 7115593 6783001 6533474 6350694 6035107 5978671 5878985 5743118 5660276
4587 5660276 5533787 5509134 5284817 5123508 5093229 5040726 5022276 4962095 4828038 4785888 4698451
4576 4698451 4586101 4630526 4467715 4404042 4253699 4091689 4167653 4165584 4087655 4157961 4325764
4565 4325764 4337353 4277333 4246305 4053879 4057036 3912122 4010102 4123010 4031603 4031584 4028534 3897146
4553 3897146 4021971 3891261 3803963 3861513 3900098 3873453 3793149 3855147 3678398 3590818 3571452
4542 3571452 3523805 3524638 3382771 3364033 3411868 3431094 3440153 3401506 3375230 3531980 3524898 3322115
4530 3322115 3418832 3385596 3160945 2932419 2825702 2928907 3024152 2987139 2929588 2865292 2748255
4519 2748255 2671619 2610584 2549709 2685459 2671843 2788687 2901390 2970603 3092465 3019147 2945581
4508 2945581 2984157 2983975 2903977 3099597 3347925 3319681 3189620 3133205 3130723 3194817 3186424 3133328
4496 3133328 3189187 3127884 3124223 3238440 3251988 3550386 3575297 3569912 3632560 3539354 3713477
4485 3713477 3669237 3664288 3860141 3911500 3822954 4028864 4006033 4086968 4152066 4279481 4383760
4474 4383760 4459039 4372917 4513211 4751277 4761442 4806285 4968036 5108739 5111494 5211079 5209466
4463 5209466 5331064 5384174 5520802 5656765 5863896 6171718 6424478 6628894 6832197 7113666
4453 7113666 7726223 8029464 8295940 8328702 8340961 8333713 8314435 8328312 8422371 8513217 8475869
4442 8475869 8611618 8681206 8790576 9092841 9287426 9490841 9788412 10082410 10282749 10346740
4432 10346740 10564870 10792158 10854679 10855536 11084404 11248797 11448173 11684228 11895394 11819566
4422 11819566 12051838 12207401 12349086 12555273 12740689 12692694 12542848 12687621 12689844 12815682
4412 12815682 12746934 12728074 12895834 12799015 12867819 12909306 13025322 12960055 12987761 13189260 13332834
4401 13332834 13624217 13712510 13930376 13984071 14208177 14483387 14769771 15001845 15244549 15518691
4391 15518691 15812246 15960556 16122945 16428537 16473672 16479673 16435985 16537508 16526058 16559341
4381 16559341 16286181 16107233 15905673 15615671 15250404 14822735 14269717 13578913 12964469
4372 12964469 12256957 11756207 11466808 11008346 10390456 10016305 9820713 9640610 9474706
4363 9474706 9312582 9161184 8954579 8667677 8626601 8595469 8450988 8318210 8321953 8260789
4353 8260789 8201737 8150750 8237157 8336057 8236839 8104562 8208458 8389569 8369796 8502245 8785000
4342 8785000 8667612 8629865 8705517 8994081 9243034 9462439 9689977 10064150 10188675 10510433
4332 10510433 10781362 11216913 11700221 12033161 12489785 12816984 13297950 13701438 14160980
4323 14160980 14714804 15146351 15427258 15845943 16193457 16604072 17021116 17183794 17276949 17388405
4313 17388405 17377190 17249283 17153354 17148324 16993390 16936949 16766271 16655726 16575360 16391408
4303 16391408 16143068 15954241 15794586 15589791 15472349 15320905 15052474 15118393 15115616 15106312
4293 15106312 15016858 14958505 15020267 15138171 15293193 15350801 15299191 15373493 15372153 15473232 15545047
4282 15545047 15604664 15718321 15608588 15671475 15511286 15467544 15318034 15200368 15027491 14918629
4272 14918629 14889347 14828809 14709574 14554916 14388205 14060943 13975809 13751655 13493936 13476749
4262 13476749 13261446 13157529 13032775 12718490 12529835 12424103 12182861 12022321 12041936 12084017
4252 12084017 12019354 12030274 12003533 11942491 12025072 12050250 11915518 12057523 12071886 12077036 12184214
4241 12184214 12080921 12205432 12212953 12253842 12228669 12296986 12419935 12551706 12404443 12698042
4231 12698042 12883459 12798888 12893427 13058624 13297510 13358695 13505899 13841070 13970934 14132984
4221 14132984 14345101 14514435 14833929 14950496 14879597 15067087 15110677 15239909 15415518 15394080
4211 15394080 15555955 15608441 15669021 15749172 15845854 15981288 15985556 16139783 16234975 16392057 16329492
4200 16329492 16263759 16401672 16373159 16642722 16633247 16494147 16481839 16760502 16802233 16988728
4190 16988728 17077242 17193654 17259192 17356219 17493832 17460245 17446219 17160119 17103043 17145175 17126961
4179 17126961 17077644 17081739 17153353 17007681 17004675 17075515 17186454 17195611 17275929 17476222 17432884
4168 17432884 17315498 17431781 17458973 17371094 17518198 17699152 17814328 17842459 18111740 18276716
4158 18276716 18612851 19024350 19513932 20127146 20564208 21068358 21536239 22023149 22374529
4149 22374529 22727199 22956719 23263058 23396375 23658347 24017878 24252739 24537381 25305279
4140 25305279 25931597 26379654 26843864 27245590 27661178 28027816 28316102 28555189 28636246 28531207
4130 28531207 28348839 27852417 27486775 26958546 26456810 25909382 25500343 25115530 24887987
4121 24887987 24510735 24323011 23922998 23677995 23514677 23296296 23027155 22680362 22567575
4112 22567575 22424457 22267553 22164407 21844649 21821497 21874541 21712805 21837012 21787193 21608745
4102 21608745 21713556 21755892 21981488 22139233 22299770 22734491 23111823 23522228 23722442 24068476
4092 24068476 24328979 24699941 25035114 25339822 25653882 25858341 26113892 26302671 26594684
4083 26594684 26793124 26950490 27278643 27355377 27422160 27475118 27758844 28031434 28161066 28403931
4073 28403931 28822591 29034228 29372434 29836162 30188680 30670836 31331875 32114313 32721065
4064 32721065 33469191 34279849 35061146 36095492 37271819 38542185 39943157 41584993 43398518
4055 43398518 45453638 47950157 50296463 52530377 54891958 57051618 59692149 62418362
4047 62418362 65661440 69752052 74318039 80207464 86965717 94264023 102091404 109382683
4039 109382683 115240775 118820925 118343878 113192409 104799701 95301350 86283877 78467268
4031 78467268 71600873 65896529 61459866 57748815 54790340 52287492 50097315 48295190
4023 48295190 46932653 45784924 44645524 43958873 43402233 42945657 42521197 42242834 42339912
4014 42339912 42447788 42673208 43169464 43700128 44347715 45342544 46615359 47743794 48579247
4005 48579247 49082131 48955093 48597270 48138924 47510140 47077608 46962113 46894164 46985731 47425026
3995 47425026 47975146 48473912 49195930 50115592 51064791 52035791 52981692 54147185 55179538
3986 55179538 56332678 57563070 58977182 60154849 61335169 62674929 63957004 65358490
3978 65358490 66797776 68070853 69533165 71112733 72380408 73910422 75334957 76763194
3970 76763194 78048816 79153468 80322244 81286828 82361556 83471516 84404635 85557112
3962 85557112 86724354 87663572 88562964 89586218 90575430 91351020 91969280 92550601 93318867
3953 93318867 93981224 94378808 94919731 95242202 95459906 95802499 96215805 96491703 96900218
3944 96900218 97116767 97197793 97210927 97253471 97397259 97444478 97656659 97866774 97975313 98281565
3934 98281565 98483656 98421351 98400267 98058456 97593772 96838032 96045162 95028209 93964363
3925 93964363 92757261 91557819 90365374 89297964 88607202 87735793 86997163 86099773 85598653
3916 85598653 85235041 84850492 84559354 84288223 84314284 84518768 85281864 86416292 87590654
3907 87590654 89097619 91096534 93523549 96231871 99386750 102985120 106670262 110230267
3899 110230267 113969049 117314254 120228713 122560079 124193938 125403148 126136120 126451623
3891 126451623 126575634 126606377 126640807 126508403 126376387 126329806 126261987 125728057 124909850 124090220
3881 124090220 122759235 121385582 119534562 117554450 115406433 113256571 111404249 109694703
3873 109694703 108338019 107106788 106237473 105947594 106100700 106648606 107542411 108692382 109784605
3864 109784605 111184665 112362308 113165185 113550240 113720620 113278189 112310550 111054781 109193667
3855 109193667 107701176 106032269 104187441 102440103 100720732 99065160 97511746 95772399
3847 95772399 93683348 91330978 88821320 86092778 82904199 79741211 76556475 73367747
3839 73367747 70234122 67323236 64694935 62215875 60069876 58395086 56878907 55593666
3831 55593666 54476369 53764357 52915693 52447341 52237651 52205155 52446438 52708078 53206420
3822 53206420 53783252 54402813 55129464 55623530 55711747 55640969 55447747 55045373 54385961 53485383
3812 53485383 52580330 51629242 50683390 49909723 49221149 48574002 47738614 47026486 46202246
3803 46202246 45280851 44092034 42819785 41327686 39702245 38149863 36665017 35092233
3795 35092233 33872713 32796363 31610015 30887398 30160192 29477730 28992858 28391647 28042657
3786 28042657 27458784 26867582 26500717 26005258 25476124 25209631 24725784 24349762 23986264
3777 23986264 23496233 23154952 22840833 22411126 22063235 21641610 21363418 21092897 20965309
3768 20965309 20722412 20622176 20506134 20412588 20515057 20519562 20584631 20416069 20284230 20272897
3758 20272897 20085011 19993208 19953564 19747936 19605894 19497914 19454112 19433727 19457239 19435711
3748 19435711 19458142 19570142 19819061 19841205 19816880 19768622 19662548 19450487 19441081 19398380 19037043
3737 19037043 18737417 18649654 18440505 18378995 18084827 18066090 18031801 18083544 18105678 18109778 18172351
3726 18172351 18364810 18482064 18665121 18596306 18555397 18585593 18506787 18512172 18578799 18532705 18435929
3715 18435929 18708453 18591668 18602198 18627971 18962734 19202637 19270717 19356172 19361387 19434610 19456482
3704 19456482 19516638 19654386 19709437 19807968 19749522 19670617 19842973 19979086 20018256 20183132
3694 20183132 20358243 20424215 20422824 20618688 20841730 21023839 21077493 21264281 21676279 22122744
3684 22122744 22359984 22742357 23256717 23770656 24372951 24900073 25468958 25950179 26544055
3675 26544055 27030908 27507058 27936361 28436411 28798630 29025379 29427963 29602603 29692864 30019690
3665 30019690 30245284 30457804 30601383 30740072 31018986 31212965 31308839 31441675 31592561 31665516
3655 31665516 31656041 31776133 31972705 32205047 32373710 32466858 32483286 32845413 33229155 33690433
3645 33690433 34264590 34809093 35329126 36141945 36895593 37708140 38694644 39611565 40685010
3636 40685010 41886229 43213823 44526847 46159567 47802887 49724656 51832078 54119122
3628 54119122 56669619 59429905 62444248 65517536 68820281 72391283 76052007 80140119
3620 80140119 84202407 88283620 92463885 96466346 100452862 104523835 108607520 112730619
3612 112730619 116988056 121301103 125609108 130035479 134257220 138286741 142092572 145881992
3604 145881992 149451884 152664047 155388752 157749037 160031552 161908449 163536527 164674635
3596 164674635 165509989 165980925 165990149 165802735 165424029 165056958 164482378 163942764 163073918 162182060
3586 162182060 161092842 159615038 157515733 154988683 151932278 148410094 144524775 140525594
3578 140525594 136659144 132727680 128886363 125291124 121991830 118629314 115494468 112290756
3570 112290756 108742831 105276713 101563220 97481164 93380839 89373888 85188124 81237336
3562 81237336 77692101 74351810 71374168 68429749 65768003 63357109 60921155 58644331
3554 58644331 56356476 54114153 52246441 50160131 48334364 46546690 45015286 43648124
3546 43648124 42479080 41128657 40062082 38987013 37975661 37167866 36491994 35892714 35234255
3537 35234255 34585726 33923971 33387187 32931505 32524758 32191613 31743346 31320403 30946369
3528 30946369 30519219 30018013 29576675 29465790 29141080 28888616 28658792 28196048 27919377
3519 27919377 27733159 27514132 27200939 26742123 26483694 26353394 26397933 26097960 25740415 25445895
3509 25445895 25052224 24835574 24619044 24406016 24177645 24019068 23567764 23273266 23068823
3500 23068823 22739291 22328279 21937395 21634100 21315326 20987461 20661065 20481902 20162987
3491 20162987 19801274 19406993 18991413 18644952 18313791 17920390 17457881 16996957 16522791
3482 16522791 16154504 15947717 15494701 15215009 14905206 14627447 14373562 13966425 13685681
3473 13685681 13402619 13068474 12842102 12588659 12336803 12132688 11886056 11634898 11456715
3464 11456715 11161050 11046963 10851635 10815490 10792808 10720253 10544661 10299472 10277719 10196938
3454 10196938 10095431 10059854 9889658 9753891 9591975 9418512 9411295 9341936 9268129 9196456
3444 9196456 9107749 8981026 8810844 8632922 8610381 8576713 8554717 8442257 8526207 8402110
3434 8402110 8134501 7952257 7973409 7920351 7907759 7818775 7739685 7803453 7774280 7617895 7664436
3423 7664436 7436963 7124360 7326346 7188794 6938239 6814034 6743373 6755620 6708509 6568051
3413 6568051 6648545 6463063 6325832 6256658 6273977 6204200 6017940 5847977 5954222 5972666
3403 5972666 5903903 5849057 5746492 5786534 5763696 5611754 5552352 5477234 5506500 5407167 5305306
3392 5305306 5369330 5332349 5311883 5252080 5339820 5378256 5243992 5174670 5163573 5215411 5166859
3381 5166859 5118935 5189308 5126873 4904190 4892252 4955189 4864312 4883338 4893111 4921780 4912271 4912990
3369 4912990 4847623 4745968 4569231 4510369 4590731 4548745 4672454 4676743 4534114 4661436 4609987
3358 4609987 4492933 4390050 4389252 4353354 4332301 4201839 4205256 4292199 4366835 4208882 4218650
3347 4218650 4300561 4446771 4228470 4181309 4346625 4174919 4170337 4217969 4192361 4228577 4157614
3336 4157614 4122063 3971467 3979689 4080677 4158777 4168376 3900898 3856499 3935262 3925377 4020020
3325 4020020 3996550 3975246 4035069 4116891 3941825 3768236 3925048 3959546 4022632 4096057 4308622
3314 4308622 4250803 4370567 4321048 4190907 4153287 4163178 4225492 4321738 4440763 4494130 4580893
3303 4580893 4489062 4535322 4572459 4519932 4598456 4534239 4534962 4560672 4486760 4360499 4230993
3292 4230993 4304345 4241929 4291525 4161960 4087903 4094320 3938622 3944441 3879102 4075696 4088331
3281 4088331 4137214 4155297 4244180 4237485 4245972 4333061 4193006 4092456 4143988 4220529 4209342
3270 4209342 4077560 4149381 4165101 4253412 4261968 4338924 4449759 4459456 4411599 4321769 4342848
3259 4342848 4650997 4824129 4938325 4976893 5045864 5219005 5174593 5130405 5237740 5478415
3249 5478415 5527811 5611272 5736925 5847139 5918627 6161166 6301683 6481485 6833375 7263842
3239 7263842 7587904 7969225 8228455 8611138 9102323 9600829 10178879 10452080 10714824 11026176
3229 11026176 11274983 11536099 11735266 11788527 11596917 11514185 11087921 10492618 9916196 9302090
3219 9302090 8721019 8296978 7996002 7655288 7438752 7291117 7125049 6894932 6724635 6541235
3209 6541235 6477714 6622683 6656169 6601910 6818162 7121912 7250039 7346786 7511857 7293485
3199 7293485 7115103 6711082 6315485 5973224 5557255 5292557 5088004 4855897 4645342 4489341
3189 4489341 4327399 4325739 4219959 4386198 4540507 4235858 4105236 4107901 4025648 4024353 4036623
3178 4036623 4003819 3822108 3933873 4041870 4087554 4118725 4109363 4198533 4452711 4379855 4280935
3167 4280935 4079159 3779982 3607181 3492630 3159608 2970765 2875757 2710259 2871466 2811213
3157 2811213 2659873 2567589 2567962 2694601 2751741 2681573 2495933 2361980 2411573 2462783 2408003
3146 2408003 2240648 1891325 2007542 2041609 2056739 2196726 2203351 2084165 1910331 1933129
3136 1933129 1803422 1895427 2004298 1993332 1951962 1782769 1735228 1890680 1668558 1518108
3126 1518108 1430621 1479571 1490426 1421807 1333423 1194763 1393583 1384505 1193494 1173009 1245612
3115 1245612 1477677 1455534 1397600 1295074 1339351 1358426 1274004 1315702 1281951 1209073 1375555
3104 1375555 1340177 1161815 1222548 1195920 1085587 1142290 1225865 1262389 1172875 1034280 950355
3093 950355 958287 1022202 1159753 1114782 1037852 1013990 918686 977236 1002598 1030477 1008190 990995
3081 990995 995143 909995 959608 979626 942390 1202898 1039490 897230 868951 1021117 1113675
3070 1113675 1045712 950029 861241 748632 835094 642077 757241 776530 660803 753160 845192
3059 845192 882743 791841 690180 812132 881071 869116 756860 742076 846509 865718 824002
3048 824002 686030 796444 680152 697560 606243 610862 673292 744904 799682 828529 718087
3037 718087 675247 632204 687874 728635 701233 623551 660942 687665 707770 701615 722509 634305
3025 634305 711629 733128 651602 608199 621701 640329 607262 621509 832514 904855 830093
3014 830093 739806 670937 602769 663076 503140 578876 644240 565791 662769 690092 644023
3003 644023 546875 687260 657650 667553 560236 567008 707339 751370 849571 814703 752147
2992 752147 789770 805731 839288 883015 900543 872500 888233 703082 720933 905119 846381
2981 846381 731582 975675 808273 743835 823759 721751 651449 645243 603806 616932 677229
2970 677229 915529 928972 804133 718488 779133 874691 959791 971864 966546 1017878 992984
2959 992984 998483 1028163 1022465 1258963 1253621 1072301 1131783 1152175 1179206 1147202 1160391 1191976
2947 1191976 1188144 1205186 1235265 1218299 1202276 1213545 1334827 1392572 1418060 1465310 1443153
2936 1443153 1426258 1338769 1278867 1213540 1293051 1381386 1280063 1359442 1380879 1376862 1376753 1370637
2924 1370637 1450670 1514477 1360874 1460699 1577460 1524871 1549105 1507586 1539440 1843805 1810002
2913 1810002 1709205 1656008 1725874 1869367 1809904 1758494 1834038 1772309 1935963 1922109 1882788
2902 1882788 1909275 2020856 2024085 1828481 2084302 2138942 2054734 2016343 1989049 2061576 2146235
2891 2146235 2047047 2138819 2362786 2393056 2491091 2458212 2420809 2403889 2434631 2451311 2218845
2880 2218845 2152014 2136301 2157851 2175611 2067551 2098545 2073502 2051744 2091805 1930455 1920294
2869 1920294 1993165 2032349 2126780 2258653 2176050 2240255 2239232 2329425 2385629 2332963 2334653 2282842
2857 2282842 2200895 2058422 2089182 1967223 1999555 1985705 1930162 1948757 1802679 1853705 1880409
2846 1880409 1783885 1728304 1745846 1724537 1613846 1605414 1577159 1602122 1640453 1540454 1394118
2835 1394118 1276495 1260237 1369598 1386499 1366148 1181366 1226652 1414393 1419084 1328345 1099734
2824 1099734 1084236 1054277 939945 995760 858219 717186 820994 827730 770316 892571 939658
2813 939658 917779 905695 669705 483789 495978 575718 728673 792418 660140 530540 506925
2802 506925 394704 422275 613648 559137 382473 447425 515625 483878 497182 438183 408347
2791 408347 339582 424259 429528 412665 511511 458508 509199 490657 546477 572372 508123 481942
2779 481942 392509 345768 336839 289873 313564 258171 266924 383084 294426 259581 212938 307434
2767 307434 326672 309880 325221 327308 378860 294799 275234 315391 274086 188302 291062 257136
2755 257136 121338 104600 185904 228199 195968 96737 -10276 27444 47752 91450 136590
2744 136590 203949 172182 313909 178193 147334 267713 306255 238617 156861 60036 44742
2733 44742 84268 27399 -6784 7888 22971 111692 153770 230181 72933 -32745 21520
2722 21520 60945 113027 41320 -94970 -3097 256763 267111 191200 17735 -53157 -115619
2711 -115619 -83330 28294 -24527 -74029 -60612 59474 247948 183029 98132 198115 202882
2700 202882 28292 -149379 21701 16984 -55190 30138 -62690 -8764 18958 79612 74711
2689 74711 -207783 -256113 -59777 -47662 22971 38331 188881 24695 -94103 -67768 4797
2678 4797 -109932 -116 -31785 -44130 40036 -100333 -108081 -20414 -3011 -68330 -83744 18343
2666 18343 -21555 -21530 70567 -94631 -56598 145502 115129 -183511 -188597 50411 -55958 -193966
2654 -193966 -178432 -7831 156974 93573 10715 44615 61462 -73151 -300327 -175513 110378
2643 110378 60035 -93623 -223421 -111277 -164595 -94970 -105713 -96464 -40417 -95095 -67333
2632 -67333 89956 107908 39671 79826 151141 42189 -131796 135025 -23975 -145908 -12024
2621 -12024 43242 44649 183956 166445 -34217 72399 -3751 -89679 28657 141115 169889
2610 169889 56463 5216 16545 68364 124687 -7334 93884 121742 89719 9439 -37135
2599 -37135 -81975 -137251 -125018 -1478 13416 81075 316899 304459 243757 171987 -32403
2588 -32403 -22109 74607 148044 129035 85080 36515 10483 55955 81596 31069 -46684 73643
2576 73643 61404 118067 15732 6409 158088 39004 55227 51607 157199 151587 202728 268463
2564 268463 153742 122367 73503 -11899 144392 124322 75389 11396 51596 54813 75159
2553 75159 158304 102852 139552 -13503 -25036 7361 92639 180871 103411 8224 -41182 -59428
2541 -59428 -59356 33268 70007 101880 159145 14802 -147950 -132220 36788 85456 -42221 -95310
2529 -95310 -21870 79510 61017 -10662 -46821 -744 90709 56379 -95779 -60085 -5289
2518 -5289 91533 110424 -121836 -78384 13033 58551 -104297 -62904 -66104 -161979 -162472 -34481
2506 -34481 16779 13725 2323 -103728 -96566 -120138 -87350 -200742 -207911 -29372 -34656 -166319
2494 -166319 -201426 -183726 -239861 -198678 -164216 -120293 -127611 -213620 -253139 -158953 -186767 -88819
2482 -88819 90716 75109 -77112 -72408 35289 39205 34371 1802 -63081 -80286 -13477 -86461
2470 -86461 -44905 17092 -91248 -124450 -69434 -87769 -137952 -85346 -202436 -229392 -203964
2459 -203964 -151126 -183850 -36576 58463 -17977 -117544 -169667 -219836 -78499 -64953 -238837
2448 -238837 -245428 -81281 51506 -116275 -62747 -86661 -897 80970 -46200 -56903 8739
2437 8739 -124796 -110428 -109725 -186850 -128127 -128019 -240286 -256485 -133426 -145425 -170560 -81903
2425 -81903 -65547 -184730 -315206 -331315 -262814 -103018 -73642 -28523 -109375 -53471 -58270
2414 -58270 -36247 -118381 -310653 -177681 3719 -46113 -187465 -181150 -149606 -196119 -241347
2403 -241347 -196272 -87408 -214818 -83333 -107475 -234305 -17285 -104229 -162993 115044
2393 115044 135219 -102346 -4586 -69594 -176039 -194238 -166207 -186547 -190137 -76994 40293
2382 40293 99604 161310 117274 165996 89921 55816 77966 56754 49199 -32581 -34108 90427
2370 90427 223184 40600 66452 -34332 -36971 -88472 -90432 -50871 -67320 -196500 -205337 -121173
2358 -121173 24958 155327 67892 178705 379780 350941 407942 394389 205977 97158
2348 97158 163932 171111 80129 138715 16358 2059 -3419 23276 45812 106273 144123 79354
2336 79354 39099 98225 -61927 -69298 44760 9032 102585 135493 49032 -82048 33327
2325 33327 -57388 -54678 88280 29117 -2950 -45377 32301 162260 165706 -792 111028
2314 111028 186538 109932 52272 -8564 -14858 23742 11461 131615 105723 -108319 -69603
2303 -69603 -93038 -48816 -81659 -139677 -58381 -4705 144390 70366 118140 34898 45310 36471
2291 36471 82993 -69010 26684 34974 71315 196917 69405 128323 -1292 143900 101578
2280 101578 136164 280053 307161 259509 213971 183057 122789 195160 301430 268821 268255 248576
2268 248576 192049 17188 6940 99912 288775 381207 289946 333303 418978 263246 91476
2257 91476 126289 9806 -2246 -17902 -3123 -85474 -35876 -66531 79941 262118 400210
2246 400210 331987 252330 267139 396090 127181 42823 127234 161263 259199 169058 173804
2235 173804 238341 269315 246611 316582 358031 345153 246412 263406 60110 227606 203340
2224 203340 271413 398231 299757 356462 457274 501182 458066 359640 216502 92497 156998
2213 156998 314448 329035 377414 463337 461153 349637 290435 268275 375625 521515 524191
2202 524191 521771 533551 669494 492824 350609 417317 445718 468895 612190 606042 555879
2191 555879 435822 575958 575521 514501 678163 652069 518365 557170 568895 619284 716560
2180 716560 640389 675118 707917 848596 725230 524627 635968 739829 881334 830067
2170 830067 865047 930682 856345 868734 848431 964652 883051 983849 966547 1095247 1221256
2159 1221256 1267098 1289466 1263752 1304604 1341747 1479554 1366751 1441989 1494964 1594956 1647043
2148 1647043 1697412 1685874 1775953 1864921 1928344 1959980 2122310 2135727 2256932 2401483 2436228
2137 2436228 2333414 2283761 2333237 2445114 2606249 2635063 2821454 2987220 3031575 3145578
2127 3145578 3215441 3501354 3671845 3769109 3771577 3924841 4326107 4397444 4551886 4999733
2117 4999733 5206427 5327327 5621101 6003427 6384409 6778927 7074343 7234845 7633278 8098782
2107 8098782 8641139 9225911 9933448 10596862 11641947 12629236 13622890 14462709 15367793
2098 15367793 16574308 18314970 20342880 22881580 25794253 29478577 34037255 40099350
2090 40099350 47591574 58016926 71296619 86815364 94680892 87191038 72779651 59485929
2082 59485929 48071244 39019032 32230191 26999856 23176882 20649458 18713423 16774810
2074 16774810 15528929 14481104 13785337 13126872 12097790 11141504 10432042 9583180 8901236
2065 8901236 8316515 7853940 7308697 6825660 6304304 5923069 5615050 5390289 5024318 4721263
2055 4721263 4464883 4393541 4269209 4113555 4024242 3804050 3601924 3502316 3305948 3135093
2045 3135093 3030644 3040094 2968712 2805901 2674106 2637503 2412549 2450458 2298250 2161675
2035 2161675 2154774 2031727 1942333 1809153 1858199 1913256 1869948 1777403 1793361 1836296 1718804
2024 1718804 1637172 1663387 1506733 1456894 1473335 1479647 1475806 1357915 1319393 1227999 1259954
2013 1259954 1312458 1272098 1262459 1175299 1023538 1001361 957185 821354 778059 869634 927903
2002 927903 745170 807758 816892 623222 533487 674976 693886 629631 615512 549148 537985
1991 537985 654589 766412 657588 699611 573941 480863 473143 512298 483413 501238 472231
1980 472231 459226 509574 473650 566524 661337 589140 353636 304878 477141 325785 315013
1969 315013 428329 416700 280580 247897 299286 303930 256491 302253 312847 133916 284659
1958 284659 408798 438220 438128 472091 419685 275300 146482 202742 346334 268402 200267
1947 200267 189703 165632 142797 33086 7629 100440 139239 205185 61382 107536 243129
1936 243129 176731 89912 5433 100652 161947 257852 113349 -44002 -124153 154820 255360
1925 255360 296827 139719 101370 170619 172059 114826 99618 227941 194323 217921 188744
1914 188744 239715 62164 142626 151079 78454 10659 19935 41204 -188578 -89419 -100302 -118066
1902 -118066 -53125 -95878 -53427 -20134 72994 -42148 -57047 175966 23164 -77079 -100634
1891 -100634 12953 189013 77602 1527 -120325 -66425 -56200 -135278 -121293 -78870 -181077
1880 -181077 -328493 -276980 -48928 124704 -3804 83688 211729 169522 170462 51372 29355
1869 29355 121971 30276 67575 65632 609 -34634 137321 146205 -5095 -147122 -74685 -14920
1857 -14920 -24807 42098 131448 26226 83889 97317 113341 164297 94517 -59658 -224461
1846 -224461 -78165 47806 133859 74470 33357 194237 96039 1012 65938 80965 -10016
1835 -10016 -91594 43314 -175066 -155912 16131 101065 139704 105456 30747 91435 193281
1824 193281 152720 222061 106154 166820 342369 314315 406910 512744 445918 333452 338763
1813 338763 268291 220658 91114 155587 66228 142697 182416 75505 86530 234433 251856
1802 251856 74211 140230 34486 -77432 -77519 62481 246667 191839 37988 -67719 -120157
1791 -120157 91361 87851 34186 44843 4870 -77507 -208106 -132117 137891 137481 76554 32561
1779 32561 -42584 19982 18460 231526 189110 17281 -46069 -182563 -194642 -1676 129749
1768 129749 109523 56887 150019 -34596 -78026 -114506 -126378 -90909 -100185 42861 49960 -57893
1756 -57893 -128519 -65288 -58911 -66953 4934 -51094 64131 -8188 36479 105579 128322 16380
1744 16380 27270 212483 99623 125919 54756 143264 148771 22361 110300 -10813 -37605
1733 -37605 37471 16451 57005 62707 119434 -88320 -110381 -89813 4202 -11335 47170 67440
1721 67440 67809 29526 2605 -41313 -124873 -5388 -109457 -96972 -891 -57257 -113880 -168613
1709 -168613 -3091 -66479 -182055 -11856 -78335 -110166 -175007 -172871 -20729 93436 -26286
1698 -26286 31319 -31646 -67495 19301 -115218 -143620 -201629 -112249 -60039 -37473 81 -12127
1686 -12127 -78773 -32169 124619 123165 -2450 3315 7448 -115503 -71745 13451 25051 -41642
1674 -41642 -16683 -86531 -22656 -34106 -45235 17112 21078 101502 225205 81430 36863 -23070
1662 -23070 -33736 -59728 -164538 -121932 -122354 -48804 -58504 -95012 -225565 -53351 -131137 -74260
1650 -74260 -50432 -150744 -241156 -106774 -102517 -123979 42880 21810 -77196 -19484 -79038
1639 -79038 -133527 -195949 -94145 -53195 2132 -85227 -153947 36798 27495 59539 71109 64425
1627 64425 63498 12960 -35056 -27596 10951 -127195 -170693 -123543 -201978 -217199 -79911 -186480
1615 -186480 -119025 -78169 -108070 -139386 -225792 -118089 -70135 -137674 -117992 -68770 -171071
1604 -171071 -218681 -51113 87219 153677 130730 -112599 -98813 -91736 -30963 104595 23226
1593 23226 109756 95638 -12225 23851 6584 97538 104964 9155 -155562 -106903 -130026 -53602
1581 -53602 -36266 48543 126472 98233 39163 66305 -90411 -170454 -88878 -101987 1279
1570 1279 22982 -27507 43280 -94891 -220830 -116672 -110083 -136408 -131420 -112151 21319 96670
1558 96670 51559 66893 55359 -140408 4069 69686 114713 19808 -131060 -50905 117415
1547 117415 114987 188780 162030 24694 12065 81140 -55667 7174 33228 -77547 123308
1536 123308 221974 100809 134015 76839 69739 83321 47921 -29505 -123200 -1695 85390
1525 85390 -14259 -86978 -132031 -181274 -28595 -90286 -127919 -150975 -68074 30079 81194 -29072
1513 -29072 -261489 -343248 -195899 -133851 -214338 -134582 -149225 -151622 -20121 15063 -2877
1502 -2877 21046 -12660 87993 -21209 -57280 90296 -589 70887 14394 81 -44749
1491 -44749 -102465 -132446 -87690 -59877 20965 -106432 4639 44675 -111456 -244041 -159206
1480 -159206 -129084 -189032 -69742 -48710 -72577 -67459 -41077 -24871 -77645 17407 79546 46576
1468 46576 33946 104584 -87651 -132018 -70333 -122461 -111825 -139782 -74130 39103 -34134
1457 -34134 34343 93417 50 -123237 -129348 -81177 -119171 -95916 -94173 -23885 -24372 9934
1445 9934 25980 29913 -58595 -4220 -33485 -10918 52193 116920 70347 36504 66939 -1473
1433 -1473 73017 -65707 -16702 38533 45480 183183 97431 -128891 -179130 -225831 -199895 -105286
1421 -105286 -104693 -98271 -124646 -20104 94762 154129 -34442 -14103 91942 15108 -56566
1410 -56566 -158300 -161175 -19808 -111846 -63625 46139 -28091 -151594 -31240 11988 -55507
1399 -55507 56795 -91599 -178771 -189193 10766 50903 -101165 -117990 -173965 -132767 15699
1388 15699 -26585 17922 21795 -78335 -29149 11962 -108094 -52965 -1649 36692 -131461
1377 -131461 -93479 -101727 -144121 -88629 -146810 2447 220066 66166 -242131 -141469 -88843
1366 -88843 -79024 -85727 -205180 -52194 20849 -107160 -100919 -67440 -102352 -26667 40994 -75086
1354 -75086 -55444 -50629 -8677 29826 -3451 -116135 -159734 -128731 -74768 -39238 144479 20934
1342 20934 33501 68189 116500 34903 19487 131854 101637 10263 -11313 18534 242055
1331 242055 186312 90430 81479 -121566 -99806 -91006 -44781 -90037 -105779 -34075 47150 -35756
1319 -35756 -70496 -116534 -117897 -116168 -66738 -38109 -6526 30729 127747 20525 573 62980
1307 62980 -39923 111953 16668 -12171 -139715 43207 67644 122338 -64372 -188712 -73196
1296 -73196 67003 -137527 -117836 -35134 -943 93805 52903 21522 -77555 -74475 37548
1285 37548 -96134 -28242 9297 -54306 -117055 18886 117434 -121133 -74087 -160318 -103100
1274 -103100 114498 77231 99011 -31498 -122473 11287 -23247 26033 18065 77389 25239
1263 25239 105380 77398 -42450 -23995 -2419 1580 53862 87154 127732 102783 233815 9931
1251 9931 -17732 -180025 -92122 29512 -2911 -85033 -76278 -5018 148493 104943 -20132
1240 -20132 -42251 -57068 -103216 87513 -101801 -187266 -100312 -52466 -33762 101969 143254
1229 143254 -9896 -26270 21418 15682 -50491 -138637 -189461 -85379 -53789 -69225 15600
1218 15600 -20253 -51641 -26287 -83929 -66264 79504 136261 59646 14667 -42430 -2733 -77596
1206 -77596 -106846 -70358 -6735 71113 31635 11219 -65224 -39416 67410 143837 142181 -123920
1194 -123920 -127965 96150 172917 -7763 -146776 -66023 27522 34841 -13423 -79822 -79835 42704
1182 42704 133082 40483 -190967 -84503 -21027 -113530 -88626 -72201 -132603 -63957 -65753 -50318
1170 -50318 -14737 -28097 -36956 -116360 -60428 -5414 -69385 -26404 -5394 -76272 55099 32516
1158 32516 30843 -74143 100778 121759 155067 23118 -10612 -3791 127578 166871 294754
1147 294754 166299 158314 204225 71043 73908 4874 -20979 -100820 -17532 73692 -82712
1136 -82712 -73384 -81683 -57657 -17612 41527 50793 56591 -101749 -50536 64975 68571 -128764
1124 -128764 -251835 -147995 -233982 -182496 -3939 33835 -50415 -82686 38836 4564 -82776
1113 -82776 74886 152935 99973 -62766 64591 -50216 -54925 106449 -29821 -46885 -84813
1102 -84813 -32853 -106937 -52983 8219 44182 133549 123452 140975 191100 -22253 -174358
1091 -174358 -90622 57517 -99094 -107807 -84435 -94112 -43757 -43212 -105119 -135179 32573 20400
1079 20400 -21048 68102 115610 18186 122822 71629 175291 81577 177184 -6184 -152335
1068 -152335 -184700 -213334 -92730 -69207 -3306 82459 -92566 -156539 -122398 -28246 78863
1057 78863 51734 222504 253263 -20361 81961 65964 35319 -8303 -52632 36265 -92967
1046 -92967 -144298 -26149 -53766 -54983 6118 133224 -26657 77307 27657 3333 100315
1035 100315 36513 184170 260432 157876 94195 -44936 -55505 -19528 -39548 31269 -132793
1024 -132793 -65271 7780 9599 16052 25543 94865 7514 -106262 -35249 64948 109682 -3448
1012 -3448 -25756 -142374 -225836 -49265 -1414 60022 77952 94556 -88819 -21562 -72855
1001 -72855 -63381 -48410 -92787 7330 -156313 45093 -38291 -128331 -42547 42281 -59171
990 -59171 31657 101788 63303 45261 27547 12966 51335 57874 -15318 32805 -36413 -173036
978 -173036 -112799 -17455 -109394 -183284 25053 135983 83861 -49749 -3356 72445 65154
967 65154 -43217 -71604 -210191 -104937 -18200 -145948 -105576 -50180 141762 228271 105785
956 105785 -39034 -86017 -62707 42833 126210 181252 141671 276880 105182 -128206 -116040
945 -116040 51519 -47932 -151433 -232630 22069 43955 13603 14654 -74847 -144918 -71106
934 -71106 62832 13499 -21906 -75874 -18012 -41885 -52310 -10399 123997 11848 75947
923 75947 154596 58099 36684 -73687 -35334 6615 23197 -129718 -152740 142368 198556
912 198556 26364 -3724 83015 -72683 -85085 -220216 30514 10843 -3522 -74795 -61613
901 -61613 -31167 73269 105046 216415 181452 31682 59435 30913 15797 -82165 -167915
890 -167915 -181724 -217905 -165926 -186096 -112883 -3234 -51800 -79276 -3672 -45291 -18487 -9627
878 -9627 -80331 85176 18504 52156 7310 107137 142824 149867 18896 46541 -4776 -23104
866 -23104 58835 -215685 -169964 -130590 -154522 -36162 -99337 -99778 -28808 -64631 -155220 -103153
854 -103153 56779 48458 162789 46640 79176 100899 139280 -53012 -58645 27120 50127
843 50127 143587 26627 93514 -8299 -130077 3185 10254 -156897 -132253 -124051 -50583
832 -50583 -127842 -122643 -101625 -104695 -153784 64701 31201 118930 29721 157741 57141 -20959
820 -20959 -16046 -93816 -29450 -95167 -82888 -103278 -71974 -30911 -34165 -90656 -181045 -61509
808 -61509 -40657 -15998 53944 -45945 -95469 -76607 -24219 75545 169696 88098 29771 -33826
796 -33826 -158695 -144795 13838 -20816 -59319 -40123 43505 -25652 -29111 67897 137293 236087
784 236087 193040 189551 20210 -4508 132155 137717 157329 23164 -172332 -45547 -1291
773 -1291 118809 197774 24809 -34762 31013 149411 230590 125621 -127524 -211430 -164304
762 -164304 -200288 -124140 -87992 -41876 12833 84274 80227 242264 158952 -6872 38042 -84947
750 -84947 147746 187319 19892 -4051 -15894 -78790 68120 96436 93328 -34744 -93024
739 -93024 89791 -88858 -302706 -15068 -24464 -76115 43699 7081 93909 106357 -6074
728 -6074 100153 65839 -709 26655 130652 127929 -30503 27099 67795 -7304 172329 281327
716 281327 210348 162322 120856 8817 3833 85694 -71974 -122758 -88840 -251825 -11523
705 -11523 35313 -78270 -93324 -128607 -103920 75607 -20762 -259025 -61600 -32196 -118194
694 -118194 -85432 10937 -122662 -142373 10487 -60306 -102562 2060 127667 192148 137831
683 137831 128171 91450 66628 73422 33536 64178 125429 80416 29395 41310 55548 75124
671 75124 47581 -30609 44054 113169 150486 110425 24204 180030 30498 94562 28134 44200
659 44200 157742 137769 78931 150794 -101368 -256433 -90336 24788 -54169 -149886 -66149
648 -66149 60419 165511 80459 47537 -36703 74450 104990 131654 -9059 -11827 81839
637 81839 -71516 -99577 -29161 -43002 28350 -10620 -114207 -187468 -50396 -45422 -49655 -806
625 -806 -57434 -96405 77083 596 -56368 -41162 -181484 -70671 -80739 -119328 -98385 -63896
613 -63896 -115303 -15942 -64582 -122308 31328 -16519 -49781 -59646 -120863 -59839 121212 -7168
601 -7168 -46372 86051 88982 19662 13381 -19331 133376 184136 147466 139367 114198 159986
589 159986 105652 73319 115020 25168 88125 -22297 61943 126593 46114 15364 24947 1054
577 1054 -51431 -49514 -6312 57299 87913 27123 -108624 -138787 9341 50236 50665 36029
565 36029 -63169 -35965 32732 29212 -224138 -205409 -18340 17413 5103 33085 -25247 -157760
553 -157760 -58802 81096 53375 -53761 -139607 -74547 105595 113829 84662 170202 136225
542 136225 -122623 -211275 -39739 8761 81969 167357 82546 61809 -3174 -23532 -69763
531 -69763 -59174 -84891 -23824 8095 6490 119104 36699 52498 -92809 -57277 46550 57043
519 57043 109008 10227 -106010 -112039 47371 199550 298581 188548 -32617 -58357 33025
508 33025 94797 -93973 -135398 -132110 95265 133297 32392 -111040 -73523 68020 111439
497 111439 149559 193620 99347 70915 56046 -79745 -2278 -31581 -120539 -92999 -100588 29419
485 29419 -19544 -62744 -73235 -101441 -43910 9116 93302 81842 10664 91042 121904 99519
473 99519 57715 86407 -75788 -86467 -289383 -194513 -70215 -64068 -19408 -67093 48683
462 48683 -19242 58726 46342 14572 42546 132509 189342 84397 28162 64633 121725 96633
450 96633 129126 -31787 -173588 -139389 -58268 44548 1422 -78358 -97517 -45639 -41294 -77214
438 -77214 -76266 139505 53479 94074 146047 31066 -33805 87019 72343 -41791 -220310
427 -220310 -121470 37079 109757 27149 -17511 -2948 82882 27939 -111468 -19854 27149
416 27149 112105 158024 143722 40402 90955 211120 130505 153861 129189 71914 121375 138490
404 138490 113575 -133361 -79380 119500 42068 -17526 -30946 25704 118927 -38852 -85708
393 -85708 -55826 4405 137524 82822 115535 89025 197632 201577 171499 73021 -20866 -91575
381 -91575 -74939 53836 183205 102167 -39579 -34507 91046 135733 134230 76071 250131
370 250131 284960 225401 249544 278963 213230 146702 81721 -97635 -69159 74137 195189
359 195189 -407 -28216 -94172 -248357 -266987 -159626 49210 48959 -16209 49192 -66764
348 -66764 2543 -52422 15797 57701 -3402 -10072 -24369 52005 89293 79308 73749 145248 224329
335 224329 253939 145481 54729 99754 186102 205630 186133 247059 129118 71057 -38865
324 -38865 -69400 -132390 -31342 107782 228342 215035 128659 -13572 -146545 -89605 -31447
313 -31447 63998 79894 169794 163307 160408 185300 15012 -29074 110701 193056 113261 130342
301 130342 97826 -78545 -15867 -9309 147301 23608 -33963 -103487 3740 93448 104673
290 104673 158982 -19117 2668 389 104650 109718 15119 -8897 -87770 7085 92683 86025
278 86025 -39139 -28240 -68094 29729 45233 4567 25860 66809 14124 77764 112073 21742
266 21742 -881 97807 104390 206200 225085 184884 246666 118159 125104 139915 149464 25405
254 25405 48068 120116 162055 45174 102500 57382 -2653 -107954 -24040 22801 25395 49981
242 49981 96165 86964 -57687 -190017 -29510 12787 48453 39568 12676 224015 149383 88839
230 88839 136356 145234 114124 115926 126193 279381 240290 17549 53300 70457 133471 211979
218 211979 175838 3927 -93724 -80921 68977 97802 78254 55727 57156 -41829 5936 -69824
206 -69824 -146608 178936 310320 77269 31048 93099 72330 116441 178698 107220 -52191
195 -52191 57728 196037 140927 121060 77404 -5390 41089 -11854 164889 242376 254630
184 254630 96689 64803 27758 67104 203105 295728 82024 -27580 15645 99521 82324
173 82324 35689 121608 64819 -72886 -51051 38236 11057 -13151 -122368 25437 -9
162 -9 -125355 -40144 -9857 12213 -14570 124700 134699 70777 34376 24378 158266 23010
150 23010 2892 207923 218963 90764 46579 -92343 -26748 24703 51436 179990 4079
139 4079 -107533 -183829 7569 -15697 74221 136336 37002 14168 117713 110575 60640 149077
127 149077 152235 182869 136960 154946 143917 51395 112087 150239 109477 110740 137801 105218
115 105218 132016 148985 112696 48830 -29937 4165 60815 59371 12586 93148 199173 77835
103 77835 42698 53223 4577 -42175 -18788 161557 131071 42863 103020 141525 160354 178452
91 178452 85157 95218 85793 14569 -44991 -14279 -31602 -24703 -30261 -24970 -93763 -65933 124430
78 124430 211281 27582 -5990 116008 127482 206403 238774 162625 81537 -13086 69937 -39260
66 -39260 27493 21314 -75561 -32681 26860 73464 20184 54359 -12375 -14627 3485 106111
54 106111 124520 22014 170206 128251 48561 32491 149763 208017 153989 96960 93657 115779
42 115779 83609 65365 -33507 58814 140779 120931 -60607 -60344 109043 200744 69220 6270
30 6270 70261 -34028 115594 122663 51751 167710 149641 149918 230337 190324 103293 46107
18 46107 54628 25142 68312 83058 23710 31877 94016 131013 192135 125486 30304 52859 91150
5 91150 63385 50316 9011 -89046 -121554
0 -121554
$$ Imaginary data points
##PAGE= N=2
##DATA TABLE= (X++(I..I)), XYDATA
16383 -1498448 -1541640 -1440533 -1418678 -1449190 -1448447 -1391445 -1442253 -1359144 -1261862 -1310656 -1343011
16372 -1343011 -1324362 -1307334 -1256868 -1180966 -1197428 -1178884 -1178340 -1092771 -1048116 -1090601 -1038151 -925140
16360 -925140 -913074 -926823 -958817 -1052458 -911510 -757903 -841741 -832783 -730620 -724656 -707482
16349 -707482 -667145 -652294 -634399 -637553 -514786 -446018 -451291 -462719 -423473 -359907 -331434 -335776
16337 -335776 -303544 -279723 -272040 -267927 -229043 -265313 -224004 -166654 -147600 -95653 -102758 -120350
16325 -120350 -158154 -84844 -95215 -84106 43992 -13276 -26380 31574 120359 205515 204900 237220
16313 237220 299485 312725 338749 466416 349004 156921 268703 352042 313156 417615
16303 417615 494687 528734 535803 404657 469940 554157 624363 589160 445315 513382 570063
16292 570063 608188 768301 836559 712085 636374 821198 857356 850714 813015 819699 861519
16281 861519 939456 1008523 959332 969187 1029979 999567 861434 939653 1160542 1152733 1069745
16270 1069745 1079952 1038933 1077947 1246807 1304504 1264491 1208809 1242797 1295021 1197833 1187484
16259 1187484 1296238 1346313 1260928 1292387 1413125 1212111 1171997 1295920 1207948 1265442
16249 1265442 1399922 1517116 1422881 1403059 1458017 1528171 1629260 1529609 1492394 1429330 1577844
16238 1577844 1564408 1609853 1772594 1799988 1781050 1728904 1739643 1675834 1606341 1672137 1721610
16227 1721610 1721614 1874665 1757217 1841811 1869584 1845895 1753751 1773546 1770897 1752270 1913934 1789562
16215 1789562 1798643 1767222 1781871 1876956 1850545 1877566 1890534 1872614 1909115 1938359 1890776
16204 1890776 2052663 2002498 1999616 2029210 1986349 2065505 2037303 1944398 1830556 1924491 1995606
16193 1995606 1944622 1998215 1976746 2087593 2188665 2221699 2304235 2167894 2179894 2309435
16183 2309435 2306935 2277490 2235231 2184980 2300631 2289218 2147644 2184908 2263617 2290545 2459273
16172 2459273 2452078 2255095 2104268 2184109 2228618 2147231 2175799 2261134 2310069 2290793 2380113
16161 2380113 2344595 2445373 2482308 2194949 2174189 2311747 2237672 2400526 2386082 2191450
16151 2191450 2347162 2526305 2549665 2470804 2536481 2375333 2437100 2364682 2318438 2532103
16141 2532103 2663670 2483750 2682313 2658816 2479340 2597221 2574449 2551586 2301851 2346575
16131 2346575 2421297 2361012 2320266 2353483 2534862 2605198 2447867 2549540 2402229 2483748
16121 2483748 2484069 2368828 2526442 2651016 2577005 2427612 2428298 2400046 2561415 2615437 2499370
16110 2499370 2519469 2584749 2452359 2436105 2415908 2524412 2594258 2576063 2592091 2612309 2500436
16099 2500436 2503805 2540018 2508852 2540417 2631814 2688989 2592704 2458986 2435681 2593509 2480154
16088 2480154 2532959 2689136 2674511 2695627 2619341 2590779 2599125 2624030 2619712 2539603 2447499
16077 2447499 2459424 2671256 2735221 2742753 2649313 2565096 2536379 2434822 2434654 2600594 2521762
16066 2521762 2599789 2803104 2791477 2572492 2745045 2730962 2658359 2751947 2831738 2837645 2570779
16055 2570779 2679411 2714665 2817951 2929499 2769535 2725430 2733626 2763490 2682012 2668370 2577028
16044 2577028 2541813 2673040 2638142 2604766 2608516 2642433 2693254 2717421 2664196 2653759 2740181
16033 2740181 2817782 2670421 2540850 2662032 2795206 2754094 2543986 2587574 2648103 2566099
16023 2566099 2625463 2748816 2803057 2768630 2830251 2660630 2638544 2619966 2659883 2720436 2729028
16012 2729028 2673403 2715707 2784317 2728413 2744140 2674225 2772992 2658515 2668322 2621440 2518719
16001 2518719 2424233 2557942 2660712 2700193 2716160 2812717 2808821 2635978 2735860 2695830 2787477
15990 2787477 2690402 2546314 2449204 2542639 2639354 2634900 2707278 2841699 2907473 2827785 2728458
15979 2728458 2777928 2758557 2706199 2665691 2594534 2544660 2556373 2642924 2836546 2678518 2679517
15968 2679517 2701833 2579932 2482068 2480122 2476767 2533913 2638480 2795945 2609857 2410407 2540665
15957 2540665 2577279 2633533 2668420 2764153 2733903 2638893 2535931 2650976 2800849 2876730 2798428
15946 2798428 2650530 2556548 2691630 2809548 2874557 2741729 2585811 2656303 2678123 2615711
15936 2615711 2586537 2692254 2847143 2777197 2797914 2743439 2655539 2647277 2657964 2668871 2620129
15925 2620129 2604224 2491348 2557595 2654230 2659725 2526220 2606304 2683141 2734465 2764790 2776572
15914 2776572 2789629 2856389 2783758 2864884 2944802 2836911 2741008 2752197 2536195 2444633 2687145
15903 2687145 2763710 2766820 2762364 2729045 2673831 2697917 2619274 2695005 2785840 2776255 2800379 2789095
15891 2789095 2655164 2700693 2662103 2620025 2699917 2736616 2643736 2563659 2663408 2781213 2795434
15880 2795434 2816575 2655209 2793636 2918041 2799325 2677410 2742083 2813647 2737273 2582855
15870 2582855 2802550 2805313 2759755 2744794 2790523 2659133 2575133 2574838 2690161 2790155 2771523
15859 2771523 2751725 2701466 2662780 2668476 2626537 2571305 2477727 2569476 2700932 2565256 2608532
15848 2608532 2643277 2533683 2679681 2726737 2636841 2642041 2686843 2734883 2636029 2711910 2762759
15837 2762759 2680968 2653335 2724609 2616428 2786890 2787707 2625347 2536322 2696498 2599101 2674588
$$ [...]
##END NTUPLES=NMR SPECTRUM
##END=
