##TITLE=1H_EC-3286(III-0)
 CDCl3
 8 sc, 
 22.11.2022
##JCAMPDX= 6.0         $$ Bruker NMR JCAMP-DX V2.0
##DATA TYPE= NMR SPECTRUM
##DATA CLASS= NTUPLES
##ORIGIN= UXNMR, Bruker Analytische Messtechnik GmbH
##OWNER= root
$$ XWIN-NMR		Version 3.5
$$ Tue Nov 22 15:57:15 2022 Russian Standard Time (UT+4h)  she@DPX200
##.OBSERVE FREQUENCY= 200.1313499994
##.OBSERVE NUCLEUS= ^1H
##.ACQUISITION MODE= SIMULTANEOUS
##.ACQUISITION SCHEME= undefined
##.AVERAGES= 8
##.DIGITISER RES= 18
##SPECTROMETER/DATA SYSTEM= spect
##.PULSE SEQUENCE= zg30
##.SOLVENT NAME= CDCl3
##.SHIFT REFERENCE= (INTERNAL, CDCl3, 0, 15.7524)
##AUDIT TRAIL= $$ (NUMBER, WHEN, WHO, WHERE, WHAT)
$$ ##TITLE= Audit trail, XWIN-NMR		Version 3.5
$$ ##JCAMPDX= 5.01
$$ ##ORIGIN= Bruker BioSpin GmbH
$$ ##OWNER= she
$$ F:/spectra/data/she/nmr/H-F/1/pdata/1/auditp.txt
$$ ##AUDIT TRAIL=  $$ (NUMBER, WHEN, WHO, WHERE, WHAT)
(   1,<2022-11-22 15:55:58.67 +0400>,<she>,<DPX200>,
      <created by zg, POWCHK disabled, PULCHK disabled
       configuration hash MD5:
       00 E9 B6 7A A2 85 ED C7 34 08 36 98 17 FE 4E 26
       data hash MD5: 16K
       0A BE 9B 77 26 22 18 F5 84 34 F5 AF 76 14 B0 B3>)
(   2,<2022-11-22 15:56:02.70 +0400>,<she>,<DPX200>,
      <Start of raw data processing
       efp BC_mod = 2 LB = 0.24 FT_mod = 6 PKNL = 1 PHC0 = -18035.89 PHC1 = 14.80071 SI = 16K 
       data hash MD5: 16K
       A0 7D 18 A1 B8 C3 28 1D 8B 91 E1 73 B1 98 9F 9C>)
(   3,<2022-11-22 15:56:20.37 +0400>,<she>,<DPX200>,
      <pk PHC0 = -4.675536 PHC1 = 7.2 
       data hash MD5: 16K
       49 A5 8C 85 50 12 3E C3 03 FD 05 BF 9D CB 50 DA>)
(   4,<2022-11-22 15:56:23.53 +0400>,<she>,<DPX200>,
      <abs ABSG = 5 
       data hash MD5: 16K
       5F 67 5F D2 02 2C E6 FD BB F2 1A 17 2F D1 4C 64>)
$$ ##END=
$$ 
$$ hash MD5
$$ 82 EB 05 7B AB ED A5 2A 91 5E 0C 17 49 95 33 89
##$RELAX= 
##$RELAX= 
##$RELAX= 
##$RELAX= 
##$RELAX= 
##$RELAX= 
$$ Bruker specific parameters
$$ --------------------------
##$DU= <F:/spectra>
##$EXPNO= 1
##$NAME= <H-F>
##$PROCNO= 1
##$TYPE= <nmr>
##$USER= <she>
##$AMP= (0..31)
100 100 100 100 100 100 100 100 100 100 100 100 100 100 100 100 100 100 
100 100 100 100 100 100 100 100 100 100 100 100 100 100 
##$AQSEQ= 0
##$AQ_mod= 1
##$AUNM= <au_zg>
##$AUTOPOS= <>
##$BF1= 200.13
##$BF2= 200.13
##$BF3= 200.13
##$BF4= 200.13
##$BF5= 200.13
##$BF6= 200.13
##$BF7= 200.13
##$BF8= 200.13
##$BYTORDA= 1
##$CFDGTYP= 0
##$CFRGTYP= 5
##$CHEMSTR= <none>
##$CNST= (0..31)
1 1 145 1 1 1 1 1 1 1 1 1 1 1 1 1 1 1 1 1 1 1 1 1 1 1 1 1 1 1 1 1 
##$CPDPRG= <>
##$CPDPRG1= <>
##$CPDPRG2= <>
##$CPDPRG3= <>
##$CPDPRG4= <mlev>
##$CPDPRG5= <mlev>
##$CPDPRG6= <mlev>
##$CPDPRG7= <mlev>
##$CPDPRG8= <mlev>
##$CPDPRGB= <>
##$CPDPRGT= <>
##$D= (0..31)
0 1.2 0 0 0 0 0 0 0 0.06 0 0.03 0 0 0 0 0.0002 0 0 0 0 0 0 0 0 0 0 0 0 
0 0 0 
##$DATE= 1669118158
##$DBL= (0..7)
120 120 120 120 120 120 120 120 
##$DBP= (0..7)
150 150 150 150 150 150 150 150 
##$DBP07= 0
##$DBPNAM0= <>
##$DBPNAM1= <>
##$DBPNAM2= <>
##$DBPNAM3= <>
##$DBPNAM4= <>
$$ [...]
##$SUBNAM3= <"">
##$SUBNAM4= <"">
##$SUBNAM5= <"">
##$SUBNAM6= <"">
##$SUBNAM7= <"">
##$SUBNAM8= <"">
##$SUBNAM9= <"">
##$SW= 18.0517283424941
##$SWIBOX= (0..15)
0 0 2 0 0 0 0 0 0 0 0 0 0 0 0 0 
##$SW_h= 3612.71676300578
##$TD= 16384
##$TD0= 1
##$TE= 0
##$TE2= 300
##$TE3= 300
##$TEG= 300
##$TL= (0..7)
0 120 120 120 120 120 120 120 
##$TP= (0..7)
150 150 150 150 150 150 150 150 
##$TP07= 0
##$TPNAME0= <>
##$TPNAME1= <>
##$TPNAME2= <>
##$TPNAME3= <>
##$TPNAME4= <>
##$TPNAME5= <>
##$TPNAME6= <>
##$TPNAME7= <>
##$TPOAL= (0..7)
0.5 0.5 0.5 0.5 0.5 0.5 0.5 0.5 
##$TPOFFS= (0..7)
0 0 0 0 0 0 0 0 
##$TUNHIN= 0
##$TUNHOUT= 0
##$TUNXOUT= 0
##$USERA1= <user>
##$USERA2= <user>
##$USERA3= <user>
##$USERA4= <user>
##$USERA5= <user>
##$V9= 5
##$VALIST= <valist>
##$VCLIST= <CCCCCCCCCCCCCCC>
##$VD= 0
##$VDLIST= <DDDDDDDDDDDDDDD>
##$VPLIST= <PPPPPPPPPPPPPPP>
##$VTLIST= <TTTTTTTTTTTTTTT>
##$WBST= 1024
##$WBSW= 4
##$XGAIN= (0..3)
0 0 0 0 
##$XL= 0
##$YL= 0
##$YMAX_a= 546728
##$YMIN_a= -754428
##$ZGOPTNS= <>
##$ZL1= 120
##$ZL2= 120
##$ZL3= 120
##$ZL4= 120
##$ABSF1= 15.7535
##$ABSF2= -2.298349
##$ABSG= 5
##$ABSL= 3
##$ALPHA= 0
##$AQORDER= 0
##$ASSFAC= 0
##$ASSFACI= 0
##$ASSFACX= 0
##$ASSWID= 0
##$AUNMP= <proc_1d>
##$AZFE= 0.1
##$AZFW= 0.1
##$BCFW= 0
##$BC_mod= 2
##$BYTORDP= 0
##$COROFFS= 0
##$CY= -3
##$DATMOD= 1
##$DC= 0
##$DFILT= <>
##$DTYPP= 0
##$F1P= 0
##$F2P= 0
##$FCOR= 1
##$FTSIZE= 16384
##$FT_mod= 6
##$GAMMA= 0
##$GB= 0
##$INTBC= 1
##$INTSCL= 3.70164e-10
##$ISEN= 128
##$LB= 0.24
##$LEV0= 0
##$LPBIN= 0
##$MAXI= 10000
##$MC2= 0
##$MEAN= 0
##$ME_mod= 0
##$MI= 1.114404
##$NCOEF= 0
##$NC_proc= -5
##$NLEV= 6
##$NOISF1= 3.799351
##$NOISF2= 2.8
##$NSP= 0
##$NTH_PI= 0
##$NZP= 0
##$OFFSET= 15.7524
##$PC= 1
##$PHC0= -18040.57
##$PHC1= 22.00071
##$PH_mod= 1
##$PKNL= yes
##$PPARMOD= 0
##$PSCAL= 0
##$PSIGN= 0
##$REVERSE= no
##$SF= 200.130003830066
##$SI= 16384
##$SIGF1= 3
##$SIGF2= 2
##$SINO= 5.538805
##$SIOLD= 16384
##$SREGLST= <1H.CDCl3>
##$SSB= 0
##$STSI= 16384
##$STSR= 0
##$SW_p= 3612.71676300578
##$SYMM= 0
##$S_DEV= 0
##$TDeff= 16384
##$TDoff= 0
##$TI= <>
##$TILT= no
##$TM1= 0
##$TM2= 0
##$TOPLEV= 0
##$USERP1= <user>
##$USERP2= <user>
##$USERP3= <user>
##$USERP4= <user>
##$USERP5= <user>
##$WDW= 1
##$XDIM= 16384
##$YMAX_p= 365048477
##$YMIN_p= -238533
$$ End of Bruker specific parameters
$$ ---------------------------------
##NTUPLES= NMR SPECTRUM
##VAR_NAME=  FREQUENCY,     SPECTRUM/REAL,   SPECTRUM/IMAG
##SYMBOL=    X,             R,               I
##VAR_TYPE=  INDEPENDENT,   DEPENDENT,       DEPENDENT
##VAR_FORM=  AFFN,          ASDF,            ASDF
##VAR_DIM=   16384,         16384,           16384
##UNITS=     HZ,            ARBITRARY UNITS, ARBITRARY UNITS
##FACTOR=    0.220516191357247, 1,           1
##FIRST=     3152.52795203539, 0,            0
##LAST=      -460.188810970395, 0,           0
##MIN=       -460.188810970395, -238533,     0
##MAX=       3152.52795203539, 365048477,    0
$$ Real data points
##PAGE= N=1
##DATA TABLE= (X++(R..R)), XYDATA
$$ [...]
7151C6848653J514416j488039k868904k312474j253503j22646J134101K008786
7143C3460390J843149K07152k618492m200775m083716l360949k631313j929029
7135A6686417j486382j178337r44821o33335n52447m03937l35086k70243o4772
7126A0817057J5970K4986K1714J08941J52975K75943K94532L18083N15643N87780
7116A3133624O62171Q06901J029905J353280J669786K160440K751550L159999
7108B6727656L202208K144628l9757j908951k158725j443792n61677M37068J383810
7099B7782468J790307Q57013j427379l307709l702443l243538k575271j936554
7091A4236894j431381j122894p81603o35487n32520m12901l25441l10407k14710
$$ y = [36848653, 38363069, 36875030, 34006126, 31693652, 30440149, 30317503, 31451604, 33460390, 35303539, 35510691, 32892199, 28691424, 24607708, 21246759, 18615446, 16686417, 15200035, 14021698, 13076877, 12443542, 11891095, 11487158, 11152072, 10881829, 10817057, 10833027, 10858013, 10879727, 10988668, 11141643, 11417586, 11712118, 12030201, 12545844, 13133624, 13795795, 14602696, 15632601, 16985881, 18655667, 20816107, 23567657, 26727656, 29929864, 32074492, 32034735, 30125784, 27967059, 26523267, 25961590, 26398658, 27782468, 29572775, 30429788, 29002409, 25694700, 21992257, 18748719, 16173448, 14236894, 12805513, 11682619, 10901016, 10265529, 9733009, 9320108, 8994667, 8684260, 8469550]
7082H469550k85792j35341m0082l2265J1489j70086k01722o3160l3237j3758j3049
7071G492547N5123M9611J8410J9535L6432R0494o8977P0779J14083Q7216P5839
7060H041092N9918Q3623J55813O1924J31847J74208J73949J78459J50378J10275
7050I321486J14162J36197J81392L4560J12243J98992J75476J66159K14564K28365
7040A0883596K03812L26907L15491K19897K57776K79634J23514L14190L59733
7031A3284550K43809K63641L42864L44253K47008L47859L14423K86955K43367
7022A5918729K73515K37547K17439L12358J51460K06861K18766J84118J06328
7013A7827121R8809J16367K8269j9733K3273k3386l3312j60276j81120k49805
$$ y = [8469550, 8183758, 8048417, 8008335, 7976070, 7987559, 7817473, 7615751, 7552591, 7519354, 7505596, 7492547, 7547670, 7597281, 7615691, 7635226, 7671658, 7762152, 7693175, 7763954, 7878037, 7965253, 8041092, 8101010, 8184633, 8340446, 8402370, 8534217, 8708425, 8882374, 9060833, 9211211, 9321486, 9435648, 9571845, 9753237, 9787797, 9900040, 10099032, 10274508, 10440667, 10655231, 10883596, 11087408, 11414315, 11729806, 11949703, 12207479, 12487113, 12610627, 12924817, 13284550, 13528359, 13792000, 14134864, 14479117, 14726125, 15073984, 15388407, 15675362, 15918729, 16192244, 16429791, 16647230, 16959588, 17111048, 17317909, 17536675, 17720793, 17827121, 17925930, 18042297, 18070566, 18050833, 18074106, 18050720, 18017408, 17857132, 17676012, 17426207]
7003A7426207j17730j86357k57811k77543l67964k71323k57566l42050m07883
6994A4939980l19138k55915m28526l75170l75983l70259l00192l14294l78114
6985A1822389l58857k45009l18783l50307k66269l72903l81632k66347k90272
6976H972010j99402l23820k43210o9296k32542l08218k07204k20347j59828j84410
6966F823733k42864k20700j10070j68326j79973k05435j94074n6026k33392j91485
6956E021388o0795r6418j21446j60705j66479n2521j58465j35043r3840q2243
6946C893433m8446m9213j32108j27365j4949j39672j29366r2922M3598k7783r0361
6935C084846q7750r8384o4042q6700m5510k5839m7164p581n2459N188r7722j09254
$$ y = [17426207, 17308477, 17122120, 16864309, 16586766, 16218802, 15947479, 15689913, 15347863, 14939980, 14620842, 14364927, 13936401, 13561231, 13185248, 12814989, 12514797, 12200503, 11822389, 11463532, 11218523, 10899740, 10549433, 10283164, 9910261, 9528629, 9262282, 8972010, 8772608, 8448788, 8205578, 8136282, 7903740, 7595522, 7388318, 7167971, 7008143, 6823733, 6580869, 6360169, 6250099, 6081773, 5901800, 5696365, 5502291, 5446265, 5212873, 5021388, 4960593, 4864175, 4742729, 4582024, 4415545, 4363024, 4204559, 4069516, 3975676, 3893433, 3844987, 3795774, 3663666, 3536301, 3521352, 3381680, 3252314, 3159392, 3202990, 3175207, 3084846, 2997096, 2898712, 2834670, 2747970, 2702460, 2676621, 2629457, 2621876, 2569417, 2574605, 2476883, 2367629]
6923B367629o5311l6098J076l3110q0654n4456K5596q7689m3626o69n1283J1895
6911A953300O2807p8441k7599P252k3840J8183R075N9502M0536J45072k912k4781
6899B138154j11211k00557j04301q9128r9070q8461q3384n3606M298j6363r778
6888A286593m7419p8937j3452L8017J4118k5578O826l9777r2869r2331M0468N147
6876A000806l816l135O078p7616r0288N8321J4210M9307n2908o5700m7557J8591
6864H06293j034l4049K3396j1264j9419Q6370o0421o0452K3107P5675p1195o4265
6852F92742N2236l6054m2161L4334n1448o2153Q3554j668N1732O1738q2333Q4241
6840G84760j320o7662m010j8400N9217m6409l8248J33058j4786j7197l2880l6449
$$ y = [2367629, 2302318, 2266220, 2267296, 2234186, 2153532, 2099076, 2124672, 2036983, 1993357, 1992688, 1941405, 1953300, 2016107, 1937666, 1910067, 1917319, 1893479, 1911662, 1920737, 1980239, 2020775, 2165847, 2162935, 2138154, 2026943, 1826386, 1722085, 1632957, 1533887, 1445426, 1362042, 1308436, 1312734, 1296371, 1286593, 1239174, 1160237, 1146785, 1184802, 1198920, 1173342, 1180168, 1140391, 1047522, 955191, 995659, 1000806, 996990, 993855, 999933, 922317, 832029, 890350, 904560, 953867, 900959, 835259, 787702, 806293, 805259, 771210, 794606, 783342, 763923, 850293, 789872, 729420, 752527, 828202, 757007, 692742, 744978, 708924, 666763, 701097, 649649, 587496, 671050, 669382, 721114, 782852, 700519, 784760, 783440, 715778, 711768, 693368, 752585, 706176, 667928, 800986, 786200, 769003, 736123, 699674]
6828F99674m4970j1324P8864N7409K9915K6736n3792J0558L617J1396L7059O8448
6816I13590P3061j2757J00255L4689K3813O77L9691R44j3848J17771Q553l0984
6804A255455n66O9448M0080M4092J9722P3023J48824L3338J15520J14873J11248
6793B025057k583P5003K1317L8714J19050J3501M877K0186o0306p44r7415k6710
6781B129947j12596q6917L8091j28052n1125o1073j90581j43039q8926j00163
6771A205566p7859k6333j08567l7103k1370o5438j30076q651o9025K408L3684
6760F97236p0312m3967j10027j9418K6950j0448q7745J7964O4295m135l9017M7977
6748D69353q4507l0219J4706P5011l9260n3659K4656k0237L6773o334l3147m9114
$$ y = [699674, 654704, 643380, 722244, 779653, 809568, 836304, 782512, 793070, 796687, 808083, 845142, 913590, 986651, 973894, 1074149, 1108838, 1132651, 1133328, 1173019, 1173963, 1160115, 1277886, 1286439, 1255455, 1254889, 1324337, 1364417, 1408509, 1428231, 1501254, 1650078, 1683416, 1798936, 1913809, 2025057, 2022474, 2097477, 2118794, 2157508, 2276558, 2290059, 2294936, 2315122, 2254816, 2254072, 2156657, 2129947, 2017351, 1930434, 1968525, 1840473, 1789348, 1728275, 1537694, 1394655, 1305729, 1205566, 1127707, 1101374, 992807, 955704, 934334, 868896, 738820, 730169, 661144, 663552, 697236, 626924, 582957, 472930, 453512, 480462, 470014, 382269, 400233, 464528, 460393, 421376, 469353, 384846, 354627, 369333, 444344, 405084, 351425, 376081, 355844, 392617, 386283, 353136, 304022]
6736C04022l0689O1041K1838N1027L783m0111l9069n4137m7532j0083k4894l3309
6724A61887m8865O6015L0526p627m0108m7384L2159j5642r858N8408Q6238j11722
6712A54027q6544l0641j6513N2260N8212m5896o6926M8634Q3684m2327j3807m492
6700H9671j6753r72j7638N1280l9189m8958j2536J97Q3898L4401j03585o5367
6688d5551L8054j0585J275L1411P41p0640K9250m782R122q030l5639k136Q544
6675e8966Q2877o2186K8977P3682m804J9912o4792M3206L7426r2904r4231Q794
6663h3009N0060P151o033q9040K0576J7550J6236J3960P923K8429j4269L777k8448
6650e5137m310j3586j532J5025j8978K6591j7359L284M8965q487j8082M9544N5311
$$ y = [304022, 273333, 334374, 356212, 407239, 411022, 370911, 331842, 277705, 230173, 220090, 195196, 161887, 113022, 179037, 209563, 201936, 161828, 114444, 146603, 130961, 121103, 179511, 265749, 154027, 67483, 36842, 20329, 72589, 130801, 84905, 17979, 66613, 150297, 107970, 94163, 89671, 72918, 71946, 54308, 105588, 66399, 17441, 4905, 5102, 89000, 123401, 19816, -45551, -7497, -18082, -16807, 14604, 15345, -55295, -26045, -30827, -21705, -29735, -65374, -67510, -58966, 23911, -38275, -9298, 64384, 59580, 79492, 14700, 57906, 95332, 2428, -91803, -83009, -32949, -25798, -31831, -120871, -100295, -82745, -66509, -52549, -44626, -16197, -30466, -26689, -55137, -59447, -73033, -74565, -59540, -78518, -51927, -69286, -66002, -17037, -25524, -43606, 5938, 61249]
6637F1249q9226q223l043o603j3357r078P8835n0746k7010L5240P4135r2071l6624
6624h6522L5449n1631J24503M9608q4984K6358j1342M268Q3719q0501k7357N418
6612a3014o4481l1477M5302O2704n6036k9427R5483L9479J893o9881l4940K9129
6600b5266k1976o3888N1290J01519m6889n5409k65J03441M5464m9705r0101q1991
6588a33776J4043P1928M9120L4438k8183O2501l8578o1627R5902O5587n5175j42015
6576f5835N7868P7077p9744j2758M9323m9863l6240K3395p53N656J8774J9212
6564F112n7657l3540J0924J2852L1162j21660K7552J9122J3640J9922J7576k6298
6552h0293k3958O7500k3746N2408p0627L1599Q670q841K9597M5668m324q537m6727
$$ y = [61249, -27977, -36200, -39243, -45846, -59203, -68281, 10554, -40192, -67202, -31962, 42173, -49898, -86522, -51073, -102704, 21799, 71407, -13577, 12781, 1439, 5707, 89426, 8925, -18432, -13014, -77495, -108972, -63670, -966, -57002, -86429, 9054, 48533, 50426, -19455, -54395, -25266, -47242, -111130, -59840, 41679, -5210, -60619, -60884, 42557, 88021, 38316, -51785, -133776, -119733, -47805, 1315, 35753, 7570, 70071, 31493, -30134, 65768, 131355, 76180, -65835, -7967, 69110, -10634, -23392, 25931, -23932, -60172, -36777, -37530, -31874, -13100, 6112, -51545, -85085, -74161, -61309, -30147, -151807, -124255, -105133, -91493, -71571, -53995, -80293, -104251, -36751, -60497, -8089, -78716, -47117, -38447, -47288, -17691, 27977, 23653, 15116, -31611]
6539c1611k1470Q4485M0292r6833j0337K8953k1292N0150m9321o1825M258L5346
6527d9205M0233m4925R326O115o5999j297m7739J3971N1134K1376M7227K2534
6515B751l0684k4668m6080O3452N5301L2104o0552j0812M3360k8326m1935l220
6503d9309o818m128M2782M5792k891j3174k3987n0272M2120K5539p9352l2354
6491a06052j236k6868N5144L3595q1406j7600p27L1067N9419J5236p0408J1378
6479i8458K9464o0459o1221M6910m5715M3673m1583J5129L0747K3985j3533p95
6467a31856K4699K8121O4536j9789k6863k6207Q4314j8747j23548k3884M3616
6456a25608P1560O7302q0281L2344l5692l2216Q120L3952L5453j9756L0133k2561
$$ y = [-31611, -53081, 31404, 71696, -25137, -35474, -6521, -27813, 22337, -26984, -88809, -84551, -49205, -8972, -53897, -44571, -38456, -104455, -105752, -153491, -139520, -88386, -67010, -19783, 2751, -27933, -52601, -98681, -35229, 20072, 52176, -8376, -19188, 24172, -4154, -46089, -49309, -56127, -60255, -17473, 28319, 25428, 12254, -11733, -62005, -19885, 5654, -73698, -106052, -107288, -134156, -79012, -45417, -126823, -144423, -145150, -114083, -54664, -39428, -109836, -98458, -68994, -129453, -190674, -143764, -189479, -145806, -187389, -172260, -141513, -117528, -131061, -131856, -107157, -79036, -14500, -34289, -61152, -87359, -3045, -21792, -145340, -169224, -125608, -54048, 13254, -67027, -34683, -70375, -102591, -94471, -60519, -25066, -44822, -14689, -37250]
6444c7250M707m163m4404j213N7998j5496q8683K8729l287l2331L2042k934j3806
6431a20091N3177J325K5423o7419l7103J6091J7780k0424N4882K8418j8037M1554
6419b4424k2264N555K8764j7646q0273N0237m42k2001j0745k4316r104J07272
6407a9387M9390o1698L3535k8982M5062m7531o4792r398K7620k6696M6836l5278
6395i1319L3052j1664p714k6296O7700k1636o4733m6080O7394K2473l30p7406
6383a56559k1806J4752R5083P3638k4875l4851l6996N8559N6162o6705l4315J9788
6371e8125M7842m7456r981m1992q5998O3465m3716J14724m5648K8661P3115Q241
6359C132j04672K4028k6182m1874M7398N8717m484k352j5418m4581o3896J15895
$$ y = [-37250, -32543, -36706, -81110, -82323, -24325, -39821, -128504, -99775, -103062, -135393, -103351, -106285, -120091, -66914, -65589, -40166, -107585, -144688, -128597, -110817, -131241, -76359, -47941, -65978, -24424, -46688, -41133, -12369, -30015, -110288, -60051, -60493, -82494, -93239, -117555, -126659, -19387, 30003, -31695, 1840, -27142, 17920, -29611, -94403, -103801, -76181, -102877, -56041, -91319, -58267, -69931, -77645, -103941, -36241, -57877, -122610, -168690, -101296, -78823, -79153, -156559, -178365, -163613, -68530, 5108, -19767, -54618, -91614, -33055, 23107, -43598, -77913, -58125, -10283, -57739, -67720, -109712, -195710, -132245, -175961, -61237, -106885, -78224, -5109, 3132, -101540, -77512, -103694, -145568, -98170, -39453, -43937, -46289, -61707, -106288, -170184, -54289]
6347e4289l814Q3287k9176l0815J4093j1360J5120p1656m6713n489J20651M207
6335a5954m2413J7177l1294K3645K3713m7583n6091K4850n0824K8624l1551N2659
6323a05042L1848N4461k3305k5308j1595K6580N278m4310J675q379o5819N2760
6311a11156l0462k6758P2826M1193l7451O627N9816j3613M9583o1438n4132L6148
6299f8817K8642m7956Q5061o8790j0002n9757P816L8636K3435l1431L5912l599
6287g0850K586l8119M6502O6168q518l9592n742K2580N64K5139l319k9523K739
6274b9385j617l6568N2451P3896k5289p0101k5671K8137j9027N3612l3042n7407
6262i0011O9724j6442p3981m7149O3200J28183l2940o2285J2275k0771n43m4580
$$ y = [-54289, -58103, 25184, -3992, -34807, -20714, -32074, -16954, -88610, -135323, -140812, -20161, -15954, -58367, -41190, -72484, -48839, -25126, -72709, -128800, -103950, -154774, -126150, -157701, -105042, -73194, -18733, -42038, -67346, -78941, -52361, -47083, -91393, -89718, -98097, -163916, -111156, -141618, -168376, -95550, -54357, -91808, -85181, -25365, -38978, 10605, -50833, -104965, -68817, -40175, -88131, -3070, -71860, -81862, -141619, -133803, -95167, -71732, -103163, -67251, -70850, -68264, -106383, -59881, 6287, -2231, -41823, -47565, -24985, -24421, 718, -2601, -32124, -29385, -31002, -67570, -15119, 58777, 33488, -36613, -62284, -34147, -53174, 438, -32604, -90011, -20287, -36729, -110710, -157859, -94659, 33524, 584, -61701, -49426, -70197, -70740, -115320]
6250a15320p1887J2878L2867J6147P6538l2150m8400M9432j7363m0213L1652k3082
6238a28901J406M6636P9793l4231j0134l6221n284L6285O829K668p179j2598K5763
6225c5168K1702q949p1295L2616k6725j0708M5922j1463R2808o6563P6142j7152
6213B1167r8925k0680N8422q034k3344n0607o444j8697O6097J829l0536Q1082
6201b8670J1097n6144m1630P0171n1245J7737p9385q0464J31573R3309N417j8729
6189b6963J5677P2235k6071r2851k4516j07963K7799O3177J4028L2478K7908L3277
6177H215J2462o4885m1094J5166M1188L5708m9750l6695J414r731l8629L1010
6165i5621P0664L002j4844M7987j8572q2991P3416M2m7641K381J1842j23K1375
$$ y = [-115320, -187207, -174329, -141462, -125315, -48777, -80927, -129327, -79895, -97258, -137471, -105819, -128901, -127495, -80859, -1066, -35297, -45431, -81652, -86936, -50651, -43822, -41154, -48333, -60931, -35168, -13466, -22415, -93710, -61094, -87819, -98527, -52605, -64068, 28740, -37823, 38319, 21167, -77758, -98438, -40016, -48050, -71394, -122001, -128445, -147142, -81045, -79216, -109752, -28670, -17573, -73717, -115347, -45176, -96421, -78684, -158069, -238533, -106960, -13651, -8234, -26963, -11286, 60949, 34878, -57973, -82489, -190452, -162653, -99476, -85448, -52970, -25062, 8215, 20677, -44208, -85302, -70136, -28948, 6760, -42990, -79685, -78271, -88002, -126631, -95621, -24957, -21955, -36799, 11188, -7384, -90375, -16959, -16917, -64558, -62177, -50335, -50458, -29083]
6152b9083j5322L2031k9466K4799J0203n4515k9378L1246K9128n5010O2359q197
6140c1205k9850K0675J8399l0316O3521J5158l8539j1946j8209J5347L3216j1117
6128d866j6065m3300P3090k7060L6999m8622p0806J0045O7454J6091n8869o0834
6116a26743Q559O409L7053P2427m0192M1090N3803j00932K200r3127Q774J876
6104a28803J08083P6862l0920m5216l1624j9838k2446O3116M7162m9171k5393
6093e8188M8516j0584L4984J9748k7315j39880m1603Q3062K4918Q23j8727P0561
6081a3685m4148K6993J473n7135Q7674m5204O9249p7511l1214n121O6804j8265
6069d0090k6071P3972J4971o2815L3355M8674m8451n6505L5831j8904N9169j1831
$$ y = [-29083, -44405, -12374, -41840, -17041, -6838, -61353, -90731, -59485, -30357, -85367, -23008, -31205, -61055, -40380, -21981, -52297, 11224, 26382, -12157, -24103, -42312, -26965, 6251, -4866, -20931, -64231, 8859, -18201, 18798, -29824, -100630, -90585, -23131, -7040, -65909, -126743, -118184, -111775, -74722, -2295, -42487, -1397, 52406, -48526, -46326, -139453, -130679, -128803, -20720, 56142, 25222, -19994, -51618, -71456, -93902, -30786, 16376, -32795, -58188, -9672, -20256, 14728, 34476, 7161, -132719, -174322, -91260, -66342, -65519, -84246, -13685, -57833, -30840, -29367, -86502, 1172, -44032, 25217, -52294, -83508, -88629, -21825, -40090, -66161, 7811, 22782, -40033, -6678, 41996, -6455, -62960, -27129, -46033, 13136, 1305]
6057A305k7690l28r939N113N4758J008p6509l329J106Q2192m2173k256N2772P7339
6043A13369l0890j20663k7577J1130O5331j7430n0213q091M7817P2387k9936L2824
6031E8058K1344j4247K2674K3894M8147O9264p6387K3526n7024n8468N7390J4712
6019A32883j2809o0248l2736M619N9594o4582L2058J0455r489m026n315J3791
6007F4195k7957L4791M4524o5922l60n5853O2983N3388j2801J08369M8934O527
5995B60818O7490p4372j8698j4508q4318J0755k1670K3529M2900o2961n7191q407
5983F3367k0744j2437m6574l2648P4720O7532l0140K6847j4683o9896L8125M7535
5971I1004n661K582N245l2357J3696M4556n654L7143m771Q589p568j02171J392
$$ y = [1305, -26385, -26713, -36652, -31539, 23219, 24227, -52282, -55611, -54505, 27687, -14486, -16742, 36030, 113369, 82479, -38184, -65761, -54631, 10700, -6730, -56943, -65034, -17217, 55170, 25234, 58058, 79402, 65155, 87829, 111723, 159870, 229134, 152747, 176273, 119249, 60781, 118171, 132883, 120074, 59826, 27090, 31709, 91303, 26721, 58779, 69234, 59745, 55719, 50404, 64195, 36238, 71029, 115553, 49631, 49271, -6582, 56401, 109789, 96988, 205357, 254291, 260818, 328308, 253936, 235238, 220730, 136412, 147167, 125497, 149026, 191926, 128965, 71774, 63367, 42623, 30186, -16388, -49036, 25684, 93216, 63076, 89923, 75240, 5344, 43469, 91004, 85343, 87925, 93170, 60813, 74509, 119065, 113411, 150554, 145783, 154372, 146804, 44633, 46025]
5958D6025J5482L5306m9336p5181n8548O8623N7584m6390J2158J4805l5435j4230
5946b9137J6345J3974J2879K8534K9757m4664M3980n7949j0613n095k3368j1563
5934c6920Q2167L8528l181m3683K229R120k4594N1488J3952J347m6598M5280o307
5921H2828J1312P1740m4283j3299J655k0351q3119M4080N9791j2850J3826p2280
5909C9050r5052J24643Q1841n8998j7504m34M9018R1128j36047j1719J7662K8964
5897A12552l2719P5776R6112k1659k0862k5712k3012L5096Q1284k6365k9830J2079
5885B32740l8999L2667Q893k6581K5374j3740L1845R953m25L0626r213m645m1891
5872B36604m6095J8677O5683O4324j6071K0301K0471j31328O1044M9771n2113
$$ y = [46025, 61507, 96813, 47477, -27704, -86252, -17629, 39955, -6435, 5723, 20528, -14907, -29137, -12792, 1182, 14061, 42595, 72352, 27688, 71668, 13719, 3106, -1989, -25357, -36920, 45247, 83775, 80594, 36911, 39140, 48260, 23666, 75154, 89106, 90453, 43855, 89135, 82828, 94140, 165880, 121597, 108298, 109953, 89602, 6483, 50563, 110354, 97504, 111330, 39050, -56002, 68641, 150482, 91484, 73980, 73546, 122564, 213692, 77645, 65926, 83588, 112552, 79833, 155609, 251721, 230062, 209200, 183488, 160476, 195572, 276856, 250491, 220661, 232740, 193741, 226408, 235301, 208720, 234094, 220354, 252199, 262152, 261727, 292353, 283140, 278495, 236604, 190509, 209186, 274869, 339193, 323122, 343423, 363894, 232566, 293610, 343381, 291268]
5861B91268Q4121M911M7315L2584R9633N7909p0011J9611O3668l5065o1610l3845
5849E00489K5529o0458j8723j5778m4180k8226j0794o4761M0658J1844K0199q5997
5837B69802m0687j7421M4378K7831P0848n8945k2438Q4085j3559J15155M3036
5826E02085l7526N2264M7212M2616K1172K2905l9020r9762o8987j4258j12519
5815C16182l0658K5161k0762l7467k902L7593m0971J4767M5067J8283P655Q953
5803C40901m3481j0094m9366m6327J12885M2719J3385K0880R4154K3582K2970
5792E22208J36517j9764J5145r7057j48070n0307j7157l8563l1224j0873P8591
5781C39446r9741n589L5647j9718j4944l4400j9585J1901j8533L089j5950j5007
$$ y = [291268, 375389, 380300, 427615, 460199, 559832, 617741, 547730, 567341, 631009, 595944, 534334, 500489, 526018, 465560, 446837, 431059, 386879, 358653, 347859, 283098, 323756, 335600, 355799, 269802, 229115, 211694, 256072, 283903, 354751, 295806, 273368, 357453, 343894, 459049, 502085, 464559, 516823, 564035, 606651, 627823, 650728, 611708, 511946, 442959, 428701, 316182, 285524, 310685, 289923, 252456, 249554, 287147, 246176, 260943, 306010, 324293, 331948, 340901, 297420, 287326, 237960, 191633, 304518, 347237, 360622, 381502, 475656, 499238, 522208, 658725, 638961, 654106, 557049, 408979, 358672, 341515, 302952, 271728, 260855, 339446, 239705, 234116, 269763, 250045, 235101, 200701, 181116, 193017, 174484, 177573, 161623, 146616]
5769A46616j3338l1743J4668j0155J6846J7141j093M6992m2475m8782L8615K373
5757A35665k4868M9461L930n9413l0179L4413p492r8200m5582Q575N8641N2181
5745G7132j0458k71O8991m9008l9559P4526k7149j6078J3372Q827K6758l4134
5733I2949J7962M7072J2243o8125J8376l7896M1941K0988J9638m2910j14437O3560
5721G1361M6411n0588L4771J8528L3287m9659q3417O2253K2805j6521K2365j2172
5709I9424j969L4393j3753k5309j6913k2982l0732O5645j0759M6595k7190L6699
5697A33149j4207q3133O704Q3213j5749L533j892o8569Q4443L7886K6025m1680
5685A49723N16N7038p0486n3414M2738L7568m0201k6711J7325n7053L7733P6150
$$ y = [146616, 133278, 101535, 116203, 106048, 122894, 140035, 138942, 185934, 143459, 94677, 133292, 135665, 110797, 160258, 164188, 104775, 74596, 109009, 101517, 3317, -42265, -33690, 24951, 77132, 66674, 66403, 135394, 86386, 46827, 121353, 94204, 78126, 91498, 100325, 127083, 92949, 110911, 157983, 170226, 102101, 120477, 82581, 124522, 145510, 165148, 122238, 7801, 71361, 117772, 67184, 101955, 120483, 153770, 104111, 20694, 82947, 105752, 89231, 111596, 99424, 97455, 131848, 118095, 92786, 75873, 52891, 22159, 87804, 77045, 123640, 96450, 133149, 118942, 35809, 42513, 125726, 109977, 113510, 111618, 43049, 127492, 165378, 191403, 149723, 150239, 207277, 136791, 83377, 126115, 163683, 123482, 96771, 114096, 57043, 94776, 170926]
5673A70926l9395o4068n8377J09651n5832r342J7794P2426P5056n3774O08m1633
5661A24040K8217j7736j5686O4260l7465J9502Q0200M763o4820M4883K2137m9592
5649B02703r9871Q5164k7181n549L7283L9067n3878k1247q479l7490R4444j31735
5637G3231J6224J9509O0335k1500O418N9730J6721r0115m2840L5762N3791m31
5625A86835J5770J6606K868n653k1453q4610R3349n9201O0466O6285r6161L5130
5613B10231K9073n4729Q1033p6990l1019k3868m428j4618o40R1125K96P1086Q187
5600B84739L453j00793l6592l297O5236l5874j1284n7264K7372L6284L8388P3623
5588B83991l447j9751J7721L0943o5934N0483l4845O3737Q578o1890p4753j0225
$$ y = [170926, 131531, 67463, 9086, 118737, 62905, 53563, 71357, 143783, 218839, 165065, 165673, 124040, 152257, 134521, 118835, 183095, 145630, 165132, 245332, 250095, 185275, 230158, 252295, 202703, 102832, 187996, 160815, 155266, 192549, 231616, 177738, 156491, 148012, 110522, 204966, 73231, 89455, 108964, 169299, 147799, 154217, 213947, 230668, 140553, 97713, 133475, 187266, 186835, 202605, 219211, 222079, 216426, 194973, 110363, 203712, 144511, 204977, 271262, 175101, 210231, 239304, 184575, 265608, 188618, 157599, 133731, 129303, 114685, 114045, 205170, 205466, 276552, 284739, 288192, 187399, 150807, 147510, 212746, 176872, 165588, 108324, 135696, 171980, 210368, 283991, 280544, 260793, 278514, 309457, 243523, 294006, 259161, 322898, 331476, 269586, 194833, 184608]
5576A84608P8632m2178j1756p5239M0069O8536K8776N2126L6110m9601l0415k8164
5564B51504K1353N1590K038l8838L2057K1577l1092L6160M2961l0598r809K3757
5552C72660q254Q0811J1483M2959O8407k2200K1794L7072J06706J35659N8291
5541I05388L8113j944q4891o9879r6926n2283l0205m8806m6834k1275l6897J8789
5529D72350q4903j5544l289j2864O1938O0984j3705j3780j0938j3456o37L0719
5517D56875N5679j00688l835l021K0684K3885j2400K3171P8574L1J8842j1996
5505E45801N3065o3j20184n4444Q6094J5524r4307m9968M3094P6920k0689L9888
5493E20731l1543m8612K8089O242L6515O1534O222k7462J7435m6474m7360N7014
$$ y = [184608, 263240, 221062, 209306, 134067, 174136, 242672, 271448, 323574, 359684, 310083, 279668, 251504, 272857, 324447, 326485, 287647, 319704, 341281, 310189, 346349, 389310, 358712, 348903, 372660, 364406, 445217, 456700, 499659, 568066, 545866, 567660, 604732, 711438, 847097, 905388, 943501, 941557, 856666, 786787, 689861, 637578, 607373, 558567, 511733, 490458, 453561, 472350, 387447, 371903, 368614, 355750, 417688, 478672, 464967, 451187, 440249, 426793, 426156, 456875, 512554, 411866, 408031, 405010, 425694, 449579, 437179, 460350, 538924, 538955, 557797, 545801, 598866, 598803, 478619, 424175, 510269, 525793, 431486, 381518, 424612, 501532, 480843, 520731, 489188, 440576, 468665, 474907, 511422, 572956, 579178, 551716, 569151, 522677, 475317, 532331]
5481E32331j3716N3849o0345l0175L0752O4557J08504P0064J9282j24333J4544
5470F65314L1257k6259j0896o068K214k1364n5618N5063m4003m4650j4779K9018
5458E59229J13528l2703K1378l1505j4718l1351L5625k5892J8773P1150l6397
5447F47117o1134Q8425L2069L0526J20558m2844j4099J8095J5254m2282p151n615
5435G78919o4850n9637j3514r4448o1411L5082O2947O0072n7762P3597O0247m0249
5423F78993K639K4946K6562J2703l4547n647n028O2008Q3585q738M1411M2234
5411I21121K8083K5173J857k7697J5059n7167m9697j05790o8797J5346J31410
5400H28901K2496n5218m3262J9872K7947k9541L5435L9761n019P189j3595O7485
$$ y = [532331, 518615, 572464, 512119, 481944, 512696, 577253, 685757, 755821, 775103, 650770, 665314, 696571, 670312, 659416, 653348, 655562, 634198, 578580, 633643, 589640, 544990, 530211, 559229, 672757, 640054, 661432, 629927, 615209, 583858, 619483, 593591, 612364, 683514, 647117, 585983, 674408, 706477, 737003, 857561, 814717, 800618, 818713, 833967, 791685, 784534, 778919, 714069, 654432, 640918, 546470, 485059, 520141, 583088, 643160, 585398, 658995, 719242, 678993, 681632, 706578, 733140, 745843, 711296, 705649, 700621, 762629, 846214, 837476, 878887, 921121, 949204, 974377, 976234, 948537, 963596, 906429, 856732, 750942, 682145, 697491, 828901, 851397, 796179, 752917, 772789, 800736, 771195, 806630, 846391, 841372, 848561, 834966, 902451]
5388I02451R374O1713L2285M8120J5434j3780K8587J87L7654j02642q6795j09163
5376H23425Q120l9158l3011j9743L3824J6462P6726q627q1159m9472J1147K7877
5364G66411n1440L226m501J4485J9369J5561P0571o895K2343M9964r2985k6546
5352G79563N0478p2273k5013r007L7433p7227J4975L6465j55324J8468N381l0194
5340E73725j5024J5302O289k7701q585L9068J1684Q1063J3587k3126p2374Q3207
5328F77115K841k8225j1608M8632m4508J3477J0523l5316M1060j4857J7663p5135
5316F01662n2075P519j2910m9961P4076L2296o6627N078k5095O9363J8445j1930
5304E89841j8830k8702j2564n0074R5323L4260K6248N5797L467j8129O7074Q9002
$$ y = [902451, 911825, 973538, 1005823, 1053943, 1069377, 1055597, 1084184, 1084371, 1122025, 1019383, 932588, 823425, 831545, 792387, 759376, 739633, 773457, 789919, 866645, 858018, 776859, 727387, 738534, 766411, 714971, 718197, 713696, 728181, 747550, 763111, 833682, 826787, 849130, 899094, 806109, 779563, 830041, 757768, 732755, 723748, 761181, 683954, 698929, 735394, 580070, 598538, 603919, 573725, 558701, 574003, 580292, 552591, 544006, 583074, 594758, 675821, 689408, 666282, 593908, 677115, 679956, 651731, 640123, 688755, 644247, 657724, 668247, 632931, 673991, 659134, 676797, 601662, 549587, 557106, 544196, 494235, 568311, 600607, 533980, 539058, 513963, 583326, 601771, 589841, 571011, 542309, 529745, 479671, 574994, 609254, 635502, 691299, 694766, 676637, 743711, 832713]
5292H32713Q0840J9328O6212r7726m7683p8637J2099L3347k094j40682j13007
5281E64710N03r112K605m2167L4595j5971O6336L8964j05741K2952p169M3305
5269E93810M7131N224m649p7113N4102J53682l4515r9682N5255P5982J59745M5980
5257I74952k575o7037o8260j16098q6954P06l371n4649k6629l5220n4160K8906
5245D89611m1299J2883p2406R841O2293m2248L1470O0178J0158k354M3251K3744
5233E85122M4411O910p921J6799k2300N9119M7702P1687l5737j7030J0087l192
5221G55657N0225m4152N9780o0711p7308M3996M0700m2633k5075m7689q9595l3700
5209E29495M5776J6475N165r7826l7101k9249J7905O1806J1867q8712j4591n5221
$$ y = [832713, 913553, 932881, 999093, 901367, 853684, 775047, 787146, 820493, 818399, 677717, 564710, 565213, 556101, 558706, 516539, 551134, 535163, 601499, 640463, 534722, 557674, 550505, 593810, 640941, 646165, 641516, 564403, 618505, 772187, 737672, 637990, 693245, 769227, 928972, 974952, 972377, 905340, 837080, 720982, 634028, 634734, 631363, 576714, 550085, 514865, 460705, 489611, 448312, 461195, 388789, 398630, 460923, 418675, 450145, 510323, 520481, 518127, 561378, 585122, 629533, 636443, 628522, 645321, 623021, 682140, 729842, 801529, 765792, 748762, 758849, 755657, 805882, 761730, 821510, 760799, 683491, 727487, 768187, 725554, 700479, 652790, 563195, 529495, 575271, 591746, 596911, 499085, 461984, 432735, 450640, 512446, 524313, 435601, 421010, 365789]
5197C65789l7636N1075J9345k3300J4853l981K35r046m4601j6369J1996M4171
5185C72531J09462l4825o5718j4639j7887K3158O418K7502J9584P9761j33818
5174C71529O7609N443L935j3330N7496m5773P4026K2880p4006N9337q965o1397
5162D58784N6518L0100n3516L3779P0000j8650N1725P8532J7019n5481o4729J13897
5150G17978J0042L1434K6407P3375J00677J29060J633P384P4145m7324l6292J02561
5138A191080k1696n1519M5617j4767q4583m6369j00368r2115R132j7718m1184
5127G75510l8918j22927k7299k28l998r5488M9239K2873r4757j0071Q5164K618
5115E41718m3380M5967P76K0740m0435p0832L3946k0011j0020K3215o741j2600
$$ y = [365789, 328153, 379228, 398573, 375273, 390126, 386145, 386380, 377334, 332733, 316364, 328360, 372531, 481993, 447168, 381450, 366811, 348924, 372082, 378500, 406002, 425586, 505347, 371529, 439138, 444581, 448516, 435186, 492682, 446909, 520935, 543815, 469809, 529146, 520181, 458784, 515302, 545402, 491886, 525665, 595665, 577015, 628740, 707272, 724291, 668810, 604081, 717978, 728020, 759454, 785861, 859236, 959913, 1088973, 1090606, 1097990, 1172135, 1124811, 1088519, 1191080, 1169384, 1117865, 1163482, 1148715, 1064132, 1017763, 917395, 825280, 834412, 816694, 775510, 736592, 613665, 586366, 586138, 582140, 486652, 535891, 558764, 464007, 453936, 539100, 541718, 498338, 544305, 545081, 565821, 525386, 454554, 488500, 468489, 458469, 481684, 474943, 462343]
5103D62343K0366l25p284P0939n2177N8967k6936l2893N8628O1364O5565K7078
5091G05635m864J09741N7081j32819m8529L2823m189M1423m3533K5140k2526J2248
5079G27631j2046j3953J6216o5554n6755N7886J15127m0343K5219J8885L5761
5068H08074M6218J5947P4353L3098N599O4600L7367J8316Q8632P6441K0942J4111
5056A303698m2138n3251p6714o8018p6104J4621l8219K1197j17553j7037M0790
5045H91272j3135N7664L2856j59695k90J14026k0117J7124L6804j1304l1210R5690
5033A009685j564O4897M2462Q3225Q009N5689O827O1654K3864j7681n9530O450
5021A283987N2730N1277R8557M266o205O5291J47397O0890M1465J46613P7986
$$ y = [462343, 482709, 482384, 475100, 546039, 493862, 552829, 525893, 493000, 551628, 612992, 678557, 705635, 700771, 810512, 867593, 734774, 686245, 719068, 714879, 756302, 712769, 737909, 715383, 727631, 715585, 701632, 717848, 652294, 595539, 653425, 768552, 728209, 753428, 772313, 808074, 854292, 870239, 944592, 977690, 983289, 1047889, 1085256, 1103572, 1192204, 1268645, 1289587, 1303698, 1261560, 1208309, 1131595, 1063577, 987473, 1002094, 963875, 985072, 867519, 850482, 891272, 878137, 935801, 968657, 808962, 808672, 922698, 902581, 919705, 956509, 945205, 913995, 1009685, 1008121, 1073018, 1115480, 1198705, 1206714, 1262403, 1269230, 1330884, 1354748, 1337067, 1277537, 1283987, 1336717, 1387994, 1486551, 1490817, 1484612, 1549903, 1697300, 1758190, 1799655, 1946268, 2024254]
5010B024254P3109M0117j7396q130M019P857O6715J4237K8813J0649M9314J03991
4998B397549J06722N2841J67840J61648N6131J08387l9988J9377J3222j11924
4988B931805j11847q2644r8005m6386j08270k9597p0634k0753p854j7871o2477
4977B275467o037K6220O8784O1018O1189P7142P3296M4479j2737j9391k141M6493
4965B693782J46484N7850J44195J52622O5875J2591L5915l0118k3337N2841K9993
4954C338693Q0215L1256m8876R427k7388j32672j2820m2214M0473K1594P7366
4943C335054J4192P1056r965n7022J8106j6239j9580l9756L5212J09952M5546
4932C486556L6075k5172m3348q6465j13056N4477j09174p1162l2972l0715k8311
$$ y = [2024254, 2097363, 2137480, 2120084, 2111954, 2115973, 2123830, 2190545, 2204782, 2233595, 2244244, 2293558, 2397549, 2504271, 2557112, 2724952, 2886600, 2942731, 3051118, 3011130, 3030507, 3043729, 2931805, 2819958, 2737314, 2639309, 2592923, 2484653, 2455056, 2384422, 2363669, 2355815, 2337944, 2275467, 2269430, 2295650, 2364434, 2425452, 2486641, 2563783, 2637079, 2681558, 2668821, 2649430, 2647289, 2693782, 2840266, 2898116, 3042311, 3194933, 3260808, 3273399, 3309314, 3279196, 3255859, 3308700, 3338693, 3418908, 3450164, 3401288, 3410715, 3383327, 3250655, 3237835, 3195621, 3236094, 3257688, 3335054, 3349246, 3420302, 3410337, 3353315, 3371421, 3355182, 3335602, 3295846, 3331058, 3441010, 3486556, 3522631, 3497459, 3454111, 3367646, 3254590, 3309067, 3199893, 3128731, 3095759, 3065044, 3036733]
4921C036733j5251K732L5354P4753J18224J48957K774J1310L9392k9087m9003
4910C376888o3671j32247j10332l5261j23289j83013m013j71494o4346J9011m9730
4899B458503k7786q9519O0885P3636n4646m3496K4802j9328M9483n7557M7896
4888B422873R3699Q4142M4979J23223R9638j0411Q2686L0086J7780J0112l626
4877B995181r4139j59989p7667o4243j08107l4591p2810l2516R78J6905o0987
4866B308015j4821K2781m2142r1807k5774j16614N812j50178q7419o8159j26247
4855A613447j9177q2248J297q2965j07593p2050l762p2159k1223m2701J6106P3859
4843A200831m9458n0911J7538K3220j1453n0591K0274j0900m9648Q7729N4409
$$ y = [3036733, 3021482, 3024214, 3059568, 3134321, 3252545, 3401502, 3404276, 3415586, 3454978, 3425891, 3376888, 3313217, 3180970, 3070638, 3035377, 2912088, 2729075, 2725062, 2553568, 2489222, 2508233, 2458503, 2430717, 2341198, 2402083, 2475719, 2421073, 2377577, 2402379, 2383051, 2432534, 2374977, 2422873, 2516572, 2600714, 2645693, 2768916, 2868554, 2858143, 2940829, 2970915, 2988695, 2998807, 2995181, 2901042, 2741053, 2663386, 2599143, 2491036, 2456445, 2383635, 2351119, 2352097, 2369002, 2308015, 2293194, 2315975, 2273833, 2182026, 2156252, 2039638, 2045450, 1895272, 1807853, 1739694, 1613447, 1594270, 1512022, 1513319, 1430354, 1322761, 1250711, 1246949, 1174790, 1153567, 1110866, 1126972, 1200831, 1151373, 1100462, 1118000, 1141220, 1129767, 1079176, 1099450, 1088550, 1038902, 1126631, 1181040]
4832A181040m5884p508J8220r401r3454O8279N8892j310J227J03839p4192k0019
4820A179729R0437k5541j02012l3211N8123p4352J4968P6156N978j3805m1210
4809A135260k4037N5639L0788M8988N044R6934m1708l6150k2999O8220O6927O9444
4797A452350M0146j6352K7305J5290P2896N331N5093N9333O6773R1746Q390N6877
4785A935178J18312K04367P2613J43334K96365J95595J93548K62194L44266L54747
4775D120519M63535O29128Q65612J137872J201952J065423N51210l09343r54269
4766H771639j328609j221297j044132p70278m73887l46685j99354k52613k49550
4757B885234k28490k14384j72907p1643N092j18600j07000j1970M9227m7845o3428
$$ y = [1181040, 1135156, 1127648, 1145868, 1136467, 1043013, 1111292, 1170184, 1168874, 1170101, 1273940, 1199748, 1179729, 1270166, 1244625, 1142613, 1109402, 1167525, 1093173, 1108141, 1184297, 1190275, 1176470, 1135260, 1111223, 1166862, 1197650, 1246638, 1251682, 1348616, 1306908, 1270758, 1247759, 1315979, 1382906, 1452350, 1492496, 1476144, 1503449, 1518739, 1591635, 1596966, 1652059, 1711392, 1778165, 1869911, 1878301, 1935178, 2053490, 2257857, 2330470, 2473804, 2770169, 2965764, 3159312, 3421506, 3765772, 4120519, 4584054, 5213182, 6078794, 7216666, 8418618, 9484041, 10035251, 9725908, 8771639, 7443030, 6221733, 5177601, 4407323, 3933436, 3586751, 3387397, 3134784, 2885234, 2656744, 2442360, 2269453, 2197810, 2202902, 2084302, 1977302, 1965332, 2014559, 1966714, 1903286]
4746A903286q1374n9377J4707K5531j1579k4258m3963N992n2451l211o0742M5501
4734A658062P7424k4993J02755K1967o8167l8409k3596L3522p6519m0610L632
4723A625068l8656M5431J11508P6473L4799M5088l0778R2121J23288J41887J07618
4712B333847M7629J14781J69335J73660K62099L09885L63368L38282M05027P28288
4702E246201R12607J049615J035281O42024J78636j72973o93448j151900j151692
4693E894351r99790p69820n12015m05833l79447k07655j94661j10745j24930j40532
4683B048923j2031L6418o6937q3093K4310M2019P4658Q0428J41619J33778k5093
4672B394999k36882k23146j86342j44781j13938j07875q7358q9198l0111m5572
$$ y = [1903286, 1821912, 1762535, 1777242, 1802773, 1791194, 1766936, 1722973, 1728965, 1676514, 1673303, 1612561, 1658062, 1735486, 1710493, 1813248, 1835215, 1767048, 1728639, 1705043, 1738565, 1662046, 1621436, 1625068, 1586412, 1631843, 1743351, 1819824, 1854623, 1899711, 1868933, 1961054, 2084342, 2226229, 2333847, 2381476, 2496257, 2665592, 2839252, 3101351, 3411236, 3774604, 4112886, 4517913, 5246201, 6158808, 7208423, 8243704, 8885728, 9064364, 8891391, 8197943, 7046043, 5894351, 4894561, 4124741, 3612726, 3206893, 2827446, 2619791, 2425130, 2314385, 2189455, 2048923, 2036892, 2073310, 2006373, 1923280, 1947590, 1989609, 2064267, 2144695, 2286314, 2420092, 2394999, 2158117, 1934971, 1748629, 1603848, 1489910, 1382035, 1294677, 1205479, 1175368, 1129796]
4662A129796n7707l5514K0024p5412J0586M2014Q0263o2382p3990o2698J8392
4651I33372l1143j7351J398p3529q8441o1134O9494J3661O6556O476n5110J8137
4639G82386L0925k7088j05861l7673M7808K8613N6830j4831N3250k6963m7600
4628G39796Q2838l7968n0826k4254L1869k476n2214K679K9732P4219l1381K142
4616G64156p7115L701J10524l2166r6259L6414r725J04203J1135k0778m4710j9505
4604G29875M5560O759j9972k2308q870L6183K9284N6128L2254L3431M3751N7578
4592A019653J20989l7614l1252j12815O8455l1647l0182L207m8820J3235k1630
4581I11579m5813M240N1110K7167O9478P1041K2603K7997J66839N2593n854j1379
$$ y = [1129796, 1072089, 1036575, 1056599, 981187, 991773, 1033787, 1114050, 1051668, 977678, 914980, 933372, 902229, 884878, 886276, 812747, 724306, 663172, 732666, 746327, 812883, 819359, 764249, 782386, 813311, 786223, 680362, 642689, 690497, 719110, 775940, 761109, 814359, 787396, 739796, 822634, 784666, 733840, 709586, 741455, 738979, 686765, 689444, 719176, 793395, 762014, 764156, 687041, 690742, 801266, 769100, 672841, 709255, 699530, 803733, 814868, 794090, 749380, 729875, 775435, 782194, 762222, 739914, 731044, 767227, 796511, 852639, 884893, 918324, 962075, 1019653, 1140642, 1103028, 1071776, 958961, 1027416, 995769, 965587, 968794, 919974, 933209, 911579, 865766, 870006, 921116, 948283, 1017761, 1088802, 1111405, 1139402, 1306241, 1358834, 1352980, 1341601]
4569A341601o9638j15301q0119l098l6756r1827n2162L1478J8582Q6476k5566
4558A003670n8259P0524M8781J3527n5067N0604l7859q6954o0155l4366l9795
4547H14651o5393o0048M0670K0065q3209o6264r797Q9092N329m5119K3166K3022
4535F86165R4587n1549p9215K7035l5460k8556N8019k6279M939j5249J9035L7399
4523F90871K239l7878J2337N8816k4613l0911k3120N2728q252N6298m1530O497
4511G13482l1333J4845j3602P0321J03167j9822p4174N3759M2401P4754m5344
4500H88454p2646K2352m0105K3769k9448l0967j7068l1372K9745M9536m2310O587
4488G56527P2441l6463k4387P699O4750l773K5998k306o0850J5094N85k7684k6317
$$ y = [1341601, 1271963, 1156662, 1076543, 1073445, 1036689, 944862, 892700, 924178, 942760, 1029236, 1003670, 945411, 1015935, 1064716, 1078243, 1023176, 1073780, 1035921, 948967, 888812, 854446, 814651, 749258, 689210, 729880, 749945, 666736, 600472, 590675, 679767, 685096, 639977, 663143, 686165, 780752, 729203, 649988, 677023, 641563, 613007, 671026, 644747, 649686, 634437, 653472, 690871, 693110, 655232, 667569, 726385, 701772, 670861, 647741, 700469, 692217, 748515, 706985, 713482, 682149, 696994, 683392, 753713, 856880, 837058, 762884, 816643, 859044, 933798, 888454, 815808, 838160, 798055, 821824, 792376, 761409, 744341, 712969, 742714, 792250, 749940, 756527, 828968, 792505, 768118, 775817, 840567, 836794, 862792, 860486, 799636, 814730, 815315, 787631, 761314]
4475G61314l1380J06141n0382R528N0779L973l1397l6289L6094K7185M9687J4418
4463I09671l262K2162M1633M0242L0426k0875p0992O722M3010J25655K2652o5489
4451A081555l6670j06765L1789m9666l9128j3083O9454O0636o7393p4466R7067
4440I53330n6564n08k4904P1915M550j7902M7357r0553q0866J13757M9220J1572
4428I80404k2504k4184L9472o922K9496J2544M87k7686k3080K6133M258J5485
4416A003903m1172o8665j2707J01500M3365Q608j3416m5389P0136j4201K5994
4405A057956k1374N5736J9218p8468J661K2972L22n8007O2287K6990J1339J0303
4393A110935p4371j1311j37O5251J14563k585O912J9656L5323k1034N5331r1984
$$ y = [761314, 729934, 836075, 785693, 795221, 846000, 849973, 818576, 782287, 818381, 845566, 895253, 909671, 906409, 928571, 970204, 1010446, 1040872, 1019997, 949005, 955727, 998737, 1124392, 1147044, 1081555, 1044885, 938120, 969909, 920243, 881115, 868032, 937486, 998122, 930729, 856263, 953330, 896766, 896258, 871354, 943269, 947819, 929917, 977274, 886721, 805855, 919612, 968832, 980404, 957900, 933716, 973188, 966266, 995762, 1008306, 1008793, 981107, 958027, 984160, 988418, 1003903, 962731, 894066, 881359, 982859, 1026224, 1034832, 1021416, 976027, 1046163, 1031962, 1057956, 1036582, 1092318, 1111536, 1033068, 1034729, 1057701, 1058023, 1000016, 1062303, 1089293, 1100632, 1110935, 1036564, 1025253, 1025116, 1090367, 1204930, 1202345, 1209257, 1228913, 1264236, 1243202, 1298533, 1206549]
4381A206549Q5044m2767l5986n3768j7401J47377j8161j3687o5202O3440J1378
4370A266816K1645p9292k5517m6172Q9615m255m4368P6244P67Q961R0942R0563
4358A445949J3150p5622m9067L9499O3328M3057K1660k746k9316L5522J67922
4347A673336R643P2531O7475J02674P8213J3113m5668n7414k7448k365K7023p7060
4335A834053m4108Q316l6646J249M660N9578j6819j6133P2921l0502l2801o3485
4323A740283J3289L2950R2569J65164m770n6105P2332R9425Q1214J23470J11837
4312B471658q831M3215L5982q2700o4864j2141q6132l6223m0165N7648O2537o6387
4300B273597l2014N149j5727K8654P5261m2782P3422L4325j2017J5445J21436
$$ y = [1206549, 1291593, 1248826, 1212840, 1159072, 1141671, 1289048, 1270887, 1257200, 1191998, 1255438, 1266816, 1288461, 1209169, 1183652, 1137480, 1227095, 1222840, 1178472, 1254716, 1255483, 1264444, 1355386, 1445949, 1459099, 1383477, 1334410, 1373909, 1437237, 1480294, 1501954, 1499208, 1469892, 1505414, 1673336, 1682979, 1755510, 1822985, 1925659, 2003872, 2016985, 1971317, 1913903, 1886455, 1884090, 1911113, 1834053, 1789945, 1798261, 1761615, 1762864, 1767524, 1827102, 1810283, 1794150, 1867071, 1836569, 1803768, 1740283, 1753572, 1786522, 1879091, 2044255, 2039485, 1983380, 2055712, 2155137, 2236351, 2359821, 2471658, 2462827, 2506042, 2542024, 2459324, 2394460, 2382319, 2296187, 2259964, 2219799, 2277447, 2339984, 2273597, 2241583, 2246732, 2231005, 2259659, 2334920, 2292138, 2365560, 2399885, 2387868, 2403313, 2524749]
4289B524749P1075J6492J9539M5263Q5108N3925L9023L1087j7877J10981m328
4278B975037O1300J1588m9627L5058K6549q164m878O5591M6551M995q026K8940
4266C184914M6237R8801M0850L5377M79P9247J28043N9688J30881J02414M6588
4255C953519J63869J65880L20909J62545K49655K87896K57574L33561M79793M54158
4245F829359K62779k39957l30032m11974l25837j86369j51329n9393m911L8286
4235E420622K4886J52842J65383R0856J26435J58536J36285J58345J45907J03962
4225F684059R8821M1993J19470m9147Q0687J43470P0220J26001J48243J42440
4215G606257M0169M7185o1081m5050k9657j8972j14613j07227l8074m1889O3922
$$ y = [2524749, 2595824, 2612316, 2631855, 2677118, 2762226, 2816151, 2855174, 2886261, 2868384, 2979365, 2975037, 3036337, 3047925, 2998298, 3033356, 3059905, 3051741, 3046863, 3112454, 3159005, 3164000, 3155974, 3184914, 3231151, 3329952, 3370802, 3406179, 3406658, 3485905, 3613948, 3673636, 3804517, 3906931, 3953519, 4117388, 4283268, 4604177, 4766722, 5016377, 5304273, 5561847, 5895408, 6375201, 6829359, 7092138, 6852181, 6522149, 6110175, 5784338, 5597969, 5446640, 5387247, 5382336, 5420622, 5445508, 5598350, 5763733, 5854589, 5981024, 6139560, 6275845, 6434190, 6580097, 6684059, 6782880, 6824873, 6944343, 6895196, 6975883, 7119353, 7189573, 7315574, 7463817, 7606257, 7646426, 7693611, 7632530, 7587480, 7557823, 7538851, 7424238, 7317011, 7278937, 7237048, 7300970]
4204G300970J29264J43765K33253K82965K16371K06624R7971k8736j7012j13662
4194H451773k78154k23729k12318k93861k14241k02157p6446j36335N3855l0667
4184F837720N458P4388N8046J32085N2121J18102J62919J16378K10146J86947
4174G954310L44121L71997M07477M67725N73336N88121N46440M40549R3317k15771
4164A1571622n15225n26099n25016n16004m04092k43209r6950j81075j61064j6232
4154H386656J17880O4234J29193O3458J70929K19235J30212K87554L59099M39163
4144A0367613P08118P51764Q67365O86395L87019K32980J52890J82316M2445j45438
4134A4233467l33517l94233m89312n86276n14658m01166m86756m58570k74961
$$ y = [7300970, 7430234, 7573999, 7807252, 8090217, 8306588, 8513212, 8611183, 8582447, 8565435, 8451773, 8173619, 7949890, 7737572, 7443711, 7229470, 7027313, 6950867, 6814532, 6868387, 6837720, 6843178, 6917566, 6975612, 7107697, 7159818, 7277920, 7440839, 7557217, 7767363, 7954310, 8298431, 8670428, 9077905, 9545630, 10118966, 10707087, 11253527, 11694076, 11787393, 11571622, 11056397, 10530298, 10005282, 9489278, 9085186, 8841977, 8745027, 8563952, 8402888, 8386656, 8504536, 8568770, 8697963, 8761421, 8932350, 9151585, 9281797, 9569351, 9928450, 10367613, 11075731, 11827495, 12694860, 13381255, 13768274, 14001254, 14154144, 14336460, 14378905, 14233467, 13899950, 13505717, 13016405, 12430129, 11915471, 11514305, 11027549, 10568979, 10294018]
4125A0294018k64427k72178j33951j04650L8758q274K3371O5802J97825K21308
4115A0057602J87027K35183L13556K28467K31266L39485L45926L24455M24587
4106A2687554L52638L33718L17336J53468P5067k4446j94703k34300j46969j42584
4096A3176779j35611l989M7974J61964J68553K36875K83093L31036K87230K20402
4086A4774306O2400l1978O7991r6587n0937o6646k3694J58331R0347N0927J77229
4075A5111689K48370L05075K98703L19100M03471L50042M19023O00115N87435
4066A8643023O42693P65721Q64053J035955J080006J215458J510503J675775J993033
4057B9426220K351203K811843L504540M358891N394789O638160O954916N164038
$$ y = [10294018, 10029591, 9757413, 9623462, 9518812, 9557570, 9549296, 9572667, 9638469, 9836294, 10057602, 10244629, 10479812, 10793368, 11021835, 11253101, 11592586, 11938512, 12262967, 12687554, 13040192, 13373910, 13691246, 13844714, 13919781, 13895335, 13700632, 13466332, 13319363, 13176779, 13041168, 13037179, 13085153, 13247117, 13415670, 13652545, 13935638, 14266674, 14553904, 14774306, 14836706, 14804728, 14872719, 14776132, 14725195, 14658549, 14634855, 14793186, 14883533, 14934460, 15111689, 15360059, 15665134, 15963837, 16282937, 16686408, 17036450, 17455473, 18055588, 18643023, 19285716, 20051437, 20915490, 21951445, 23031451, 24246909, 25757412, 27433187, 29426220, 31777423, 34589266, 38093806, 42452697, 47847486, 54485646, 61440562, 66604600]
4049F6604600L72112n163197p141378o527259n352347m066616l046131k198695
4041C3481089j583422j151629p39275m50517j66763J00591K53378M22817M54029
4032C0620298N15554N78092N51351O29971N36424L82043M10242M95783O09360
4023C5329118P58490Q18781Q37273Q65620R44167J010337J233109J440783J599259
4014D4836937J892454K079607K284290K518304K573902K342264J931883J636100
4006F2095741J582434J604663J848577J960886K123364K328636K492479K605121
3998G8641901K824310K933021L105910L110525L112288L214581L247922L020379
3990A03210837K916328K828224K654676K687202K566137K539391K595925K673226
$$ y = [66604600, 66976712, 61813515, 54672137, 48144878, 42792531, 38725915, 35679784, 33481089, 31897667, 30746038, 30006763, 29556246, 29389483, 29490074, 29743452, 30166269, 30620298, 31135852, 31713944, 32265295, 32895266, 33431690, 33813733, 34223975, 34719758, 35329118, 36087608, 36906389, 37743662, 38609282, 39553449, 40563786, 41796895, 43237678, 44836937, 46729391, 48808998, 51093288, 53611592, 56185494, 58527758, 60459641, 62095741, 63678175, 65282838, 67131415, 69092301, 71215665, 73544301, 76036780, 78641901, 81466211, 84399232, 87505142, 90615667, 93727955, 96942536, 100190458, 103210837, 106127165, 108955389, 111610065, 114297267, 116863404, 119402795, 121998720, 124671946]
3982A24671946K671637K729208K661979K486033K383391K185082K093993J710968
3974A43594237J411407J221553J122598J202124J141817J155159J340280J465365
3966A53654540J442902J652575J700942J705096J686473J898237K120902K477989
3958A68339656K986997L573107M317711N204310O293952P431343Q571030J0142170
3950B16860276J1910977J3887324J5925036J7904566J9235119J9532500J8151865
3943C33407663J5146886J0858971N574659O0298m870964q725412j1091527j2064158
3935C28296416j2049873j1391033j0700032j0294006r866559r642799j0091134
3928B54260980j0894355j2080566j3083765j3678352j3827136j3277991j2508463
$$ y = [124671946, 127343583, 130072791, 132734770, 135220803, 137604194, 139789276, 141883269, 143594237, 145005644, 146227197, 147349795, 148551919, 149693736, 150848895, 152189175, 153654540, 155097442, 156750017, 158450959, 160156055, 161842528, 163740765, 165861667, 168339656, 171326653, 174899760, 179217471, 184421781, 190715733, 198147076, 206718106, 216860276, 228771253, 242658577, 258583613, 276488179, 295723298, 315255798, 333407663, 348554549, 359413520, 364988179, 365048477, 360177513, 351452101, 340360574, 328296416, 316246543, 304855510, 294155478, 283861472, 273994913, 264352114, 254260980, 243366625, 231286059, 218202294, 204523942, 190696806, 177418815, 164910352]
3921A64910352j1311967r963871q620957p277632o049546m817322l748758k768091
3913A10352208j829905q48921l61279Q0727N1166q8249m64233j179637j693326
3904A04018551k136535k400284k346677k465940k333910k078636j887639j819593
3896H6549337j821776j838732j895264k114974k317266k555838k824157k919802
3888F8261528k956604k843753k800211k823803k754512k661675k555684k286494
3880D6578792k241197k009222j705932j686322j538888j393851j205853j133392
3872C3664135j108457r39746r20773q82301p25419o00332o73053m96122m65739
3863B6852193l82080m39690o58474p93889q34518p20925o50964n70008m50164
$$ y = [164910352, 153598385, 143634514, 135013557, 127735925, 121686379, 116869057, 113120299, 110352208, 108522303, 107673382, 107312103, 107392830, 107443996, 107355747, 106891514, 105711877, 104018551, 101882016, 99481732, 97135055, 94669115, 92335205, 90256569, 88368930, 86549337, 84727561, 82888829, 80993565, 78878591, 76561325, 74005487, 71181330, 68261528, 65304924, 62461171, 59660960, 56837157, 54082645, 51420970, 48865286, 46578792, 44337595, 42328373, 40622441, 38936119, 37397231, 36003380, 34797527, 33664135, 32555678, 31615932, 30695159, 29812858, 29087439, 28487107, 27814054, 27317932, 26852193, 26470113, 26030423, 25371949, 24578060, 23743542, 23022617, 22371653, 21801645, 21351481]
3854B1351481n16103l90208k91088l06895k33415j44737j61993j98453j94906
3845A8913683j17215l2870j33265j04291k01927r9515l2791O3429J15471J42216
3835A8512925J32521J29176K80881L54979L61340M73618N33721O19332O61831
3826B2060324O17064N59132M78672L91094J83158j6436j60138j26611k37839k91345
3816B3457075l02931l51542k65413l35781l10262l11446k39875l04124m97482
3807B0538219n28396n58061p41007q31209p43857o96437o45635n54116l99163
3798A4840338l60163k55812j14193J5748J3714M5023p0707j16067k65313k28729
3788A3503839j61931p2618q9075k03195k68797k36509l06448k47037j58280k61238
$$ y = [21351481, 20835378, 20445170, 20154082, 19847187, 19613772, 19469035, 19307042, 19108589, 18913683, 18796468, 18763598, 18630333, 18526042, 18324115, 18224600, 18191809, 18255238, 18370709, 18512925, 18645446, 18774622, 19055503, 19410482, 19771822, 20245440, 20779161, 21398493, 22060324, 22677388, 23236520, 23715192, 24106286, 24289444, 24273008, 24112870, 23986259, 23748420, 23457075, 23154144, 22802602, 22537189, 22201408, 21891146, 21579700, 21339825, 21035701, 20538219, 20009823, 19451762, 18710755, 17879546, 17135689, 16439252, 15793617, 15239501, 14840338, 14480175, 14224363, 14110170, 14125918, 14139632, 14184655, 14113948, 13997881, 13732568, 13503839, 13341908, 13269290, 13180215, 12977020, 12708223, 12471714, 12165266, 11918229, 11759949, 11498711]
3778A1498711j36057j28465p1072k7477K9699P2811J34555J21634R9353K22683
3768A1816375K55121P2856o6708j75299k40915j91848j28737n8938o500J20066
3758A1395473R4453K6345P1403n952j07555j65578o1064o6969o4185m4486M480
3747A1076365q1648q1606L6165J4049o90j3686L1449k6798m5343j45222q9609
3736A0673426j92087k14170J0428j25819m9698N1408M4452J16104J52047P9256
3726A0545347J77910K62289K01421J45404J65043J0895J568l1088k5432P7177
3716A1530534J15938J49093J40301J87026J24317R1647K60519L05110K06714K99977
3706A3411176K82881K09130J40547N7852J10959J46903K67191K95316K37000L86114
$$ y = [11498711, 11362654, 11234189, 11163117, 11135640, 11165339, 11238150, 11372705, 11494339, 11593692, 11816375, 12071496, 12144352, 12077644, 11902345, 11661430, 11469582, 11340845, 11281907, 11275407, 11395473, 11489926, 11516271, 11587674, 11581722, 11474167, 11308589, 11247525, 11180556, 11116371, 11071885, 11076365, 10994717, 10913111, 10949276, 10963325, 10962635, 10948949, 10980398, 10953600, 10908257, 10763035, 10673426, 10481339, 10267169, 10277597, 10151778, 10102080, 10153488, 10197940, 10314044, 10466091, 10545347, 10723257, 10985546, 11186967, 11332371, 11497414, 11508309, 11509877, 11478789, 11453357, 11530534, 11646472, 11795565, 11935866, 12122892, 12247209, 12338856, 12599375, 12904485, 13111199, 13411176, 13694057, 13903187, 14043734, 14101586, 14212545, 14359448, 14626639, 14921955, 15158955, 15545069]
3696A5545069L83241L71062L80346L95621L12979L10447L38612L19265K80958
3687A8637600M75577M70686N06061N59359N30714O10702N68150N64264O49159
3678B3572272O23450N66776N39572O02215O90299N98364O41445O54496O50429
3669B9139318O50860O21152O20616O94408P88439Q60750Q70840R67555J058948
3660C6272886J058670J132923J221547J291454J391630J379253J607164J690579
3652D7046106J754617J903730K051103K253578K452008K688665K946429L361495
3644F6457731L648264L968455M478222N045304N544953O312293P160852Q068673
3636A10684747R220184J0350588J1575981J2357724J2650706J2210117J0855878
$$ y = [15545069, 15928310, 16299372, 16679718, 17075339, 17388318, 17698765, 18037377, 18356642, 18637600, 19113177, 19583863, 20089924, 20649283, 21179997, 21790699, 22358849, 22923113, 23572272, 24195722, 24762498, 25302070, 25904285, 26594584, 27192948, 27834393, 28488889, 29139318, 29790178, 30411330, 31031946, 31726354, 32514793, 33375543, 34246383, 35213938, 36272886, 37331556, 38464479, 39686026, 40977480, 42369110, 43748363, 45355527, 47046106, 48800723, 50704453, 52755556, 55009134, 57461142, 60149807, 63096236, 66457731, 70105995, 74074450, 78552672, 83597976, 89142929, 95455222, 102616074, 110684747, 119904931, 130255519, 141831500, 154189224, 166839930, 179050047, 189905925]
3629A89905925R118004P610915O831095O329880O622900P450130Q556030R666798
3621B52091677J0414238J0547268R901065Q236846N689746K640093p53979l711943
3613B95055011o165970p599520q304993q314379p725143o993089o441232n988229
3605B37522456n913073o403768p585196r149107j0762298j1981661j2350967j2114261
3597A61262125j1302244j0361908r322703q305071p472790o872701o312146n842847
3589I5469715n467226n113596m667935m225803l907242l645179l245186k835965
3581F2361583k482245k231679j941632j783242j651911j484217j384079j348845
3573D8053733j404829j389690j546699j562314j488099j482522j405443j306511
$$ y = [189905925, 199023929, 206634844, 213465939, 219795819, 226418719, 233868849, 242424879, 252091677, 262505915, 273053183, 282954248, 291191094, 296880840, 299520933, 298766954, 295055011, 288889041, 281289521, 272984528, 264670149, 256945006, 249951917, 243510685, 237522456, 231609383, 225205615, 217620419, 208471312, 197709014, 185727353, 173376386, 161262125, 149959881, 139597973, 130275270, 121970199, 114497409, 107624708, 101312562, 95469715, 90002489, 84888893, 80220958, 75995155, 72087913, 68442734, 65197548, 62361583, 59879338, 57647659, 55706027, 53922785, 52270874, 50786657, 49402578, 48053733, 46648904, 45259214, 43712515, 42150201, 40662102, 39179580, 37774137, 36467626]
3565C6467626j294071j172205j013167r40381j006267r38814r27156r04648r39115
3556B7331802q82232j085014j079457r26565r65643q09777q93206p44035o66947
3547A9278926o61655n79198n16238n63755n04332m28414m17407n01078m23194
3538A4683655l91670m15911l87265l48352l83083l20466l04613l95130k89939
3529A1447226k53338j65545j77114k59973k79514l14854j89125j84314k35240
3520I388209j84099j81189j99226j95375k77298j87439j09192j42238j57410j01127
3510G653616p9955r5565k40700k08522j48006j45500k3608n2440j20441q4713
3500F454166q4499j05054j04162j62031j19022m2549n4888j08709r5235o9806
$$ y = [36467626, 35173555, 34001350, 32988183, 32047802, 31041535, 30102721, 29175565, 28270917, 27331802, 26449570, 25364556, 24285099, 23358534, 22392891, 21583114, 20689908, 19945873, 19278926, 18617271, 18038073, 17521835, 16958080, 16453748, 16025334, 15607927, 15106849, 14683655, 14291985, 13876074, 13488809, 13140457, 12757374, 12436908, 12132295, 11737165, 11447226, 11193888, 11028343, 10851229, 10591256, 10311742, 9996888, 9807763, 9623449, 9388209, 9204110, 9022921, 8823695, 8628320, 8351022, 8163583, 8054391, 7912153, 7754743, 7653616, 7573661, 7478096, 7237396, 7028874, 6880868, 6735368, 6711760, 6659320, 6538879, 6454166, 6369667, 6264613, 6160451, 5998420, 5879398, 5836849, 5781961, 5673252, 5578017, 5508211]
3490E508211j56369j22140q6958q556l2823j88346l6727o3996j5494l0171j02064
3479D664567n292q8860j48761l3168n8889p3300Q058p2690j60041m3495j52432
3468C835697J2952l0235p2380o6872l7265p8657p4686J8721Q561p4707n2190n860
3456C383079m9179j2242o5016q9092l9388O9246k4692j3941M4861k9400L9113
3445C213349o8275q4957O3331N5442n9769j25289P6208N0532p6604L5765J2995
3434C092728l9613P6261K1531j5288k5990J8926j5729P4120q469P804N5155p8637
3422C162799L7628P3712Q6283k5164m2331o2920R134k1274k5442l8713m0862k0232
3410C092618J0668J656j4736j2737l2899j2415K8814P4368n7568L4465N0336k1851
$$ y = [5508211, 5351842, 5229702, 5142744, 5134188, 5101365, 4913019, 4876292, 4812296, 4796802, 4766631, 4664567, 4659275, 4570415, 4421654, 4388486, 4329597, 4256297, 4264355, 4191665, 4031624, 3988129, 3835697, 3848649, 3818414, 3746034, 3679162, 3641897, 3563240, 3488554, 3507275, 3515836, 3441129, 3388939, 3383079, 3333900, 3321658, 3256642, 3167550, 3128162, 3197408, 3172716, 3158775, 3203636, 3174236, 3213349, 3145074, 3060117, 3123448, 3178890, 3119121, 2993832, 3070040, 3120572, 3043968, 3079733, 3092728, 3053115, 3129376, 3150907, 3135619, 3109629, 3128555, 3112826, 3186946, 3178477, 3186281, 3241436, 3162799, 3200427, 3274139, 3360422, 3335258, 3292927, 3230007, 3239141, 3217867, 3192425, 3153712, 3112850, 3092618, 3103286, 3104942, 3090206, 3077469, 3044570, 3032155, 3060969, 3135337, 3077769, 3112234, 3162570, 3140719]
3398C140719R2169m9465j792k779k7090L3465R0842J47193L4203J88933J69885
3387C816283Q7709K4511m5688j35263p2758j70883L6267j33855m8450J1654j20165
3376C249362j6674o2424k6477N2428m5853n1004n7158r2086l7349J56p763q240
3364B896918M4730O426L9809N5684J08637N075O6229O2666P7038K2543j336q3082
3352C301337K6826P8475l5601P440J13458R6664O2316J33137K9387M1064J46228
3341D000731Q3989k5251R3520J0533Q1696J80119J4804N1358J7955p306J5627
3330D517775o2157J7353L5831J7341Q664j2011n1273j5704n044n9020m9515q2043
3318D260197q6466L0530N7133J2735M2926J9835q9426j5100j2671m2843N5025
$$ y = [3140719, 3232888, 3183423, 3181631, 3178852, 3151762, 3185227, 3276069, 3423262, 3457465, 3646398, 3816283, 3903992, 3928503, 3882815, 3747552, 3674794, 3503911, 3540178, 3406323, 3357873, 3369527, 3249362, 3232688, 3170264, 3143787, 3196215, 3150362, 3099358, 3042200, 2950114, 2912765, 2912921, 2905158, 2896918, 2941648, 2948074, 2987883, 3043567, 3152204, 3157279, 3223508, 3286174, 3363212, 3385755, 3384419, 3301337, 3328163, 3406638, 3371037, 3378477, 3491935, 3588599, 3650915, 3784052, 3813439, 3854503, 4000731, 4084720, 4059469, 4152989, 4163522, 4245218, 4425337, 4440141, 4491499, 4509454, 4502148, 4517775, 4455618, 4472971, 4508802, 4526143, 4534807, 4522796, 4471523, 4455819, 4450775, 4391755, 4342240, 4260197, 4173731, 4204261, 4261394, 4274129, 4317055, 4336890, 4247464, 4232364, 4219693, 4176850, 4231875]
3307D231875k4315k2903M7920J25057L918j5446O1578J20131m7230j2324p6422
3296D391839n9536q557K260o0663l1113O7193j0718J1357N954M6639n4728K9805
3284D329732J34729K4570Q0542R4748j0847L0167J9035O9939R0389N0065K2004
3273D935073L5423M2572K1255P6135R1263P9408J12686J16786O3734J16524J51808
3262E842667R9630J05419K05508K24503K39063L16813K43359J82626J09806J50161
3252G719555J28914R1032j8334J15780J23420J15228J86423K62161K69826K46470
3242I240475L81503L93521M08864L43591M06545M98672M89595N96311O14453O93299
3232A4066829P43762O51569P48258O12472L31166J48684j00283n94722q21038
$$ y = [4231875, 4207560, 4184657, 4232577, 4357634, 4361552, 4346106, 4407684, 4527815, 4480585, 4468261, 4391839, 4332303, 4323746, 4326006, 4265343, 4234230, 4301423, 4290705, 4302062, 4308016, 4354655, 4299927, 4329732, 4464461, 4489031, 4569573, 4664321, 4653474, 4683641, 4702676, 4772615, 4863004, 4913069, 4935073, 4970496, 5013068, 5034323, 5110458, 5201721, 5281129, 5393815, 5510601, 5574335, 5690859, 5842667, 5942297, 6047716, 6253224, 6477727, 6716790, 7033603, 7276962, 7459588, 7569394, 7719555, 7848469, 7939501, 7921167, 8036947, 8160367, 8275595, 8462018, 8724179, 8994005, 9240475, 9621978, 10015499, 10424363, 10767954, 11174499, 11673171, 12162766, 12759077, 13373530, 14066829, 14810591, 15462160, 16210418, 16822890, 17154056, 17302740, 17202457, 16607735, 15786697]
3223A5786697r79948r15266r48125q81044o22453o01750o37806n27040n34091
3214I139174m12070l69871j72460p4970k26537k02330l05085k44896l02691k47948
3204F580316j66848j84451j71244j74521r9291n1143j01619j10618j35402k7244
3194E357935q9406r0759l8124p711R1885M1623l0149p196p6095j42226j87871
3183D821906k08452j61750j22515q2374J1308P703j37873j01585j20964j51231
3173C754173j37466m1497N57o8792j17597l7319J8585l9999n9412m9033k3852
3162C198348p5660L7126l4086N2811n075J3102K1225m6194j05340n8115q0284
3151B917858j01245k8039r322n7076j67700l8684m7233l7748m7154l6061n6520
$$ y = [15786697, 14806749, 13891483, 12943358, 12062314, 11439861, 10838111, 10200305, 9673265, 9139174, 8727104, 8357233, 8184773, 8109803, 7883266, 7680936, 7375851, 7130955, 6828264, 6580316, 6413468, 6229017, 6057773, 5883252, 5783961, 5732818, 5631199, 5520581, 5385179, 5357935, 5268529, 5177770, 5139646, 5131935, 5223820, 5265443, 5235294, 5228098, 5152003, 5009777, 4821906, 4613454, 4451704, 4329189, 4246815, 4258123, 4265826, 4127953, 4026368, 3905404, 3754173, 3616707, 3575210, 3575767, 3506975, 3389378, 3352059, 3370644, 3330645, 3271233, 3222200, 3198348, 3122688, 3159814, 3125728, 3178539, 3173464, 3186566, 3207791, 3161597, 3056257, 2998142, 2917858, 2816613, 2788574, 2779252, 2722176, 2554476, 2515792, 2468559, 2430811, 2383657, 2347596, 2291076]
3140B291076Q3441R9343n6690m0315K3654n3313P446M4843r8371o1777J8907k9479
3128B228765n5971k4954p660J3064p939m3189K160K847j6890l7270o1910M4532
3116B035585m1861n3043O1324o3997n9337k3206k0806j5621P4865R542n4178l9996
3104A809271k0894j2695L1131n4474L2142k3385m8599P3224k8991m6589k3465
3093A686676R398k2488M82N7124P7172l0744o1143Q587k9627r1578L8979m640
3081A638198O6690j1851j27604j3339k4403K810k3498k216N651p601N3652M718
3069A561207j5634l5804K0883J00029l6007r1078J8403J6120l8006p2813M3069
3058A470369N8826l6108n6926L3674j8831j2578J1332j7373L767L799Q0o8990
$$ y = [2291076, 2374517, 2473860, 2417170, 2376855, 2400509, 2347196, 2354642, 2399485, 2301114, 2239337, 2258244, 2228765, 2172794, 2147840, 2140180, 2153244, 2145305, 2102116, 2104276, 2107123, 2090233, 2052963, 1991053, 2035585, 1993724, 1940681, 2002005, 1938008, 1878671, 1855465, 1834659, 1819038, 1893903, 1903445, 1849267, 1809271, 1788377, 1775682, 1806813, 1752339, 1784481, 1761096, 1712497, 1785721, 1756730, 1710141, 1686676, 1696074, 1673586, 1674068, 1731192, 1808364, 1777620, 1716477, 1725064, 1695437, 1603859, 1642838, 1638198, 1704888, 1693037, 1565433, 1552094, 1527691, 1530501, 1507003, 1504787, 1510438, 1502837, 1556489, 1561207, 1545573, 1509769, 1530652, 1630681, 1594674, 1503596, 1521999, 1538119, 1500113, 1427300, 1470369, 1529195, 1493087, 1436161, 1469835, 1451004, 1438426, 1449758, 1432385, 1436152, 1439951, 1440031, 1371041]
3046A371041M7061J6074K2185k7073p1249K0732j1297m2599j3502N6955N2999
3035A421327o4263j1734R0006R951r1492r122n6582k6821O9287k7697J9686N5158
3023A377704q2913M4096J7499p0201N3175m844Q8563P364j25376o1684P6578J9201
3011A339162n444k2308O6668M4400n9506M8807N5377o0072k5225L5333J14731
3000A531923Q2277p9032K7084p5M1329J16255O0369O3062k6200j4570O4411P7815
2988A944648n22k7068L9932q2644N8999k7158J103J5664K2413P4322l8449l683
2976A977557p9794J8622J8469L4531K7517l0923K9313O0100m7146Q8293J16879
2965B213418o401M2882K7483J04670J57580O5905j604M2565K3503K6610k3925
$$ y = [1371041, 1418102, 1434176, 1456361, 1429288, 1358039, 1378771, 1367474, 1324875, 1311373, 1368328, 1421327, 1357064, 1345330, 1435336, 1445287, 1353795, 1344673, 1288091, 1261270, 1330557, 1302860, 1322546, 1377704, 1294791, 1338887, 1356386, 1286185, 1339360, 1334516, 1423079, 1430443, 1305067, 1243383, 1319961, 1339162, 1333718, 1311410, 1378078, 1422478, 1362972, 1411779, 1467156, 1407084, 1381859, 1417192, 1531923, 1614200, 1535168, 1562252, 1562177, 1603506, 1719761, 1780130, 1843192, 1816992, 1802422, 1866833, 1944648, 1944126, 1917058, 1956990, 1874346, 1933345, 1906187, 1907290, 1922954, 1945367, 2019689, 1981240, 1977557, 1897763, 1916385, 1934854, 1969385, 1996902, 1965979, 1995292, 2055392, 2008246, 2096539, 2213418, 2207017, 2249899, 2277382, 2382052, 2539632, 2605537, 2603933, 2646498, 2670001, 2696611, 2672686]
2954B672686Q3048m2658j5189J01461K7950O5845j4106N1290o698l1571R639j9074
2942B882623m9725l6390J202m3645O5198o3058L3289N4778M9626L9086R3678O4766
2930C091428j8732N6190Q846k6570k7464R0887O3910K9969P8718P7799j7827N0275
2918C457429L8934J04844J47854J09872M4288k1418O0536L6274K7614m1464L6156
2907D000919M117j5418j2336J7773J28975R0272M6022l5351N9707M1078Q3667
2896D409425L0020N8615J04523J58355J17420J56788J07746N3882J59837J52561
2886E509172L8162j06750n8154j63007l23193j60326k5380o6760r7604q5545l5470
2875D425145l9649K9716P1484J3470P2876O2235j6911R5618J68683j1056R961
$$ y = [2672686, 2755734, 2713076, 2697887, 2799348, 2827298, 2893143, 2879037, 2930327, 2923629, 2892058, 2901697, 2882623, 2832898, 2796508, 2797710, 2754065, 2819263, 2756205, 2789494, 2844272, 2893898, 2932984, 3026662, 3091428, 3072696, 3128886, 3137732, 3111162, 3083698, 3174585, 3238495, 3268464, 3347182, 3424981, 3407154, 3457429, 3496363, 3601207, 3749061, 3858933, 3903221, 3881803, 3942339, 3978613, 4006227, 3964763, 4000919, 4005036, 3989618, 3977282, 3995055, 4124030, 4214302, 4260324, 4224973, 4284680, 4325758, 4409425, 4439445, 4498060, 4602583, 4760938, 4878358, 5035146, 5142892, 5196774, 5356611, 5509172, 5547334, 5440584, 5382430, 5219423, 4896230, 4735904, 4710524, 4643764, 4546160, 4460615, 4425145, 4385496, 4415212, 4486696, 4500166, 4573042, 4635277, 4618366, 4713984, 4882667, 4871611, 4881572]
2864D881572R7931j4518p6846J44721Q7056m4678k1219j42809o5930j15834p3713
2853D655733j38252k04650j50180j08740l3087r9014j02107k5352l1632l9433
2843C723286J8966r1976o9848p9726J5364N9952j14712j40872n9533r2504j9422
2832C148975o1030j35706o8038j14457l6361o9236j05433k0289j29378j34101
2822B274946j1796j12696j13018N348j8700l0920l4628n653m1692p1390j08508
2811A731293L7666m8185j2955k2392k1792N113q0155K2245n2600n7567p5716O698
2799A431653m7480j3811J4728n0926n3565k4192m7933L9577O5400m0817m5451
2788A227183j4246m6423L6247o464j01360j03668P993Q277J5408j1143l028l5816
$$ y = [4881572, 4979503, 4964985, 4888139, 5032860, 5119916, 5075238, 5054019, 4911210, 4845280, 4729446, 4655733, 4517481, 4312831, 4162651, 4053911, 4020824, 3921810, 3819703, 3794351, 3762719, 3723286, 3742252, 3650276, 3580428, 3500702, 3516066, 3576018, 3461306, 3320434, 3260901, 3168397, 3148975, 3087945, 2952239, 2884201, 2769744, 2733383, 2664147, 2558714, 2538425, 2409047, 2274946, 2263150, 2150454, 2037436, 2042784, 2024084, 1993164, 1958536, 1952883, 1911191, 1839801, 1731293, 1768959, 1720774, 1707819, 1685427, 1663635, 1668748, 1588593, 1610838, 1558238, 1500671, 1424955, 1431653, 1384173, 1370362, 1385090, 1334164, 1280599, 1256407, 1208474, 1248051, 1313451, 1272634, 1227183, 1212937, 1166514, 1202761, 1196297, 1094937, 991269, 999262, 1007539, 1022947, 1011804, 1008776, 972960]
2776I72960j5223k5436K576J2789m0408m7957j3307N356k48j1879K7708j882o4569
2763H00480n7746L558k9258K4733N9621m8747k1356k3108m3071n7853O4500L787
2751F75540r7857k0755l3323M8660R830m3637Q1509M0060l1394k2481J331O0295
2739F67778j09310k726P1615k8313q8319m8806p552L2168m9279q5687K4619o577
2727C69611K8372M7291L9993l5756r4980L3726J11887n9473k7927N9274j528j06110
2715C64380O2449r367m4873m7565M5694p1196N053Q5380m3272O3490m3093q3038
2703B84042J6147j3479p724k197N7909l603j8152Q3941m4629o4586K6795J0321
2691C24785P7521m6043q8656m1869L5962K5755j17012j1586L2125Q2672P456o2138
$$ y = [972960, 957737, 932301, 934877, 947666, 907258, 859301, 845994, 851350, 851102, 839223, 866931, 865049, 800480, 742734, 746292, 717034, 741767, 801388, 752641, 731285, 708177, 665106, 607253, 671753, 675540, 577683, 556928, 523605, 572265, 582095, 538458, 619967, 660027, 628633, 606152, 607483, 667778, 558468, 555742, 627357, 599044, 510725, 461919, 454367, 486535, 437256, 351569, 376188, 369611, 397983, 445274, 485267, 449511, 354531, 388257, 500144, 440671, 412744, 472018, 470490, 364380, 426829, 417462, 372589, 325024, 370718, 299522, 304575, 389955, 346683, 410173, 367080, 284042, 300189, 286710, 278986, 276789, 334698, 331095, 312943, 396884, 352255, 287669, 314464, 324785, 402306, 356263, 267607, 225738, 261700, 287455, 170443, 158857, 190982, 273654, 281110, 218972]
2679B18972k6211M0408M1401K822P5882j1511r4097L038K2918m3435J2218l2780
2667B09625o3374R0628J8816j04547M9695N8637j1969m7647k7798N9694O2511
2656B94271O809j3633k7426K3622J4063p6207J5110j9058l6965R2574o775l9591
2644B26794M9489J7400M5296j2816j23855j7612N0836L4538J8885Q417n901l23
2632B91148N728o5132r959L3770M1238j9810o2984k5693O5597N1227l5697k6454
2620B42979K7742Q3050m4549m9683L6714K3083J2169l6910L8935j3903p2285J00956
2608C48298J8646L650j5737m8266Q9155M6430p9942N377P9287q1415K9913O6170
2596D61566l4053m4506J9318J0822M5056m3076J2151J12366o0691l1130j04999
$$ y = [218972, 192761, 233169, 274570, 277392, 353274, 341763, 247666, 250704, 273622, 230187, 242405, 209625, 146251, 236879, 255695, 151148, 200843, 259480, 247511, 199864, 172066, 231760, 294271, 301080, 287447, 260021, 283643, 297706, 221499, 236609, 217551, 180586, 273160, 266385, 226794, 276283, 293683, 338979, 326163, 202308, 184696, 235532, 270070, 288955, 297372, 291471, 291148, 296876, 231744, 221785, 255555, 296793, 276983, 213999, 188306, 253903, 305130, 269433, 242979, 270721, 353771, 309222, 259539, 296253, 319336, 331505, 294595, 333530, 319627, 247342, 348298, 366944, 370594, 354857, 306591, 395746, 442176, 362234, 367611, 446898, 365483, 395396, 461566, 427513, 383007, 402325, 413147, 458203, 415127, 427278, 539644, 478953, 447823, 342824]
2585C42824l2528Q1987J842n2362m51l8782J18003K0671k907K6503M2519k9941
2573D77378j731N6733k4268K8678Q221P873n8844q394p4939n4948l5275J06406
2561D26890j3582n6178m9668N31L4376l438K9771L2412n7982L9782N0682l8075
2549C95521n2256r4904N86M5441M2772l9813O5044N0588J8029J0376K4821L0002
2537D96207o4540K2588J068j914n7508q358J5084o0756m8789K2578R616m3315
2525B81961l3956L8456k5664j323l573O1538K7539p9467p3868k3935k1123M3234
2513A89819l602J2401M836l6792K9986J4559j9234o415p687l685K1331j6665n8193
2500A20659P9468R388m4971K7822r1392l8558L2816m3130J1558j2779N8103J03523
$$ y = [342824, 310296, 392283, 394125, 341763, 341312, 302530, 420533, 441204, 438297, 464800, 507319, 477378, 475647, 532380, 508112, 536790, 545011, 552884, 494040, 485646, 410707, 355759, 320484, 426890, 413308, 357130, 307462, 307993, 342369, 338931, 368702, 401114, 343132, 382914, 433596, 395521, 343265, 248361, 248947, 294388, 337160, 297347, 362391, 412979, 431008, 441384, 466205, 496207, 431667, 454255, 455323, 453409, 395901, 387543, 402627, 341871, 293082, 315660, 325276, 281961, 248005, 286461, 260797, 259474, 255901, 317439, 344978, 265511, 191643, 167708, 146585, 189819, 186217, 198618, 203454, 166662, 196648, 211207, 191973, 185558, 177871, 174186, 195517, 178852, 120659, 200127, 209515, 164544, 192366, 100974, 62416, 95232, 52102, 63660, 50881, 108984, 212507]
2488B12507n5864k4375n6926M5018M966m0746q962n4172j126P9940J4269J4686
2476A29215l4803O423k0820p1359N419M1424l5792J1738Q4886K9639N821j8826
2464A32965m3607m7853m5829J3139j3111m3982K9105J3377K166P1876N295J4917
2452H8458j199j8357k319m807j0189O9801m9613n1374o8278M4716j1288k5569
2440d0018N5161k8103n015P7678n634m8171j3272K9792K8351k5643q4861K3554
2428c6181O244Q3850J842l6050j2702M0687j0986M3472m4257N9965k7598p5894
2416g608j2517Q094N5967r047o7664q9103l391K5662J12292j7436L3647n278J9650
2403D3268n4936k8703N9751O2665J4685k2234p431m4976j674m1799J7020R2090
$$ y = [212507, 156643, 132268, 75342, 120360, 125326, 84580, 75618, 21446, 20320, 100260, 114529, 129215, 94412, 100835, 80015, 8656, 14075, 55499, 19707, 31445, 116331, 145970, 151791, 132965, 89358, 41505, -4324, 8815, -4296, -48278, -19173, -5796, -3630, 68246, 73541, 88458, 87259, 68902, 66583, 61776, 51587, 121388, 71775, 20401, -47877, -3161, -14449, -40018, 15143, -12960, -17975, 59703, 54069, 5898, -7374, 22418, 50769, 25126, -59735, -36181, -29937, 53913, 55755, 19705, 7003, 47690, 36704, 80176, 35919, 95884, 68286, -7608, -20125, -12031, 43936, 34889, -32775, -121878, -125269, -99607, 12685, -4751, 28896, 23618, 43268, -11668, -40371, 19380, 82045, 96730, 74496, 67065, 22089, 20415, -21384, -4364, 87726]
2391H7726O7381p6179j7363m150n9977N5319k0885n9967K0018J09065r3338j1812
2379d162L5077Q0625N203n4567m4244r3215n2363J9148L5848O5325p4669P8612
2367c382N1716L0104q107p3675o886J17107R417N379m8992l3994J10287J21583
2355B70557N127l6135l4205N1940k4635k7520q0564l8823K3861k2046m3887O6372
2343A10042n1080k9229Q3603M3457l1294j14037n9703O5160J776M9315L5360n0167
2331E3203p2103N871K4219m7709M6238P962j0261Q929Q6627J1692j67327R2746
2319D0087o51q2442J9640O447j0896J0665Q1846k4817k6634j6135O0473n2165
2307E418K6636K2015J2641L670J5773k0219j7087k454K8320R027j5001J8962L9669
$$ y = [87726, 155107, 78928, 61565, 57415, -2562, 52757, 31872, -28095, -8077, 100988, 7650, -4162, 30915, 111540, 116743, 62176, 17932, -75283, -127646, -108498, -72650, -7325, -81994, -3382, 48334, 78438, 70331, -3344, -10230, 106877, 116294, 121673, 72681, 38687, 148974, 270557, 275684, 239549, 205344, 257284, 232649, 205129, 124565, 85742, 109603, 87557, 43670, 110042, 58962, 29733, 113336, 156793, 125499, 11462, -48241, 16919, 18695, 68010, 103370, 53203, -18900, -13029, 11190, -36519, 9719, 17681, 7420, 16349, 102976, 114668, -52659, 40087, 39436, -43006, -23366, -16919, -27815, -17150, 64696, 39879, 13245, -2890, 57583, 5418, 32054, 54069, 66710, 70380, 86153, 65934, 48847, 46393, 74713, 83740, 68739, 87701, 127370]
2294A27370O2248m205j28401k1483O0802j532j5849L9691o4066m7703J5787k330
2282B0329N6008K4812n893l9556j20034K8998P286m5691Q8342Q0294o6510m1334
2270a2949j6873M8866N9017j5096l390P929L2154K2819j2250O8517m190L183n3614
2257A24123J7188n2458J08490n8581O0050r8333o1564J4874K3605j7758R4389
2246A54025k2707K4697M4o4855K5942k8478n6938L7181L8643j7877O8067l3347
2234A24397m4987r119R6011k7382O7113j9980o3147o119j3325J8906N8566l0543
2222A50391n7496L9178j033L3422k5307m5513M7569p3618O591R6453K6504k1415
2210A75726q427l8843n2796m9890R5221O669k4266N7805O8266m317J849k6110
$$ y = [127370, 189618, 185413, 57012, 35529, 96331, 94799, 78950, 118641, 54575, 6872, 22659, 20329, 76337, 101149, 95256, 55700, -64334, -35336, -28050, -73741, 14601, 94895, 28385, -12949, -29822, 19044, 78061, 62965, 59575, 67504, 99658, 122477, 110227, 178744, 174554, 177737, 124123, 141311, 88853, 197343, 138762, 198812, 100479, 38915, 53789, 77394, 59636, 154025, 131318, 156015, 156059, 91204, 117146, 88668, 31730, 68911, 107554, 89677, 157744, 124397, 79410, 70291, 166302, 138920, 206033, 186053, 122906, 116787, 103462, 122368, 180934, 150391, 92895, 132073, 131040, 164462, 139155, 93642, 141211, 67593, 74184, 170637, 197141, 175726, 167299, 128456, 75660, 25770, 120991, 127660, 103394, 161199, 229465, 225148, 226997, 200887]
2198B00887P6291p9948j621j0829P8680n0918N1918k6963l6415m0619k3636O6835
2186B03662l1624L6651P3105K9001K2028J8610j7679P799K3441m805P259L1684
2174C99132K966o9527l2041k750m4229M7399J14640Q7897M8294k5640k108R782
2162E33815L444J9186p350J2833N2503L5716J7193O5658q633K1835P4308N5686
2150H76194j5862k5846L7725J8047L2889O2079P6128J1237J8827k1117Q0935P3141
2138A224377j9446n052J12804J2337j7411l4717O2537J13706p719M2873Q4299
2127A568588M1305J9523K06851K09408q755P5416J16036K9975M5650J47655R3165
2116B544817J59770J51363J18697J72828J99152R6668J55084K16912J42876L52270
$$ y = [200887, 277178, 197230, 195609, 184780, 263460, 212542, 264460, 237497, 201082, 160463, 136827, 203662, 172038, 208689, 281794, 310795, 332823, 351433, 333754, 341553, 364994, 360189, 367448, 399132, 402098, 332571, 300530, 297780, 253551, 300950, 415590, 503487, 551781, 526141, 524033, 533815, 537259, 556445, 549095, 561928, 614431, 650147, 667340, 732998, 724365, 746200, 820508, 876194, 860332, 834486, 872211, 890258, 923147, 985226, 1061354, 1072591, 1091418, 1070301, 1151236, 1224377, 1204931, 1199879, 1312683, 1325020, 1307609, 1272892, 1335429, 1449135, 1441416, 1484289, 1568588, 1609893, 1629416, 1836267, 2045675, 2036920, 2112336, 2228372, 2258347, 2303997, 2451652, 2544817, 2704587, 2855950, 2974647, 3147475, 3346627, 3443295, 3598379, 3815291, 3958167, 4310437]
2106D310437L16133L74130N19307N15372N92744N00544M15814N31369P05481Q17003
2096I598334J099345J341269J631484K065500K769076L537856N155894O844913
2088C4043671N666008K419008m866395p654621n938814m510953l437628k727512
2080A2992764j970520j402331j022481r37651p05480n01230l35803k25078k53266
2071E638924m20247m44681l71819m08246l00311k04344k35389k17803k33352j79116
2061B623616k20439r1502k5502j34481j18265l8122n8628J6254q9762q1969j42362
2050A638838m2962o7604K8780j44053j03183j5297M4268n6465m6688n4014m8302
2039A133318o7887m2378m4098N5983N106n9882o6542k1386p1050l4514n375j9711
$$ y = [4310437, 4626570, 5000700, 5520007, 6035379, 6628123, 7128667, 7544481, 8075850, 8781331, 9598334, 10697679, 12038948, 13670432, 15735932, 18505008, 22042864, 27198758, 34043671, 39709679, 42128687, 37262292, 29607671, 23668857, 19157904, 15720276, 12992764, 11022244, 9619913, 8597432, 7659781, 6954301, 6453071, 6117268, 5892190, 5638924, 5218677, 4773996, 4402177, 3993931, 3693620, 3489276, 3253887, 3036084, 2802732, 2623616, 2403177, 2311675, 2286173, 2151692, 2033427, 1995305, 1936677, 1952931, 1863169, 1781200, 1638838, 1595876, 1528272, 1557052, 1412999, 1309816, 1294519, 1338787, 1282322, 1235634, 1181620, 1133318, 1065431, 1023053, 978955, 1034938, 1040044, 980162, 913620, 892234, 821184, 786670, 781295, 761584]
2027G61584k7770J6614m9151k4932N616k7063J1250l8415k1027L1208K4308o5390
2015E96832p522M4606n3037j01088N9391L3899k8675p6627j01326m001P2169O648
2003D41269l8672l1400K957n6082M9540J02446m7384l277o5523j5152L2031p5152
1991B95601p030k4227L4279k7071o0374K8672Q2158j7096J657o6500K1205N8212
1979C19486J727o1316m7121m7340J1951J3962M7003O1170j07225j9233K2404J00008
1967B95476n0015J3336m4420l2588J6276K299L253m6383o301O569l6127K5153
1955A46528L3904N4724r118j27149L7787j1356l9164n0238P1945M1679l1399J7758
1943A35901R5684j05974l2615K2371j04338l2686M0553O2245O8543n6767l0166
$$ y = [761584, 733814, 750428, 701277, 676345, 681961, 654898, 666148, 627733, 606706, 637914, 662222, 596832, 589310, 633916, 580879, 479791, 539182, 573081, 544406, 467779, 366453, 362452, 434621, 441269, 402597, 371197, 374154, 318072, 367612, 470058, 422674, 419397, 353874, 338722, 370753, 295601, 288571, 264344, 298623, 271552, 211178, 239850, 322008, 304912, 306569, 240069, 261274, 319486, 321213, 259897, 212776, 165436, 177387, 191349, 238352, 299522, 192297, 173064, 195468, 295476, 245461, 258797, 214377, 181789, 198065, 200364, 203617, 157234, 150933, 157502, 121375, 146528, 180432, 235156, 226038, 98889, 136676, 125320, 86156, 35918, 107863, 149542, 118143, 135901, 231585, 125611, 92996, 115367, 11029, -21657, 18896, 81141, 149684, 92917, 62751]
1932F2751O7551r8945L6144l7505L8018M4210M1472J0136l4128Q9885j19074p4569
1920B5946K5853k3136k9837M3051N9926N5319j4879k7919O067k1995l0224m6385
1908B1787O0732J9459o7706Q1859R285q2457J5123O173m8355j0994R2641n4183
1896D3364M7287M799L2244n5113J4833L354j3616l0389J9645K6910k7853J5933
1884H1398L2247K3203m3605r7305l5681j1600j5525R3516P1821n7199k195L231
1872D2306P388L5504J4224L105m7554Q2740l1250k7517r442J5663k130N663n2270
1859C6430n8528O7396p793m2036K5022O5014L5540M761k3122p478k8832M4365
1847A10739j8018L7224K9742q2041L775j14570j1861N7424M3660K0302J25878
$$ y = [62751, 130302, 31357, 67501, 29996, 68014, 112224, 153696, 163832, 129704, 219589, 100515, 25946, 51799, 28663, -1174, 41877, 101803, 157122, 142243, 114324, 120391, 98396, 68172, 21787, 82519, 101978, 34272, 116131, 125416, 42959, 58082, 64255, 15900, 4906, 97547, 43364, 90651, 95450, 127694, 72581, 87414, 90768, 77152, 46763, 66408, 93318, 65465, 81398, 113645, 136848, 93243, -4062, -39743, -51343, -66868, 26648, 98469, 41270, 39075, 42306, 49694, 85198, 99422, 102527, 54973, 137713, 106463, 78946, 69504, 85167, 83037, 88700, 36430, -22098, 45298, 37505, -4531, 20491, 85505, 121045, 125806, 102684, 95206, 66374, 110739, 92721, 129945, 159687, 77646, 81421, -33149, -45010, 12414, 56074, 76376, 202254]
1836B02254j09923q608k7078l3493N1212j8116N5895J3743N325m3051j6198m658
1824F7304p438M1592M6537J04848K735J5943K5276n0410q9627j3517k3402j4936
1812A04905o48J511j9682O5486l5376M0029N999o9526l1893J415R4737m8351p3573
1799C5033L0146O1865l8530K0127l7399j00049N3783M1844j1672l0551P818J2010
1787D4425n0792K6311K8972n3733O0555l591k6355J8798j8206o526n3161R5131
1775F1828n6511k1092N0150K8937p4751Q07o450M172R197P1861O0667q3161l4394
1762A1260M0351k2130J0036l974J7206k9436L4871O2628m426j24591K7716j5458
1750D053m9426J0205l5954O7458M5330J5017r8397m1288M725J26384j8605n2761
$$ y = [202254, 92331, 83723, 56645, 23152, 74364, 56248, 112143, 125886, 131211, 88160, 71962, 67304, 59866, 101458, 147995, 252843, 255578, 271521, 296797, 246387, 156760, 143243, 119841, 104905, 104257, 105768, 86086, 151572, 116196, 156225, 162224, 92698, 60805, 62220, 156957, 108606, 35033, 65179, 127044, 88514, 108641, 71242, -28807, 24976, 66820, 55148, 24597, 32415, 44425, -6367, 19944, 48916, -4817, 55738, 52147, 25792, 44590, 26384, 19858, -33303, 61828, 5317, -15775, 34375, 63312, -11439, -10632, -17082, -12910, -3713, 68148, 128815, 45654, 11260, 51611, 29481, 39517, 35543, 52749, 23313, 58184, 120812, 116386, -8205, 19511, 4053, -45373, -35168, -71122, -3664, 41666, 56683, -41714, -83002, -78277, 48107, 29502, -23259]
1738b3259l5618n036L5759O3328l5152n9375J9928J09240j3390n7807Q6754q0613
1726D759L1011p6267k3383O465M230R6874M6262j9726m5118M9876M7938j3777
1714A09144j396m7623J4939j36077l4944N6885m340L8443P0647k5372n2007Q7855
1702G6154m0200o1679P2423m0003l7290k2607J19788N7143o1329l4239k5101o907
1690c847o1357l768j2197J21024J1332o2459K9593L6274j08273N044n932N9189
1678D623p844k2530L8345k0643O7108q080j3411J0589m9982j235q2242l0323M3523
1665g2102J06190n5652K0461m1118j9062N5404N5893n043j4857q4134L9273N9850
1653D5103n1637l8401Q249M0361o3855J6432K0702O5182q3493l1504q451Q1889
$$ y = [-23259, -58877, -63913, -28154, 35174, 22, -59353, -39425, 69815, 56425, -1382, 85372, 4759, 35770, -40497, -63880, -57415, -53185, 43689, 89951, 70225, 25107, 74983, 122921, 109144, 107748, 60125, 75064, -61013, -95957, -39072, -43412, -4969, 65678, 40306, -11701, 76154, 35954, -25725, 46698, 6695, -30595, -53202, 66586, 123729, 62400, 28161, 3060, -3847, -65204, -68972, -81169, 39855, 51187, -11272, 18321, 54595, -53678, -48634, -54566, 4623, -3221, -25751, 12594, -8049, 59059, 50979, 37568, 48157, -1825, -3060, -85302, -115625, -72102, 34088, -21564, -1103, -42221, -61283, -5879, 50014, 44971, 30114, -54020, -14747, 45103, -6534, -44935, -36686, 3675, -60180, -43748, -23046, 42136, -41357, -72861, -81312, 577]
1641E77Q5273o7689p148j2528o87j7224k8107N7400Q472j0765L4390m1227k4043
1628b3306L1567j566p730m3428M9802p6819L0658R890M0590k9499j1225m2612
1616g3678J6752j2709l722K3602P1528P8669j6252r48m9175O6494k4644n9824
1604A6093k5693M93Q0218J7160n2845n0064k4858N173J05212L6867Q545p6614
1592C9687p1464L8071P2497P701j29430J12283m3925n8688n3360Q0323K2877O6246
1580H2818n9272m5436Q637Q275J4420o117j6287J5291n5563j7667R125P4108J9852
1567C2184K022L0605l5991k0390J9346N3470K9658n9707r9845L6783K5162L1119
1555D4416m1317k2160q7815j9733R1933j1513o9236Q7459O9674O0345o0538p4573
$$ y = [577, 85850, 18161, 11013, -1515, -2202, -19426, -47533, 9867, 18339, 7574, 41964, 737, -23306, 8261, 6695, -1035, -44463, 5339, -71480, -40822, -30932, 9658, -19841, -31066, -73678, -56926, -69635, -73357, -49755, 21773, 100442, 84190, 83242, 34067, 100561, 75917, 16093, -9600, -9107, 71111, 88271, 35426, -14638, -39496, -34323, 70889, 107756, 116301, 39687, -31777, 6294, 78791, 86492, -42938, 69345, 25420, -33268, -86628, -6305, 16572, 82818, 23546, -21890, -13253, -4978, 9442, 3325, -12962, 2329, -53234, -70901, -61776, 12332, 32184, 34206, 64811, 28820, 8430, 27776, 81246, 110904, 51197, -48648, -11865, 13297, 44416, 3099, -19061, -106876, -126609, -34676, -46189, -115425, -27966, 41708, 102053, 41515, -33058]
1543c3058K4909P0577l1120k5978n2152l5760K8267l877J4278K2988k8030j4K2140
1530b6830J2063k1875k2431L9974L7677K4591Q512O444k9457k4563n9112m7384
1518a02391M9695m9193L7762J0155m678R186J8106L3599Q33J2273L1419o462O546
1505D6850j3673q1939N3246N9802o2544j4914K180l6802o1834J2611j959M7824
1493e1152k0061O695m998L8929R668J3415L8725o5161M4339j5523m7908j0406
1481f3438m7033O4979R5235n8805m851P971K982M1454j7457o7371K4327L7012
1469A5005O87L613m066m9648P1104K3735q038l5576k3928J18409K9916k3150l7324
1456H0739m9876o5329m5647O4980J9768k6383n0214J936N8927J8078j12237j0692
$$ y = [-33058, -8149, 62428, 31308, 5330, -46822, -82582, -54315, -58192, -43914, -20926, -48956, -48970, -26830, -14767, -36642, -59073, -19099, 18578, 43169, 51681, 58125, 28668, 4105, -55007, -102391, -52696, -101889, -64127, -53972, -58650, -49464, -31358, 2241, 3074, 15347, 46766, 40304, 46850, 33177, -48762, 4484, 64286, 1742, -13172, -10992, -47794, -109628, -97017, -98976, -51152, -71213, -64518, -69516, -30587, -20919, -7504, 31221, -33940, 10399, -5124, -53032, -63438, -110471, -45492, 49743, -9062, -13913, -5942, -2960, 38494, 21037, -46334, -22007, 15005, 15692, 19305, 15239, -34409, 36695, 60430, 52392, 16816, -7112, 111297, 141213, 118063, 80739, 30863, -34466, -80113, -15133, 4635, -21748, -71962, -70026, -11099, 6979, -105258, -115950]
1444a15950M4736J2570k6750J5868r078M7504J9076N9018l6753q5221L3329Q5311
1432D3660M0000L0808l6339j01415k1801L4003l3052r437P5334L6575j6431M5573
1420H7478k2509k3990p6814j4750K8382r228p2563N2093O7757m4175K0879M3181
1408C5741K2828l7165m9676j0476P2423J1222l6973m924o8344K2428M8813n5093
1396d9196J11658j1513l9530Q747j711j19140O5213J9982L5062M6641L5914j25258
1384b3131K8445L3890L6547K1877p2400q1642L4347j9084K4227l8666K4979N4170
1372B3559m1621M7550K8423J4468k8911o0981o818j1252r8363J7217L0584R405
1360g6740M152L8394r875K0105O33Q0472N112M49j22164m2807J3202K3917R7317
$$ y = [-115950, -71214, -58644, -85394, -69526, -78604, -31100, -12024, 46994, 10241, -74980, -41651, 43660, 83660, 114468, 78129, -23286, -45087, -11084, -44136, -53573, 21761, 58336, 41905, 87478, 64969, 40979, -35835, -50585, -22203, -31431, -103994, -51901, 15856, -28319, -7440, 35741, 58569, 21404, -28272, -38748, 33675, 44897, 7924, 3000, -65344, -42916, 5897, -49196, 62462, 50949, 11419, 20166, 18455, -100685, -35472, -15490, 19572, 66213, 102127, -23131, 5314, 39204, 75751, 97628, 25228, -56414, -22067, -41151, -16924, -55590, -30611, 23559, -18062, 29488, 57911, 72379, 43468, -17513, -24331, -35583, -133946, -116729, -86145, -76740, -72588, -34194, -44069, -23964, -23331, 57141, 62253, 62702, -59462, -102269, -89067, -65150, 32167]
1347C2167J9166r0584p30Q8735n8211j704M0651o4313j532M1142m6532k2259J9787
1334d4217M4068r6015K244L1623K6770n596N4654q477n9831Q0778o6977J8123
1322b2853M8692N0547k8996N5845n8924m6707L2910q876l9613k7546P8487q3295
1310e0329l1733J04851l2025o6441M8740P236l870j205l6703M7034k1675k1696
1298e7816Q3362N5456n0773m4490K481K8377j05884O5352K3939L351J24693m8159
1286G9889J4174o5974j05767L8983K1446M989l6055N0514L710k1114L57P324n3661
1273f1185Q7086k2202m2018L2050J8501K4897j2648o5008k4811l2240J4940J02418
1261A9780p1548R2726L3818n344k4172L4385n7513J2250O745j934K2689O4571
$$ y = [32167, 51333, -39251, -39981, 48754, -9457, -11161, 29490, -34823, -36355, 4787, -41745, -64004, -44217, -149, -96164, -93920, -62297, -35527, -41123, 13531, 5054, -54777, 26001, -40976, -22853, 25839, 76386, 47390, 103235, 44311, -2396, 30514, 21638, -17975, -45521, 32966, -50329, -82062, 22789, -9236, -75677, -26937, -19701, -23571, -24776, -61479, -14445, -36120, -57816, 25546, 81002, 30229, -14261, -11780, 16597, -89287, -23935, 4, 3355, 128048, 79889, 94063, 28089, -77678, -38695, -17249, -12260, -48315, 2199, 5909, -15205, -14848, -7524, -61185, 25901, 3699, -38319, -6269, 12232, 37129, 24481, -40527, -65338, -97578, -82638, 19780, -51768, 40958, 74776, 69432, 45260, 79645, 22132, 34382, 41127, 39193, 61882, 126453]
1249A26453l0738j05779m8388q006L4563K5825N1347K548l4537K3551L4961k3725
1237D8075j5142r7265r890J1258j1495J2656L8221J6208L8985P658q0092L7291
1225c532M576O2220j48432p0340Q3915Q9792J7277o4814N894M0321J9762j3246
1213B3393n9952o0905M3804N6906k9009N1425R276O030j7258j26711P5267j4847
1201d2581J8862Q4031j02156L4886j7982J0157m201J7629J2095o0768K1351M2543
1189A3866p6466K229J5046j5747P3053n204L1219j8913m5351k5077L7440Q0644
1177F6739k7829k6136R7760q3196r5071K2577l4363J4389O490K5956m692n3571
1165i0947M2348P1616q1644m9157P8730J8863L5415p1153m3429Q4246M4928Q0
$$ y = [126453, 95715, -10064, -58452, -66458, -31895, -6070, 45277, 47825, 13288, 36839, 71800, 48075, 32933, -64332, -74222, -62964, -74459, -61803, -23582, -7374, 31611, 39269, -40823, -3532, 1044, 63264, -85168, -155508, -71593, 18199, 35476, -29338, -23444, 16877, 36639, 23393, -36559, -97464, -53660, 3246, -25763, 25662, 34938, 40968, 23710, -103001, -27734, -42581, -23719, 60312, -41844, -6958, -24940, -14783, -18984, -1355, 10740, -50028, -28677, 13866, -62600, -60371, -45325, -61072, 11981, 6777, 37996, 19083, -26268, -51345, -13905, 66739, 38910, 12774, 110534, 27338, -67733, -45156, -79519, -65130, -58640, -32684, -37376, -90947, -48599, 23017, -58627, -107784, -29054, -10191, 25224, -45929, -89358, -5112, 39816, 39896]
1153C9896L822p584p4495l5432J0168n9153M2819j3934l674M6689M6293k7096
1141c1681N007P2824n2945o0878O1200l9653l3706M8039K3030j0158Q2046k2144
1129D0981K051k3726k1069p0961N2096K0926j8911l2688K7380Q3522k5659m6385
1117a2443J7354O2617l7930r9868l8083P3317N9392l9717k4070l3278j7041J6934
1105g2816n4247J77724L8632n7490q1424o9356L9029J37944K752j37803K1987
1094e5068K0524m863L6564l0953J0184n9483K9791J00737j3361k0209j2584m4807
1082d3528l81M3872m8334J256J6723j7997K8650m4114N2393J9845n3815K5586
1070a9844m1120K8794j3806k4558M5497j8098j1309L9196L2849n7007K1294M1611
$$ y = [39896, 43718, 36134, -38361, -73793, -63625, -122778, -79959, -93893, -97567, -50878, -4585, -31681, -26674, 46150, -6795, -67673, -6473, -46126, -79832, -31793, -8763, -18921, 63125, 40981, 43032, 19306, -1763, -72724, -20628, 298, -18613, -51301, -23921, 59601, 33942, -12443, 4911, 67528, 29598, -70270, -108353, -35036, 24356, -15361, -39431, -72709, -89750, -72816, -127063, 50661, 89293, 31803, -49621, -118977, -79948, 57996, 60748, -77055, -55068, -34544, -39407, -2843, -33796, -23612, -83095, -53304, 47433, 34072, 13863, 1279, -43528, -43909, -37, -48371, -47115, -30392, -48389, -19739, -63853, -11460, 8385, -45430, -19844, -60964, -32170, -45976, -70534, -25037, -43135, -54444, -15248, 17601, -39406, -18112, 23499]
1058B3499j02723L1251P2418k6538j0610O802m8916Q9001M0089n1373j4101m9257
1046d0458K700j9132N1004m4586J6913O8008n7749r2544P035P0368n95M9836K3780
1033C4580J1501j9881k4133j8531L9811J13295m3188J1168n8604l8657J6504J9766
1021D3631j1839m0761k4833n957L7158K9593J6664k4973L9096M158j77431O3196
1009e2298K1913k3101j0857O395J16773n6806O470n501N5632k6818n5367L7601
997A4036J9519J3370r2393N6725J4533l8334P070N1431j3317m4943L7808N997
985C1502l5972k1718L0441M5255o8106p9935L6166L6657J0591K9362K7700O630
973D8573o7604n3080N4114n6652o2648j6515J0839M6225k3491r457O9179R0468
$$ y = [23499, -79224, -47973, 24445, -2093, -12703, -5901, -54817, 34184, 74273, 22900, 8799, -40458, -37758, -56890, -5886, -50472, -33559, 34449, -23300, -115844, -108809, -38441, -39036, 10800, 34580, 46081, 26200, 2067, -16464, 23347, 136642, 93454, 104622, 46018, 7361, 23865, 43631, 31792, -8969, -33802, -39759, -2601, 26992, 43656, 18683, 57779, 61937, -115494, -52298, -30385, -53486, -64343, -57948, 58825, 2019, 8489, 2988, 58620, 31802, -23565, 14036, 33555, 46925, -45468, 11257, 25790, -12544, -5474, 45957, 32640, -12303, 25505, 31502, -4470, -26188, 4253, 49508, -18598, -98533, -62367, -25710, -15119, 14243, 41943, 48573, -19031, -72111, -17997, -74649, -137297, -153812, -142973, -96748, -120239, -129696, -60517, 29951]
961B9951l8911O120o021l7037N0268n895J943j3283N153K4592q3248r7346Q6732
948g6982P5967o1800K485L2867M4990R9087n2314P0175p8363l2309j7772k2905
936a6874K326n9628J8231O9752M5983k8022o5937n5740M8879l543K2262K9815
924G504r381m326J5378j6028M7289j9990j14484J5346J3669Q5585K3151j18401
912g4688k8100J04836L387l7984j4155M591N5089m3713N708l133K9798J5881J5550
899C3067M9362n3053k1564q6221l3298L8890O4678j6404m3658K7884M4887j5102
887a0532J6242K2120K764n878m2674n4544O8820J0428l0887M8364j6859Q668J0616
874B6648n0526n6216J1170O7472R0889k4682J7843p2305L634J2535k6008J5275
$$ y = [29951, -8960, -2840, -8861, -45898, 4370, -1525, 418, -12865, -7712, 16880, -66368, -163714, -76982, -1015, -62815, -60330, -27463, 17527, 116614, 64300, 134475, 56112, 23803, 6031, -16874, -14548, -74176, -55945, 13807, 59790, 31768, -34169, -89909, -41030, -44573, -22311, 7504, -1877, -6203, 9175, -6853, 40436, 20446, -94038, -78692, -65023, 20562, 43713, -74688, -102788, 2048, 5435, -32549, -46704, -42113, 12976, -30737, -25029, -28162, 1636, 17517, 33067, 82429, 29376, 7812, -78409, -111707, -72817, -8139, -24543, -68201, -40317, 4570, -10532, 5710, 27830, 30594, 24716, -17958, -72502, -3682, 6746, -24141, 24223, 7364, 16032, 26648, -23878, -80094, -68924, -1452, 89437, 64755, 82598, 10293, 13927, 26462, 454, 15729]
862A5729j8178M0863j6085l723o3217m610m2906Q0688j6793m1659Q1112j7943
850f722o5685J6458J7743p7538k1860O6702k4332L2078r296O4669N8486k4693
838B6010m6232m4703M5524K0247k6537j0801N9515n6429p4996M7572O7592Q190
826A4952l8487n866j4868K2526M3255o1208l0099O3733J20381n9776m9690q5748
814h0895O2496n3674L5918k0584N0097p944P3505L306o8058R691k8804O9687n411
801C9330R515O968j5041K7773o4635j7383K1522J8079q0817L0128j8434M4514
789A519k2708p3037K7868M0771R518j1081K6857K6789Q8777r9555k2068K350k8494
776c2494K0310j99Q9745m0026m0338k8004n8775N7321L9350J7193k7398o4840
$$ y = [15729, -2449, 38414, 22329, 18606, -44611, -49221, -92127, -11439, -28232, -69891, 11221, -6722, -72407, -55949, -38206, -115744, -137604, -70902, -95234, -63156, -72452, -7783, 50703, 26010, -20222, -64925, -19401, 846, -25691, -36492, 23023, -33406, -108402, -60830, 6762, 14952, -23535, -29401, -44269, -21743, 21512, -39696, -69795, -6062, 114319, 54543, 4853, -80895, -18399, -72073, -36155, -56739, -6642, -14586, 58919, 62225, -5833, 3858, -24946, 44741, 39330, 48845, 55813, 40772, 68545, 3910, -13473, 8049, 26128, -54689, -24561, -42995, 1519, -21189, -94226, -66358, -25587, -16069, -27150, -293, 26496, 115273, 15718, -6350, -4000, -32494, -12184, -12383, 77362, 37336, -3002, -31006, -89781, -32460, 6890, 24083, -3315, -68155]
764f8155k1912N3329J9683k2993J9337l8865M0451K5210K8225m9341L3495O8455
752H6919j05583J04276m8708q1250j0360L3907j8290j1664J7369K3944j6833P401
740a8872Q673L5667p6727m6836j162O5406J7677P8396L0380m8600m5861L1743
728B9884k4210n031l71J9532j8108k4376L2338L9439m9122n6958Q8588l6034R194
$$ y = [-68155, -90067, -36738, -17055, -40048, -20711, -59576, -19125, 6085, 34310, -15031, 18464, 86919, -18664, 85612, 36904, -44346, -54706, -20799, -39089, -50753, -33384, -9440, -26273, -18872, -10199, 25468, -51259, -98095, -99257, -33851, -16174, 62222, 92602, 44002, -1859, 29884, 5674, 643, 272, 19804, 1696, -22680, 9658, 49097, -25, -56983, 31605, -4429, 4765]
$$ [...]
##END NTUPLES=NMR SPECTRUM
##END=
