##TITLE=1H_EC-3286(II-4)
 CDCl3
 40 sc, 
 17.11.2022
##JCAMPDX= 6.0         $$ Bruker NMR JCAMP-DX V2.0
##DATA TYPE= NMR SPECTRUM
##DATA CLASS= NTUPLES
##ORIGIN= UXNMR, Bruker Analytische Messtechnik GmbH
##OWNER= root
$$ XWIN-NMR		Version 3.5
$$ Thu Nov 17 15:48:13 2022 Russian Standard Time (UT+4h)  she@DPX200
##.OBSERVE FREQUENCY= 200.1313499994
##.OBSERVE NUCLEUS= ^1H
##.ACQUISITION MODE= SIMULTANEOUS
##.ACQUISITION SCHEME= undefined
##.AVERAGES= 40
##.DIGITISER RES= 18
##SPECTROMETER/DATA SYSTEM= spect
##.PULSE SEQUENCE= zg30
##.SOLVENT NAME= CDCl3
##.SHIFT REFERENCE= (INTERNAL, CDCl3, 0, 15.7315)
##AUDIT TRAIL= $$ (NUMBER, WHEN, WHO, WHERE, WHAT)
$$ ##TITLE= Audit trail, XWIN-NMR		Version 3.5
$$ ##JCAMPDX= 5.01
$$ ##ORIGIN= Bruker BioSpin GmbH
$$ ##OWNER= she
$$ F:/spectra/data/she/nmr/H-F/1/pdata/1/auditp.txt
$$ ##AUDIT TRAIL=  $$ (NUMBER, WHEN, WHO, WHERE, WHAT)
(   1,<2022-11-17 15:46:47.12 +0400>,<she>,<DPX200>,
      <continue with go, POWCHK disabled, PULCHK disabled
       configuration hash MD5:
       00 E9 B6 7A A2 85 ED C7 34 08 36 98 17 FE 4E 26
       data hash MD5: 16K
       22 41 D0 18 B7 A9 43 35 8C 62 45 CC 26 1E 9C 6B>)
(   2,<2022-11-17 15:46:50.51 +0400>,<she>,<DPX200>,
      <Start of raw data processing
       efp BC_mod = 2 LB = 0.24 FT_mod = 6 PKNL = 1 PHC0 = -18048.97 PHC1 = 34.8007 SI = 16K 
       data hash MD5: 16K
       4E EE AF 11 24 B0 EF DF DD 33 2D B5 27 0C 56 13>)
(   3,<2022-11-17 15:46:53.59 +0400>,<she>,<DPX200>,
      <abs ABSG = 5 
       data hash MD5: 16K
       76 B5 88 99 DE CF B6 01 97 2D 12 19 A7 A4 BC 12>)
(   4,<2022-11-17 15:47:14.62 +0400>,<she>,<DPX200>,
      <pk PHC0 = 1.41698 PHC1 = -2.4 
       data hash MD5: 16K
       68 AE 35 36 63 0C AD 87 E9 64 77 8D 0E B7 E1 02>)
(   5,<2022-11-17 15:47:17.31 +0400>,<she>,<DPX200>,
      <abs ABSG = 5 
       data hash MD5: 16K
       E9 54 E8 1E 5B AF D0 E7 1F 96 B1 4E F1 A1 DE 1E>)
$$ ##END=
$$ 
$$ hash MD5
$$ C4 DD 2F B4 4B 8E 07 16 4C D2 C9 4D 3A F1 FC 0B
##$RELAX= 
##$RELAX= 
##$RELAX= 
##$RELAX= 
##$RELAX= 
##$RELAX= 
$$ Bruker specific parameters
$$ --------------------------
##$DU= <F:/spectra>
##$EXPNO= 1
##$NAME= <H-F>
##$PROCNO= 1
##$TYPE= <nmr>
##$USER= <she>
##$AMP= (0..31)
100 100 100 100 100 100 100 100 100 100 100 100 100 100 100 100 100 100 
100 100 100 100 100 100 100 100 100 100 100 100 100 100 
##$AQSEQ= 0
##$AQ_mod= 1
##$AUNM= <au_zg>
##$AUTOPOS= <>
##$BF1= 200.13
##$BF2= 200.13
##$BF3= 200.13
##$BF4= 200.13
##$BF5= 200.13
##$BF6= 200.13
##$BF7= 200.13
##$BF8= 200.13
##$BYTORDA= 1
##$CFDGTYP= 0
##$CFRGTYP= 5
##$CHEMSTR= <none>
##$CNST= (0..31)
1 1 145 1 1 1 1 1 1 1 1 1 1 1 1 1 1 1 1 1 1 1 1 1 1 1 1 1 1 1 1 1 
##$CPDPRG= <>
##$CPDPRG1= <>
##$CPDPRG2= <>
##$CPDPRG3= <>
##$CPDPRG4= <mlev>
##$CPDPRG5= <mlev>
##$CPDPRG6= <mlev>
##$CPDPRG7= <mlev>
##$CPDPRG8= <mlev>
##$CPDPRGB= <>
##$CPDPRGT= <>
##$D= (0..31)
0 1.2 0 0 0 0 0 0 0 0.06 0 0.03 0 0 0 0 0.0002 0 0 0 0 0 0 0 0 0 0 0 0 
0 0 0 
##$DATE= 1668685460
##$DBL= (0..7)
$$ [...]
##$SUBNAM3= <"">
##$SUBNAM4= <"">
##$SUBNAM5= <"">
##$SUBNAM6= <"">
##$SUBNAM7= <"">
##$SUBNAM8= <"">
##$SUBNAM9= <"">
##$SW= 18.0517283424941
##$SWIBOX= (0..15)
0 0 2 0 0 0 0 0 0 0 0 0 0 0 0 0 
##$SW_h= 3612.71676300578
##$TD= 16384
##$TD0= 1
##$TE= 0
##$TE2= 300
##$TE3= 300
##$TEG= 300
##$TL= (0..7)
0 120 120 120 120 120 120 120 
##$TP= (0..7)
150 150 150 150 150 150 150 150 
##$TP07= 0
##$TPNAME0= <>
##$TPNAME1= <>
##$TPNAME2= <>
##$TPNAME3= <>
##$TPNAME4= <>
##$TPNAME5= <>
##$TPNAME6= <>
##$TPNAME7= <>
##$TPOAL= (0..7)
0.5 0.5 0.5 0.5 0.5 0.5 0.5 0.5 
##$TPOFFS= (0..7)
0 0 0 0 0 0 0 0 
##$TUNHIN= 0
##$TUNHOUT= 0
##$TUNXOUT= 0
##$USERA1= <user>
##$USERA2= <user>
##$USERA3= <user>
##$USERA4= <user>
##$USERA5= <user>
##$V9= 5
##$VALIST= <valist>
##$VCLIST= <CCCCCCCCCCCCCCC>
##$VD= 0
##$VDLIST= <DDDDDDDDDDDDDDD>
##$VPLIST= <PPPPPPPPPPPPPPP>
##$VTLIST= <TTTTTTTTTTTTTTT>
##$WBST= 1024
##$WBSW= 4
##$XGAIN= (0..3)
0 0 0 0 
##$XL= 0
##$YL= 0
##$YMAX_a= 161971
##$YMIN_a= -209977
##$ZGOPTNS= <>
##$ZL1= 120
##$ZL2= 120
##$ZL3= 120
##$ZL4= 120
##$ABSF1= 15.67748
##$ABSF2= -2.37437
##$ABSG= 5
##$ABSL= 3
##$ALPHA= 0
##$AQORDER= 0
##$ASSFAC= 0
##$ASSFACI= 0
##$ASSFACX= 0
##$ASSWID= 0
##$AUNMP= <proc_1d>
##$AZFE= 0.1
##$AZFW= 0.1
##$BCFW= 0
##$BC_mod= 2
##$BYTORDP= 0
##$COROFFS= 0
##$CY= -3
##$DATMOD= 1
##$DC= 0
##$DFILT= <>
##$DTYPP= 0
##$F1P= 0
##$F2P= 0
##$FCOR= 1
##$FTSIZE= 16384
##$FT_mod= 6
##$GAMMA= 0
##$GB= 0
##$INTBC= 1
##$INTSCL= 3.70164e-10
##$ISEN= 128
##$LB= 0.24
##$LEV0= 0
##$LPBIN= 0
##$MAXI= 10000
##$MC2= 0
##$MEAN= 0
##$ME_mod= 0
##$MI= 1.114404
##$NCOEF= 0
##$NC_proc= -6
##$NLEV= 6
##$NOISF1= 3.799351
##$NOISF2= 2.8
##$NSP= 0
##$NTH_PI= 0
##$NZP= 0
##$OFFSET= 15.73146
##$PC= 1
##$PHC0= -18047.55
##$PHC1= 32.4007
##$PH_mod= 1
##$PKNL= yes
##$PPARMOD= 0
##$PSCAL= 0
##$PSIGN= 0
##$REVERSE= no
##$SF= 200.130008020502
##$SI= 16384
##$SIGF1= 3
##$SIGF2= 2
##$SINO= 5.538805
##$SIOLD= 16384
##$SREGLST= <1H.CDCl3>
##$SSB= 0
##$STSI= 16384
##$STSR= 0
##$SW_p= 3612.71676300578
##$SYMM= 0
##$S_DEV= 0
##$TDeff= 16384
##$TDoff= 0
##$TI= <>
##$TILT= no
##$TM1= 0
##$TM2= 0
##$TOPLEV= 0
##$USERP1= <user>
##$USERP2= <user>
##$USERP3= <user>
##$USERP4= <user>
##$USERP5= <user>
##$WDW= 1
##$XDIM= 16384
##$YMAX_p= 506883593
##$YMIN_p= -1013462
$$ End of Bruker specific parameters
$$ ---------------------------------
##NTUPLES= NMR SPECTRUM
##VAR_NAME=  FREQUENCY,     SPECTRUM/REAL,   SPECTRUM/IMAG
##SYMBOL=    X,             R,               I
##VAR_TYPE=  INDEPENDENT,   DEPENDENT,       DEPENDENT
##VAR_FORM=  AFFN,          ASDF,            ASDF
##VAR_DIM=   16384,         16384,           16384
##UNITS=     HZ,            ARBITRARY UNITS, ARBITRARY UNITS
##FACTOR=    0.220516191357247, 1,           1
##FIRST=     3148.33713944744, 0,            0
##LAST=      -464.379623558338, 0,           0
##MIN=       -464.379623558338, -1013462,    0
##MAX=       3148.33713944744, 506883593,    0
$$ Real data points
##PAGE= N=1
##DATA TABLE= (X++(R..R)), XYDATA
$$ [...]
$$ plain form
5085 1170829 990283 1023389 930108 687529 848345 771287 326261 446294 533317 649920
5075 649920 593214 475059 584071 393264 545713 657987 704744 653259 436636 506249
5065 506249 308989 386388 542976 582796 564960 301423 400004 158077 252601 438387 592380
5054 592380 648393 551249 478520 687604 555712 370190 245820 508592 696574 612798
5044 612798 602097 506057 137965 482720 610381 624616 475401 -263877 -149199 241118
5034 241118 195393 93597 211166 155227 276396 346217 254712 174618 210265 412509 392696
5023 392696 467189 502891 464349 326021 488160 248390 376524 386132 146439 -93187 -229146
5012 -229146 -148689 177076 375933 239251 242195 627331 599519 392327 71922 -7896 154025
$$ packed form
5085A170829j80546L3106r3281k42579J60816p7058m45026J20033Q7023J16603
5075F49920n6706j18155J09012j90807J52449J12274M6757n1485k16623O9613
5065E06249j97260P7399J56588L9820j7836k63537R8581k41927R4524J85786J53993
5054E92380N6013r7144p2729K09084j31892j85522j24370K62772J87982q3776
5044F12798j0701r6040l68092L44755J27661J4235j49215p39278J14678L90317
5034B41118m5725j01796J17569n5939J21169O9821r1505q0094L5647K02244j9813
5023C92696P4493L5702l8542j38328J62139k39770J28134R608k39693k39626j35959
5012b29146Q0457L25765J98857j36682K944L85136k7812k07192l20405p9818J61921
$$ plain form
5001 154025 206083 404907 377786 438151 385191 409907 448691 285317 494803 235180 498615
4990 498615 708467 583384 506210 542984 735657 1043719 990609 756576 412256 310158
4980 310158 364777 209849 584492 817279 787363 289841 499746 623264 492779 382406
4970 382406 518664 744779 997777 788479 813747 783194 436494 550373 777175 519583
4960 519583 523002 591028 512257 288242 43816 299787 509009 612910 598935 662674 898763
4949 898763 762326 634419 502486 556520 507273 572162 568873 458007 531432 329053 516741
4938 516741 647101 583693 644699 400595 696207 525753 -15423 284976 511152 724451
4928 724451 652843 197573 156413 394034 727514 681223 596915 588015 734803 286863 40737
$$ packed form
5001A54025N2058J98824k7121O0365n2960K4716L8784j63374K09486k59623K63435
4990D98615K09852j25083p7174L6774J92673L08062n3110k34033l44320j02098
4980C10158N4619j54928L74643K32787k9916m97522K09905J23518j30485j10373
4970C82406J36258K26115K52998k09298K5268l0553l46700J13879K26802k57592
4960E19583L419O8026p8771k24015k44426K55971K09222J03901j3975O3739K36089
4949H98763j36437j27907j31933N4034m9247O4889l289j10866P3425k02379J87688
4938E16741J30360o3408O1006k44104K95612j70454n41176L00399K26176K13299
4928G24451p1608m55270m1160K37621L33480m6291q4308q900J46788m47940k46126
$$ plain form
4917 40737 83056 435378 796210 696447 409538 395192 143169 65675 177355 444252 65206
4906 65206 119037 677105 641232 344946 525666 553283 590645 256314 65898 139499 733
4895 733 508810 793128 915607 568491 717784 578732 614155 756945 533541 308413
4885 308413 588145 335862 367872 646782 990060 918526 656047 322492 322870 -140080 224685
4874 224685 485524 706171 1056623 884344 752162 411862 443241 532774 784757 1066656
4864 1066656 981584 795145 675878 803592 713196 636417 675035 183437 19812 -16953
4854 -16953 -29258 -19784 387019 461881 435885 453965 334955 551856 594339 464072 349614
4843 349614 466125 318473 597624 646663 149861 374294 720951 365402 358285 470944
$$ packed form
4917D0737M2319L52322L60832r9763k86909j4346k52023p7494J11680K66897l79046
4906F5206N3831N58068l5873k96286J80720K7617L7362l34331j90416P3601j38766
4895G33N08077K84318J22479l47116J49293j39052L5423J42790k23404k25128
4885C08413K79732k52283L2010K78910L43278p1534k62479l33555L78m62950L64765
4874B24685K60839K20647L50452j72279j32182l40300L1379Q9533K51983K81899
4864A066656q5072j86439j19267J27714r0396p6779L8618m91598j63625l6765
4854a6953j2305R474M06803P4862k5996J8080j19010K16901M2483j30267j14458
4843C49614J16511j47652K79151M9039m96802K24433L46657l55549p117J12659
$$ plain form
4833 470944 421110 338457 474395 431819 564101 702934 652225 419374 439692 459558 756944
4822 756944 1029524 728356 790669 699911 627947 609318 674847 480273 153419 -17877 280359
4811 280359 287892 539498 579908 497546 589095 552538 468711 568357 446274 694020 582773
4800 582773 513790 586932 531770 757470 841344 692591 689275 800284 726050 686966 396838
4789 396838 377969 787614 279686 440303 444726 435868 683522 551526 349547 383868 232292
4778 232292 123606 446932 471551 411918 765084 872445 925878 660993 492529 820349
4768 820349 859628 705177 614276 721544 591384 472610 752351 726967 567136 540409
4758 540409 422480 805848 750111 807401 1096217 1042005 876539 920765 1126755 998282
$$ packed form
4833D70944m9834q2653J35938m2576J32282J38833n0709k32851K0318J9866K97386
4822G56944K72580l01168O2313r0758p1964j8629O5529j94574l26854j71296K98236
4811B80359P533K51606M0410q2362R1549l6557q3827R9646j22083K47746j11247
4800E82773o8983P3142n5162K25700Q3874j48753l316J11009p4234l9084k90128
4789C96838j8869M09645n07928J60617M423q858K47654j31996k01979L4321j51576
4778B32292j08686L23326K4619n9633L53166J07361N3433k64885j68464L27820
4768H20349L9279j54451r0901J07268j30160j18774K79741k5384j59831k6727
4758E40409j17929L83368n5737N7290K88816n4212j65466M4226K05990j28473
$$ plain form
4748 998282 473803 734233 626888 590352 847601 839237 1157707 932107 567085 679341
4738 679341 527428 244959 14842 286630 664722 672207 514309 526243 949921 760350
4728 760350 350554 473469 488646 718092 848904 915329 522228 436469 569643 499565
4718 499565 508088 797197 624749 635960 306671 647638 1183644 870437 567055 364520
4708 364520 437731 866786 1098465 694020 679351 963172 1372112 965476 915532 991869
4698 991869 860362 732992 806586 1179198 739966 658007 715838 863355 1064163 992560
4688 992560 825925 707261 547372 759530 886078 690135 1127643 1101019 705331 587742
4678 587742 764365 946616 1061565 1356198 1056615 865345 1197896 886149 489967 628495
$$ packed form
4748I98282n24479K60430j07345l6536K57249q364L18470k25600l65022J12256
4738F79341j51913k82469k30117K71788L78092P485j57898J1934M23678j89571
4728G60350m09796J22915J5177K29446J30812O6425l93101q5759J33174p0078
4718D99565Q523K89109j72448J1211l29289L40967N36006l13207l03382k02535
4708C64520P3211M29055K31679m04445j4669K83821M08940m06636m9944P6337
4698I91869j31507j27370P3594L72612m39232q1959N7831J47517K00808p1603
4688I92560j66635j18664j59889K12158J26548j95943M37508k6624l95688j17589
4678E87742J76623J82251J14949K94633k99583j91270L32551l11747l96182J38528
$$ plain form
4668 628495 962234 687519 675430 784095 915169 933359 633699 753416 1033936 833570
4658 833570 945519 828510 987784 1035217 795031 821181 1192776 870178 456337 582993
4648 582993 938745 1465427 1439793 936145 771778 848523 587432 572750 938655 1107664
4638 1107664 842660 1043119 1098372 1101321 1202195 1213394 1129041 969553 1036377 1097589 487958
4627 487958 568869 560316 910757 1271776 924066 940218 410968 275151 570952 507963 572916
4616 572916 1083980 1125464 1313183 1347327 1366155 1174371 652860 615383 477876 762121
4606 762121 1269158 1302415 1420879 1365903 1129041 946460 1098427 1023891 1141632 1417076
4596 1417076 1298195 1045521 841869 1258796 1214916 1101853 875680 808613 1204006 1525968
$$ packed form
4668F28495L33739k74715j2089J08665J31074J8190k99660J19717K80520k00366
4658H33570J11949j17009J59274M7433k40186K6150L71595l22598m13841J26656
4648E82993L55752N26682k5634n03648j64367P6745k61091j4682L65905J69009
4638A107664k65004K00459N5253K949J00874J1199q4353j59488O6824O1212o09631
4627D87958Q0911q553L50441L61019l47710J6152n29250j35817K95801o2989O4953
4616E72916N11064M1484J87719L4144J8828j91784n21511l7477j37507K84245
4606G62121N07037L3257J18464n4976k36862j82581J51967p4536J17741K75444
4596A417076j18881k52674k03652M16927m3880j13063k26173o7067L95393L21962
$$ plain form
4586 1525968 1474077 1135127 1281185 1030566 1097252 1188465 1309023 1368880 1008168 1105616
4576 1105616 909366 1534969 1501055 1226980 1487433 1363956 1233150 1541004 1401434 1365669
4566 1365669 1568352 1413082 1462227 1643264 1312114 1364652 1347469 1497997 1017731 1322323
4556 1322323 1522240 1379978 1710976 1498008 1441917 1233962 1423325 1230183 1714725 1861101
4546 1861101 1907311 2267109 1926527 1838908 1884355 1407406 1320185 1377055 1651109 1683578 1473745
4535 1473745 1284980 1504677 1632072 1801128 1902108 2104999 1668707 1617295 1537357 1292952
4525 1292952 1627773 1940587 1956695 2009898 1577354 1742213 1935071 1672883 1643911 1836209
4515 1836209 1915297 1721172 1837418 1994017 1935494 2240995 2145682 2181907 2646102 2517002
$$ packed form
4586A525968n1891l38950J46058k50619O6686R1213J20558N9857l60712R7448
4576A105616j96250O25603l3914k74075K60453j23477j30806L07854j39570l5765
4566A365669K02683j55270M9145J81037l31150N2538j7183J50528m80266L04592
4556A322323J99917j42262L30998k12968n6091k07955J89363j93142M84542J46376
4546A861101M6210L59798l40582q7619M5447m76949q7221N6870K74054L2469k09833
4535A473745j88765K19697J27395J69056J00980K02891m36292n1412p9938k44405
4525A292952L34821L12814J6108N3203m32544J64859J92858k62188k8972J92298
4515A836209P9088j94125J16246J56599n8523L05501r5313L6225M64195j29100
$$ plain form
4505 2517002 2454675 2431407 2506908 2667672 2945440 2818922 3013500 2917065 3072381 3319070
4495 3319070 3615698 3714270 3148756 2776089 2835780 2839208 3053864 2961691 2701534 2586487
4485 2586487 2145924 2022447 2227928 2158767 1946105 2106161 2407937 2550807 2619269 2769220
4475 2769220 3065588 2384638 2192142 2350474 2464027 2430857 2336677 2289773 2109688 2557274
4465 2557274 2303753 1995471 2582392 2727642 2303065 2075836 2650834 2590760 2633210 2542571
4455 2542571 2436705 2601843 2675757 2786886 3119638 3145885 2818161 2756693 2620615 2584201
4445 2584201 3390630 3250587 3052242 3597429 3776957 3527789 3331599 3853429 3402038 3190824
4435 3190824 3182831 3294845 3558637 3698553 3810682 3324910 3254174 3113713 3256626 3326180
$$ packed form
4505B517002o2327k3268P5501J60764K77768j26518J94578r6435J55316K46689
4495C319070K96628R8572n65514l72667N9691L428K14656r2173k60157j15047
4485B586487m40563j23477K05481o9161k12662J60056L01776J42870O8462J49951
4475B769220K96368o80950j92496J58332J13553l3170r4180m6904j80085M47586
4465B557274k53521l08282N86921J45250m24577k27229N74998o0074M2450r0639
4455B542571j05866J65138P3914J11129L32752K6247l27724o1468j36078l6414
4445B584201Q06429j40043j98345N45187J79528k49168j96190N21830m51391k11214
4435C190824p993J12014K63792J39916J12129m85772p0736j40461J42913O9554
$$ plain form
4425 3326180 3459837 3711838 3681845 3572999 3421860 3405210 3379294 3396523 3194185 3182590
4415 3182590 3094239 3182341 3111715 3144051 3187734 3590495 3392450 3026715 3224370 2943998
4405 2943998 2605233 2518948 2741776 2981226 2680871 2568916 2500451 2655571 2550347 2828513
4395 2828513 2602040 2315711 2584002 2839720 2946161 2784794 3353005 3072833 2706824 2474108
4385 2474108 2720167 2606197 2742824 2829080 2535326 2684360 2895496 3324554 3109224 2819105
4375 2819105 2694170 3161956 2892013 2790492 2781041 2959315 3233541 3467172 3689352 3579897
4365 3579897 3459040 3299789 3362758 3177259 3075998 3100955 2917969 2974270 3116880 2904451
4355 2904451 2931710 2845368 3028287 3290298 3325308 3130666 3212067 3389729 3281768 3546661
$$ packed form
4425C326180J33657K52001k9993j08846j51139j6650k5916J7229k02338j1595
4415C182590q8351Q8102p0626L2336M3683M02761j98045l65735J97655k80372
4405B943998l38765q6285K22828K39450l00355j11955o8465J55120j05224K78166
4395B828513k26473k86329K68291K55718J06441j61367N68211k80172l66009k32716
4385B474108K46059j13970J36627Q6256k93754J49034K11136M29058k15330k90119
4375B819105j24935M67786k69943j01521r451J78274K74226K33631K22180j09455
4365C579897j20857j59251O2969j85499j01261K4957j82986N6301J42610k12429
4355B904451K7259q6342J82919K62011L5010j94642Q1401J77662j07961K64893
$$ plain form
4345 3546661 3023225 2850987 3168106 3244689 3047451 3374182 3430890 3219559 3057872 3023188
4335 3023188 3222590 3277554 2930240 3024186 3217169 3465214 3490232 3179954 3099988 3109956 3382638
4324 3382638 3355101 3061330 3244921 2991909 2847688 2703825 2820916 3057502 2916617 3264527
4314 3264527 3530556 3602415 3560157 3339923 3274077 3267715 3413949 3637925 3478014 3454865 3335099
4303 3335099 3633988 3304538 3190663 3260761 3091576 3161059 3012182 2998578 3321127 3431930
4293 3431930 3467758 2942449 3322172 3601319 3493317 3511641 3525567 3786958 3854541 3836070
4283 3836070 4048381 4023536 3843454 3906734 4153951 3942513 4198934 4242435 4284353 4356304
4273 4356304 4352546 4437759 4159437 4119759 4467123 4409469 4237539 4390657 4473749 4483402 4698811
$$ packed form
4345C546661n23436j72238L17119P6583j97238L26731N6708k11331j61687l4684
4335C023188J99402N4964l47314R3946J92983K48045K5018l10278p9966R968K72682
4324C382638k7537k93771J83591k53012j44221j43863J17091K36586j40885L47910
4314C264527K66029P1859m2258k20234o5846o362J46234K23976j59911k3149j19766
4303C335099K98889l29450j13875P0098j69185O9483j48877j3604L22549J10803
4293C431930L5828n25309L79723K79147j08002J8324J3926K61391O7583j8471
4283C836070K12311k4845j80082O3280K47217k11438K56421M3501M1918P1951
4273D356304l758Q5213k78322l9678L47364n7654j71930J53118Q3092R653K15409
$$ plain form
4262 4698811 4515580 4456886 4672767 4694168 4731401 5012212 4978397 5189187 5152925 4881962
4252 4881962 4845333 4480284 4273135 4520992 4312019 4456342 4554009 4533859 4584088 4520127
4242 4520127 4890830 4747824 4664531 4322385 4464362 4381898 4564562 4901614 4901544 4898194 5237433
4231 5237433 5106161 5033433 4744897 4531611 4447094 4653947 5193825 5200428 5217073 5161525 5419298
4220 5419298 5454496 5461177 5737782 5614218 5749119 5443811 5331554 5581668 5216008 5231214
4210 5231214 5327452 5556410 5828004 5668326 5805724 6143610 6275158 6143696 5888754 5874572
4200 5874572 5828449 5662744 5689748 6099730 6172901 6195055 6389686 6662065 6735968 6375491
4190 6375491 6017641 6490943 6696451 6509657 6161818 6176566 6683532 6516510 6568953 6998971
$$ packed form
4262D698811j83231n8694K15881K1401L7233K80811l3815K10790l6262k70963
4252D881962l6629l65049k07149K47857k08973J44323R7667k0150N0229o3961
4242D520127L70703j43006q3293l42146J41977q2464J82664L37052p0l350L39239
4231E237433j31272p2728k88536k13286q4517K06853N39878O603J6645n5548K57773
4220E419298L5198O681K76605j23564J34901l05308j12257K50114l65660J5206
4210E231214R6238K28958K71594j59678J37398L37886J31548j31462k54942j4182
4200E874572m6123j65705K7004M09982P3171K2154J94631K72379P3903l60477
4190F375491l57850M73302K05508j86794l47839J4748N06966j67022N2443M30018
$$ plain form
4180 6998971 7169599 7425981 7160379 6944726 7333242 7266295 7418547 7153539 7245860 7310861
4170 7310861 7537964 7934847 7906603 7700749 7661552 7772914 7949909 8004394 8271500 8627727
4160 8627727 8398322 8392701 8760885 9011830 9188907 9220241 9046756 9284537 9668421 9868670
4150 9868670 10256836 9712490 9634272 9606410 9973730 10445201 10852887 10982227 11019368 11335433
4140 11335433 11166904 11237029 11092775 11349431 11564057 11826006 12036367 11888571 12211405 12353791
4130 12353791 12160859 12302571 12807341 12868872 12780980 12873416 13146014 13414190 13821700 14487831
4120 14487831 15184463 15800552 16005446 16206858 16720062 17489050 17847152 18506346 18962037
4111 18962037 19386776 20034682 20704852 21598489 22075680 22924632 23929987 24868733 25608187
$$ packed form
4180F998971J70628K56382k65602k15653L88516o6947J52252k65008R2321O5001
4170G310861K27103L96883k8244k05854l9197J11362J76995N4485K67106L56227
4160H627727k29405n621L68184K50945J77077L1334j73485K37781L83884K00249
4150I868670L88166n44346p8218k7862L67320M71471M07686J29340L7141L16065
4140A1335433j68529P0125j44254K56656K14626K61949K10361j47796L22834J42386
4130A2353791j92932J41712N04770O1531q7892R2436K72598K68176M07510O66131
4120A4487831O96632O16089K04894K01412N13204P68988L58102O59194M55691
4111A8962037M24739O47906O70170Q93637M77191Q48952J005355R38746P39454
$$ plain form
4102 25608187 26695452 27627626 28894588 30286793 32221580 34334018 36998998 39609590
4094 39609590 42717622 46496263 50022810 54348245 60424494 67935139 76928097 88482481
4086 88482481 102861954 120562605 145665340 176235793 201528805 206798584 181349504
4079 181349504 147461617 119488678 97851600 81432021 69042603 60140923 53368253
4072 53368253 47934681 43572691 40126360 37429172 34948535 32864459 30624907 28670624
4064 28670624 27125177 25597010 24352393 23128884 22359005 21310439 20460463 20112600 19482890
4055 19482890 18783549 18198942 17730290 17383883 16885859 16441281 15793255 15496407 15156606
4046 15156606 14464856 13929730 13930932 13862265 13587409 13361424 13125863 12797366 12823727 12629307
$$ packed form
4102B5608187J087265R32174J266962J392205J934787K112438K664980K610592
4094C9609590L108032L778641L526547M325435O076249P510645Q992958J1554384
4086H8482481J4379473J7700651K5102735L0570453K5293012N269779k5449080
4079A81349504l3887887k7972939k1637078j6419579j2389418q901680o772670
4072E3368253n433572m361990l446331k697188k480637k084076k239552j954283
4064B8670624j545447j528167j244617j223509p69879j048566q49976l47863o29710
4055A9482890o99341n84607m68652l46407m98024m44578o48026k96848l39801
4046A5156606o91750n35126J202o8667k74856k25985k35561l28497K6361j94420
$$ plain form
4036 12629307 12647554 12500607 12564010 12436324 12060365 12226540 12105506 11926517 11723274 11553393
4026 11553393 11785970 11698093 11589733 11246900 11351211 11418943 11029483 10835068 11024071 10867194
4016 10867194 11034750 11173133 10939206 10722959 10700773 11094010 10814144 10691340 10732482 10518391
4006 10518391 10774441 10957400 10733353 10634146 10507125 10695934 11045231 11204570 11644394 11655060
3996 11655060 11513570 11659233 11731408 11386998 11164456 11079898 11148288 10918193 10787272 10911165
3986 10911165 10897105 10718716 10983938 10817131 10605875 10718894 10872296 10635599 10783208 10939899
3976 10939899 11080783 10990273 10641069 10845612 11364428 11445398 11384992 11706138 12200758 12243879
3966 12243879 11892381 11922910 11701066 11621456 11613355 11694615 11948518 11809729 11657323 11700410
$$ packed form
4036A2629307J8247j46947O3403j27686l75959J66175j21034j78989k03243j69881
4026A1553393K32577q7877j08360l42833J04311O7732l89460j94415J89003j56877
4016A0867194J67556J38383k33927k16247k2186L93237k79866j22804M1142k14091
4006A0518391K56050J82959k24047r9207j27021J88809L49297J59339M39824J0666
3996A1655060j41490J45663P2175l44410k22542q4558O8390k30095j30921J23893
3986A0911165j4060j78389K65222j66807k11256J13019J53402k36697J47609J56691
3976A0939899J40884r0510l49204K04543N18816Q0970o0406L21146M94620M3121
3966A2243879l51498L0529k21844p9610q101Q1260K53903j38789j52406M3087
$$ plain form
3956 11700410 11815926 11742989 11538520 11574659 11311229 11402450 11156369 11305116 11338133 11543347
3946 11543347 11244506 11688876 11817140 11260641 11293600 11269745 10961753 11034133 11088098 10952139
3936 10952139 11028500 11208440 11262239 11760338 11877652 11785003 12137602 12104940 11760595 11525684
3926 11525684 11490406 11522474 11569438 11588981 11715343 11636144 11530578 11291382 11313981 11373804 11515127
3915 11515127 11445347 11147795 11098527 11118920 10871548 10842667 10830342 10795150 10833825 11233604 10777605
3904 10777605 10689919 10701174 10462791 10679257 10845675 10943408 11044283 10933339 10981159 10934873
3894 10934873 10948602 11101387 11070339 11034277 10600068 10484275 10574986 10137205 10233597 10354803
3884 10354803 10443251 10361985 10644469 10319484 10323794 10319800 9785908 10371566 10107115 9983571
$$ packed form
3956A1700410J15516p2937k04469L6139k63430R1221k46081J48747L3017K05214
3946A1543347k98841M44370J28264n56499L2959k3855l07992P2380N3965j35959
3936A0952139P6361J79940N3799M98099J17314r2649L52599l2662l44345k34911
3926A1525684l5278L2068M6964J9543J26362p9199j05566k39196K2599N9823J41323
3915A1515127o9780k97552m9268K0393k47372k8881j2325l5192L8675L99779m55999
3904A0777605q7686J1255k38383K16466J66418R7733J00875j10944M7820m6286
3894A0934873J3729J52785l1048l6062m34209j15793R0711m37781R6392J21206
3884A0354803Q8448q1266K82484l24985M310l994n33892N85658k64451j23544
$$ plain form
3874 9983571 9856756 9947765 9913378 9614813 9617439 9766290 9777827 9552643 9640703 9778588 9813651
3863 9813651 9756201 9444541 9284024 9331482 9462388 9337285 9246621 9258464 9301222 9058250
3853 9058250 9093070 9509223 9523104 9245773 9157780 9282971 9625233 9573116 9830803 9538191
3843 9538191 9541638 9732555 9582370 9368954 9501793 9940410 10042886 9824647 9435551 9607031
3833 9607031 9147534 9203083 9733972 9728740 9574070 9717438 9582773 9824811 9827834 9952786
3823 9952786 9847162 10000761 10142036 10107512 9489289 9258389 9505602 9651793 9854280 9571222
3813 9571222 9386028 9552414 9611233 9452501 9386756 9485716 9865629 9859244 9906355 9365141 9506200
3802 9506200 9447213 9439748 9619335 9912569 10201183 10052319 10022363 10255187 10491728 10468151
$$ packed form
3874I983571j26815R1009l4387k98565K626J48851J1537k25184Q8060J37885L5063
3863I813651n7450l11660j60517M7458J30906j25103r0664J1843M2758k42972
3853I058250L4820M16153J3881k77331q7993J25191L42262n2117K57687k92612
3843I538191L447J90917j50185k13416J32839M38617J02476k18239l89096J71480
3833I607031m59497N5549N30889n232j54670J43368j34665K42038L023J24952
3823I952786j05624J53599J41275l4524o18223k30900K47213J46191K02487k83058
3813I571222j85194J66386N8819j58732o5745R8960L79913o385M7111n41214J41059
3802I506200n8987p465J79587K93234K88614j48864k9956K32824K36541k3577
$$ plain form
3792 10468151 10710277 10624360 10388527 10579599 10580259 10166416 10071576 10031294 10145166 10449977
3782 10449977 10293126 9773262 9871918 9893739 10003645 10051385 9669717 9802618 9973312 9895609
3772 9895609 10031026 10024753 9965966 9976989 10132495 9888722 10267432 10450152 10115155 10194687
3762 10194687 10169439 10457759 10579371 10298913 10251213 10534575 10439077 10771296 10751622 10748680
3752 10748680 10357638 10362593 10610169 10879296 10506791 10824395 10771744 11006939 11133098 10879469
3742 10879469 10875705 10900819 10839524 11030687 11458898 11430865 11211277 10881259 10923250 11202554
3732 11202554 11409171 11470729 11322891 11230504 11293927 11208550 11344266 11154455 11399303 11233470
3722 11233470 11432455 11205592 11506955 11695775 11961284 12202598 12374266 11925001 11881817 11811293
$$ packed form
3792A0468151K42126q5917k35833J91072O60m13843r4840m0282J13872L04811
3782A0449977j56851n19864R8656K1821J09906M7740l81668J32901J70694p7703
3772I895609J35417o273n8787J1023J55506k43773L78710J82720l34997P9532
3762A0194687k5248K88320J21612k80458m7700K83362r5498L32219j9674k942
3752A0748680l91042M955K47576K69127l72505L17604n2651K35195J26159k53629
3742A0879469l764K5114o1295J91163M28211k8033k19588l30018M1991K79304
3732A1202554K06617O1558j47838r2387O3423q5377J35716j89811K44848j65833
3722A1233470J98985k26863L01363J88820K65509K41314J71668m49265m3184p0524
$$ plain form
3712 11811293 11818045 12181939 12131359 12202007 12119946 12205800 12221307 12136483 12489435 12843527 12744657
3701 12744657 13163252 13163969 13170070 13407960 13390207 13644792 13520511 13176506 13427114 13327296 13401088
3690 13401088 13689506 13895499 13988010 14154748 14033927 14054375 14175339 14399765 14628858 14637512
3680 14637512 14388234 14500803 14692225 14983644 15251313 15372596 15698568 15523800 15669167
3671 15669167 15360393 15561122 15640838 15639478 16088966 16469441 16260722 16540292 16891111 17139728
3661 17139728 16671635 17087284 17763018 17575547 17741449 17739102 18159681 18226267 18443142 19016924
3651 19016924 19133929 19514069 19603747 20047503 20194602 20351486 20484234 20604000 21092470 21257355
3641 21257355 21300135 21456332 21797707 22027625 22446765 22596092 22815670 22982807 23116721 23020491
$$ packed form
3712A1811293O752L63894n0580P0648q2061Q5854J5507q4824L52952L54092r8870
3701A2744657M18595P17O101K37890j7753K54585j24281l44005K50608r9818P3792
3690A3401088K88418K05993R2511J66738j20821K0448J20964K24426K29093Q654
3680A4637512k49278J12569J91422K91419K67669J21283L25972j74768J45367
3671A5669167l08774K00729P9716j360M49488L80475k08719K79570L50819K48617
3661A7139728m68093M15649O75734j87471J65902k347M20579O6586K16875N73782
3651A9016924J17005L80140Q9678M43756J47099J56884J32748J19766M88470J64885
3641B1257355M2780J56197L41375K29918M19140J49327K19578J67137J33914r6230
$$ plain form
3631 23020491 23114198 23252772 23579141 23589127 23176021 23326916 23650383 23800459 23912854 24081700
3621 24081700 24315115 24249674 24336250 24617116 24608328 24803513 24890391 24991026 24935190 24723518
3611 24723518 24780194 25194409 25489175 25392793 25541079 25638977 25501681 25748311 25888161 25909353
3601 25909353 26091707 25876521 25964120 25999667 26070231 25944037 26001587 26141789 26400548 26389051
3591 26389051 26397340 26252379 26051450 26007406 26148846 26303034 26410315 26136267 26175644 26104564
3581 26104564 26283419 25939584 25927812 26076295 26054018 26004225 26018835 25741052 25836474 25627262
3571 25627262 25355139 25285493 25255378 25266627 25473305 25549756 25151385 25185581 25359903 24828450
3561 24828450 24900346 24748973 24454358 24561463 24433018 24643084 24273699 23985965 24088022 24504459
$$ packed form
3631B3020491R3707J38574L26369R986m13106J50895L23467J50076J12395J68846
3621B4081700K33415o5441Q6576K80866q788J95185Q6878J00635n5836k11672
3611B4723518N6676M14215K94766r6382J48286R7898j37296K46630J39850K1192
3601B5909353J82354k15186Q7599L5547P0564j26194N7550J40202K58759j1497
3591B6389051Q289j44961k00929m4044J41440J54188J07281k74048L9377p1080
3581B6104564J78855l43835j1772J48483k2277m9793J4610k77783R5422k09212
3571B5627262k72123o9646l0115J1249K06678P6451l98371L4196J74322n31453
3561B4828450P1896j51373k94615J07105j28445K10066l69385k87734J02057M16437
$$ plain form
3551 24504459 24161002 23999322 23660903 23309565 23201823 23186266 22592360 22714241 22991461 22709068
3541 22709068 22473081 21971085 21811058 21767711 21509890 21550977 21285150 21152041 20983022 20953392
3531 20953392 20505878 20447043 20101856 19965443 19938329 19734242 19329873 19559173 19566126 19119908
3521 19119908 19010527 18898493 18958680 18657435 18190443 17822857 17799644 17507106 17354919 17312847
3511 17312847 17061873 16575342 16568550 16519866 16501639 16259288 16333178 16272253 15938123 15578097
3501 15578097 15317663 15408022 15383914 15085805 14867041 14865174 14717534 14580094 14344709 14209871
3491 14209871 14049873 14193666 13992215 14050693 14092203 13800876 13791859 13680170 13286565 13569776
3481 13569776 13568206 13219241 13160703 13200417 12929497 12657168 12470577 12497553 12232629 12461586
$$ packed form
3551B4504459l43457j61680l38419l51338j07742j5557n93906J21881K77220k82393
3541B2709068k35987n01996j60027m3347k57821M1087k65827j33109j69019k9630
3531B0953392m47514n8835l45187j36413k7114k04087m04369K29300O953m46218
3521A9119908j09381j12034O0187l01245m66992l67586k3213k92538j52187m2072
3511A7312847k50974m86531o792m8684j8227k42351P3890o0925l34130l60026
3501A5578097k60434R0359k4108k98109k18764j867j47640j37440k35385j34838
3491A4209871j59998J43793k01451N8478M1510k91327r017j11689l93605K83211
3481A3569776j570l48965n8538L9714k70920k72329j86591K6976k64924K28957
$$ plain form
3471 12461586 12417854 12020479 12280975 12142367 12091020 11896490 11916298 11826879 11622112 11595026
3461 11595026 11509302 11197343 10906040 10734692 11038626 11473448 11312503 11088283 10868136 10753869
3451 10753869 10754994 10859900 10968601 10753081 10410819 10329483 10137681 9690417 9733928 10262193
3441 10262193 10502054 10189678 9961507 10018875 10136835 10058676 9874818 9518197 9629264 9401955
3431 9401955 9312113 9125900 9193867 9209097 9167260 9073909 9140883 8899090 8624733 8889036 8899183
3420 8899183 9145269 8809063 8904771 8833484 9097983 9048831 8722254 8861629 8309572 8012047
3410 8012047 8173661 8379326 8494615 8244247 8183882 8263999 8332160 7869859 8023579 8152291
3400 8152291 7853003 7963797 8270071 8307321 7984748 7768212 7462925 7646564 7382494 7469128
$$ packed form
3471A2461586m3732l97375K60496j38608n1347j94530J9808q9419k04767k7086
3461A1595026q5724l11959k91303j71348L03934M34822j60945k24220k20147j14267
3451A0753869J125J04906J08701k15520l42262q1336j91802m47264M3511N28265
3441A0262193K39861l12376k28171N7368J17960p8159j83858l56621J11067k27309
3431I401955q9842j86213O7967J5230m1837r3351O6974k41793k74357K64303J0147
3420H899183K46086l36206R5708p1287K64499m9152l26577J39375n52057k97525
3410H012047J61614K05665J15289k50368o0365Q0117O8161m62301J53720J28712
3400H152291k99288J10794L06274L7250l22573k16536l05287J83639k64070Q6634
$$ plain form
3390 7469128 7006262 6925127 7016080 7422101 7348103 6936719 6997359 7147348 7355028 7353574 7412620
3379 7412620 7395034 7001080 6795903 6938091 7019251 7074093 6906092 6771024 6407579 6458551
3369 6458551 6549452 6930656 7330458 7082523 7011129 6842179 6405932 6269450 6130749 5905645
3359 5905645 6319761 6423522 6140651 6175033 6432762 6606970 6370395 6466725 6536005 6642907
3349 6642907 6285083 6117740 6157866 6067532 5858199 6148630 6141861 5941229 5843135 5559064
3339 5559064 5801100 5960566 6199375 6091454 6165154 6126847 6194350 6097983 5833792 6221081
3329 6221081 5910041 6119685 6251993 6221114 6552216 6249586 6099753 5942262 5944577 6005065
3319 6005065 5936979 6062495 5989139 6083487 6208601 6314312 6287411 6186875 6238045 6349535
$$ packed form
3390G469128m62866q1135R0953M06021p3998m11384O0640J49989K07680j454N9046
3379G412620j7586l93954k05177J42188Q1160N4842j68001j35068l63445N0972
3369F458551R0901L81204L99802k47935p1394j68950m36247j36482j38701k25104
3359E905645M14116J03761k82871L4382K57729J74208k36575R6330O9280J06902
3349F642907l57824j67343M0126r0334k09333K90431o769k00632r8094k84071
3339E559064K42036J59466K38809j07921P3700l8307O7503r6367k64191L87289
3329F221081l11040K09644J32308l0879L31102l02630j49833j57491K315O0488
3319F005065o8086J25516p3356R4348J25114J05711k6901j00536N1170J11490
$$ plain form
3309 6349535 6523052 6476462 6548615 6386190 6453519 6656922 6303084 6263339 6727190 6954091
3299 6954091 6554862 6503569 6628245 6704604 6894533 6502710 6684930 6909516 7217307 7622358
3289 7622358 7728780 7790706 7784689 8028745 8236511 8563119 8702102 8693302 8890906 9508084
3279 9508084 9614312 9398779 9714724 10007531 10214697 10288205 10843522 11454043 12233245 12979184
3269 12979184 13933815 14433768 15333793 16132890 16722339 17075560 17059876 16667127 16068747 15672756
3259 15672756 15321853 15289683 15088774 14721214 14989380 15125801 15027501 15271650 15165090 15552129
3249 15552129 16190904 16981493 17587933 17922570 18286118 19424774 19840908 20417582 20700172
3240 20700172 21364029 21788911 22312237 22724233 23296152 24512632 25276147 25377521 25316820
$$ packed form
3309F349535J73517m6590P2153j62425O7329K03403l53838l9745M63851K26901
3299F954091l99229n1293J24676P6359J89929l91823J82220K24586L07791M05051
3289G622358J06422O1926o017K44056K07766L26608J38983q800J97604O17178
3279I508084J06228k15533L15945K92807K07166P3508N55317O10521P79202P45939
3269A2979184R54631M99953R00025P99097N89449L53221j5684l92749n98380l95991
3259A5672756l50903l2170k00909l67560K68166J36421r8300K44149j06560L87039
3249A5552129O38775P90589O06440L34637L63548J138656M16134N76674K82590
3240B0700172O63857M24882N23326M11996N71919J216480P63515J01374o0701
$$ plain form
3231 25316820 24256105 22535874 20987253 19490338 18305245 17093834 15929027 14924150
3223 14924150 14301780 13220114 12460947 12009507 11638768 11597719 11388644 11077682 10677143
3214 10677143 10549845 10702093 10543651 10802304 11082991 11092067 11316930 11647460 12011519 12415772
3204 12415772 12857455 13247689 13371488 13116338 12753514 12595632 12017986 11199648 10359083
3195 10359083 9875461 9194834 8377656 7882738 7898387 7578969 7197182 7326218 7006579 6548773
3185 6548773 6310161 5853553 5300011 5380080 5181319 4938412 5042027 4992100 4612888 4761445
3175 4761445 4423830 4466412 4654188 4430651 4228437 4317991 4175472 4062787 4384053 3919588
3165 3919588 3902275 3760976 3823734 4019424 3701016 3485021 3369963 3425486 3416301 3456365 3324972
$$ packed form
3231B5316820j060715j720231j548621j496915j185093j211411j164807j004877
3223A4924150o22370j081666p59167m51440l70739m1049k09075l10962m00539
3214A0677143j27298J52248j58442K58653K80687R076K24863L30530L64059M04253
3204A2415772M41683L90234J23799k55150l62824j57882n77646q18338q40565
3195A0359083m83622o80627q17178m94918J5649l19418l81787J29036l19639m57806
3185F548773k38612m56608n53542Q0069j98761k42907J03615m9927l79212J48557
3175D761445l37615M2582J87776k23537k02214Q9554j42519j12685L21266m64465
3165C919588j7313j41299O2758J95690l18408k15995j15058N5523r185M0064j31393
$$ plain form
3154 3324972 3229402 3198109 3398943 3193950 3008463 2940158 2643552 2946952 3060865 3347403
3144 3347403 2852290 2863208 3026240 2962720 2704615 2456745 2941347 2810900 2730063 2727049
3134 2727049 2282638 2766505 2856247 2489108 2513661 2571433 2593567 2596604 2414036 2630495 2413302
3123 2413302 2271560 2444380 2615298 2217067 2288621 2185065 2008768 2165024 2094218 2024737
3113 2024737 1925068 2062914 1931839 2035121 2290309 2069345 2182155 2528220 2556599 2148769
3103 2148769 2012147 1738977 1550379 1909694 2162319 1867084 1939777 1854591 1957732 2332093
3093 2332093 2084110 1892037 2056942 1854475 1440897 2027714 2044446 1739385 1513313 1329996
3083 1329996 1465460 1540583 1750044 2037292 1850148 1808822 2156392 1805345 1313402 1706146
$$ packed form
3154C324972r5570l1293K00834k04993j85487o8305k96606L03400J13913K86538
3144C347403m95113J0918J63032o3520k58105k47870M84602j30447q0837l014
3134B727049m44411M83867Q9742l67139K4553N7772K2134L037j82568K16459k17193
3123B413302j41742J72820J70918l98231P1554j03556j76297J56256p0806o9481
3113B024737r9669J37846j31075J03282K55188k20964J12810L46065K8379m07830
3103B148769j36622k73170j88598L59315K52625k95235P2693q5186J03141L74361
3093B332093k47983j92073J64905k02467m13578N86817J6732l05061k26072j83317
3083A329996J35464P5123K09461K87248j87144m1326L47570l51047m91943L92744
$$ plain form
3073 1706146 1677260 1829036 1709916 1411214 1641024 1755065 1596433 1549713 1578721 1798715
3063 1798715 1924785 1762999 1750673 1875262 1973747 1875541 1447481 1755478 1625418 1312460
3053 1312460 1258826 1359614 1447531 1562931 1170630 1389591 1200175 1478600 1350738 1338094
3043 1338094 1366462 1652420 1999650 1404677 1264999 1526676 1496638 1417071 1373155 1351687
3033 1351687 1654979 1544296 1282559 1356696 1156173 892257 1272712 1369474 1571080 1511069
3023 1511069 1560566 1667414 1318334 1111227 1398738 1323929 1189995 1367726 1174944 1350447
3013 1350447 1298902 1097039 870180 942245 1341839 1061349 1192297 1452495 1185402 1085524
3003 1085524 1152266 1355011 1442810 1165948 1005447 1258981 1068226 937855 906938 802682
$$ packed form
3073A706146k8886J51776j19120k98702K29810J14041j58632m6720K9008K19994
3063A798715J26070j61786j2326J24589R8485r8206m28060L07997j30060l12958
3053A312460n3634J00788Q7917J15400l92301K18961j89416K78425j27862j2644
3043A338094K8368K85958L47230n94973j39678K61677l0038p9567m3916k1468
3033A351687L03292j10683k61737P4137k00523k63916L80455R6762K01606o0011
3023A511069M9497J06848l49080k07107K87511p4809j33934J77731j92782J75503
3013A350447n1545k01863k26859P2065L99594k80490J30948K60198k67093r9878
3003A085524O6742K02745Q7799k76862j60501K53534j90755j30371l0917j04256
$$ plain form
2993 802682 1076450 992048 1032009 1116666 1403698 1681332 1664047 1343371 1181226 1133605 1226617
2982 1226617 1176936 1218527 1285573 1544822 896165 802767 1026993 922755 726314 830058
2972 830058 1126507 959444 902667 584455 665601 1265573 1518887 1669906 1374894 1017345
2962 1017345 841128 1146469 1430401 1606596 1387915 1195983 1093882 1611443 1727668 1728418
2952 1728418 1251803 1002700 1000838 854320 1180933 1256734 1341586 1329581 1084850 1282243
2942 1282243 1527192 1410635 1117789 1229263 1314147 1060286 1003927 1215588 1702548 1475766
2932 1475766 1387761 1117531 1021850 1101704 1123972 1242151 924570 1012879 1454412 1653454
2922 1653454 1501779 1622364 1564159 1305498 1415631 1366441 1456627 1410083 1424722 1268032
$$ packed form
2993H02682K73768q4402L9961Q4657K87032K77634j7285l20676j62145m7621R3012
2982A226617m9681M1591O7046K59249o48657r3398K24226j04238j96441J03744
2972H30058K96449j67063n6777l18212Q1146N99972K53314J51019k95012l57549
2962A017345j76217L05341K83932J76195k18681j91932j02101N17561J16225P50
2952A728418m76615k49103j862j46518L26613P5801Q4852j2005k44731J97393
2942A282243K44949j16557k92846J11474Q4884k53861n6359K11661M86960k26782
2932A475766q8005k70230r5681P9854K2268J18179l17581Q8309M41533J99042
2922A653454j51675J20585n8205k58661J10133m9190R0186m6544J4639j56690
$$ plain form
2912 1268032 1704263 1515264 1551624 1672359 1978609 1581083 1433019 1298061 1432865 1481799
2902 1481799 1625361 1697755 1281732 1366174 1441240 1512242 1141081 1249532 1437920 1137628
2892 1137628 1453994 1607054 1535352 1268146 916400 817787 1040027 1350049 1343186 1423487
2882 1423487 1476072 1341178 1166448 1328871 1621013 1606228 1428386 1105737 1318421 1507842
2872 1507842 1046358 1007157 1050059 1228866 1461804 1378293 1143374 1236914 1277848 1344334 1217667
2861 1217667 1380888 1260536 1117476 1075940 1020389 1072407 739139 693237 639844 798926
2851 798926 751146 781990 1022151 748952 1199108 1183718 969881 722643 295402 44974
2841 44974 268363 173149 230127 559693 736578 749550 526159 669965 712694 887409 792775
$$ packed form
2912A268032M36231j88999L6360J20735L06250l97526j48064j34958J34804M8934
2902A481799J43562P2394m16023Q4442P5066P1002l71161J08451J88388l00292
2892A137628L16366J53060p1702k67206l51746r8613K22240L10022o863Q0301
2882A423487N2585j34894j74730J62423K92142j4785j77842l22649K12684J89421
2872A507842m61484l9201M2902J78807K32938q3511k34919R3540M0934O6486j26667
2861A217667J63221j20352j43060m1536n5551N2018l33268m5902n3393J59082
2851G98926m7780L0844K40161k73199M50156j5390k13837k47238m27241k50428
2841D4974K23389r5214N6978L29566J76885J2972k23391J43806M2729J74715r4634
$$ plain form
2830 792775 303397 453441 831989 616447 297720 607523 967581 793565 458206 388523
2820 388523 428181 373166 308270 281710 468939 461060 370540 490059 369121 480098 427277
2809 427277 363626 422137 200660 248851 387112 625965 768225 677976 549073 738598
2799 738598 666470 545567 84574 -195344 118059 411261 519971 284294 -17349 193588
2789 193588 184504 -52588 341047 294353 335512 347215 12522 -171762 -91426 218826 186314
2778 186314 189202 4859 -24360 -80521 47182 19689 -161400 -468243 -829971 -261524 -85701
2767 -85701 -69792 -38273 -307193 -211270 6756 78738 154604 167671 -16955 166008 30162
2756 30162 24622 228978 305166 119422 -31353 126636 27981 68186 60611 227320 344028
$$ packed form
2830G92775m89378J50044L78548k15542l18727L09803L60058j74016l35359o9683
2820C88523L9658n5015o4896k6560J87229p879r0520J19519j20938J10977n2821
2809D27277o3651N8511k21477M8191J38261K38853J42260r0249j28903J89525
2799G38598p2128j20903m60993k79918L13403K93202J08710k35677l01643K10937
2789A93588r084k37092L93635m6694M1159J1703l34693j84284Q0336L10252l2512
2778A86314K888j84343k9219n6161J27703k7493j81089l06843l61728N68447J75823
2767h5701J5909L1519k68920R5923K18026P1982P5866J3067j84626J82963j35846
2756C0162n540K04356P6188j85744j50775J57989r8655M0205p575J66709J16708
$$ plain form
2745 344028 679525 27750 -3641 240744 212938 159051 172852 25180 137509 244273
2735 244273 58537 252503 202340 10216 -158661 -59353 9802 38704 -436485 -194299
2725 -194299 -224219 -193508 -438903 -59861 106708 25635 -197583 -330034 -191555 -146264
2715 -146264 219731 55374 -68030 12958 43662 -171910 -113782 47767 200765 -43290
2705 -43290 40637 90487 -34714 -248927 -371234 -127362 293909 -252085 -448255 -59652
2695 -59652 -161078 -221853 -124229 -179699 -140517 -174597 -156007 -264800 -4280 134831 -278477
2684 -278477 -93903 -187366 -71187 2812 -284562 -333160 5279 -159117 55524 122152
2674 122152 -111927 8491 279878 80290 154493 24100 -261144 -524367 126932 -30669
$$ packed form
2745C44028L35497o51775l1391K44385k7806n3887J3801j47672J12329J06764
2735B44273j85736J93966n0163j92124j68877R9308O9155K8902m75189K42186
2725a94299k9920L0711k45395L79042J66569q1073k23218j32451J38479M5291
2715a46264L65995j64357j23404Q0988L0704k15572N8128J61549J52998k44055
2705d3290Q3927M9850j25201k14213j22307K43872M21271n45994j96170L88603
2695e9652j01426o0775R7624n5470L9182l4080J8590j08793K60520J39111m13308
2684b78477J84574r3463J16179P3999k87374m8598L38439j64396K14641O6628
2674A22152k34079J20418K71387j99588P4203j30393k85244k63223O51299j57601
$$ plain form
2664 -30669 -32682 -69196 -328273 -174434 -268817 -259664 -325440 153949 46382 -286781 -100413
2653 -100413 405630 338152 91321 -111549 -43439 137171 134576 -52032 93728 -205753
2643 -205753 -319257 -82706 -160402 -142656 -165382 -139650 75108 -105591 1134 222652
2633 222652 -81430 -357131 -117061 -297292 -429020 -309614 -335180 -241683 18105 160552
2623 160552 48468 -153115 -309368 101918 -76355 -377565 -241023 305285 414064 -168457
2613 -168457 -142957 -55298 -36561 -464821 -290633 -270104 144765 198185 127077 354568 -22387
2602 -22387 3051 492238 133929 153726 -184837 -322657 -484491 -400933 22551 -270107
2592 -270107 -454053 -639311 -560910 -520987 -453115 -657214 -541267 -444775 -482278 -627307 -636639
$$ packed form
2664c0669k013l6514k59077J53839r4383R153o5776M79389j07567l33163J86368
2653a00413N06043o7478k46831k02870O8110J80610k595j86608J45760k99481
2643b05753j13504K36551p7696J7746k2726K5732K14758j80699J06725K21518
2633B22652l04082k75701K40070j80231j31728J19406k5566R3497K59788J42447
2623A60552j12084k01583j56253M11286j78273l01210J36542N46308J08779n82521
2613a68457K5500Q7659J8737m28260J74188K0529M14869N3420p1108K27491l76955
2602b2387K5438M89187l58309J9797l38563j37820j61834Q3558M23484k92658
2592b70107j83946j85258P8401L9923O7872k04099J15947R6492l7503j45029r332
$$ plain form
2581 -636639 -463207 -366370 -132883 33597 8191 44463 -138796 -157348 316080 222753 -73463
2570 -73463 -147688 -8418 -426562 -394759 -139569 -309057 -30367 88870 51194 -187945
2560 -187945 -412755 -220536 -343561 -384843 -237370 -231883 -98823 -190171 -257556 -338668 -140524
2549 -140524 -245952 -104424 40320 70158 -354836 -416633 -297239 -73997 -147281 -92968
2539 -92968 6183 20804 128254 230372 196408 23854 29861 10755 573 -563726 -568957
2528 -568957 -306109 -239993 -174423 -504290 -296682 -266391 -317909 -76687 109264 -267600
2518 -267600 -239060 -323254 -177513 -84108 -88960 -228656 174094 264825 -133624 -38844 210522
2507 210522 89315 -268030 -239074 -74908 -208492 -409229 -77821 -204008 105551 187206
$$ packed form
2581f36639J73432R6837K33487J66480k5406L6272j83259j8552M73428r3327k96216
2570g3463p4225J39270m18144L1803K55190j69488K78690J19237l7676k39139
2560a87945k24810J92219j23025m1282J47473N487J33060r1348o7385q1112J98144
2549a40524j05428J41528J44744K9838m24994o1797J19394K23242p3284N4313
2539i2968R9151J4621J07450J02118l3964j72554O007j9106j0182n64299n231
2528e68957K62848O6116O5570l29867K07608L0291n1518K41222J85951l76864
2518b67600K8540q4194J45741R3405m852j39696M02750R0731l98449R4780K49366
2507B10522j21207l57345K8956J64166j33584k00737L31408j26187L09559Q1655
$$ plain form
2497 187206 70345 -222468 -372276 -228659 -154804 -56386 -82308 -66717 167517 -225139
2487 -225139 43621 87055 -7668 455157 359821 587620 232939 -133205 85239 179069
2477 179069 244218 530911 300156 75736 210026 192276 207662 128723 -412190 -157645
2467 -157645 -264741 -182469 -147774 -218340 -439214 -329794 -40711 -52413 -186113 -290355
2457 -290355 -73431 -284256 -309108 -76505 32269 -7323 45356 -228167 -70579 -237004
2447 -237004 -489596 -195637 39827 156359 40041 -434561 -541460 -351138 -95747 -130063
2437 -130063 19811 94137 59700 192122 339051 -296351 -225890 27784 56591 -226654
2427 -226654 -171223 -32633 64851 23284 293094 171979 -137136 6935 -129648 -200725
$$ packed form
2497A87206j16861k92813j49808J43617P3855R8418k5922J5591K34234l92656
2487b25139K68760M3434r4723M62825r5336K27799l54681l66144K18444R3830
2477A79069O5149K86693k30755k24420J34290j7750J5386p8939n40913K54545
2467a57645j07096Q2272L4695p0566k20874J09420K89083j1702j33700j04242
2457b90355K16924k10825k4852K32603J08774l9592N2679k73523J57588j66425
2447b37004k52592K93959K35464J16532j16318m74602j06899J90322K55391l4316
2437a30063J49874P4326l4437J32422J46929o35402P0461K53674K8807k83245
2427b26654N5431J38590R7484m1567K69810j21115l09115J44071j36583p1077
$$ plain form
2417 -200725 -201271 -133166 -77212 4548 -460932 -255762 11488 118848 -97209 -602636 -366160
2406 -366160 -369578 -507040 -258889 445226 251802 110861 368862 468673 350978 68051
2396 68051 -73043 -55668 -95399 199360 156187 130015 743667 547322 549772 562032 264880
2385 264880 514184 394794 506977 544657 520548 470128 807115 891981 1382988 1913058
2375 1913058 2438871 2681454 2340802 2242595 2329147 1862103 1201569 1135504 1081023 1083740 933405
2364 933405 868448 698740 742141 603010 349730 289896 380881 507626 437057 381851 390687
2353 390687 286373 407386 137084 365398 100892 -180083 82425 274471 128728 305839
2343 305839 405765 551621 341529 290955 169756 113134 213684 312256 115784 -128728
$$ packed form
2417b00725n46O8105N5954Q1760m65480K05170K67250J07360k16057n05427K36476
2406c66160l418j37462K48151P04115j93424j40941K58001R9811j17695k82927
2396F8051j41094J7375l9731K94759m3173k6172O13652j96345K450J2260k97152
2385B64880K49304j19390J12183L7680k4109n0420L36987Q4866M91007N30070
2375A913058N25813K42583l40652r8207Q6552m67044o60534o6065n4481K717j50335
2364I33405o4957j69708M3401j39131k53280n9834R0985J26745p0569n5206Q836
2353C90687j04314J21013k70302K28314k64506k80975K62508J92046j45743J77111
2343C05839R9926J45856k10092n0574j21199n6622J00550R8572j96472k44512
$$ plain form
2333 -128728 51259 -40617 -8079 127361 333205 126763 -202176 197584 401149 355491
2323 355491 114715 227540 172608 320844 449755 522958 763931 520481 237616 194058
2313 194058 274038 -87114 34922 316343 284625 18633 264050 122000 407969 776177
2303 776177 882218 684592 24722 120599 210829 243273 103218 701469 517591 433125
2293 433125 558935 581486 541615 984571 1237591 1296678 781580 867372 969266 1061135 1057970
2282 1057970 1385381 1408404 983386 779255 220753 375520 823509 1162969 1339067 1093025
2272 1093025 1113257 1432438 967388 1098748 756215 1147278 1255454 1257303 911975 691899
2262 691899 935433 1209799 1120115 1325461 1501257 1271268 1221279 1340920 1603247 1174612
$$ packed form
2333a28728J79987r1876L2538J35440K05844k06442l28939L99760K03565m5658
2323C55491k40776J12825n4932J48236J28911P3203K40973k43450k82865m3558
2313A94058P9980l61152J22036K81421l1718k65992K45417j42050K85969L68208
2303G76177J06041j97626o59870R5877R0230L2444j40055N98251j83878q4466
2293D33125J25810K2551l9871M42956K53020N9087n15098Q5792J01894R1869l165
2282A057970L27411K3023m25018k04131n58502J54767M47989L39460J76098k46042
2272A093025K0232L19181m65050J31360l42533L91063J08176J849l45328k20076
2262F91899K43534K74366q9684K05346J75796k29989m9989J19641K62327m28635
$$ plain form
2252 1174612 1401243 1295895 1166400 810896 1314557 1742246 1553534 1379611 1333611 1252566
2242 1252566 1055007 1081574 1335289 1410287 1196411 1227651 1164409 1270332 1498226 1631770
2232 1631770 1793862 1928556 1541707 1521084 1933808 1778338 1607153 1638777 1746466 1979210
2222 1979210 1723150 2322248 2280566 2430292 2459259 2613930 2702385 2797155 2826965 2771294 2491290
2211 2491290 2485100 2356595 2250000 2549821 2971075 2779744 2902638 3152615 3670060 3614159
2201 3614159 3370707 3264431 3240286 3445018 3712818 4116567 3968494 3967715 4022078 4401318
2191 4401318 4433164 4708801 4875617 5450430 5689099 5550956 5681912 6504234 6694352 6755304
2181 6755304 6774342 6825501 7118433 7314524 7483268 7680340 8202363 8459983 8852260 8885331
$$ packed form
2252A174612K26631j05348j29495l55504N03661M27689j88712j73923m6000q1045
2242A252566j97559K6567K53715P4998k13876L1240o3242J05923K27894J33544
2232A631770J62092J34694l86849k0623M12724j55470j71185L1624J07689K32744
2222A979210k56060N99098m1682J49726K8967J54671Q8455R4770K9810n5671k80004
2211B491290o190j28505j06595K99821M21254j91331J22894K49977N17445n5901
2201C614159k43452j06276k4145K04732K67800M03749j48073p79N4363L79240
2191D401318L1846K75637J66816N74813K38669j38143J30956Q22322J90118O0952
2181F755304J9038N1159K92932J96091J68744J97072N22023K57620L92277L3071
$$ plain form
2171 8885331 9148598 9739782 9640943 9657473 9931641 10506691 11022026 11429491 11550752 11541202
2161 11541202 11996972 12250317 12685036 12770006 13523613 13375702 13522805 13570844 14059507 14586034
2151 14586034 15324186 15649968 16186712 16643678 17062985 17638825 18466961 19091048 20146734
2142 20146734 21404012 22271451 23356943 24565686 25755092 27182002 28575605 30274318
2134 30274318 31592715 33323720 35097105 37060293 38762206 41110434 43733041 46434508
2126 46434508 49066862 52878924 57548475 63294146 69647960 76085829 80900521 85735475
2118 85735475 91881286 99802908 109487468 123093807 140729592 162477719 191312125 226591269
2110 226591269 269770239 333681104 415988087 486763254 506883593 438223028 350794155
$$ packed form
2171H885331K63267N91184r8839J6530K74168N75050N15335M07465J21261r550
2161A1541202M55770K53345M34719Q4970P53607j47911J47103M8039M88663N26527
2151A4586034P38152L25782N36744M56966M19307N75840Q28136O24087J055686
2142B0146734J257278Q67439J085492J208743J189406J426910J393603J698713
2134C0274318J318397J731005J773385J963188J701913K348228K622607K701467
2126D6434508K632354L812062M669551N745671O353814O437869M814692M834954
2118H5735475O145811P921622R684560J3606339J7635785K1748127K8834406L5279144
2110B26591269M3178970O3910865Q2306983P0775167K0120339o8660565q7428873
$$ plain form
2103 350794155 282396753 229873817 190190521 159766010 137894233 120954905 107391785
2096 107391785 96758220 88367362 81601792 77471798 73611439 69551819 63882761 58343768
2088 58343768 53121932 49498555 45724419 42595236 40013405 38062567 36174208 34708660
2080 34708660 33077141 31470234 29516579 28393853 26684347 25413164 24408710 23423183
2072 23423183 22287181 21456980 20417936 19460984 18764244 18262437 17688394 16989612 15999243
2063 15999243 15514852 14890455 14843888 14672937 14310019 13413467 12942925 12300991 11972942 11395348
2053 11395348 11110921 10970892 11121134 10781084 10435977 9973462 9901889 9477919 9256889 9022912
2043 9022912 9150549 8774884 8984007 8890050 8752403 8156208 8160552 7998404 7660984 7345993
$$ packed form
2103C50794155o8397402n2522936l9683296l0424511k1871777j6939328j3563120
2096A07391785j0633565q390858o765570m129994l860359m059620n669058n538993
2088E8343768n221836l623377l774136l129183k581831j950838j888359j465548
2080C4708660j631519j606907j953655j122726j709506j271183j004454r85527
2072B3423183j136002q30201j039044r56952o96740n01807n74043o98782r90369
2063A5999243m84391o24397m6567j70951l62918q96552m70542o41934l28049n77594
2053A1395348k84427j40029J50242l40050l45107m62515p1573m23970k21030k33977
2043I022912J27637l75665K09123r3957j37647n96195M344j62148l37420l14991
$$ plain form
2033 7345993 7156214 7203815 6705930 6332265 6346778 5952301 5554335 5315030 5357034 5103152
2023 5103152 4779044 4587041 4455079 4191070 4445372 4473576 4168540 4130755 4390969 4379693
2013 4379693 3930994 3737197 3627440 3619795 3979096 3740836 3870315 3801926 3438671 3522300
2003 3522300 3537817 3502673 3227401 3166633 2999782 3313035 3122538 2633305 2544673 2555793
1993 2555793 2376015 2635364 2537118 2608736 2435409 2480881 2593112 2450346 2361410 2676353
1983 2676353 2520458 2513775 2212503 2105480 1886213 1949911 2086206 1822838 2090533 1924198
1973 1924198 1853966 1963633 1989341 2081010 1783402 1806053 1981697 2265936 1765157 1665836
1963 1665836 1754746 1546198 1683476 1378538 1318238 1396222 1119480 1357853 1466742 1264310
$$ packed form
2033G345993j89779M7601m97885l73665J4513l94477l97966k39305M2004k53882
2023E103152l24108j92003j31962k64009K54302K8204l05036l7785K60214j1276
2013D379693m48699j93797j09757p645L59301k38260J29479o8389l63255Q3629
2003C522300J5517l5144k75272o0768j66851L13253j90497m89233q8632J1120
1993B555793j79778K59349r8246P1618j73327M5472J12231j42766q8936L14943
1983B676353j55895o683l01272j07023k19267O3698J36295k63368K67695j66335
1973A924198p0232J09667K5708R1669k97608K2651J75644K84239n00779r9321
1963A665836Q8910k08548J37278l04938o0300P7984k76742K38373J08889k02432
$$ plain form
1953 1264310 947638 1155262 1615746 1261725 1190991 1002992 1044219 1076989 1414641 1441585
1943 1441585 1350868 1366386 1342283 1380221 1288274 1452600 1440334 994640 339112 854858 817792
1932 817792 700259 912525 739896 216104 403247 539375 900700 658743 903564 1081502
1922 1081502 1184756 1055356 1111827 849893 560213 699014 776086 422513 340597 29409
1912 29409 157973 453127 559456 790227 623944 666864 782759 724968 559003 453771
1902 453771 630796 561406 573237 460802 536471 433055 83295 56135 433923 426777 243124
1891 243124 568547 200243 527900 822908 723444 383710 542436 624745 937526 627170
1881 627170 947473 907676 1206498 999321 622147 969426 672643 721526 963668 648465
$$ packed form
1953A264310l16672K07624M60484l54021p0734j87999M1227L2770L37652K6944
1943A441585r0717J5518k4103L7938r1947J64326j2266m45694o55528N15746l7066
1932H17792j17533K12266j72629n23792J87143J36128L61325k41957K44821J77938
1922A081502J03254j29400N6471k61934k89680J38801P7072l53573q1916l11188
1912B9409J28564K95154J06329K30771j66283M2920J15895n7791j65965j05232
1902D53771J77025o9390J1831j12435P5669j03416l49760k7160L77788p146j83653
1891B43124L25423l68304L27657K95008r9464l39734J58726Q2309L12781l10356
1881F27170L20303l9797K98822k07177l77174L47279k96783M8883K42142l15203
$$ plain form
1871 648465 613549 727682 476965 319892 454687 556184 628447 541724 787932 582375
1861 582375 82134 139026 608960 841856 845731 998039 1008538 849775 912524 742601 651209
1850 651209 498588 346576 742758 1129359 651920 961350 1390810 1249518 1438906 1940482
1840 1940482 2398161 2539705 2682765 2686604 2415908 1999573 1655062 1513212 1405645 1282293
1830 1282293 1026879 633654 895695 994826 759386 668291 560227 489413 714928 539086
1820 539086 513160 768821 860422 788724 700948 650383 980851 865147 836515 666451 414901
1809 414901 561638 763600 678947 538077 694243 789146 624121 514508 262534 100609
1799 100609 284894 582006 233702 171496 488738 155541 131577 -108810 177884 216049
$$ packed form
1871F48465l4916J14133k50717j57073J34795J01497P2263q6723K46208k05557
1861E82375n00241N6892M69934K32896L875J52308J0499j58763O2749j69923r1392
1850F51209j52621j52012L96182L86601m77439L09430M29460j41292J89388N01576
1840A940482M57679J41544J43060L839k70696m16335l44511j41850j07567j23352
1830A282293k55414l93225K62041R9131k35440r1095j08064p0814K25515j75842
1820E39086k5926K55661R1601p1698q7776n0565L30468j15704k8632j70064k51550
1809D14901J46737K01962q4653j40870J56166R4903j65025j09613k51974j61925
1799A00609J84285K97112l48304o2206L17242l33197k3964k40387K86694L8165
$$ plain form
1789 216049 104444 66367 -177944 -331425 -156322 -12634 -110358 8769 206047 160397
1779 160397 224985 230036 366171 387245 270235 67363 64285 -33237 -65340 -174705 -381173
1768 -381173 -274330 -24712 124947 91599 -281450 -145945 22000 227987 51582 -154338
1758 -154338 60209 398057 466201 -134397 79156 259946 362575 224737 495213 413360
1748 413360 -39564 9642 184354 -126791 -143687 -131607 -76912 141210 168441 -97979 209309
1737 209309 209821 -100438 -278725 -330998 44068 409280 67715 184055 158329 -32204 -72059
1726 -72059 241092 -160221 -377421 -309953 -156600 156339 65286 -174215 -118513 20108
1716 20108 154064 -242066 -33095 -211245 -251462 161619 53293 -4292 -341526 -426810
$$ packed form
1789B16049j11605l8077k44311j53481J75103J43688r7724J19127J97278m5650
1779A60397O4588N051J36135K1074j17010k02872l078r7522l2103j09365k06468
1768c81173J06843K49618J49659l3348l73049J35505J67945K05987j76405k05920
1758a54338K14547L37848O8144o00598K13553J80790J02629j37838K70476q1853
1748D13360m52924M9206J74712l11145j6896J2080N4695K18122K7231k66420L07288
1737B09309N12l10259j78287n2273L75066L65212l41565J16340k5726j90533l9855
1726g2059L13151m01313k17200O7468J53353L12939r1053k39501N5702J38621
1716B0108J33956l96130K08971j78150m0217M13081j08326n7585l37234q5284
$$ plain form
1706 -426810 -735625 -593923 -323573 -293426 -378956 27634 -146310 202551 258020 48589
1696 48589 -2053 164859 329721 718281 368187 270778 -73096 -249683 -217040 -48181
1686 -48181 -175847 -26482 -276475 -783208 -81328 862 -55673 77593 329399 70577
1676 70577 -208615 -206031 13393 463903 341693 335930 214777 464369 331088 -31711 -8961
1665 -8961 -4418 234354 105653 -420991 -502505 -341568 -290132 -60174 73595 -188535 -199773
1654 -199773 -379976 -183627 -111099 -26563 -132995 92756 526335 209270 -130651 -401974
1644 -401974 -377527 -358143 -452415 -312308 -198493 -362603 -214883 -196769 101288 106722 -17506
1633 -17506 -291326 -211157 -310066 -429981 -256010 -211866 -144034 -70543 -3463 -69571 44546
$$ packed form
1706d26810l08815J41702K70350L0147q5530M06590j73944L48861N5469k09431
1696D8589n0642J66912J64862L88560l50094r7409l43874j76587L2643J68859
1686d8181j27666J49365k49993n06733P01880Q2190n6535J33266K51806k58822
1676G0577k79192K584K19424M50510j22210n763j21153K49592j33281l62799K2750
1665h961M543K38772j28701n26644q1514J60937N1436K29958J33769k62130j1238
1654a99773j80203J96349P2528Q4536j06432K25751M33579l17065l39921k71323
1644d01974K4447J9384r4272J40107J13815j64110J47720J8114K98057N434j24228
1633a7506k73820Q0169r8909j19915J73971M4144O7832P3491O7080o6108J14117
$$ plain form
1622 44546 161659 -118428 -231514 -403199 -56835 -94705 -292199 -441492 13990 239282
1612 239282 75827 -25375 188140 -221234 -106326 204118 -20182 -241531 -143609 90608
1602 90608 121397 3846 -365060 -476495 14679 23334 86014 116723 -52883 -250349 -416633
1591 -416633 -278201 -325805 -523201 -726221 -423259 -180556 -31151 238921 -324686 -287328
1581 -287328 -117393 -16978 -211974 -260301 -92242 80370 -140615 -190637 -129983 -252106
1571 -252106 34914 -124205 -105316 -246247 -119452 207574 168533 -413877 -161804 101979
1561 101979 -45374 -188460 157409 176286 282958 67893 24401 -204617 -66858 -161535
1551 -161535 71862 -35441 -102348 22040 -224289 -274906 -193692 -77513 28439 -126981
$$ packed form
1622D4546J17113k80087j13086j71685L46364l7870j97494j49293M55482K25292
1612B39282j63455j01202K13515m09374J14908L10444k24300k21349R7922K34217
1602I0608L0789j17551l68906j11435M91174Q655O2680L0709j69606j97466j66284
1591d16633J38432m7604j97396k03020L02962K42703J49405K70072n63607L7358
1581b87328J69935J00415j94996m8327J68059J72612k20985n0022O0654j22123
1571b52106K87020j59119J8889j40931J26795L27026l9041n82410K52073K63783
1561A01979j47353j43086L45869J8877J06672k15065m3492k29018J37759r4677
1551a61535K33397j07303o6907J24388k46329n0617Q1214J16179J05952j55420
$$ plain form
1541 -126981 -192103 -77994 -37774 55985 249537 33646 -266708 17079 87661 99604 49548
1530 49548 -71032 176788 131285 359683 318545 224609 411958 413197 254231 -208568 -422233
1519 -422233 -28121 74190 479160 340072 104552 234042 -277560 -537515 -253701 -79131
1509 -79131 -386768 -285467 54324 65753 -165731 -129327 -86906 -240785 -79118 -48927 -53873
1498 -53873 -27878 138207 -169681 -379035 -222339 -358494 84899 16578 -48767 -177346
1488 -177346 -338780 -75163 13685 -141441 -128418 -245815 -464490 -538280 -210323 -200598 -84705
1477 -84705 56215 -68073 -220376 -225274 12406 -28487 -205777 -501625 -562218 -77750 238918
1466 238918 -259662 -265376 -338670 -231683 -120099 -220381 -69481 -78015 -63169 192852 271820
$$ packed form
1541a26981o5122J14109M0220R3759J93552k15891l00354K83787P0582J1943n0056
1530D9548j20580K47820m5503K28398m1138r3936J87349J239j58966m62799k13665
1519d22233L94112J02311M04970j39088k35520J29490n11602k59955K83814J74570
1509g9131l07637J01301L39791J1429k31484L6404M2421j53879J61667L0191m946
1498e3873K5995J66085l07888k09354J56696j36155M43393o8321o5345j28579
1488a77346j61434K63617Q8848j55126J3023j17397k18675p3790L27957R725J15893
1477h4705J40920j24288j52303m898K37680m0893j77290k95848o0593M84468L16668
1466B38918m98580n714p3294J06987J11584j00282J50900q534J4846K56021P8968
$$ plain form
1455 271820 34314 -93617 -2465 373685 196995 61848 106310 -85792 -408852 -384071
1445 -384071 -210925 99326 -4869 38674 -47501 -57995 -347477 -227324 -342654 -335260 -81081
1434 -81081 35235 -1837 -49299 -216003 -73754 -35843 38236 -57935 -265155 -425586 -235690
1423 -235690 -221700 -334889 120569 214817 -175577 -285152 -215566 -310209 -320280 80312 444696
1412 444696 70762 -174796 -195200 -226865 -291807 74583 252637 -9854 -15314 267404 374146
1401 374146 63845 112690 71083 91461 -102567 -221077 -254274 -196877 12350 -83853 23052
1390 23052 -27409 -246080 -481709 -231766 -82194 -167194 -106002 149600 -121763 -560263
1380 -560263 -141527 -154920 -178297 312622 136738 1523 -251112 -255714 4086 139904
$$ packed form
1455B71820k37506j27931R1152L76150j76690j35147M4462j92102l23060K4781
1445c84071J73146L10251j04195M3543q6175j0494k89482J20153j15330P394K54179
1434h1081J16316l7072m7462j66704J42249L7911P4079r6171k07220j60431J89896
1423b35690J3990j13189M55458R4248l90394j09575O9586r4643j0071M00592L64384
1412D44696l73934k45558k0404l1665o4942L66390J78054k62491n460K82718J06742
1401C74146l10301M8845m1607K0378j94028j18510l3197N7397K09227r6203J06905
1390B3052n0461k18671k35629K49943J49572q5000O1192K55602k71363m38500
1380e60263M18736j3393k3377M90919j75884j35215k52635m602K59800J35818
$$ plain form
1370 139904 375282 245911 -30272 164415 279934 86915 62010 -185775 -550131 -145177
1360 -145177 55697 293556 172676 -60261 -46973 -112615 -286316 -71213 -77305 271038
1350 271038 411088 221773 -38174 -370345 -216936 140060 33615 186297 -183977 -424083
1340 -424083 -223774 -211291 -132681 -96878 167556 126975 -295864 -233819 30663 267201 287516
1329 287516 -29974 -293903 -9344 56019 -130794 -54842 -168020 -138776 245423 31369
1319 31369 -84060 200711 139403 111401 193705 277747 -47392 -299868 -72066 -23509 -334154
1308 -334154 -215054 73112 199687 116410 534186 349397 -27271 190476 83726 -27615
1298 -27615 -149372 -96214 -94926 182726 67571 422993 580318 133759 -216999 -247195 43943
$$ packed form
1370A39904K35378j29371k76183J94687J15519j93019k4905k47785l64356M04954
1360a45177K00874K37859j20880k32937J3288o5642j73701K15103o092L48343
1350B71038J40050j89315k59947l32171J53409L56996j06445J52682l70274k40106
1340d24083K00309J2483P8610L5803K64434m0581m22839O2045K64482K36538K0315
1329B87516l17490k63929K84559O5363j86813P5952j13178K9244L84199k14054
1319C1369j15429K84771o1308k8002Q2304Q4042l25139k52476K27802M8557l10645
1308c34154J19100K88166J26575q3277M17776j84789l76668K17747j06750j11341
1298b7615j21757N3158J288K77652j15155L55422J57325m46559l50758l0196K91138
$$ plain form
1287 43943 -95116 -18803 -114186 -205408 22690 -164274 -39593 -54191 -123004 69664 -356222
1276 -356222 -370814 -68659 179334 -18314 -135657 -231094 -515953 -259595 111331 23417
1266 23417 128723 17325 146566 -132108 -254620 -46960 -324986 -377681 -12746 -267447
1256 -267447 -121692 120065 249238 -54246 -297521 -247258 -285635 -827400 -614952 -60594
1246 -60594 -585205 -628751 -2608 15897 -365889 -376693 -504597 -119423 -3228 -110916
1236 -110916 329502 -242818 -364247 85206 77396 -396900 -107868 212753 -43869 -120498
1226 -120498 -106617 -84639 -239898 -27363 205698 314695 -80672 -247706 -89575 -351408
1216 -351408 -411161 -294114 -279984 -198490 -417195 -134575 74456 -34093 -68065 -375182
$$ packed form
1287D3943j39059P6313r5383r1222K28098j86964J24681j4598o8813J92668m25886
1276c56222j4592L02155K47993j97648j17343r5437k84859K56358L70926q7914
1266B3417J05306j11398J29241k78674j22512K07660k78026n2695L64935k54701
1256b67447J45755K41757J29173l03484k43275N0263l8377n41765K12448N54358
1246f0594n24611m3546O26143J8505l81786j0804j27904L85174J16195j07688
1236a10916M40418n72320j21429M49453p810m74296K89032L20621k56622p6629
1226a20498J3881K1978j55259K12535K33061J08997l95367j67034J58131k61833
1216c51408n9753J17047J4130Q1494k18705K82620K09031j08549l3972l07117
$$ plain form
1206 -375182 -430321 -144698 170181 244017 -141716 -209357 192631 139478 -178643 -445236
1196 -445236 -561331 -439736 -811764 -805866 -437352 -214666 -551691 -240206 53977 101170
1186 101170 301112 337890 -41713 -134261 150388 7339 -85012 -98435 -189555 -97700 -64943
1175 -64943 -256975 -183799 227356 67253 -327582 -412877 -526496 -71901 275953 302430
1165 302430 326164 348550 -178953 -405350 -405981 -374301 -87806 -129599 -290021 -6940 195224
1154 195224 30317 -5569 -110311 -128678 -331101 -432056 -528750 -511110 -172609 -97251 9287
1143 9287 192851 122051 -36281 17461 374998 94597 -29708 -140033 -82125 91427 353324
1132 353324 257203 -125419 414200 220536 -15239 77817 106172 -102353 -186477 -63288
$$ packed form
1206c75182n5139K85623L14879P3836l85733o7641M01988n3153l18121k66593
1196d45236j16095J21595l72028N898L68514K22686l37025L11485K94183M7193
1186A01170J99942L6778l79603r2548K84649j43049r2351j3423r1120R1855L2757
1175f4943j92032P3176M11155j60103l94835q5295j13619M54595L47854K6477
1165C02430K3734K2386n27503k26397o31L1680K86495m1793j60422K83081K02164
1154A95224j64907l5886j04742j8367k02423j00955r6694J7640L38501P5358J06538
1143I287J83564p0800j58332N3742L57537k80401j24305j10325N7908J73552K61897
1132C53324r6121l82622N39619j93664k35775R3056K8355k08525q4124J23189
$$ plain form
1122 -63288 -346796 -522119 -303262 13890 -107516 -251688 -100611 -554108 -267994 -227739
1112 -227739 -145247 408529 253135 22728 167487 131062 -135165 -304281 -133049 -72960
1102 -72960 -29323 288801 331058 58662 332277 -47362 -333364 -372810 -532882 -431246
1092 -431246 -374306 -198057 -542917 -506429 -534457 -176861 -82525 -489339 -342416 265077
1082 265077 385974 6440 -275678 -195692 30113 305755 248738 322316 156904 -113610
1072 -113610 -308500 154727 45501 71536 73763 203826 -37084 -62368 79289 -19762 -19446
1061 -19446 24211 328974 188874 210095 566215 159434 -175267 -260922 -160623 88785
1051 88785 351697 459682 504744 -19599 -314690 -491934 -424979 -162968 -363441 -68779
$$ packed form
1122f3288k83508j75323K18857L17152j21406j44172J51077m53497K86114M0255
1112b27739Q2492N53776j55394k30407J44759l6425k66227j69116J71232O0089
1102g2960M3637L18124M2257k72396K73615l79639k86002l9446j60072J01636
1092d31246N6940J76249l44860L6488k8028L57596R4336m06814J46923O07493
1082B65077J20897l79534k82118P9986K25805K75642n7017P3578j65412k70514
1072a13610j94890M63227j09226K6035K227J30063k40910k5284J41657r9051L16
1061a9446M3657L04763j40100K1221L56120m06781l34701q5655J00299K49408
1051H8785K62912J07985M5062n24343k95091j77244O6955K62011k00473K94662
$$ plain form
1041 -68779 -147128 -142772 -305146 -346997 -97316 -95608 -263616 -34134 -315695 -182364 -133521
1030 -133521 -160407 -342779 -127247 -37834 -254243 -388305 -140975 -231378 -344015 -197324
1020 -197324 -19426 22016 -307330 -297048 61455 58068 -124749 -372078 -452001 -411503 166622
1009 166622 231010 146507 35705 -122002 -112752 -150195 -378639 -338577 -656601 -246174 134827
998 134827 139589 -51580 -264669 -59544 -533456 -7620 165026 -38059 153723 179833
988 179833 39338 287222 304897 59902 164166 636770 294667 -51653 -152329 -184243
978 -184243 -308384 -227950 -140722 -292405 -150479 -199496 -195220 -176846 -123006 -94490 55800
967 55800 339679 235225 165282 260495 -75703 -199511 -50463 -315981 -483124 -263468
$$ packed form
1041f8779p8349M356j62374m1851K49681J708j68008K29482k81561J33331M8843
1030a33521k6886j82372K15532Q9413k16409j34062K47330r0403j12637J46691
1020a97324J77898M1442l29346J0282L58503l387j82817k47329p9923M0498N78125
1009A66622O4388q4503j10802j57707R250l7443k28444M0062l18024M10427L81001
998A34827M762j91169k13089K05125m73912N25836J72646k03085J91782K6110
988A79833j40495K47884J7675k44995J04264M72604l42103l46320j00676l1914
978a84243j24141Q0434Q7228j51683J41926m9017M276J8374N3840K8516J50290
967E5800K83879j04454o9943R5213l36198j23808J49048k65518j67143K19656
$$ plain form
957 -263468 201457 -70777 -95361 62291 -149118 -282020 186376 63712 -167002 171944
947 171944 -38478 -246372 -72800 200132 95029 144487 537 246839 -192475 -399987
937 -399987 104187 159921 166871 -116465 -190461 -35731 73254 -64195 -237336 -201361 -112605
926 -112605 -439572 -172920 -123186 -160098 -239465 43707 488837 374352 503038 213953
916 213953 340888 430752 180499 195519 -204263 -103337 253669 61836 13397 -34638 -209628
905 -209628 -76979 38766 152345 7142 70857 217715 28236 -224630 -567071 -36617
895 -36617 -258740 -343234 -153621 -220048 -102289 -176868 -94764 49551 116158 -178072 -75833
884 -75833 -106951 -25450 334390 61332 -112618 -147979 -72963 -115631 367798 563616 297874
$$ packed form
957b63468M64925k72234k4584J57652k11409j32902M68396j22664k30714L38946
947A71944k10422k07894J73572K72932j05103M9458j43950K46302m39314k07512
937c99987N04174N5734O950k83336p3996J54730J08985j37449j73141L5975Q8756
926a12605l26967K66652M9734l6912p9367K83172M45130j14485J28686k89085
916B13953J26935Q9864k50253J5020l99782J00926L57006j91833m8439m8035j74990
905b09628J32649J15745J13579j45203O3715J46858j89479k52866l42441N30454
895c6617k22123q4494J89613o6427J17759p4579Q2104J44315O6607k94230J02239
884g5833l1118Q1501L59840k73058j73950l5361P5016m2668M83429J95818k65742
$$ plain form
873 297874 195895 -37114 -427504 -282195 -45879 59390 6607 96354 -135286 105935
863 105935 394147 50402 -1166 -105300 -506978 -151647 566018 478703 87017 -212855
853 -212855 -18274 -178363 -325450 -180852 194807 69556 -175762 -159197 95289 -29487
843 -29487 132928 -37991 -358090 -107326 94164 310037 299355 61938 77783 -424902
833 -424902 -309881 -131384 591925 632446 476617 121794 402340 438612 -40592 -285850
823 -285850 -315637 -302538 -532814 -120490 47581 -155650 129539 217961 -445178 -353263 -101338
812 -101338 197496 -2067 37695 -52285 107342 177666 -27761 352642 425862 356755 521755
801 521755 124417 1451 -162707 -78786 131278 393574 14285 -152987 -167756 -176197 -51389
$$ packed form
873B97874j01979k33009l90390J45309K36316J05269n2783Q9747k31640K41221
863A05935K88212l43745n1568j04134m01678L55331P17665q7315l91686k99872
853b12855J94581j60089j47087J44598L75659j25251k45318J6565K54486j24776
843b9487J62415j70919l20099K50764K01490K15873j0682k37417J5845n02685
833d24902J15021J78497P23309M0521j55829l54823K80546L6272m79204k45258
823b85850k9787J3099k30276M12324J68071k03231K85189Q8422o63139R1915K51925
812a01338K98834j99563L9762q9980J59627P0324k05427L80403P3220o9107J65000
801E21755l97338j22966j64158Q3921K10064K62296l79289j67272j4769q441J24808
$$ plain form
790 -51389 25421 139749 96168 -67284 41540 124103 30180 425700 251310 115429 -186957
779 -186957 -525800 -741004 -370157 -14449 85018 152976 228978 15578 84947 192309 -122776
768 -122776 226745 253803 112458 -133863 18671 241603 212390 45023 -21728 -14341 465311
757 465311 353167 364473 284696 192906 -173003 -467059 -320580 -376277 -409367 -272687 -16700
746 -16700 -82415 -381937 -264377 286592 66637 -253576 -297596 -271054 146787 268168 189698
735 189698 109576 -289451 -417477 -172321 57724 79568 198366 193622 -153212 -12980 186999
724 186999 392043 392032 185160 -81810 -176103 -341648 -395125 -339438 -190545 -76506 -15688
713 -15688 -122536 78637 197409 -258074 -331545 25707 17080 -283041 130328 -28244 353392
$$ packed form
790e1389P6810J14328m3581j63452J08824Q2563r3923L95520j74390j35881l02386
779a86957l38843k15204L70847L55708R9467O7958P6002k13400O9369J07362l15085
768a22776L49521K7058j41345k46321J52534K22932k9213j67367o6751P387M79652
757D65311j12144J1306p9777r1790l65909k94056J46479n5697l3090J36680K55987
746a6700o5715k99522J17560N50969k19955l20213m4020K6542M17841J21381p8470
735A89698q0122l99027j28026K45156K30045K1844J18798m744l46834J40232J99979
724A86999K05044j1k06872k66970r4293j65545n3477N5687J48893J14039O0818
713a5688j06848K01173J18772m55483p3471L57252q627l00121M13369j58572L81636
$$ plain form
702 353392 235854 107455 3941 -112645 -41073 68778 160256 238881 293790 283890 357675
691 357675 147584 83524 -44473 -100901 5432 -163990 -211703 -193322 -151359 -172581 -22880
680 -22880 -91221 12711 124672 -76368 -325983 -251364 -141535 -107166 157281 177760 -22017
669 -22017 -228218 -140683 177589 258223 168523 52585 40285 -42343 -14332 21050 -165443
658 -165443 -39626 81671 -53423 94397 408699 298766 299822 387975 197490 65438
648 65438 299923 254257 -199634 -93940 -178089 -168228 120750 -229674 -247559 -229445 4737
637 4737 228907 423618 330155 -101646 49877 211700 151525 -203491 -195264 -109204 -99227
626 -99227 -251741 -467754 -310338 -359852 -142664 -214597 -45985 -136927 75069 181967 -428822
$$ packed form
702C53392j17538j28399j03514j16586P1572J09851R1478P8625N4909r900P3785
691C57675k10091o4060j27997n6428J06333j69422m7713J8381M1963k1222J49701
680b2880o8341J03932J11961k01040k49615P4619J09829L4369K64447K0479j99777
669b2017k06201Q7535L18272Q0634q9700j15938j2300q2628K8011L5382j86493
658a65443J25817J21297j35094J47820L14302j09933J056Q8153j90485j32052
648F5438K34485m5666m53891J05694q4149R861K88978l50424j7885J8114K34182
637D737K24170J94711r3463m31801J51523J61823o0175l55016Q227Q6060R977
626i9227j52514k16013J57416m9514K17188p1933J68612r0942K11996J06898o10789
$$ plain form
615 -428822 -113193 72405 43678 71187 -224871 -157631 153294 -8348 -269214 -215789 -400392
604 -400392 -414919 -47404 -186913 70178 99820 135547 70001 -38176 311499 131008 -190380
593 -190380 21572 150834 -132812 -96500 214957 395691 155328 -27561 -108922 67016
583 67016 421285 204639 214518 254064 174854 599516 79679 -13775 156687 330904 488007
572 488007 297258 50036 102777 366092 -949 -113485 -258016 65720 9536 -38264
562 -38264 -51214 -98537 -16918 -159806 -424076 -166195 -121020 -352902 -468559 -473344 -276824
551 -276824 -186652 199715 441680 103864 -169256 -82544 -41137 40632 -103857 59181 527647
540 527647 314163 36594 -42384 -49100 563930 514596 178305 140889 38009 -41869 315221
$$ packed form
615d28822L15629J85598k8727K7509k96058O7240L10925j61642k60866N3425j84603
604d00392j4527L67515j39509K57091K9642L5727o5546j08177L49675j80491l21388
593a90380K11952J29262k83646L6312L11457J80734k40363j82889q1361J75938
583F7016L54269k16646R879L9546p9210M24662n19837r3454J70462J74217J57103
572D88007j90749k47222N2741K63315l67041j12536j44531L23736n6184m7800
562c8264j2950m7323Q1619j42888k64270K57881M5175k31882j15657m785J96520
551b76824R0172L86367K41965l37816k73120Q6712M1407Q1769j44489J63038M68466
540E27647k13484k77569p8978o716O13030m9334l36291l7416j02880p9878L57090
$$ plain form
529 315221 55884 -6352 -14195 -235668 29872 259026 444073 294034 382351 91090 60412
518 60412 212180 264913 585975 98522 -78705 -121196 15910 -3025 -50431 -402446 -148743
507 -148743 -192608 28534 422497 430630 -13128 151685 380919 110465 117908 -36827 188192
496 188192 -108084 74418 -138148 -297267 -110937 41436 370669 625453 539098 407341
486 407341 213276 76088 -122811 171407 316946 134281 592394 141882 -195200 142403
476 142403 339428 127114 239654 448178 581649 48114 270155 537931 330072 315116
466 315116 175660 303730 152011 100815 203439 439749 75773 200693 89416 -28066
456 -28066 -125136 173810 378054 91493 -16559 184876 259577 138277 -19921 -25598 84552
$$ packed form
529C15221k59337o2236p843k21473K65540K29154J85047j50039Q8317k91261l0678
518F0412J51768N2733L21062m87453j77227m2491J37106j8935m7406l52015K53703
507a48743m3865K21142L93963Q133m43758J64813K29234k70454P443j54735K25019
496A88192k96276J82502k12566j59119J86330J52373L29233K54784q6355j31757
486D07341j94065j37188j98899K94218J45539j82665M58113m50512l37082L37603
476A42403J97025k12314J12540K08524J33471n33535K22041K67776k07859j4956
466C15116j39456J28070j51719n1196J02624K36310l63976J24920j11277j17482
456b8066r7070K98946K04244k86561j08052K01435P4701j21300j58198n677J10150
$$ plain form
445 84552 152633 104352 467345 474800 418723 291927 356417 331390 110784 298724 83808
434 83808 -222566 292083 524072 194628 -94533 -4461 290528 223739 408960 273644
424 273644 254201 231417 63557 295109 482573 353487 375950 62258 -169303 172050
414 172050 -136186 -80244 85983 21876 54785 130238 21357 237846 33134 17242 140317
403 140317 224051 502051 363469 689839 588659 222748 96671 -71291 -140434 -139812 -238175
392 -238175 -223909 -25391 91114 -207952 -269824 -262552 -82761 -170206 -68887 293314 85867
381 85867 242890 657487 651852 284878 288032 500367 733700 502096 -24008 -58750 185411
370 185411 298688 110425 39590 45990 35341 222027 206884 -61349 -47346 -216318 43374
$$ packed form
445H4552O8081m8281L62993P455n6077j26796O4490k5027k20606J87940k14916
434H3808l06374N14649K31989l29444k89161R0072K94989o6789J85221j35316
424B73644j9443k2784j67860K31552J87464j29086K2463l13692k31561L41353
414A72050l08236N5942J66227o4107L2909P5453j08881K16489k04712j5892J23075
403A40317Q3734K78000j38582L26370j01180l65911j26077j67962o9143O22r8363
392b38175J4266J98518J16505k99066o1872P272J79791q7445J01319L62201k07447
381H5867J57023M14597n635l66974L154K12335K33333k31604n26104l4742K44161
370A85411J13277j88263p0835O400j0649J86686j5143k68233J4003j68972K59692
$$ plain form
359 43374 -81670 104455 -46260 -203962 23425 248176 453917 374844 262376 315503
349 315503 501382 420749 392893 384231 276507 287861 225507 -16597 -69594 244528 379986
338 379986 -37975 105067 215824 7683 -82426 23497 145205 443403 288779 78979
328 78979 333843 420469 304146 320559 262326 62730 56937 138858 616632 303580 148448
317 148448 264807 347249 -60339 -39929 -238106 -317379 -205189 150353 188943 11108 138547
306 138547 459279 591046 517672 365486 231651 288865 102000 -101627 351595 434669
296 434669 108077 -231824 -288285 -142585 -160114 21174 -75888 85396 86059 217563 -7229
285 -7229 288279 403772 309171 452775 329807 -11219 179485 -25542 200146 262528 457368
$$ packed form
359D3374j25044J86125j50715j57702K27387K24751K05741p9073j12468N3127
349C15503J85879q0633k7856q662j07724J1354o2354k42104n2997L14122J35458
338C79986m17961J43042J10757k08141r0109J05923J21708K98198j54624k09800
328G8979K54864Q6626j16323J6413n8233j99596n793Q1921M77774l13052j55132
317A48448J16359Q2442m07588K0410j98177p9273J12190L55542L8590j77835J27439
306A38547L20732J31767p3374j52186j33835N7214j86865k03627M53222Q3074
296D34669l26592l39901n6461J45700j7529J81288r7062J61284O63J31504k24792
285g229K95508J15493r4601J43604j22968l41026J90704k05027K25688O2382J94840
$$ plain form
274 457368 830914 627607 209754 276361 148722 31996 94558 401491 304485 -55641
264 -55641 -324177 -498006 -124467 340824 70313 25714 103273 10879 -313366 -303169 270964
253 270964 266357 513150 471976 506319 433617 60245 339943 639825 761560 526544 313528
242 313528 236997 -35493 81259 -55231 -95425 138382 84124 293200 491738 133172
232 133172 107970 -49247 -244462 8300 53650 5951 41434 50089 44400 -175905 4665
221 4665 65314 -140446 -205681 -525736 -271998 -208329 -289622 345284 636686 490551 382012
210 382012 377499 350323 496817 186469 14336 414375 556393 542313 241872 460827 360001
199 360001 -74065 176747 413712 485113 -14822 173435 69019 -22681 87603 48872
$$ packed form
274D57368L73546k03307m17853O6607j27639j16726O2562L06933r7006l60126
264e5641k68536j73829L73539M65291k70511m4599P7559r2394l24245J0197N74133
253B70964m607K46793m1174L4343p2702l73372K79698K99882J21735k35016k13016
242C13528p6531k72490J16752j36490m0194K33807n4258K09076J98538l58566
232A33172k5202j57217j95215K52762M5350m7699L5483Q655n689k20305J80570
221D665O0649k05760o5235l20055K53738O3669q1293O34906K91402j46135j08539
210C82012m513k7176J46494l10348j72133M00039J42018j4080l00441K18955j00826
199C60001m34066K50812K36965P1401m99935J88257j04416r1700J10284l8731
$$ plain form
189 48872 144938 360401 766042 679869 341 -43205 -70118 418530 476115 418823 207005
178 207005 36662 609027 422561 547409 680112 411543 -46562 130745 444310 456944
168 456944 469921 494147 589328 508795 364545 515673 267900 83838 90070 360377 371097
157 371097 256662 237553 -104008 -166589 -133551 135975 -80698 300167 591669 267111
147 267111 124121 43433 149603 343441 449631 237784 121643 125837 412369 425567 399947
136 399947 17880 -91659 248104 139021 89120 287249 250434 235482 119034 273545
126 273545 -54651 -78537 209711 438369 342654 228368 324143 216424 189691 -2984 -200697
115 -200697 17401 546381 325591 322364 336040 368885 200671 323083 381094 49036 70324
$$ packed form
189D8872R6066K15463M05641q6173o79528m3546k6913M88648N7585n7292k11818
178B07005j70343N72365j86466J24848J32703k68569m58105J77307L13565J2634
168D56944J2977K4226R5181q0533j44250J51128k47773j84062O232K70307J0720
157C71097j14435j9109l41561o2581L3038K69526k16673L80865K91502l24558
147B67111j42990q0688J06170J93838J06190k11847j16141M194K86532J3198k5620
136C99947l82067j09539L39763j09083m9901J98129l6815j4952j16448J54511
126B73545l28196k3886K88248K28658r5715j14286R5775j07719k6733j92675j97713
115b00697K18098N28980k20790l227J3676L2845j68214J22412N8011l32058K1288
$$ plain form
104 70324 -71135 249038 249537 -13115 268220 138988 99435 279859 532488 591407 612306
93 612306 304615 118777 29485 -125880 20004 60211 -30647 99890 288749 150436 185250
82 185250 112162 302343 303919 217609 183097 307376 245494 96629 305381 390186 305325
71 305325 515443 433466 237091 243256 35697 159156 198228 313633 317753 693322 217544
60 217544 -107866 281215 121464 360704 109034 308077 393510 171602 244547 327730 428913
49 428913 429282 290963 160456 239184 205640 284343 211282 165895 299951 392179 435908 354405
37 354405 297530 157841 165918 338416 297415 324861 209170 229819 414008 450388 162621
26 162621 114016 97979 368787 496359 380285 339543 11944 127632 423900 410827 244068
$$ packed form
104G0324j41459L20173M99k62652K81335j29232l9553J80424K52629N8919K0899
93F12306l07691j85838q9292j55365J45884M0207r0858J30537J88859j38313L4814
82A85250p3088J90181J576q6310l4512J24279o1882j48865K08752Q4805q4861
71C05325K10118q1977j96375O165k07559J23459L9072J15405M120L75569m75778
60B17544l25410L89081j59751K39240k51670J99043Q5433k21908P2945Q3183J01183
49D28913L69j38319j30507P8728l3544P8703p3061m5387J34056R2228M3729q1503
37C54405n6875j39689Q077J72498m1001K7446j15691K0649J84189L6380k87767
26A62621m8605j6037K70808J27572j16074m0742l27599J15688K96268j3073j66759
$$ plain form
15 244068 256584 160837 220708 231881 287632 338556 357206 76169 373205 321601 138186
4 138186 219746 231087 281338 315495
0 315495
$$ packed form
15B44068J2516r5747N9871J1173N5751N0924J8650k81037K97036n1604j83415
4A38186Q1560J1341N0251L4157
0C15495
$$ Imaginary data points
##PAGE= N=2
##DATA TABLE= (X++(I..I)), XYDATA
$$ plain form
16383 -1357908 -1435406 -1229538 -932187 -1158558 -1092734 -1257529 -1371805 -1542633 -1376300 -1024004
16373 -1024004 -1168921 -1416515 -1161536 -1335598 -1243439 -1035240 -1132760 -1300660 -1339072 -1269082
16363 -1269082 -1039043 -1138082 -1311712 -1009876 -862454 -631793 -554490 -841478 -996867 -783674
16353 -783674 -479690 -517406 -783381 -910114 -963815 -1071229 -913974 -923929 -822444 -487798
16343 -487798 -351185 -556669 -599166 -675740 -590458 -824511 -606248 -562388 -745681 -722262
16333 -722262 -732695 -617162 -849487 -601015 -357533 -276661 -504334 -343967 -432154 -421688
16323 -421688 -517452 -437510 -545427 -480760 -222176 -187054 -296303 -425004 -479767 -661444
16313 -661444 -640462 -947540 -626676 -270951 -557592 -616305 -450621 -188499 -179277 -359635
$$ packed form
16383a357908p7498K05868K97351k26371O5824j64795j14276j70828J66333L52296
16373a024004j44917k47594K54979j74062R2159K08199r7520j67900l8412O9990
16363a269082K30039r9039j73630L01836J47422K30661P7303k86988j55389K13193
16353g83674L03984l7716k65975j26733n3701j07414J57255r955J01485L34646
16343d87798J36613k05484m2497p6574Q5282k34053K18263M3860j83293K3419
16333g22262j0433J15533k32325K48472K43482Q0872k27673J60367q8187J0466
16323d21688r5764P9942j07917O4667K58584L5122j09249j28701n4763j81677
16313f61444K0982l07078L20864L55725k86641n8713J65684K62122R222j80358
$$ plain form
16303 -359635 -91227 1293 18065 -4304 -302381 -314443 -169085 135797 23112 -195157
16293 -195157 52047 278861 123631 -105834 -196224 -383039 -314416 -64369 -89708 201799
16283 201799 -3727 117062 25221 -144740 -187981 75545 184814 621746 478655 380107
16273 380107 342684 317356 354166 173793 206671 214186 240180 169813 153425 137318 -70179
16262 -70179 -224989 -278380 -10448 212315 139398 25073 278308 305995 429484 545530
16252 545530 427465 186004 93999 225270 -14542 -123569 215348 249222 520530 627922
16242 627922 488649 533359 454077 730892 578457 444515 488945 646568 140877 689710
16232 689710 863549 534636 360024 381387 639786 1001732 541946 623918 827089 674983
$$ packed form
16303c59635K68408R2520J6772k2369k98077j2062J45358L04882j12685k18269
16293a95157K47204K26814j55230k29465r0390j86815O8623K50047k5339K91507
16283B01799k05526J20789r1841j69961m3241K63526J09269M36932j43091r8548
16273C80107l7423k5328L6810j80373L2878P515K5994p0367j6388j6107k07497
16262g0179j54810n3391K67932K22763p2917j14325K53235K7687J23489J16046
16252E45530j18065k41461r2005J31271k39812j09027L38917L3874K71308J07392
16242F27922j39273M4710p9282K76815j52435j33942M4430J57623n05691N48833
16232F89710J73839l28913j74612K1363K58399L61946m59786Q1972K03171j52106
$$ plain form
16222 674983 368986 369642 496590 627205 579795 922387 1035690 699334 799913 682046
16212 682046 616276 881412 773588 761516 622534 624161 132292 497136 640772 383109
16202 383109 850425 593861 487429 525962 210512 394500 640011 579510 617281 989800
16192 989800 914316 555743 374075 395409 255533 315030 455896 735905 884642 1126705
16182 1126705 971234 817784 1118205 1032362 1011377 589498 468662 708629 453124 394744
16172 394744 527027 718013 955642 787885 1282200 1249913 977408 848137 548393 170583
16162 170583 437409 652436 666530 817933 1001609 731060 821249 600884 693673 1152692
16152 1152692 1349766 957920 720290 911185 1018005 901765 1012523 1075653 1317371 992416
$$ packed form
16222F74983l05997O56J26948J30615m7410L42592J13303l36356J00579j17867
16212F82046o5770K65136j07824j2072j38982J627m91869L64844J43636k57663
16202C83109M67316k56564j06432L8533l15450J83988K45511o0501L7771L72519
16192I89800p5484l58573j81668K1334j39876N9497J40866K80009J48737K42063
16182A126705j55471j53450L00421q5843k0985m21879j20836K39967k55505n8380
16172C94744J32283J90986K37629j67757M94315l2287k72505j29271k99744l77810
16162A70583K66826K15027J4094J51403J83676k70549R0189k20365R2789M59019
16152A152692J97074l91846k37630J90895J06820j16240J10758O3130K41718l24955
$$ plain form
16142 992416 477442 767070 888499 1073270 1329632 1240840 755783 710595 933404 696507
16132 696507 576483 427545 615575 483363 498631 804873 995991 622466 487929 994857
16122 994857 1165393 781414 609759 910001 1139443 829966 826473 844099 889362 872487
16112 872487 1198466 1176432 960347 627035 607220 992892 952847 951910 1060598 712875 739327
16101 739327 866648 866905 989896 1243850 902441 880491 1172259 1189951 1203515 1145756 998915
16090 998915 653313 872142 544520 647548 474095 724694 589608 587364 802457 936267
16080 936267 1313028 1342321 1446635 1185341 963487 1062699 848959 927929 766397 840842
16070 840842 906535 1136474 1178237 795227 688413 545338 353191 838830 936184 1284196
$$ packed form
16142I92416n14974K89628J21429J84771K56362q8792m85057m5188K22809k36897
16132F96507j20024j48938J88030j32212J5268L06242J91118l73525j34537N06928
16122I94857J70536l83979j71655L00242K29442l09477l493J7626M5263j6875
16112H72487L25979k2034k16085l33312j9815L85672m0045r37J08688l47723K6452
16101G39327J27321K57J22991K53954l41409k1950K91768J7692J3564n7759j46841
16090I98915l45602K18829l27622J03028j73453K50599j35086k244K15093J33810
16080I36267L76761K9293J04314k61294k21854R9212k13740P8970j61532P4445
16070H40842O5693K29939M1763l83010j06814j43075j92147M85639R7354L48012
$$ plain form
16060 1284196 933396 947701 1139924 1004026 1220468 1427737 1307464 1191622 1254006 1219269
16050 1219269 993307 850397 641272 763744 1122955 901990 555827 638562 1139402 983801
16040 983801 1162324 1116574 1239580 1181877 776757 815160 1212462 910806 861571 1037891
16030 1037891 776516 667698 1053803 1206806 1146576 1209028 1300478 1207990 1087836 1243315
16020 1243315 817479 1102452 1568616 1668691 1430109 1057285 858491 864407 1016079 1164080
16010 1164080 1177661 937757 979153 1232839 998714 834066 1077775 943158 918121 1247025
16000 1247025 1517572 1186035 709046 868667 907631 955036 970753 903104 1165545 1318109
15990 1318109 1132638 893343 807378 946871 943351 837644 1259587 1382689 1126143 1405577
$$ packed form
16060A284196l50800J4305J92223j35898K16442K07269j20273j15842O2384l4737
16050A219269k25962j42910k09125J22472L59211k20965l46163Q2735N00840j55601
16040I83801J78523m5750J23006n7703m05120L8403L97302l01656m9235J76320
16030A037891k61375j08818L86105J53003o0230O2452R1450r2488j20154J55479
16020A243315m25836K84973M66164J00075k38582l72824j98794N916J51672J48001
16010A164080J3581k39904M1396K53686k34125j64648K43709j34617k5037L28904
16000A247025K70547l31537m76989J59621L8964M7405J5717o7649K62441J52564
15990A318109j85471k39295q5965J39493l520j05707M21943J23102k56546K79434
$$ plain form
15980 1405577 1132534 943585 874774 994630 1077576 783835 868465 1141356 1269490 1058992
15970 1058992 910975 826731 771040 853817 950762 796357 946712 1004018 1019183 1339369
15960 1339369 1322881 1329155 1197033 1304220 1113439 879678 656974 861473 995965 947875
15950 947875 1031735 1203926 1228235 949754 922444 621530 1243611 1073580 766676 1160522
15940 1160522 1399175 1121080 1113466 890712 1139473 1153165 834271 872356 1001730 1038792
15930 1038792 968541 1230468 1269668 1088103 1399751 1398653 927579 795408 1084206 1201863
15920 1201863 1233561 1151304 1535278 1566396 1326375 1391655 1311059 1011447 913905 1146466
15910 1146466 1276949 1192369 1305544 1331291 955501 974853 1111441 1194809 1091578 856674
$$ packed form
15980A405577k73043j88949o8811J19856Q2946k93741Q4630K72891J28134k10498
15970A058992j48017q4244n5691Q2777R6945j54405J50355N7306J5165L20186
15960A339369j6488O274j32122J07187j90781k33761k22704K04499J34492m8090
15950I47875Q3860J72191K4309k78481k7310l00914O22081j70031l06904L93846
15940A160522K38653k78095p614k22754K48761J3692l18894L8085J29374L7062
15930A038792p0251K61927L9200j81565L11648j098m71074j32171K88798J17657
15920A201863L1698q2257L83974L1118k40021O5280q0596k99612r7542K32561
15910A146466J30483q4580J13175K5747l75790J9352J36588Q3368j03231k34904
$$ plain form
15900 856674 479341 614479 1072515 1219244 1479916 1482807 1183625 1115704 1108520 933926
15890 933926 934532 1065294 793078 1277973 1581127 1241306 1468146 1034953 1012646 1170484
15880 1170484 1181832 1132544 893198 1219513 1088861 925519 1041676 1077270 1049326 834912
15870 834912 784684 1137287 939078 1162853 1198009 1251173 1162732 1318160 891118 799135
15860 799135 907617 898415 1004809 956143 1343885 1205539 1082468 658928 726419 1000572
15850 1000572 920272 1066364 1176775 1020006 790674 904751 1384290 1180154 1205947 1089427
15840 1089427 928484 995558 1043616 1266306 1370691 1162776 1000859 1015337 1017718 1256925
15830 1256925 1184743 1041301 1277142 1242191 848439 1054233 1237732 1068791 594377 560293
$$ packed form
15900H56674l77333J35138M58036J46729K60672K891k99182o7921p184j74594
15890I33926O06J30762k72216M84895L03154l39821K26840m33193k2307J57838
15880A170484J1348m9288k39346L26315j30652j63342J16157L5594k7944k14414
15870H34912n0228L52603j98209K23775L5156N3164q8441J55428m27042r1983
15860G99135J08482r202J06394m8666L87742j38346j23071m23540O7491K74153
15850A000572q0300J46092J10411j56769k29332J14077M79539k04136K5793j16520
15840A089427j60943O7074M8058K22690J04385k07915j61917J4478K381K39207
15830A256925p2182j43442K35841l4951l93752K05794J83499j68941m74414l4084
$$ plain form
15820 560293 1170415 1108978 1320172 1143584 946762 995005 968686 975201 881235 790051 732862
15809 732862 856243 989769 1050253 898980 947247 666263 924511 998523 1404038 1357367
15799 1357367 1336002 985744 1060259 924850 1429033 1706892 1138326 885211 849710 931010
15789 931010 695979 804263 751028 914408 1183298 1085272 1282506 1295011 1275566 1218943
15779 1218943 1293801 1231110 1235600 1303718 893617 657169 742613 954623 959094 705125 902470
15768 902470 1113031 815724 610434 644187 1011917 1109569 771119 560824 692167 1047885
15758 1047885 1561517 1276636 1183051 941462 872145 849616 1154893 875902 776357 1045765
15748 1045765 827331 1041274 887345 777056 917203 864249 1004746 881993 1107919 949986
$$ packed form
15820E60293O10122o1437K11194j76588j96822M8243k6319O515r3966r1184n7189
15809G32862J23381J33526O0484j51273M8267k80984K58248P4012M05515m6671
15799A357367k1365l50258P4515j35409N04183K77859n68566k53115l5501Q1300
15789I31010k35031J08284n3235J63380K68890r8026J97234J2505j9445n6623
15779A218943P4858o2691M490O8118m10101k36448Q5444K12010M471k53969J97345
15768I02470K10561k97307k05290L3753L67730R7652l38450k10295J31343L55718
15758A047885N13632k84881r3585k41589o9317k2529L05277k78991r9545K69408
15748A045765k18434K13943j53929j10289J40147n2954J40497j22753K25926j57933
$$ plain form
15738 949986 1061625 805904 1155603 1180199 1058362 1305074 1285512 1174143 1032868 813051
15728 813051 1026332 863405 757087 656989 740836 894776 994105 691533 497411 863747
15718 863747 1040721 1358905 1432371 1272991 1068734 1108516 981620 1359068 1313477 886739
15708 886739 829027 997943 918618 904685 1282287 1328165 1264209 1301222 1215472 1185377 712444
15697 712444 526033 723941 900188 936840 1104742 985938 974010 851372 884698 965177
15687 965177 1138157 1288293 1025567 806508 581271 431350 425995 726358 1041579 971803
15677 971803 1213634 1040146 849069 899695 1023083 1161739 978748 1101158 1186946 870103
15667 870103 601817 773629 1211611 1165464 1001803 1146195 973835 941287 984114 1002739
$$ packed form
15738I49986J11639k55721L49699K4596j21837K46712j9562j11369j41275k19817
15728H13051K13281j62927j06318j00098Q3847J53940R9329l02572j94122L66336
15718H63747J76974L18184P3466j59380k04257L9782j26896L77448m5591m26738
15708H86739n7712J68916p9325j3933L77602M5878o3956L7013q5750l0095m72933
15697G12444j86411J97908J76247L6652J67902j18804j1928j22638L3326Q0479
15687I65177J72980J50136k62726k19059k25237j49921n355L00363L15221o9776
15677I71803K41831j73488j91077N0626J23388J38656j82991J22410Q5788l16843
15667H70103k68286J71812M37982m6147j63661J44392j72360l2548M2827J8625
$$ plain form
15657 1002739 1041554 1215079 1552561 1537160 1350045 1399151 1577588 1386215 1231719 741651
15647 741651 650886 747985 713115 924268 1116149 749313 749593 1071513 1371815 1450484 1195655
15636 1195655 1195961 1076268 1116373 1184868 1113076 1168533 1154653 961006 988932 1440047 1206539
15625 1206539 1066492 1043155 832313 831894 1114149 985068 696842 886289 1286658 1212349
15615 1212349 1097184 918265 888965 1078721 907981 711580 384119 690585 796420 902778
15605 902778 1197369 1341305 1347516 1385741 1393400 1304550 1112906 1294000 1259496 1074368 1372423
15594 1372423 1098481 966743 1215296 1213699 1140109 1000418 1487078 1089890 840145 929488
15584 929488 1040685 871921 938865 1271398 1215324 1031762 1033445 1371058 1496511 1336776
$$ packed form
15657A002739L8815J73525L37482j5401j87115M9106J78437j91373j54496m90068
15647G41651r0765R7099l4870K11153J91881l66836K80L21920L00302P8669k54829
15636A195655L06j19693M0105O8495p1792N5457j3880j93647K7926M51115k33508
15625A206539j40047k3337k10842m19K82255j29081k88226J89447M00369p4309
15615A212349j15165j78919k9300J89756j70740j96401l27461L06466J05835J06358
15605I02778K94591J43936O211L8225P659q8850j91644J81094l4504j85128K98055
15594A372423k73942j31738K48553j597p3590j39691M86660l97188k49745Q9343
15584I29488J11197j68764O6944L32533n6074j83562J683L37613J25453j59735
$$ plain form
15574 1336776 870715 840009 1364614 1327649 1394960 1667424 1421784 1541876 1491489 1216135
15564 1216135 871098 863747 864785 958515 992620 1050395 1010047 985905 1092882 908985 1010020
15553 1010020 734527 776258 716875 1124385 1148595 920485 1181321 1481817 1086915 750604
15543 750604 1121921 1035955 1144458 1188717 1052273 829090 903097 1387535 1225979 1124429
15533 1124429 1192777 1311109 1334999 1379618 1025044 903512 1161583 1450992 1513241 1494360
15523 1494360 1592016 1588284 1534673 1201254 802144 309026 672408 542510 770676 715436
15513 715436 651488 710311 809928 888084 1180629 831688 778658 1063089 760296 681188 1065716
15502 1065716 1393857 1398399 1358154 1376936 1629860 1240265 1238555 1380671 1225547 1001841
$$ packed form
15574A336776m66061l0706N24605l6965O7311K72464k45640J20092n0387k75354
15564A216135l45037p351J038R3730L4105N7775m0348k4142J06977j83897J01035
15553A010020k75493M1731n9383M07510K4210k28110K60836L00496l94902l36311
15543G50604L71317q5966J08503M4259j36444k23183P4007M84438j61556j01550
15533A124429O8348J18332K3890M4619l54574j21532K58071K89409O2249j8881
15523A494360R7656l732n3611l33419l99110m93118L63382j29898K28166n5240
15513G15436o3948N8823R9617P8156K92545l48941n3030K84431l02793p9108L84528
15502A065716L28141M542m0245J8782K52924l89595j710J42116j55124k23706
$$ plain form
15492 1001841 724083 1049217 936642 947891 958208 1122080 1317094 1257586 1032736 650922
15482 650922 646511 796797 1260990 1536323 1146119 1005355 1123546 860932 947460 925687
15472 925687 719115 925844 907904 954758 1147419 1214093 1331085 1212585 1784051 1734816
$$ packed form
15492A001841k77758L25134j12575J1249J0317J63872J95014n9508k24850l81814
15482F50922m411J50286M64193K75333l90204j40764J18191k62614Q6528k1773
15472I25687k06572K06729j7940M6854J92661O6674J16992j18500N71466m9235
$$ [...]
##END NTUPLES=NMR SPECTRUM
##END=
