##TITLE=1H_EC-3286(II-4)
 CDCl3
 40 sc, 
 17.11.2022
##JCAMPDX= 6.0         $$ Bruker NMR JCAMP-DX V2.0
##DATA TYPE= NMR SPECTRUM
##DATA CLASS= NTUPLES
##ORIGIN= UXNMR, Bruker Analytische Messtechnik GmbH
##OWNER= root
$$ XWIN-NMR		Version 3.5
$$ Thu Nov 17 15:01:14 2022 Russian Standard Time (UT+4h)  she@DPX200
##.OBSERVE FREQUENCY= 200.1313499994
##.OBSERVE NUCLEUS= ^1H
##.ACQUISITION MODE= SIMULTANEOUS
##.ACQUISITION SCHEME= undefined
##.AVERAGES= 8
##.DIGITISER RES= 18
##SPECTROMETER/DATA SYSTEM= spect
##.PULSE SEQUENCE= zg30
##.SOLVENT NAME= CDCl3
##.SHIFT REFERENCE= (INTERNAL, CDCl3, 0, 15.7403)
##AUDIT TRAIL= $$ (NUMBER, WHEN, WHO, WHERE, WHAT)
$$ ##TITLE= Audit trail, XWIN-NMR		Version 3.5
$$ ##JCAMPDX= 5.01
$$ ##ORIGIN= Bruker BioSpin GmbH
$$ ##OWNER= she
$$ F:/spectra/data/she/nmr/H-F/1/pdata/1/auditp.txt
$$ ##AUDIT TRAIL=  $$ (NUMBER, WHEN, WHO, WHERE, WHAT)
(   1,<2022-11-17 14:59:04.45 +0400>,<she>,<DPX200>,
      <created by zg, POWCHK disabled, PULCHK disabled
       configuration hash MD5:
       00 E9 B6 7A A2 85 ED C7 34 08 36 98 17 FE 4E 26
       data hash MD5: 16K
       FC FE 51 77 09 38 DB BD 10 E8 B7 F7 85 62 82 BF>)
(   2,<2022-11-17 14:59:06.92 +0400>,<she>,<DPX200>,
      <Start of raw data processing
       efp BC_mod = 2 LB = 0.24 FT_mod = 6 PKNL = 1 PHC0 = -18053.62 PHC1 = 39.6007 SI = 16K 
       data hash MD5: 16K
       E4 E3 72 64 EC 6F 2E 4F 18 70 BF C9 79 2C E0 E4>)
(   3,<2022-11-17 14:59:25.90 +0400>,<she>,<DPX200>,
      <pk PHC0 = 17.72839 PHC1 = -20.4 
       data hash MD5: 16K
       94 8E 78 60 24 33 44 F3 E2 8F CE 22 7B 45 CD 9A>)
(   4,<2022-11-17 14:59:29.01 +0400>,<she>,<DPX200>,
      <abs ABSG = 5 
       data hash MD5: 16K
       47 98 B4 9B F2 33 3B 8D 89 C4 93 3F D8 89 D8 E6>)
$$ ##END=
$$ 
$$ hash MD5
$$ EE 7D 1D 0B B5 8D 92 CC 06 6A E9 77 05 40 F5 6A
##$RELAX= 
##$RELAX= 
##$RELAX= 
##$RELAX= 
##$RELAX= 
##$RELAX= 
$$ Bruker specific parameters
$$ --------------------------
##$DU= <F:/spectra>
##$EXPNO= 1
##$NAME= <H-F>
##$PROCNO= 1
##$TYPE= <nmr>
##$USER= <she>
##$AMP= (0..31)
100 100 100 100 100 100 100 100 100 100 100 100 100 100 100 100 100 100 
100 100 100 100 100 100 100 100 100 100 100 100 100 100 
##$AQSEQ= 0
##$AQ_mod= 1
##$AUNM= <au_zg>
##$AUTOPOS= <>
##$BF1= 200.13
##$BF2= 200.13
##$BF3= 200.13
##$BF4= 200.13
##$BF5= 200.13
##$BF6= 200.13
##$BF7= 200.13
##$BF8= 200.13
##$BYTORDA= 1
##$CFDGTYP= 0
##$CFRGTYP= 5
##$CHEMSTR= <none>
##$CNST= (0..31)
1 1 145 1 1 1 1 1 1 1 1 1 1 1 1 1 1 1 1 1 1 1 1 1 1 1 1 1 1 1 1 1 
##$CPDPRG= <>
##$CPDPRG1= <>
##$CPDPRG2= <>
##$CPDPRG3= <>
##$CPDPRG4= <mlev>
##$CPDPRG5= <mlev>
##$CPDPRG6= <mlev>
##$CPDPRG7= <mlev>
##$CPDPRG8= <mlev>
##$CPDPRGB= <>
##$CPDPRGT= <>
##$D= (0..31)
0 1.2 0 0 0 0 0 0 0 0.06 0 0.03 0 0 0 0 0.0002 0 0 0 0 0 0 0 0 0 0 0 0 
0 0 0 
##$DATE= 1668682743
##$DBL= (0..7)
120 120 120 120 120 120 120 120 
##$DBP= (0..7)
150 150 150 150 150 150 150 150 
##$DBP07= 0
##$DBPNAM0= <>
##$DBPNAM1= <>
##$DBPNAM2= <>
##$DBPNAM3= <>
##$DBPNAM4= <>
$$ [...]
##$SUBNAM3= <"">
##$SUBNAM4= <"">
##$SUBNAM5= <"">
##$SUBNAM6= <"">
##$SUBNAM7= <"">
##$SUBNAM8= <"">
##$SUBNAM9= <"">
##$SW= 18.0517283424941
##$SWIBOX= (0..15)
0 0 2 0 0 0 0 0 0 0 0 0 0 0 0 0 
##$SW_h= 3612.71676300578
##$TD= 16384
##$TD0= 1
##$TE= 0
##$TE2= 300
##$TE3= 300
##$TEG= 300
##$TL= (0..7)
0 120 120 120 120 120 120 120 
##$TP= (0..7)
150 150 150 150 150 150 150 150 
##$TP07= 0
##$TPNAME0= <>
##$TPNAME1= <>
##$TPNAME2= <>
##$TPNAME3= <>
##$TPNAME4= <>
##$TPNAME5= <>
##$TPNAME6= <>
##$TPNAME7= <>
##$TPOAL= (0..7)
0.5 0.5 0.5 0.5 0.5 0.5 0.5 0.5 
##$TPOFFS= (0..7)
0 0 0 0 0 0 0 0 
##$TUNHIN= 0
##$TUNHOUT= 0
##$TUNXOUT= 0
##$USERA1= <user>
##$USERA2= <user>
##$USERA3= <user>
##$USERA4= <user>
##$USERA5= <user>
##$V9= 5
##$VALIST= <valist>
##$VCLIST= <CCCCCCCCCCCCCCC>
##$VD= 0
##$VDLIST= <DDDDDDDDDDDDDDD>
##$VPLIST= <PPPPPPPPPPPPPPP>
##$VTLIST= <TTTTTTTTTTTTTTT>
##$WBST= 1024
##$WBSW= 4
##$XGAIN= (0..3)
0 0 0 0 
##$XL= 0
##$YL= 0
##$YMAX_a= 369597
##$YMIN_a= -509202
##$ZGOPTNS= <>
##$ZL1= 120
##$ZL2= 120
##$ZL3= 120
##$ZL4= 120
##$ABSF1= 15.73146
##$ABSF2= -2.32039
##$ABSG= 5
##$ABSL= 3
##$ALPHA= 0
##$AQORDER= 0
##$ASSFAC= 0
##$ASSFACI= 0
##$ASSFACX= 0
##$ASSWID= 0
##$AUNMP= <proc_1d>
##$AZFE= 0.1
##$AZFW= 0.1
##$BCFW= 0
##$BC_mod= 2
##$BYTORDP= 0
##$COROFFS= 0
##$CY= -3
##$DATMOD= 1
##$DC= 0
##$DFILT= <>
##$DTYPP= 0
##$F1P= 0
##$F2P= 0
##$FCOR= 1
##$FTSIZE= 16384
##$FT_mod= 6
##$GAMMA= 0
##$GB= 0
##$INTBC= 1
##$INTSCL= 3.70164e-10
##$ISEN= 128
##$LB= 0.24
##$LEV0= 0
##$LPBIN= 0
##$MAXI= 10000
##$MC2= 0
##$MEAN= 0
##$ME_mod= 0
##$MI= 1.114404
##$NCOEF= 0
##$NC_proc= -7
##$NLEV= 6
##$NOISF1= 3.799351
##$NOISF2= 2.8
##$NSP= 0
##$NTH_PI= 0
##$NZP= 0
##$OFFSET= 15.74028
##$PC= 1
##$PHC0= -18035.89
##$PHC1= 19.2007
##$PH_mod= 1
##$PKNL= yes
##$PPARMOD= 0
##$PSCAL= 0
##$PSIGN= 0
##$REVERSE= no
##$SF= 200.130006255205
##$SI= 16384
##$SIGF1= 3
##$SIGF2= 2
##$SINO= 5.538805
##$SIOLD= 16384
##$SREGLST= <1H.CDCl3>
##$SSB= 0
##$STSI= 16384
##$STSR= 0
##$SW_p= 3612.71676300578
##$SYMM= 0
##$S_DEV= 0
##$TDeff= 16384
##$TDoff= 0
##$TI= <>
##$TILT= no
##$TM1= 0
##$TM2= 0
##$TOPLEV= 0
##$USERP1= <user>
##$USERP2= <user>
##$USERP3= <user>
##$USERP4= <user>
##$USERP5= <user>
##$WDW= 1
##$XDIM= 16384
##$YMAX_p= 522932182
##$YMIN_p= -1552337
$$ End of Bruker specific parameters
$$ ---------------------------------
##NTUPLES= NMR SPECTRUM
##VAR_NAME=  FREQUENCY,     SPECTRUM/REAL,   SPECTRUM/IMAG
##SYMBOL=    X,             R,               I
##VAR_TYPE=  INDEPENDENT,   DEPENDENT,       DEPENDENT
##VAR_FORM=  AFFN,          ASDF,            ASDF
##VAR_DIM=   16384,         16384,           16384
##UNITS=     HZ,            ARBITRARY UNITS, ARBITRARY UNITS
##FACTOR=    0.220516191357247, 1,           1
##FIRST=     3150.10236515179, 0,            0
##LAST=      -462.614397853986, 0,           0
##MIN=       -462.614397853986, -1552337,    0
##MAX=       3150.10236515179, 522932182,    0
$$ Real data points
##PAGE= N=1
##DATA TABLE= (X++(R..R)), XYDATA
$$ [...]
6383A09125r0007K3311j30208l5401Q7761N8872J79436p5156j72186k00505K46791
6372A833N15308R9849l80544R2570K47602j98788l5297j25793j7143J61017n3444
6361C07170n4398l4418r2391Q3649L7323M1205j12673M9292M9253j94646m04622
6350c25256o0110L480J85324k12671K02837n4809M3358J95900Q3209L10028J8150
6339C89440p0615j89471J56217j22518M8316K49283J46105m11767m80334L39041
6329E3697L83029j0292n5839N017J16879k66354j30894l5859O2004j35415J15645
6318A01618J77576K91605J8979l55549j09515j25771K26652K47432j40223j15015
6308B17789r8782J81826j66620K65738r0883O8458P9079O1955l68513k19951Q2422
$$ plain form
6383 109125 19118 42429 -87779 -123180 -35419 23453 202889 127733 -44453 -244958 1833
6372 1833 517141 616990 236446 329016 576618 377830 342533 216740 199597 360614 307170
6361 307170 252772 218354 125963 209612 246935 288140 175467 224759 274012 79366 -325256
6350 -325256 -385366 -381886 -196562 -409233 -206396 -261205 -217847 -21947 61262 371290 389440
6339 389440 318825 129354 285571 163053 211369 460652 606757 194990 -285344 53697
6329 53697 436726 426434 370595 375612 492491 226137 95243 59384 121388 -14027 101618
6318 101618 279194 570799 589778 234229 124714 -1057 225595 473027 332804 217789
6308 217789 119007 300833 134213 399951 309068 377526 456605 518560 150047 -69904 12518
6297A2518L16164K16156n7196q9297J45497k16308l38497j6927Q8899L55182M8854
6286D65045j96025O1541J20152l26280n1786k38295Q0831L43238K01728J72838
6276F32987k63014r2494M286j28966j27089J45302j21173k0789J29998m1291J13893
6265B31650j72845J08699J51664j33084j02161J1845j50846J28181K28189K95860
6255E97152k00369k25844k5005R6308l8732K07449j84631J10589R2107j81371
6245B47653j08553o2042o3761K58824R2868R2177j57089k13438K73319K5780j97328
6234A88410l9346J4597j4385q0451K71485L64909j84507l56774J23990J18144
6224D06072p0862r4586O8403k83961j34291K50112L72365m7803q4505O2881o1748
$$ plain form
6297 12518 328682 544838 487642 398345 543842 327534 -10963 -27890 61009 416191 465045
6286 465045 269020 330561 450713 124433 72647 -165648 -84817 258421 460149 632987
6276 632987 369973 277479 281765 152799 25710 171012 49839 29050 159048 117757 231650
6265 231650 58805 167504 319168 186084 83923 95768 -55078 73103 301292 597152
6255 597152 396783 170939 145934 242242 203510 410959 226328 336917 429024 247653
6245 247653 139100 77058 13297 272121 364989 457166 300077 86639 359958 385738 188410
6234 188410 149064 163661 149276 68825 340310 705219 520712 163938 287928 406072
6224 406072 335210 240624 309027 25066 -109225 140887 513252 465449 380944 443825 382077
6213C82077K21364k14718j63792j20634K50293K0625k68567J95692K7849n444
6203C24745j27349j56777K66731J38728m65069J65266k54579R2918J27379j04667
6193G326J1237Q899P8416j51242K88055J3332Q3705j66223k64340n7586M96393
6182C47972J32679l47338J69150K14052n3640j70067r2041J32464j26205K32490
6172D39516k1022l36730k52748K34819L41284j1955r8865O6527k76216j1078l3177
6161D0355L08035L6465o1737j63850J76675P3786k11358K08042J76479J5604j36857
6150D61639j37355o0957J66267j21420P1771J24379J09477m452K66055k94834
6140E80570N6038o2023k54994O2657Q9048k43416J22443P6823J46505p0118k09600
$$ plain form
6213 382077 603441 388723 224931 104297 354590 375215 106648 302340 330189 324745
6203 324745 197396 40619 307350 446078 -18991 146275 -108304 -15386 111993 7326
6193 7326 18563 27462 105878 -45364 242691 256023 339728 173505 -90835 -148421 347972
6182 347972 480651 133313 302463 516515 462875 292808 200767 333231 207026 439516
6172 439516 418494 81764 -170984 63835 405119 393164 294299 360826 84610 73532 40355
6161 40355 348390 384855 323118 159268 335943 409729 198371 406413 582892 598496 461639
6150 461639 324284 263327 429594 308174 379945 504324 613801 609349 875404 580570
6140 580570 636608 574585 319591 382248 471296 227880 350323 427146 573651 503533 293933
6129B93933L3005J48329J54341q393J52962j90463k67268L7933j68967M1773M25856
6118F53041p6797K71355J02502l67061l0459n058l32158J64299k63974K3087O4437
6107B03214J46035j24096J97781m2073k29391P3528R6605J76696j14237K51338
6097F35400L7166l00166j78587J35931n5795j75001K70367L76236J8272m591r7456
6086F61776k45232L17167p8003o8541L7426k09100m14811j7977L26650j10382
6076A98973K1029K52150J06159l39217L19232P6429Q4478m1204j26031j92101
6066C59897J27170p6959o8270m6997N7217K94613j72769K36207J85718l76027
6056E19800m23336R2978K41353M19235l90950P5424L22274k57120j46138J45781
$$ plain form
6129 293933 326938 475267 629608 621215 774177 583714 316446 354379 185412 227185 653041
6118 653041 576244 847599 950101 583040 552581 547523 215365 379664 115690 138777 203214
6107 203214 349249 225153 422934 380861 151470 224998 321603 498299 384062 635400
6097 635400 672566 372400 193813 329744 273949 98948 369315 745551 763823 759232 661776
6086 661776 416544 733711 655708 587167 624593 415493 682 -17295 309355 198973
6076 198973 220002 472152 578311 239094 558326 634755 719233 678029 551998 359897
6066 359897 487067 410108 341838 294841 352058 646671 473902 710109 895827 519800
6056 519800 96464 189442 430795 850030 459080 534504 856778 599658 453520 599301
6046E99301K67031j49348o7315J38110l63031k09389J6909N2817J02933K62270
6036F50288p0123J79305K41556l04811k05849J03766M2958m9135j12344M13578
6026H89189j8875k36876Q1167r3207J46250k9094J0458j63219K14744K46214j23904
6015I22847n62558K11977R7823J55748P5353j15328O736Q5585j6373P9805L3910
6004I75525l00805j40517K4837J79855L87640j32091k50178k34416K77961R5006
5994H82817Q4857n5456j78643l5273J10722J09919k94245J53722L33332j95436
5984I16316k59752k47793L93587J23022l58619J24433J90799J7836j82441Q306
5974G25694j46482J80896N1933J34816L89278j93037l05871L66642J22143n73683
$$ plain form
6046 599301 866332 716984 649669 787779 424748 215359 232268 285085 388018 650288
6036 650288 580165 759470 1001026 696215 490366 594132 637090 587955 475611 889189
6026 889189 870314 633438 714605 621398 767648 738554 749012 585793 800537 1046751 922847
6015 922847 360289 572266 670089 825837 901190 785862 792598 878183 861810 941615 975525
6004 975525 674720 534203 559040 738895 1126535 994444 744266 509850 787811 882817
5994 882817 967674 912218 733575 698302 809024 918943 624698 778420 1111752 916316
5984 916316 656564 408771 802358 925380 566761 691194 881993 899829 717388 725694
5974 725694 579212 760108 812041 946857 1336135 1143098 837227 1203869 1326012 752329
5964G52329Q3697J13619j55506J04168j14359k42660R2137J44525O8422K50149
5954A096521O6067l6884J58834N9060k79452l99817J03126K90496n0160K18857
5944A226648l0463m3830J08686O4814n5978L5273k3245r8325l75171p8240R6820
5933H26989L53792j79350M9255m7356j41037K37726n4885P8308n2110J22425R012
5922A202769j9301m8274M428j42050J20184K39573j35961j32877K63253L01208
5912A652952l9813o5621k53307j00843J43670j53885l24720K97564J94585j43050
5902A207532M7764o835j33187L91334M4343Q7916o9798q2839K05854K0494j9136
5891A693442K18873J09702l03710j22256P3463j60284K17765J8888J32269j21581
$$ plain form
5964 752329 836026 949645 794139 898307 783948 541288 633425 777950 846372 1096521
5954 1096521 1162588 1125704 1284538 1343598 1064146 664329 767455 1057951 1007791 1226648
5944 1226648 1196185 1152355 1261041 1325855 1269877 1305150 1281905 1183580 808409 730169 826989
5933 826989 1180781 1001431 1050686 1003330 862293 1100019 1045134 1123442 1071332 1193757 1202769
5922 1202769 1183468 1135194 1139622 997572 1117756 1357329 1221368 1088491 1351744 1652952
5912 1652952 1613139 1547518 1294211 1193368 1337038 1183153 858433 1155997 1350582 1207532
5902 1207532 1255296 1248461 1115274 1506608 1550951 1638867 1569069 1486230 1692084 1712578 1693442
5891 1693442 1912315 2022017 1718307 1596051 1669514 1509230 1726995 1745883 1878152 1756571
5881A756571m09857K75506N10100n9210j10241K25452k26085k82988k86483Q1068
5871A473833K03750K52986J0696j02602j63529l43587N04124R1934k14437J43681
5861A856849l8831K7450j34832P582p9389K91317L97933m05134j64326O3982K27329
5850B049930K00735l34165l275K45783J73280k04734J24369J41480K03045k31077
5840B365371k17582n7032j32880N3349m0141N14332K04201n5246o7969K7355J86942
5829B780700J95796J69147l13397L46226O9759J78343K12722M4297J56709P1532
5819C911834L86264l1110L49810L59324M82501O90860j9693L55123N63329N36842
5809G585084P23895R04276J184016J989884K307814L103007L569088K453050N24364
$$ plain form
5881 1756571 1346714 1622220 2132320 2073110 1962869 2188321 1962236 1679248 1392765 1473833
5871 1473833 1677583 1930569 1941265 1838663 1675134 1331547 1835671 1927605 1713168 1856849
5861 1856849 1818018 1845468 1710636 1718218 1638829 1930146 2328079 1922945 1758619 1822601 2049930
5850 2049930 2250665 1916500 1913225 2159008 2332288 2127554 2251923 2393403 2596448 2365371
5840 2365371 2147789 2090757 1957877 2011226 1971085 2485417 2689618 2634372 2566403 2593758 2780700
5829 2780700 2976496 3145643 2832246 3178472 3248231 3426574 3639296 3683593 3840302 3911834
5819 3911834 4298098 4266988 4616798 4976122 5458623 6149483 6129790 6484913 7048242 7585084
5809 7585084 8308979 9213255 10397271 12387155 14694969 17797976 21367064 23820114 24344478
5800B4344478j878899l186082l258056l116890k043349j474873r47385r69795
5792G469149o86444n61168j21049j13179l52690j75409J81538J02440l59330l58963
5782E024895n6765L17523k88538K29291N80265K43820N37837J62114j51060n85456
5772F013926m62727l46234m80700k35649l26109k26252k40113J67010j77251l48497
5762C337404j05139o4204Q40j62512j14963R3603j10013q467j68239Q6642j34371
5751B650581j88343J59264J22793k37605O1148m4982K27354J66920J4157j31675
5741B799612l46956l42778n8779O502M47700r279j69133o4431L25517n8592m17979
5730B111404J668J71419o2549K52825P01k08025K15424J8039k82487k10495L61722
$$ plain form
5800 24344478 22465579 19279497 16021441 12904551 10861202 9386329 8438944 7469149
5792 7469149 6782705 6221537 6100488 5987309 5634619 5459210 5640748 5743188 5383858 5024895
5782 5024895 4968130 5285653 4997115 5226406 5806671 6050491 6588328 6750442 6599382 6013926
5772 6013926 5551199 5204965 4724265 4488616 4162507 3936255 3696142 3863152 3685901 3337404
5762 3337404 3232265 3168061 3168901 3006389 2891426 2985029 2875016 2866549 2698310 2784952 2650581
5751 2650581 2462238 2621502 2744295 2506690 2567838 2522856 2750210 2917130 2931287 2799612
5741 2799612 2452656 2109878 2051099 2057601 2505301 2496022 2326889 2262458 2587975 2529383 2111404
5730 2111404 2113072 2284491 2221942 2474767 2475468 2267443 2482867 2500906 2218419 2007924 2369646
5719B369646k06581n8287J09089j10395K0655K1022r3025J50910L98698m02150
5709B199582k11747L53204J04184K4792k0484R4729Q9206J17708m26360k9059
5699B295755L7635K45955J61498k07650j66277M6781J50365m0912J94884J58350
5689B876384j796J40866m02319k40574J92216k27163K4841K00062N2875K61528
5679B876920k38298l3327O0957R6547j37267J1214J08289n0523J58942N992j48658
5668B710788K52123l51426J01332J75768L6061L0490J98276K21855n1252l3547
5658C290468k69494j12068K13215L85957j08291j52195j30815K50730L85758K25558
5648C978823p6863n5520L1848N9719j01432Q1045O5790n0609K47791K68745J93053
$$ plain form
5719 2369646 2163065 2104778 2213867 2103472 2124127 2145149 2052124 2203034 2601732 2199582
5709 2199582 1987835 2341039 2445223 2470015 2449531 2544260 2633466 2751174 2324814 2295755
5699 2295755 2333390 2579345 2740843 2533193 2366916 2413697 2564062 2523150 2718034 2876384
5689 2876384 2874588 3015454 2613135 2372561 2564777 2337614 2362455 2562517 2615392 2876920
5679 2876920 2638622 2605295 2666252 2762799 2625532 2636746 2745035 2694512 2853454 2859446 2710788
5668 2710788 2962911 2611485 2712817 2888585 2924646 2955136 3153412 3375267 3324015 3290468
5658 3290468 3020974 2908906 3122121 3508078 3399787 3247592 3116777 3367507 3753265 3978823
5648 3978823 3901960 3846440 3878288 3938007 3836575 3917620 3983410 3932801 4180592 4449337 4642390
5637D642390J10186o4176K58377O1009J54060j36902k6586M59461R300J51867
5627E618986M0816j57379j62395K33040J04755m4371M97280j20127M11389K33387
5617F655381j7376K33455O2861m75088K40515K96026J21109M75396L65278K89215
5607H246772q942p1531N41739O07250L12163O67992L38931K92526O31594M51135
5597A2009629Q26979J080614Q85153N94133N75065J190932J402000J236117J171667
5588B0972289J298891Q29578O89748p6347n5898j62286l32526m26692n79827m05834
5578B1751096l10961K02412P8521K50968N94072O82014P72871P64777J055413
5569B5841183J532807J547532J846803J968183K010330J473494J409585J385280
$$ plain form
5637 4642390 4752576 4688400 4946777 5007786 5161846 5024944 4998358 5457819 5467119 5618986
5627 5618986 5659802 5502423 5340028 5573068 5677823 5633452 6130732 6010605 6421994 6655381
5617 6655381 6638005 6871460 6934321 6459233 6699748 6995774 7116883 7592279 7957557 8246772
5607 8246772 8237830 8166299 8708038 9315288 9627451 10295443 10634374 10926900 11558494 12009629
5597 12009629 12836608 13917222 14802375 15396508 15971573 17162505 18564505 19800622 20972289
5588 20972289 22271180 23100758 23790506 23714159 23658261 23495975 23163449 22736757 22156930 21751096
5578 21751096 21440135 21642547 21721068 21972036 22566108 23248122 24020993 24785770 25841183
5569 25841183 27373990 28921522 30768325 32736508 34746838 36220332 37629917 39015197
5561C9015197Q28709L33445j73259j65507M12053P17512J329990K546330L197930
5552D8042400M261544K591323q76371m125548n004079m752556m044030k676510
5544C3416173j926295j365075l52869p6534k78854j50882k59364q78251j040496
5535B7087553j254690n89929j132568j314908j194666q65726q32103q20571o64665
5526A8417727j177534p30740l66007J51208L97691L46490o73261j105129r61223
5517A4299222j098098r37933j107297o86067m63424l60754k79847q27857k32279
5508H305666j05495j95696n52860l00849J80765k87261l58070l15078k99015q551
5498F063556k13271k52367K7271j28047k805k12823k06962N8290L6082K52161
$$ plain form
5561 39015197 39843906 40177351 40004092 39838585 40250638 40968150 42298140 44844470 48042400
5552 48042400 52303944 54895267 54018896 49893348 44889269 40136713 36092683 33416173
5544 33416173 31489878 30124803 29771934 29695400 29416546 29265664 29006300 28128049 27087553
5535 27087553 25832863 25242934 24110366 22795458 21600792 20735066 19902963 19082392 18417727
5526 18417727 17240193 16509453 16143446 16294654 16692345 17038835 16365574 15260445 14299222
5517 14299222 13201124 12263191 11155894 10469827 10006403 9645649 9365802 8537945 8305666
5508 8305666 8200171 8004475 7451615 7150766 7331531 7044270 6686200 6371122 6072107 6063556
5498 6063556 5850285 5597918 5625189 5497142 5494337 5281514 5074552 5132842 5168924 5421085
5488E421085N5048l10109j71122k7152R2760L77326k39580N0599M87787J84402
5478E921044J53588N70662l0713l70172l59037m47454j15864k83539m92918M34904
5468D980501m1559O0618k20518j74782j2640J55183l29557Q5614J02454j89697
5458D415617j74464M2345R7153N5906M68745J39295l5293M6460K08979k55148
5448E009595M73322K76835L33347j15503J99804k27340m41919j31637n7984l81730
5438D936790k24808L4661k34631q6041j02863N3946m0933K32782J91947M61752
5428E222602L18697J23371Q9499j11070J51017j07329m21245l3984N7527N1065
5418E340150k96647O9471K79939m02899O7315l7587j87548J88932K34404r2173
$$ plain form
5488 5421085 5476133 5166024 4994902 4967750 5060510 5437836 5198256 5248855 5736642 5921044
5478 5921044 6074632 6645294 6614581 6244409 5885372 5437918 5322054 5038515 4545597 4980501
5468 4980501 4938942 4999560 4779042 4604260 4591620 4746803 4417246 4502860 4605314 4415617
5458 4415617 4241153 4283498 4380651 4436557 4905302 5044597 5009304 5055764 5264743 5009595
5448 5009595 5482917 5759752 6093099 5977596 6177400 5950060 5508141 5376504 5318520 4936790
5438 4936790 4711982 4746643 4512012 4425971 4323108 4377054 4336121 4568903 4760850 5222602
5428 5222602 5541299 5664670 5754169 5643099 5794116 5686787 5265542 5231558 5289085 5340150
5418 5340150 5043503 5112974 5392913 4990014 5057329 5019742 4832194 5021126 5255530 5163357
5408E163357k54682k20093N5717k09538Q1659L29754K4323k09392K81459j22509
5398D920055l95471j93098k61952M45025k20379j59955J69894k94938k89688j34413
5388C585080Q9782o9843l55063K98749p7257k90584K92450j43577n6725K26425
5378C499437J03432o2789k87507J310j5112l0873P1239o1302m4380j28145J05268
5367C150578J99743k9507k27760M4532J18318J6539j23927j28488J89223l37670
5357B871581o2215K93779r1824K82764r804q8399p4727K15054j09761j14322R8169
5346C210295j19647J27499K16967k27357j6685j88835N17079J19369j74730L43647
5336C807602j6010j36224k43259O3879l24009M7014J54029l8449J58782K67863
$$ plain form
5408 5163357 4908675 4688582 4744299 4534761 4616420 4946174 4970497 4761105 5042564 4920055
5398 4920055 4524584 4331486 4069534 4514559 4294180 4134225 4304119 4009181 3719493 3585080
5388 3585080 3674862 3605019 3249956 3548705 3471448 3180864 3473314 3329737 3273012 3499437
5378 3499437 3602869 3540080 3252573 3253883 3238771 3207898 3279137 3217835 3173455 3045310 3150578
5367 3150578 3350321 3320814 3093054 3137586 3255904 3272443 3148516 3020028 3209251 2871581
5357 2871581 2809366 3103145 3011321 3294085 3284281 3195882 3121155 3336209 3226448 3112126 3210295
5346 3210295 3090648 3218147 3435114 3207757 3191072 3002237 3519316 3638685 3463955 3807602
5336 3807602 3791592 3655368 3412109 3475988 3151979 3198993 3353022 3314573 3473355 3741218
5326C741218k14483j93368J3835J95037K49490o4121l64517k28890O7887q6924
5316C115164J15690J69204k23264k10218j30027j7756M8456N12319K71539l75184
5306C275923j77075J32551j43619o6596K44317M7170k64300K29245l1097n6739
5296C189780o6719K44976o2988O1227O8447r5928l72272k1107L33597l56618q4624
5285B837771J4908J80323O6523k0969k42521K83984j25061j92697k81052O6159
5275B587368J00344K33979J89878k02331j77021J79454J41392r3974r2502J27711
5265B994298L60404l53031m1609M51600M5858J28733J26802l30273m6089K06659
5255C543352J42688k59870J32794K30172Q2879L0491J18958K96335J03889J96310
$$ plain form
5326 3741218 3526735 3333367 3347202 3542239 3791729 3727608 3363091 3134201 3202088 3115164
5316 3115164 3230854 3400058 3176794 2966576 2836549 2818793 2867249 3379568 3651107 3275923
5306 3275923 3098848 3231399 3087780 3021184 3265501 3312671 3048371 3277616 3246519 3189780
5296 3189780 3123061 3368037 3305049 3366276 3434723 3338795 2966523 2945416 3279013 2922395 2837771
5285 2837771 2852679 3033002 3099525 3078556 2836035 3120019 2994958 2802261 2521209 2587368
5275 2587368 2687712 2921691 3111569 2909238 2732217 2911671 3053063 2959089 2866587 2994298
5265 2994298 3354702 3001671 2960062 3411662 3457520 3586253 3713055 3382782 3336693 3543352
5255 3543352 3686040 3426170 3558964 3789136 3872015 3902506 4021464 4317799 4421688 4617998
5245D617998L3645L71544J89427N64917R16275P05780O42421Q4544O12639K36171
5235H975361Q3107j16829J21497K76833Q76307K30473j018373j044032j042834
5226G341510q30769n52265p98583l53500k41961l90000O8702k62999j46845j88535
5216C644755j20621P982L50520k13819l27389P0229l69630j80960K49739j30811
5206B979995L3032j74540k32998L5572j52924k40983J20163l3281K84757Q5541
5196B704334k75778j62007j9142M3326L26843J84060l41375K31554P0872r7976
5186B664711l050R6444k15299k48135L452J35247k44062j534j7890l65089M48171
5175B252966K90017R241l3432j21376J83146N2915k02658M381k0629k44776J59105
$$ plain form
5245 4617998 4651643 5023187 5212614 5777531 6693806 7399586 8042007 8126551 8739190 8975361
5235 8975361 9058468 8941639 9063136 9339969 10216276 10446749 9428376 8384344 7341510
5226 7341510 6510741 5958476 5159893 4806393 4564432 4174432 4243134 3980135 3833290 3644755
5216 3644755 3524134 3532116 3882636 3668817 3341428 3411657 3042027 2861067 3110806 2979995
5206 2979995 3013027 2838487 2605489 2641061 2488137 2247154 2367317 2334036 2618793 2704334
5196 2704334 2428556 2266549 2247407 2290733 2617576 2801636 2460261 2691815 2762687 2664711
5186 2664711 2661661 2758105 2542806 2294671 2298123 2433370 2189308 2187774 2169884 1804795 2252966
5175 2252966 2542983 2552224 2518792 2397416 2580562 2633477 2430819 2435200 2414571 2169795 2328900
5164B328900L88204M9080j54246k28894l30878r8968J99220M15774J23111j07745
5154B583558o7619l410L14251J81141l36383l2143K32948K86799L40620M897l4595
5143C470064J67346K84565j56335L9510R1167J3901J42480L34716L55108M45952
5133E188474L53169M30753k44681M2352J69609R2945o6834m99307r0845R3214
5123E468849m00034k96098J82267Q8636L20332j40347J23035K75411K39312Q647
5113E870010K52262O27534R5005J59466J0167p1949K87886k43575q62924j43020
5103E980862k30787k41915j28425l60553J93001n07866J58498L75027J76485L83580
5093E797907J84855L61750O9091N48247j8897o1339r0481k27136L0013l03507
$$ plain form
5164 2328900 2717104 2766184 2611938 2383044 2052166 1953198 2152418 2568192 2691303 2583558
5154 2583558 2515939 2512529 2826780 3007921 2671538 2639395 2872343 3159142 3499762 3504659 3470064
5143 3470064 3637410 3921975 3765640 3805150 3896317 3910218 4052698 4387414 4742522 5188474
5133 5188474 5541643 5972396 5727715 5770067 5939676 6032621 5965787 5466480 5375635 5468849
5123 5468849 5068815 4772717 4954984 5043620 5363952 5223605 5346640 5622051 5861363 5870010
5113 5870010 6122272 6749806 6844811 7004277 7014444 6942495 7230381 6986806 6123882 5980862
5103 5980862 5750075 5508160 5379735 5019182 5212183 4704317 4862815 5237842 5414327 5797907
5093 5797907 5982762 6344512 6413603 6961850 6942953 6881614 6791133 6563997 6594010 6290503
5083F290503N5345k22684m3461J31410k45262L4242J56885L5658J43594J9831
5073F356061K12677n875m10896O4716L27456j34745l10465n49207J0425j80442
5063E379705j81134n26567k23388l08912m28447o5808k30982N3450q9609k77907
5053C100401o8471j16423o0364j0179k4201j7399k00919J9461n4109P5562j52090
5042B491269k08626M11771K5311m66543L1196o8617m6284l9483J87128j36676
5032B180446R1304j10055R374J68064k640k45346l73044J18034J75281J79367
5022B190785K22644J25469k48993J61778J35460m74153K513Q507m77978L25849
5012A971881K14175p1464o1060R7097j60303k51293J49955L28137K38664k07770
$$ plain form
5083 6290503 6345848 6123164 6079703 6211113 5965851 6000093 6156978 6192636 6336230 6356061
5073 6356061 6568738 6562863 6151967 6216683 6544139 6409394 6098929 5549722 5560147 5379705
5063 5379705 5198571 4672004 4448616 4139704 3711257 3645449 3414467 3467917 3378308 3100401
5053 3100401 3031930 2915507 2855143 2844964 2820763 2803364 2602445 2621906 2567797 2643359 2491269
5042 2491269 2282643 2694414 2719725 2253182 2284378 2215761 2169477 2129994 2317122 2180446
5032 2180446 2271750 2161695 2171069 2339133 2336493 2091147 1718103 1836137 2011418 2190785
5022 2190785 2413429 2538898 2289905 2451683 2587143 2112990 2115503 2124010 1646032 1971881
5012 1971881 2186056 2114592 2053532 2150629 1990326 1739033 1888988 2217125 2455789 2248019
5002B248019J08942j29584j81303J2463j34587l01297L43592K18632J13581j42023
4992B156435k70542O6253L49716j24239j41458O502j02359J58619j80278r750
4982A908899L58936j24378l59686L03184N6528j71924L77800j5264l30573J48611
4972B152133R7793M1620j67852j54124l3310K18172j78181o8364J42442R6892
4962B147221l4968q5125J69842k50469O1966K06985M6483N9379J34989J36393
4952B592696R1448j37499j17181k40662J95424Q8907j02444J45554l19043k5673
4942B171527K11505J13450j79805J6888j76347K9566J58606k70881K63418J11572
4932B449499j24870j34903l48129K71098J59449K57924j04758k110n0585M30242
$$ plain form
5002 2248019 2356961 2227377 2046074 2058537 1923950 1622653 1966245 2184877 2298458 2156435
4992 2156435 1885893 1952146 2301862 2177623 2036165 2042667 1940308 2098927 1918649 1908899
4982 1908899 2267835 2143457 1783771 2086955 2143483 1971559 2349359 2334095 2003522 2152133
4972 2152133 2249926 2291546 2123694 1969570 1936260 2154432 1976251 1907887 2050329 2147221
4962 2147221 2112253 2027128 2196970 1946501 2008467 2215452 2261935 2321314 2456303 2592696
4952 2592696 2684144 2546645 2429464 2188802 2384226 2473133 2370689 2516243 2197200 2171527
4942 2171527 2383032 2496482 2316677 2333565 2157218 2186784 2345390 2074509 2337927 2449499
4932 2449499 2324629 2189726 1841597 2112695 2272144 2530068 2425310 2423200 2372615 2802857
4922B802857k3168k57849j89719J78J95289O4911J24788l05648J56868J46647
4912B715154N1682j46080L7645j8082n1440L81338K47472p5006j33762J3439K29045
4901C251405L9871M0113N7312J88042k04224j15507j56847M1286k07687K7556
4891B961320K21046k33184N8000p5304O9196k05714j12151K10578R412j89556
4881B713643K80488j28279K40510K5360l34485K47553j5586J75978K44468l3700
4871C415950k51750J92209M04081L1324o49987o7110L19794K49063J46562k76661
4861C513475J03277O2230N867P6747k48717n2381K38042N19333j66115M5809j31980
4850C965587n4130K09076m80125J50310K66656R8178O2745P4727j5564n9981J58176
$$ plain form
4922 2802857 2779689 2521840 2332121 2332299 2527588 2592499 2717287 2411639 2568507 2715154
4912 2715154 2766836 2620756 2658401 2640319 2588879 2970217 3217689 3142683 3008921 3022360 3251405
4901 3251405 3291276 3331389 3388701 3576743 3372519 3257012 3100165 3141451 2933764 2961320
4891 2961320 3182366 2949182 3007182 2931878 3001074 2795360 2683209 2893787 2903199 2713643
4881 2713643 2994131 2865852 3106362 3131722 2797237 3044790 3029204 3205182 3449650 3415950
4871 3415950 3164200 3356409 3760490 3791814 3141827 3074717 3394511 3643574 3790136 3513475
4861 3513475 3616752 3678982 3684849 3761596 3512879 3460498 3698540 4217873 4051758 4097567 3965587
4850 3965587 3911457 4120533 3640408 3790718 4057374 4155552 4218297 4293024 4277460 4217479 4375655
4839D375655m8731J50041L0862o9385L96601M0277k8351J04177o7906K26960K08005
4828E318205K30693q1160K5104k15741p9701M51878O6129J55384r1516O8977J77875
4817F026127N7475J13456J04145M04711M2034J15999M56988K93989J26263O84233
4807H425420N99046R3334K80539M27237Q96245N77482K23304M72453L38504M34404
4797A2767968M67412K21038N27728L22471N32298O07912P11545J304690J219392
4788A8682454J629615K235982K675912L190944M371387N694012P273113O163652
4780E1917071L163693m85052m232512o315755o337170n720004m687256l326929
4772B3976086l111956k045167j980077j495281j031638p85783n60476r83708l87099
$$ plain form
4839 4375655 4326924 4476965 4507827 4438442 4835043 4875320 4846969 4951146 4883240 5110200 5318205
4828 5318205 5548898 5467738 5492842 5277101 5197400 5649278 5715407 5870791 5779275 5848252 6026127
4817 6026127 6083602 6197058 6301203 6705914 6747948 6863947 7320935 7614924 7741187 8425420
4807 8425420 9024466 9117800 9398339 9825576 10721821 11299303 11522607 11995060 12333564 12767968
4797 12767968 13235380 13456418 13984146 14306617 14838915 15446827 16158372 17463062 18682454
4788 18682454 20312069 22548051 25223963 28414907 32786294 38480306 45753419 51917071
4780 51917071 55080764 54595712 50363200 44047445 37710275 31990271 27303015 23976086
4772 23976086 20864130 18818963 16838886 15343605 14311967 13526184 12965708 11982000 11594901
4763A1594901m50259l79379l15019m39464j64276k42152k39142k83179j48577
4754H933454N3094j02517p3514m0545Q8993Q6936o55594r2000J90832J52456L3014
4743H574609J22982J14384j58201J15155L87518N3460M43617L62974K67208Q036
4733A0291742J27324K31118q3738J37114P8877O8889J35914q1982M96507O30169
4723A2031934N61954P33795Q00137P03775J187963J228474J829119J543546K280243
4714B2900940K843344L718840N202758N478046N932933M332584K379268q98035
4706E1890678m014746n762809n791588n363512m618043l603418k803063k283914
4698A7649585j458307r63654r85678j101762q84753n77065l44270j37097L02809
$$ plain form
4763 11594901 11144642 10765263 10450244 10010780 9846504 9604352 9365210 9082031 8933454
4754 8933454 8986548 8884031 8810517 8769972 8858965 8945901 8290307 8198307 8389139 8541595 8574609
4743 8574609 8697591 8811975 8653774 8768929 9156447 9209907 9653524 10016498 10283706 10291742
4733 10291742 10419066 10650184 10566446 10703560 10782437 10851326 10987240 10905258 11401765 12031934
4723 12031934 12593888 13327683 14127820 14831595 16019558 17248032 19077151 20620697 22900940
4714 22900940 25744284 29463124 34665882 40143928 46076861 50409445 52788713 51890678
4706 51890678 47875932 42113123 36321535 30958023 26339980 22736562 19933499 17649585
4698 17649585 16191278 15227624 14241946 13140184 12255431 11678366 11334096 11196999 11499808
4689A1499808J34822q3991j96591l33193l57854o81992l75817k85655o91340m67147
4679H161050m11115n00576l47655j84159n6885k73148j55959l5240k32203j97908
4669E766202m2506J12382l12732j76252l60763O1631M37408J29165n3862k11806
4659E348867n51450j39556J02609K13403j55804J65725K44205k97058j28421L60033
4649E162553l6016k01418j22953Q6183Q9073P6598L06729m09547J90878L01306
4639E443386K96547k46283j70124k4484m6949K85656m13946J32216m11081q4351
4629D760587J6729p9516k6727k2677J89907J79636Q6859R8932R6239l04801Q8933
4618E084101J57423j63073j21882J54259o4943j95962j36233K88583J37464L554
$$ plain form
4689 11499808 11634630 11550639 11354048 11020855 10663001 9981009 9605192 9319537 8628197 8161050
4679 8161050 7749935 7249359 6901704 6717545 6660660 6387512 6231553 6196313 5964110 5766202
4669 5766202 5723696 5836078 5523346 5347094 4986331 5047962 5485370 5614535 5560673 5348867
4659 5348867 4797417 4657861 4760470 4973873 4818069 4983794 5227999 4930941 4802520 5162553
4649 5162553 5126537 4925119 4802166 4888349 4977422 5054020 5360749 4951202 5142080 5443386
4639 5443386 5739933 5493650 5323526 5299042 5252093 5537749 5123803 5256019 4844938 4760587
4629 4760587 4777316 4697800 4671073 4648396 4838303 5017939 5104798 5203730 5299969 4995168 5084101
4618 5084101 5241524 5078451 4956569 5110828 5045885 4849923 4713690 5002273 5139737 5143291
4608E143291J90521K84617j03258j58813m9104M8647j42613k80367k6292K12226
4598E118855J76219k6643M7150k32999j05718j81551R665J8471J75133J69791
4588E168373j72969R8655L2666j5016n54511J01592K29430K27164L36213j68222
4578E283375j43864P6507k21126j10841J6380J09879L26981J07152j40158N55576
4568E859861j10488K1142l18321k39044O3088K18629L56329j92308J52134k3357
4558E787665j97127L16329J01398m46328J69106J34044K08110L89628k2212l26984
4548F113629p2734J82912M63569l75472n3211M27943j00581J71627K0991L12678
4538G091351Q4727J61575j5380q8143j58036J58046M16395J66279j14369J86877
$$ plain form
4608 5143291 5333812 5618429 5515171 5356358 5307254 5355901 5213288 4932921 4906629 5118855
4598 5118855 5295074 5268431 5315581 5082582 4976864 4795313 4804978 4823449 4998582 5168373
4588 5168373 4995404 5094059 5126725 5111709 4557198 4658790 4888220 5115384 5451597 5283375
4578 5283375 5139511 5216018 4994892 4884051 4900431 5010310 5337291 5444443 5304285 5859861
4568 5859861 5749373 5770515 5452194 5213150 5276238 5494867 5851196 5658888 5811022 5787665
4558 5787665 5590538 5906867 6008265 5561937 5731043 5865087 6073197 6462825 6440613 6113629
4548 6113629 6040895 6223807 6687376 6311904 6258693 6686636 6586055 6757682 6778673 7091351
4538 7091351 7176078 7337653 7322273 7234130 7076094 7234140 7650535 7816814 7702445 7889322
4528G889322J23557k00534M6835J18574L78606j29445M21145L61600m31447J54898
4518H733111L54933K06125J28931J84210J27484N7984J06137K09164K13719K45512
4508A0567310J06254J20644o6688K63697Q6820J23793M77786K6567J76478K31828
4498A2114489L36291L55914K49595K19370J93134N24078N37477L63919M91652
4489A5385919L57315L05642L98161P00216L09129L77445N20509O53620L88904
4480A9396860O89422O72633J065612P23244R06280J065765J116304J388826J884149
4471B8909095K092499K475326L564783L893543L262493J053640n80169j716261
4463D2954949j769739p69483n70334j13386L19704J199181J834382J880692J959954
$$ plain form
4528 7889322 8012879 7812345 7859180 7977754 8356360 8226915 8648060 9009660 8578213 8733111
4518 8733111 9088044 9294169 9423100 9607310 9734794 9792778 9898915 10108079 10321798 10567310
4508 10567310 10673564 10794208 10727520 10991217 11078037 11201830 11679616 11706183 11882661 12114489
4498 12114489 12450780 12806694 13056289 13275659 13468793 13992871 14530348 14894267 15385919
4489 15385919 15743234 16048876 16447037 17147253 17456382 17833827 18354336 19007956 19396860
4480 19396860 20086282 20758915 21824527 22547771 23454051 24519816 25636120 27024946 28909095
4471 28909095 31001594 33476920 37041703 40935246 44197739 45251379 44671210 42954949
4463 42954949 41185210 40415727 39845393 39732007 40051711 41250892 43085274 44965966 46925920
4454D6925920J846136J629597J794599J164983J030878J032750N19540L52316
4446E6296719L62862L91642M99215N12549J017973J048022J121828J382264J328098
4437F3961172Q64164P48047R67526P95409M40306o4275M75833j9311j63351q2538
4427F7922982K2761j8605k28546J86948k37075q54533m01811o28297p44024o2739
4417F4957061L97294R00253J589338J987125K403411K677522K137868K220612
4409G9270484J891588R35209J366169J279109J222984Q70409P58335N69866J92461
4400H8356614P6499o25504j356623j689825j918652k971197l073241l691307m465794
4391F8640970m405562l982748m007132l503096l137977k689844k263707j948461
$$ plain form
4454 46925920 48772056 50401653 52196252 53361235 54392113 55424863 55944403 56296719
4446 56296719 56659581 57051223 57550438 58062987 59080960 60128982 61250810 62633074 63961172
4437 63961172 64825336 65573383 66540909 67336318 67776624 67712349 68188182 68168871 68005520 67922982
4427 67922982 67945743 67927138 67698592 67885540 67648465 66793932 66392121 65763824 65019800 64957061
4417 64957061 65354355 66254608 67843946 69831071 72234482 74912004 77049872 79270484
4409 79270484 81162072 82097281 83463450 84742559 85965543 86835952 87594287 88164153 88356614
4400 88356614 88433113 87807609 86450986 84761161 82842509 79871312 76798071 73106764 68640970
4391 68640970 64235408 60252660 56245528 52742432 49604455 46914611 44650904 42702443
4383D2702443j585323j431328j222837j367678r42976j378788j066336p89111
4375C2918066r45296j011719m73186m50909p36327k21954k4697n61792j04336
4366B8387850l13657p8632k17296j03581J33557K57836M48876j83276O74582M96112
4356B9502371O94391N04672K23244M30823L84911N41417L27359Q64981R99396
4347C4473565R92985P33349J233026J225125J261792J211284J402329J526629
4339D4060084J960744J908022J800543K291492K559431L026963L489850L861418
4331F4958547M433871M495272M172795L791333K983588K538716K323205K138827
4323I1836154J191155N54621k58543q02484j014836r06551j205008j358598j296879
$$ plain form
4383 42702443 41117120 39685792 38462955 37095277 36152301 34773513 33707177 32918066
4375 32918066 31972770 30961051 30487865 30036956 29300629 29078675 29053978 28492186 28387850
4366 28387850 28074193 27995561 27778265 27674684 27808241 28066077 28514953 28331677 29006259 29502371
4356 29502371 30196762 30701434 30924678 31355501 31740412 32281829 32609188 33474169 34473565
4347 34473565 35466550 36199899 37432925 38658050 39919842 41131126 42533455 44060084
4339 44060084 46020828 47928850 49729393 52020885 54580316 57607279 61097129 64958547
4331 64958547 69392418 73887690 78060485 81851818 84835406 87374122 89697327 91836154
4323 91836154 93027309 93581930 93323387 92520903 91506067 90599516 89394508 88035910 86739031
4314H6739031j529274j714362j833706j817296j971649j956892j582676j087353
4306G3245823o18383n45834l48994Q21081P79137L72482Q06072M97045N85385
4297G5593814N69374Q1333L02219L69925L07623j43710l31291k76671n52615p59733
4287G5160268r29760j277507r23957j321295j299346j560484j249202j038856
4279F5559861j212058o97227p95941o07921n88439l54051r58593r10018p06270
4270E8729343j458072j701860k134149k008840j847408k251104j597264j836412
4262D3894234j634152j343277j327868j148986o46449n46767m62570n71801k2815
4253C6189549l64483l71722l07615j73586j30051K76698O0311L26752M13396P55550
$$ plain form
4314 86739031 85209757 83495395 81661689 79844393 77872744 75915852 74333176 73245823
4306 73245823 72627440 72081606 71732612 72553693 73332830 73705312 74511384 75008429 75593814
4297 75593814 76163188 76244521 76546740 76916665 77224288 77080578 76749287 76472616 75920001 75160268
4287 75160268 74230508 72953001 72029044 70707749 69408403 67847919 66598717 65559861
4279 65559861 64347803 63650576 62854635 62246714 61658275 61304224 60345631 59435613 58729343
4270 58729343 57271271 55569411 53435262 51426422 49579014 47327910 45730646 43894234
4262 43894234 42260082 40916805 39588937 38439951 37793502 37246735 36784165 36212364 36189549
4253 36189549 35825066 35453344 35145729 34972143 34842092 35118790 35179101 35505853 35919249 36674799
4243C6674799P24237J214655J772401J563898J124664P53802J131846N60244K94544
4234D5815090j82141q93340q29221n45352l01702o88435q20556m15857j00505
4225D1037981J64424L37928M89781P83045J163053J463062J669644J623569J841319
4216E0573806J724939J671729J276393R48432O83324k27338n23705j285329j259029
4207E3583222j643758k523353j829914j526642j405165j230494q96665o78813
4199D1848418o24942l59033n9583J18028L70806K51993P04052J011478J056336
4190D4317553P66293R38487L96963J75096m38916n85102n38743o47203n57738
4181D3826690l76483n59502q68360k71751n92204j017457r01551p13654r26857
$$ plain form
4243 36674799 37399036 38613691 40386092 41949990 43074654 43828456 44960302 45520546 45815090
4234 45815090 45632949 44739609 43910388 43365036 43063334 42374899 41554343 41138486 41037981
4225 41037981 41202405 41540333 42030114 42813159 43976212 45439274 47108918 48732487 50573806
4216 50573806 52298745 53970474 55246867 56195299 56878623 56651285 56127580 54842251 53583222
4207 53583222 51939464 49416111 47586197 46059555 44654390 43423896 42527231 41848418
4199 41848418 41223476 40864443 40804860 40922888 41293694 41545687 42249739 43261217 44317553
4190 44317553 45083846 46022333 46419296 46594392 46155476 45570374 45031631 44384428 43826690
4181 43826690 43450207 42890705 42022345 41750594 41158390 40140933 39239382 38525728 37598871
4172C7598871q44942n52887o78413l10238l47592l23103k42836k006k70416K00992
4162C4227430k08666j20537k40129j176K1277L83861K37066K90465M96949O00902
4152C5687442P30424O43777J69034P6887K04570J37154l91229m47063j33156j33770
4142C6544070q7009n42311m42592l57831j37116j10448j03268k9205O1709Q5702
4132C4881701K77665K23671L23631J49577M46201M11161J89869O04041J016639
4123C8524156P62903K85204O70117Q18008N43611O33365N46053L30343j2273J16907
4113D3218394k04721r1066K07589J61876p7323L09356J41356J51652M63784M48658
4103D4729555K61332P01253L70148L44003N96639O03424M00469M93096N87965
$$ plain form
4172 37598871 36753929 36201042 35522629 35212391 34864799 34541696 34298860 34296854 34026438 34227430
4162 34227430 34018764 33898227 33658098 33656922 33678199 34062060 34299126 34589591 35086540 35687442
4152 35687442 36417866 37061643 37230677 37307564 37512134 37649288 37258059 36810996 36677840 36544070
4142 36544070 36457061 35914750 35472158 35114327 34977211 34866763 34763495 34734290 34795999 34881701
4132 34881701 35159366 35383037 35706668 35856245 36302446 36713607 36903476 37507517 38524156
4123 38524156 39287059 39572263 40242380 41060388 41603999 42237364 42783417 43113760 43101487 43218394
4113 43218394 43013673 42922607 43130196 43292072 43214749 43524105 43665461 43817113 44280897 44729555
4103 44729555 44990887 45692140 46062288 46406291 47002930 47606354 48006823 48499919 49087884
4094D9087884P42282J162189Q53527Q76756Q67528R95756J033792Q15020J404092
4085E7838826J566674J738080J647666J989476K202916K148481K722298K882384
4077G4736801L439039L793360L325648M128851M762996M906480N334817O242372
4069A10670364Q120467R537113J1257548J3052092J3022786J2441310J1523453
4062A89625133J0619340R754039J0667400J3573237J8550742K4500819L0353461
4055C07644171L4733380L4161412K2742968L487785j4421011k8999618l6657081
4048C22692006l7664363l4703971k9466588k3675977j9499184j5562870j2015460
4041A50103593j0103314q251660o894243o156425n376401m570345m659795m314142
$$ plain form
4094 49087884 49830166 50992355 51845882 52722638 53590166 54585922 55619714 56434734 57838826
4085 57838826 59405500 61143580 62791246 64780722 66983638 69132119 71854417 74736801
4077 74736801 78175840 81969200 85294848 89423699 94186695 99093175 104427992 110670364
4069 110670364 118790831 128327944 139585492 152637584 165660370 178101680 189625133
4062 189625133 200244473 209998512 220665912 234239149 252789891 277290710 307644171
4055 307644171 342377551 376538963 399281931 402769716 388348705 359349087 322692006
4048 322692006 285027643 250323672 220857084 197181107 177681923 162119053 150103593
4041 150103593 140000279 131748619 124854376 118697951 113321550 108751205 104091410 99777268
4033I9777268l943979l231989k454641k367622j327823j337880j230272q74974
4025H3008088n14315j86528m4282p9429Q6906M16338M43544r0094L5039r4600
4015H2980667L33105R17891P82229O92810J300895J472804J722693J911335K035053
4006I4149482J944301J876302K554470K684447K853103L316931L078332L692766
3998A16150134L670796L440458L920319M172499M290532L969225M238387M267687
3990A48120037M559452M543107M970628N019640M696097N032857N017823M891532
3982A86851173N025935M979896M712435M822550M422137M404929M359687L785414
3974B23364156L155374L008407L232659K847382K605098K628942K369787K490630
$$ plain form
4033 99777268 95833289 92601300 90146659 87779037 86451214 85113334 83883062 83008088
4025 83008088 82493773 82307245 82262963 82183534 82270440 82686778 83130322 83040228 83075267 82980667
4015 82980667 83313772 84231663 85013892 85706702 87007597 88480401 90203094 92114429 94149482
4006 94149482 96093783 97970085 100524555 103209002 106062105 109379036 112457368 116150134
3998 116150134 119820930 123261388 127181707 131354206 135644738 139613963 143852350 148120037
3990 148120037 152679489 157222596 162193224 167212864 171908961 176941818 181959641 186851173
3982 186851173 191877108 196857004 201569439 206391989 210814126 215219055 219578742 223364156
3974 223364156 226519530 229527937 232760596 235607978 238213076 240842018 243211805 245702435
3966B45702435J755494J186569J070029J01663k46541n04992r01844j405801j629709
3957B45127303j864362j769608k285445k571618k415432k325399k647096l313549
3949B25934794l718211l680625l761548l862252m012218m139254m252856m277400
3941A94230430l911703l438103l937979l696733l827279l647712l138486l070198
3933A65562237k954428l075159k523013k473586k336013j941459j607048j308804
3925A47342727r40715r5442K89463r2817M76315R51564K316681K603078L349370
3916A56200224L372682M089971N551873N714639O713047P694853Q751139R729440
3908B07817868R903375J0391870J0072012R405146Q161841O844678N122413L664864
$$ plain form
3966 245702435 247457929 248644498 249714527 249816190 249569649 249064657 248162813 246757012 245127303
3957 245127303 243262941 241493333 239207888 236636270 234220838 231895439 229248343 225934794
3949 225934794 222216583 218535958 214774410 210912158 206899940 202760686 198507830 194230430
3941 194230430 190318727 186880624 182942645 179245912 175418633 171770921 168632435 165562237
3933 165562237 162607809 159532650 157009637 154536051 152200038 150258579 148651531 147342727
3925 147342727 146402012 146306570 146596033 146503216 146979531 147931095 150247776 152850854 156200224
3916 156200224 159572906 163662877 169214750 174929389 181642436 189337289 198088428 207817868
3908 207817868 217721243 228113113 238185125 247590271 255752112 262596790 267719203 271384067
3900B71384067L244224K814967L235835L586566M106381M738625N657548N104860
3892C03873073M518659L382507K217287J013542O5708j82932l37898K7474J460530
3883C16037950K449298M095169O410142Q936967J0649175J2290767J5087805J7154801
3875C93112074J8036120J7696315J6643135J3913341J0109906N830156P02857
3868D76043904l367673n963692q107770q630562q637764q006505p079627o316681
3860D19933630n717772o420718p166524q621862j1326609j4368142j7473134k0145194
3852C28693675k1510225k2271462k1439550k0252331j8647493j6073235j5002868
3845A93496511j2949894j1751682j0348040q662964q270283p331614o162598n112379
$$ plain form
3900 271384067 274628291 277443258 280679093 284265659 288372040 293110665 298768213 303873073
3892 303873073 308391732 311774239 313991526 315005068 315070776 314887844 314549946 314577420 316037950
3883 316037950 318487248 322582417 328992559 337929526 348578701 360869468 375957273 393112074
3875 393112074 411148194 428844509 445487644 459400985 469510891 475341047 476043904
3868 476043904 472676231 466712539 458604769 449974207 441336443 433329938 426250311 419933630
3860 419933630 414215858 407795140 400628616 392006754 380680145 366312003 348838869 328693675
3852 328693675 307183450 284911988 263472438 243220107 224572614 208499379 193496511
3845 193496511 180546617 168794935 158446895 149783931 141513648 134182034 128019436 122907057
3837A22907057m826268m081652l997892l799321l127196k932519k784649k475059
3829I4882501k408975k321837k259452j746192k101222k250678j779480j707006
3821G8307659j828847j898814j588683j229702j532946j602901j244984j491230
3813F5889552j359181j717173j271727j444579j531234j521134j792757j182562
3805E4069205q19248j322045j281355j498933q18812p18301o82544o78449q63905
3796D5385613r00330r68447n09349p21542o78880n67348p10872l53868n01061
3787C9473916o58328o39471k36459m77846r29803n37523l53004l25439o32868
3778C4683175m77111l06492k22631n99321l30179l464j69175m64690m93848l10527
$$ plain form
3837 122907057 118080789 113999137 110001245 106201924 103074728 100142209 97357560 94882501
3829 94882501 92473526 90151689 87892237 86146045 84044823 81794145 80014665 78307659
3821 78307659 76478812 74579998 72991315 71761613 70228667 68625766 67380782 65889552
3813 65889552 64530371 62813198 61541471 60096892 58565658 57044524 55251767 54069205
3805 54069205 53249957 51927912 50646557 49147624 48328812 47610511 46927967 46249518 45385613
3796 45385613 44485283 43516836 43007487 42285945 41607065 41039717 40328845 39974977 39473916
3787 39473916 38815588 38176117 37939658 37461812 36532009 35994486 35641482 35316043 34683175
3778 34683175 34206064 33899572 33676941 33077620 32747441 32743977 32574802 32110112 31616264 31305737
3768C1305737j51167J97277R8656j98427J77464j39784n46327k73571k19108k54444
3758B9996306m73773K1422n6421o28932k95709K78338l92391l28850l58742o7371
3748B7693877K23011l84539k16160l96439p1020r7156N057k39582K53275L15811
3738B7086135r630l17843j10568k66325O2225P4843Q0908J89960J44334p8133
3728B6855906j62939l32892J39489K77837K08221j6006J4700L7379J64555K69290
3718B7455540m286J83023K31577K38451k08812M00478K83718J61860N04312L29483
3708B9575344K49192M50667K80807M82800K98382M72988O81804N92759M27578
3699C3512321L90892O05514P23491Q96041O84489M61044N83796M59442N97769
$$ plain form
3768 31305737 31154570 31351847 31450503 31252076 31429540 31289756 30743429 30469858 30250750 29996306
3758 29996306 29522533 29543955 29487534 28858602 28562893 28841231 28448840 28119990 27761248 27693877
3748 27693877 27916888 27532349 27316189 26919750 26848730 26751574 26756631 26517049 26770324 27086135
3738 27086135 27076505 26758662 26648094 26381769 26443994 26518837 26599745 26789705 26934039 26855906
3728 26855906 26692967 26360075 26499564 26777401 26985622 26969616 26984316 27021695 27186250 27455540
3718 27455540 27451254 27634277 27865854 28104305 27895493 28295971 28579689 28741549 29245861 29575344
3708 29575344 29824536 30275203 30556010 31038810 31337192 31810180 32491984 33084743 33512321
3699 33512321 33903213 34508727 35232218 36128259 36812748 37273792 37857588 38317030 38914799
3690C8914799O61220R65076O60637J083789Q14519Q75816Q55004O55580N81702
3681D6068142J025674J046118R27404P94867R08966Q82592Q77905Q07354P72906
3672E4111928P19296O56998R44500J021693J313826J011488J025341O09401Q79455
3663F2293926J285053J231562Q72220J485303R91220R37989J210915J420439J591745
3654G3320372J802908J472115J541451J805086J771907K018868K243682K610700
3646H8587089K806145L164984K769423L453415L700230M007856M465924M667572
3638A17622638N348006N575431O491566O807752P619053Q627682R077559J0241689
3630A77411376J1027168J1166881J1198538J0818773J0524961J0870698J1133272
$$ plain form
3690 38914799 39576019 40541095 41201732 42285521 43100040 43975856 44830860 45486440 46068142
3681 46068142 47093816 48139934 49067338 49862205 50771171 51653763 52531668 53339022 54111928
3672 54111928 54831224 55488222 56432722 57454415 58768241 59779729 60805070 61414471 62293926
3663 62293926 63578979 64810541 65682761 67168064 68159284 69097273 70308188 71728627 73320372
3654 73320372 75123280 76595395 78136846 79941932 81713839 83732707 85976389 88587089
3646 88587089 91393234 94558218 97327641 100781056 104481286 108489142 112955066 117622638
3638 117622638 122970644 128546075 135037641 141845393 149464446 158092128 167169687 177411376
3630 177411376 188438544 199605425 210803963 221622736 232147697 243018395 254151667
3623B54151667J1664087J2481950J3913857J5089391J6819023J7462481J9369540
3616C60951996J9159403J9305839J8856853J7132335J5007115J1375397Q913934
3609D70702872N563715L959882L451424L146523L562754N178508N864603O519873
3601E07950154O667821N267693L046514l01949m173948q367134j2106769j5359903
3593D82622479j6855293j7709445j8207077j7406911j6541287j5482501j4100312
3586C66319653j2971363j2935663j2449272j3074452j3953219j4806545j5319908
3579B70809231j6369900j6874288j5835949j4833609j3679426j2430119j0656319
3572A70129621r849418q889966p699322p288970o675859o120022n247726m926440
$$ plain form
3623 254151667 265815754 278297704 292211561 307300952 324119975 341582456 360951996
3616 360951996 380111399 399417238 418274091 435406426 450413541 461788938 470702872
3609 470702872 476266587 480226469 483677893 486824416 490387170 495565678 501430281 507950154
3601 507950154 514617975 519885668 522932182 522630233 518456285 510089151 497982382 482622479
3593 482622479 465767186 448057741 429850664 412443753 395902466 380419965 366319653
3586 366319653 353348290 340412627 327963355 314888903 300935684 286129139 270809231
3579 270809231 254439331 237565043 221729094 206895485 193216059 180785940 170129621
3572 170129621 160280203 151390237 143690915 136401945 129726086 123606064 118358338 113431898
3564A13431898m580482m224411l902074l776895l272166l113547l123583k940612
3556H4498128k554440k609355k052379j910058k119356k158920j741869k095856
3548F7255895k015482j866426j323154j326532j746558j313249j327711j095039
3540E5241744j171241r67662q38973j424691j099250n78473j162641q68260q98212
3531D6232341j076195q53436m82108p17367n57208l76383p75890r45378p34958
3522C9713418p30936o83925o86749m68911p04050n48527q80023n40976q60465
3513C3608856l68240p57292n15403k66553o53121m99113p71657l78970k78577
3504B9119930k33638o28225n27664l60049m66293n97947k63361j69198o69818
$$ plain form
3564 113431898 108851416 104627005 100724931 96948036 93675870 90562323 87438740 84498128
3556 84498128 81943688 79334333 77281954 75371896 73252540 71093620 69351751 67255895
3548 67255895 65240413 63373987 62050833 60724301 58977743 57664494 56336783 55241744
3540 55241744 54070503 53102841 52263868 50839177 49739927 49161454 47998813 47130553 46232341
3531 46232341 45156146 44302710 43820602 43103235 42546027 42169644 41393754 40448376 39713418
3522 39713418 38982482 38298557 37611808 37142897 36438847 35890320 35010297 34469321 33608856
3513 33608856 33240616 32483324 31967921 31701368 31048247 30549134 29777477 29398507 29119930
3504 29119930 28886292 28258067 27730403 27370354 26904061 26306114 26042753 25873555 25203737
3495B5203737m40263m49509m07180m40678m27391m53973o12110m25406k3850k79277
3485B1244100l30556j12354o52392n25176j87339l86770p65579m24668l58546
3476A7500720j50067l55429j79741j86936l71850j3803n00543j1964J34013n77315
3466A5287085j00801l58282m35467K27337Q581j83917j95615k48483k35586K44849
3456A4009701j37108j67690k70389j07756L234l48601K1071k27591j72565N71243
3446A3173549l45531m93940k12968K8594K81895o3743n6884k04071j89051k89588
3436A1628262J38147P2632r6890m56581L48651J27389m44014j62763P2747j47786
3426A1079794J15335k15954j6322j67913L6223j13419j94037J89767m42224j01130
$$ plain form
3495 25203737 24763474 24313965 23906785 23466107 23038716 22584743 21972633 21547227 21523377 21244100
3485 21244100 20913544 20801190 20148798 19623622 19436283 19049513 18283934 17859266 17500720
3476 17500720 17350653 16995224 16815483 16628547 16256697 16242894 15742351 15730387 15864400 15287085
3466 15287085 15186284 14828002 14392535 14619872 14628453 14444536 14248921 14000438 13764852 14009701
3456 14009701 13872593 13704903 13434514 13326758 13329992 12981391 13002462 12774871 12602306 13173549
3446 13173549 12828018 12334078 12121110 12149704 12431599 12367856 12310972 12106901 11917850 11628262
3436 11628262 11766409 11839041 11742151 11285570 11634221 11761610 11317596 11154833 11227580 11079794
3426 11079794 11195129 10979175 10962853 10794940 10831163 10717744 10523707 10713474 10271250 10170120
3416A0170120p9399p6711j569N6488O9504j72475j77599J37998J2798j76930J64444
3405I926669k26065N7663J09834J0411Q884j23709J8591j22392L1851J14844k0483
3394I786098J41343K63692k20254J16360j43442l08683n269L34344k46571K19045
3384I936663n8540j62075l237r3072J86362J11938K94747K92507R5785l43729
3374A0257349J66748k7586j03369j0682J04260o4052j44407J96998K10342N3100
3364A0638701K11428O6215K13986Q7396j16559J53352Q454J89075K65959K41254
3354A1959261p4295K5936O55931R2117j3838L8984J52917N10220j22039R6542
3344A3321736J13001M76197m9772N00086L15013J27975L49527K44160K25612L67260
$$ plain form
3416 10170120 10090721 10014010 10012441 10068929 10138433 9965958 9788359 9926357 9939155 9762225 9926669
3405 9926669 9700604 9758267 9868101 9878512 9887396 9763687 9782278 9659886 9691737 9806581 9786098
3394 9786098 9927441 10191133 9970879 10087239 9943797 9635114 9629845 9964189 9717618 9936663
3384 9936663 9878123 9716048 9712811 9619739 9806101 9918039 10212786 10505293 10601078 10257349
3374 10257349 10424097 10396511 10293142 10282460 10386720 10322668 10178261 10375259 10585601 10638701
3364 10638701 10850129 10916344 11130330 11217726 11101167 11254519 11262973 11452048 11718007 11959261
3354 11959261 11884966 11910902 12566833 12658950 12645112 12684096 12837013 13347233 13225194 13321736
3344 13321736 13434737 13910934 13861162 14361248 14676261 14804236 15153763 15397923 15623535 15990795
3334A5990795N56383O5797K66146L51812O47197M41521K87713P72259O9188M75577
3324A9924388R07426M28409K56734O12209N55900M59577N91894L48298M55382
3315B4540217J51634L73279K10277K02812N46912K31283J43561L53244N11301
3306B7264520L09840J34824O75568L03746L43102J29064K20050O06465P45381
3297C0732560M27914N58317L36307K74853N07098O63044M58088Q93688J098352
3288C5950221O44153N99736Q92465P67537P40235O71141N32275Q67918J175431
3279D2841112R53759P52569J040034J659872J065179J147293J575792J736602
3271E2772212J382068J153245J624887J626015J479826J549650J638471J840235
$$ plain form
3334 15990795 16547178 16612975 16879121 17230933 17878130 18319651 18607364 19379623 19448811 19924388
3324 19924388 20831814 21260223 21516957 22129166 22685066 23144643 23736537 24084835 24540217
3315 24540217 24691851 25065130 25275407 25478219 26025131 26256414 26399975 26753219 27264520
3306 27264520 27574360 27709184 28384752 28688498 29031600 29160664 29380714 29987179 30732560
3297 30732560 31160474 31718791 32055098 32329951 32837049 33500093 33958181 34851869 35950221
3288 35950221 36594374 37194110 38086575 38854112 39594347 40265488 40797763 41665681 42841112
3279 42841112 43794871 44547440 45587474 47247346 48312525 49459818 51035610 52772212
3271 52772212 54154280 55307525 56932412 58558427 60038253 61587903 63226374 65066609
3263F5066609K166517J786427J727209K283670K647012K555219K959914L017688
3255H4210265L271118L702092M116222M521528M694141N337676O073531O503791
3247A22430364P196726P384995Q532925Q960961J0010367J1011023J1973467J2632212
3239B00133040J2649952J2253924J0591555P822633L505880j952191p637835j2227557
3231B25139401j6147990j7978530j7907735j7260167j5653630j3785675j2026139
3224A14379535j0466725q907244p795151o686893o096531m703040m041056l698481
3216F1984414l124968k174849k245993k765501k695548k367044k780720k497531
3208D1332260k085905j865234k016667j416115j337913j588068j038388j225886
$$ plain form
3263 65066609 67233126 69019553 70746762 73030432 75677444 78232663 81192577 84210265
3255 84210265 87481383 91183475 95299697 99821225 104515366 109853042 115926573 122430364
3247 122430364 129627090 137012085 145545010 154505971 164516338 175527361 187500828 200133040
3239 200133040 212782992 225036916 235628471 243451104 246956984 245004793 237366958 225139401
3231 225139401 208991411 191012881 173105146 155844979 140191349 126405674 114379535
3224 114379535 103912810 95005566 87210415 80523522 74426991 69723951 65682895 61984414
3216 61984414 58859446 56684597 54438604 51673103 48977555 46610511 43829791 41332260
3208 41332260 39246355 37381121 35364454 33948339 32610426 31022358 29983970 28758084
3200B8758084r35775j545532r77237p23199j010641q68885n35403p43858r03879
3191B0513675k92506o27144n22908k72219m43087m65336m78154p2444n4897K52108
3181A7537088l11660m41507q35073r06490m15002p54824k49332m95089k74501
3172A2853610k92006o11057n47693j67006O6516l67294k45512j51059k51821l92103
3162I894575j33088m41042k88360l35684M5266j67009l34901j81954n7078j42716
3152G858009j44573r2460j54533j0440k57503j99439p5000l72925O2021k58077
3142F355080l21649P0536K62328k64390j71475n7192k15041r5690j87933j44031
3132E230543K88155k27801j86712k29937Q4086P0039J41743L0380M2602p6294
$$ plain form
3200 28758084 27822309 26276777 25299540 24576341 23565700 22696815 22161412 21417554 20513675
3191 20513675 20221169 19594025 19071117 18798898 18355811 17890475 17412321 17339877 17284980 17537088
3181 17537088 17225428 16783921 15948848 15042358 14627356 13872532 13623200 13128111 12853610
3172 12853610 12561604 11950547 11402854 11235848 11302364 10935070 10689558 10538499 10286678 9894575
3162 9894575 9761487 9320445 9032085 8696401 8741667 8574658 8239757 8057803 8000725 7858009
3152 7858009 7713436 7620976 7466443 7456003 7198500 6999061 6924061 6551136 6613157 6355080
3142 6355080 6033431 6103967 6366295 6101905 5930430 5873238 5658197 5562507 5374574 5230543
3132 5230543 5518698 5290897 5104185 4874248 4958334 5028373 5170116 5200496 5243098 5166804
3122E166804k52647l14134K78384M26875m19670k37932N150l47596j15671J37194
3112D326757l63465k4217n7514L5166j20667O5222j66533J34725j95019p8671
3102C555784k8113J65357j37564k13313j1753K58547l47596j8263K86460K29717
3092C739263m21982j23190K10145m09624Q0304L10965J67800o0791k46400l87101
3082B859389l65346K2458J29513P4123J45374J39859Q678l75164K0505K21368
3072B880757K5163J43544m5189l42168J38597j06856k9126K29599l31278J90734
3062B753777j27289q290J65373J16983j00728j04230j56968p9672q5355J11236
3052B484837P4528k09669J25300l47618j66194M23297Q2188k7572N1717o5490
$$ plain form
3122 5166804 4914157 4600023 4878407 5305282 4885612 4647680 4652830 4305234 4189563 4326757
3112 4326757 3963292 3939075 3881561 3916727 3796060 3861282 3694749 3829474 3634455 3555784
3102 3555784 3527671 3693028 3555464 3342151 3330398 3588945 3241349 3223086 3509546 3739263
3092 3739263 3317281 3194091 3404236 2994612 3074916 3385881 3553681 3492890 3246490 2859389
3082 2859389 2494043 2516501 2646014 2720137 2865511 3005370 3014048 2638884 2659389 2880757
3072 2880757 2905920 3049464 3004275 2662107 2800704 2693848 2664722 2894321 2563043 2753777
3062 2753777 2626488 2618198 2783571 2900554 2799826 2695596 2538628 2458956 2373601 2484837
3052 2484837 2559365 2349696 2474996 2127378 1961184 2384481 2466669 2439097 2490814 2425324
3042B425324n7778j3517R9645j877j56981J4088J03541r1048k11468K35762K60878
3031B606569l23664o0677l2915J45774j58367n981P1069J59957k67591j56851
3021A977323K1932n3119J42205K47905k81891R9471m5941J197j51175M3512K21578
3010B222997K8856n9579j86041J22845M3072J57259j88968K4275K17856L10508
3000B693080j24953p5332K25143L967j14114j77668K4269K25950m58603l0215
2990B191524O55442k19568k06206J16172L93339L58154j5292k86175N5053o7079
2980B975364J96116L0367J11445k1133r9941K72577J51364j43785l51787K59018
2970C379605K5221J57185J01260m8173j48224O1049R1928l66978n2738L39350
$$ plain form
3042 2425324 2367546 2354029 2453674 2451797 2294816 2308904 2412445 2321397 2109929 2345691 2606569
3031 2606569 2282905 2222228 2189313 2335087 2176720 2170739 2241808 2401765 2134174 1977323
3021 1977323 1999255 1946136 2088341 2336246 2054355 2153826 2107885 2109082 1957907 2001419 2222997
3010 2222997 2251853 2192274 2006233 2129078 2172150 2329409 2140441 2164716 2382572 2693080
3000 2693080 2568127 2492795 2717938 2721905 2607791 2430123 2454392 2680342 2221739 2191524
2990 2191524 2846966 2627398 2421192 2537364 2930703 3288857 3273565 2987390 3042443 2975364
2980 2975364 3171480 3201847 3313292 3292159 3192218 3464795 3616159 3472374 3120587 3379605
2970 3379605 3404826 3562011 3663271 3615098 3466874 3527923 3619851 3252873 3200135 3539485
2960C539485Q5140J68229J31102J63874j01999L67019j71659r5637L13150N751
2950D404455J27864J74409p8543K15742L87263N3162J6860n7655P8759J23950
2940E446266J41565K86568J72481M21564N50716M86867L27757K49078K45668L28745
2930H657275M68551M33206J116050M48009L65888M62685L58440J71086Q7133J07418
2920A2675741j35950J94520L79216j05843r2552k43261K93932r0617j431m8179
2910A2825576K13270L18704J4385N57857N26396M20750K83246L25584M38138J218238
2900A7142144J094331J217919J390135J652513J224642O17373r30871j815691
2892B1592495j385565j693949j820899j275279r93030n77318o89994q53790J29150
$$ plain form
2960 3539485 3624625 3792854 3923956 4087830 3985831 4352850 4181191 4085554 4398704 4404455
2950 4404455 4532319 4706728 4628185 4843927 5231190 5284352 5301212 5243557 5322316 5446266
2940 5446266 5587831 5874399 6046880 6468444 7019160 7506027 7833784 8082862 8328530 8657275
2930 8657275 9125826 9559032 10675082 11123091 11488979 11951664 12310104 12481190 12568323 12675741
2920 12675741 12539791 12734311 13113527 13007684 12915132 12671871 12965803 12875186 12873755 12825576
2910 12825576 13038846 13357550 13371935 13929792 14456188 14876938 15160184 15485768 15923906 17142144
2900 17142144 18236475 19454394 20844529 22497042 23721684 24339057 23408186 21592495
2892 21592495 20206930 18512981 16692082 15416803 14423773 13846455 13156461 12302671 12431821
2883A2431821j37324l78624m50320l84401K06978j21280k01492j52506J52786
2874A0965638J26575k3448K00827M71027J4941J56485M3230m8007L89405N99j83712
2863A2113560k08533o56028p17121r70252o94649m36832m84240l36573m69628
2854G139704o6293k37705k51048k66238j56421k86449n9831l00189m10357J8061
2844E123234k68068k94273j86138k29262L6511j60998K686n8658k82517l55036
2834C327481k82616J07020l31676K09900j01540k18582J10834j68392m68738o0162
2824B123529L86814J69331j31795J3733l13075k88965L46745R6438j57248j89633
2814B055874j19873j32797j96871k50513q8996J09259L51466j68914k84220j62098
$$ plain form
2883 12431821 12294497 11915873 11465553 11081152 11288130 11166850 10965358 10812852 10965638
2874 10965638 11092213 11068765 11269592 11740619 11755560 11912045 11955275 11907268 12296673 12297272 12113560
2863 12113560 11905027 11248999 10531878 9561626 8866977 8430145 7945905 7609332 7139704
2854 7139704 7073411 6835706 6584658 6318420 6161999 5875550 5815719 5515530 5105173 5123234
2844 5123234 4855166 4560893 4374755 4145493 4182004 4021006 4023692 3965034 3682517 3327481
2834 3327481 3044865 3151885 2820209 3030109 2928569 2709987 2820821 2652429 2183691 2123529
2824 2123529 2510343 2679674 2547879 2561612 2248537 1959572 2306317 2402755 2245507 2055874
2814 2055874 1936001 1803204 1606333 1355820 1266824 1376083 1727549 1558635 1274415 1112317
2804A112317K19130K70937m8559j25409j30524k08219j26562k39740J67159N6366
2794I46896p5579N4502l67173J63287K79311k30387Q959K7514J63496P5363k59487
2783G86702m3995K98450P7282J49750j14228l65092p3763K6909J87847O8750p7054
2772I21558l75634k73477R2509j5079L49304p4382J08969j24332j33628q9710
2762C86098j22930j45886M1827J92265m3646R280L33506j4037o12059J29887L88392
2751E42697N2653q158l33250j29539l519o0940K84382l31421k7589n5751K46013
2740A75578J49969J41121m1363j84276K54180J72373m14973K29724L9725l96829
2730A25229K70307r1172N7530j41612l9204l7853J82880j80289k42790L41002
$$ plain form
2804 1112317 1331447 1602384 1553825 1428416 1297892 1089673 963111 723371 890530 946896
2794 946896 871317 925819 558646 721933 1001244 770857 779816 807330 970826 1046189 786702
2783 786702 742707 1041157 1118439 1268189 1153961 788869 715106 742015 929862 998612 921558
2772 921558 545924 272447 364956 349877 699181 624799 733768 609436 475808 386098
2762 386098 263168 117282 159109 351374 307728 317008 650514 636477 24418 154305 542697
2751 542697 595350 587192 253942 124403 120884 59944 344326 12905 -14684 -70435 175578
2740 175578 325547 466668 425305 241029 495209 667582 252609 482333 522058 125229
2730 125229 395536 304364 361894 220282 181078 143225 326105 145816 -96974 244028
2720B44028K6137K00379j87487j22387j78633r4328J64025L587k34471Q1159k9113
2709a27104K69484J84545P96k31253p0697N5999L4903L5630k73089R9801m0721
2698f1706j563J30405j39493o8139j09598N32681l17469J7209j61102m5117J17305
2687a06587Q219K11775p0769k68738k01489K11943K18248L2846j39705o8934r4626
2676b67817J79186L52801L4903m23544J83602L7186n3180j59886l36438K17995
2666b35192J51507Q1344J53170n8557R4837J09060J15651j12801J75453k79883
2656A94589k17317K88344j31196j05278J02998l25354j140L69836J18937J37954
2646D32373k78008M4036P1744j96832N3333q7246N5620L73882M4519l11553p6730
$$ plain form
2720 244028 270165 470544 283057 160670 -17963 -112291 51734 55321 -179150 -97991 -127104
2709 -127104 142380 326925 327721 96468 25771 81770 116673 152303 -120786 -20985 -61706
2698 -61706 -63269 67136 -72357 -140496 -250094 282587 -34882 -17673 -178775 -223892 -106587
2687 -106587 -98368 113407 42638 -226100 -427589 -215646 2602 35448 -104257 -173191 -267817
2676 -267817 -88631 264170 299073 -124471 59131 96317 43137 -116749 -453187 -235192
2666 -235192 -83685 -2341 150829 92272 187109 296169 411820 299019 474472 194589
2656 194589 -22728 265616 134420 29142 132140 -193214 -194354 175482 294419 432373
2646 432373 154365 198401 270145 73313 126646 39400 95020 468902 513421 201868 125138
2635A25138k96979J95898j71182p9209L44873J93004k85380j83075o5896j62809
2625c85617O8255J90841l3081m8641j07183J37605j26814J58156J35528J10245
2615I9294j105j2248j55467j66455l2399K46578q1401K15365p0993O7893l5079
2604G3983q5270k0575k50821P2071K15253k86905J04595L25556M0968k8853o4495
2593I5507o3866m3455n2738R490o4582J11503L87341p7532L70674k87686l53196
2582C1460P7119L4676m7927j43678l25330N4687k56301K47092L61205Q6676k09188
2571h9509n5231j30675p8181J53543K7524j85623Q9073j05013K30946M6527K0970
2560g5649l42986k65781N13560P6006m36072K02252r8587J04956q7937r4300m7141
$$ plain form
2635 125138 -171841 24057 -147125 -226334 118539 311543 26163 -156912 -222808 -385617
2625 -385617 -317362 -126521 -159602 -208243 -315426 -177821 -304635 -146479 -10951 99294
2615 99294 98189 85941 -69526 -235981 -268380 -21802 -103203 112162 41169 109062 73983
2604 73983 -11287 -31862 -282683 -210612 4641 -282264 -177669 147887 188855 160002 95507
2593 95507 31641 -11814 -64552 -55062 -119644 -8141 379200 301668 672342 384656 31460
2582 31460 108579 143255 95328 -48350 -373680 -318993 -575294 -328202 33003 119679 -89509
2571 -89509 -144740 -275415 -353596 -200053 -172529 -358152 -269079 -374092 -143146 -96619 -75649
2560 -75649 -418635 -684416 -170856 -94850 -530922 -328670 -427257 -322301 -410238 -504538 -551679
2549e51679N4508J52656L22730j7891k67442N4965L15328K18493m44879k05291
2539c68502J36146K08967m985k30730J17681J78539P6178k7053k92494j35449
2529c41702L73276j9765j72473L16272N1632k13783k22069N4040J8342k5990J00463
2518h1757j85607O5800K08393k66100J46445P9528m3991M6892j48175k32223L09548
2507a01247J30384j74468j58415J45016J03514j44909o007r4157J45443J25868
2497b8978j8559P3445k52943j42534k0824K66259j82782p6926J18633Q8368r7432
2486b74273K38064j18065n7724J99697k08237o2662K79979O4458l89707J59852
2476a68618K53738k24439l04455K09981O7052M5259k33838p7726J16793J00825
$$ plain form
2549 -551679 -497171 -344515 -21785 -39676 -307118 -252153 63175 281668 -163211 -368502
2539 -368502 -232356 -23389 -28374 -259104 -141423 37116 113294 86241 -206253 -341702
2529 -341702 31574 11809 -160664 155608 207240 -6543 -228612 -174572 -156230 -182220 -81757
2518 -81757 -267364 -201564 6829 -259271 -112826 -33298 -77289 -30397 -178572 -410795 -101247
2507 -101247 29137 -145331 -303746 -158730 -55216 -200125 -206132 -300289 -154846 -28978
2497 -28978 -47537 25908 -227035 -369569 -390393 -124134 -306916 -383842 -265209 -176841 -274273
2486 -274273 -36209 -154274 -211998 -12301 -220538 -283200 -3221 61237 -328470 -168618
2476 -168618 85120 -139319 -443774 -233793 -166741 -121482 -355320 -433046 -316253 -215428
2466b15428L3389M1079P3841J37883R7663j41004j94984L8824o0707k0913K42326
2455C1969n4475r7969j76857m4571j02564K20866j68172k3633R7579K2777L05399
2444A0349J60639k03016j59415r4772J96547K7959r2356J88111j98055J8353o2136
2433b07792Q5806M24157j7213k50416j68716r8602M9990k13610n1243J37762J37081
2422a72796K95590j30658l04334j65840K54988r3298M32630j29144P0989J0930
2412F9057q5907K20450k38066m9310j04044M9510K14505p8696p5110k3556j16653
2401b17820Q4662R7415j37908n9736N8075J36298N3833k5658k9580k57894R0756
2390b07557K48222J56387J95350j23852j97720k12310j83861M55923J83958j40707
$$ plain form
2466 -215428 -182039 -140960 -67119 70764 168427 27423 -167561 -128737 -189444 -210357 31969
2455 31969 -22506 -120475 -297332 -341903 -444467 -223601 -391773 -415406 -317827 -295050 10349
2444 10349 170988 -32028 -191443 -286215 -89668 -61709 -154065 34046 -164009 -145656 -207792
2433 -207792 -121986 302171 284958 34542 -134174 -232776 -182786 -396396 -447639 -309877 -172796
2422 -172796 122794 -7864 -312198 -478038 -223050 -316348 116282 -12862 58127 69057
2412 69057 -16850 203600 -34466 -83776 -187820 -138310 76195 -2501 -77611 -101167 -217820
2401 -217820 -133158 -35743 -173651 -233387 -175312 -39014 14819 -10839 -40419 -298313 -207557
2390 -207557 40665 197052 392402 268550 70830 -141480 -325341 130582 314540 173833
2380A73833j84947K3424O6025k3297q6148K43445j73939K03776j07426k425N2501
2369A84822Q9111J70561J8290L38457M18262m8480l33553m6566k30298k25469
2359C35137j65753j79818j93201J13665K81439n8648j44442j57393L45942L6750
2349B13678J37521l81982O0845J25024l38030K87905q046j54327O9048L3583J66934
2338B12153k17002m30013K56988K83312J67136L6871k06617L7522j13821l96582
2328c70053L7198K21688L06845k15631m3657J38137L27933l96061l1453K683J56860
2317A34489K35595j01971j38355k06750P0273k0152J68299j60708j85244K62621
2307E8097J15052l39680K21470k65675j29133K69751P2265j02453p3492J72864
$$ plain form
2380 173833 -11114 12310 78335 55038 -31110 212335 38396 242172 134746 132321 184822
2369 184822 273933 444494 462784 801241 1219503 1171023 837470 790904 560606 335137
2359 335137 169384 -10434 -203635 -89970 191469 132821 -11621 -169014 176928 213678
2349 213678 351199 -30783 30062 155086 -182944 104961 96915 -57412 11636 45219 212153
2338 212153 -4849 -434862 -177874 105438 272574 309445 102828 140350 26529 -370053
2328 -370053 -332855 -111167 195678 -19953 -63610 74527 402460 6399 -25054 -22371 134489
2317 134489 370084 268113 129758 -76992 -6719 -26871 141428 -19280 -204524 58097
2307 58097 173149 -166531 54939 -210736 -339869 -70118 2147 -100306 -173798 -934
2297i34K67606K18539j57059L6465l30087j09182L95361j23167k41924j31075
2287a75457K9514J62510K22669j34769J56666j19563j52486m8238R0459K12386
2277B43691k52668L8410j94745K04631o339N5276J42601j03942q358j7162L28354
2266D29749P8689N2729j06654j01202r1436J21204N4467J28626J23443m33112
2256B56503K82445j9409k4631K76358K46237k24850j53027o2469k31137j79127
2246A66893l4702L89134J70974K0501K4799j37012O375J11906j90090J85006k2082
2235F91702r0038K2349N620J13825l14557K97586j44987O5257k3059l19599K3383
2224C27482L83620N465J80212J87145k81284l3059J76823J72086j20757k45626
$$ plain form
2297 -934 266672 485211 328152 364617 34530 -74652 320709 197542 -44382 -175457
2287 -175457 -145943 16567 239236 104467 261133 141570 -10916 -59154 31305 243691
2277 243691 -8977 29433 -165312 39319 32980 88256 230857 126915 118557 101395 429749
2266 429749 508438 561167 454513 353311 261875 383079 437546 566172 689615 256503
2256 256503 538948 519539 494908 771266 1017503 792653 639626 577157 346020 166893
2246 166893 132191 521325 692299 712800 737599 600587 606962 718868 528778 713784 691702
2235 691702 601664 624013 629633 743458 428901 726487 581500 646757 623698 304099 327482
2224 327482 711102 716567 896779 1083924 802640 769581 946404 1118490 997733 752107
2214G52107l504J42874j43924J24258J77127k6980k8341K61477r7537k77600N3895
2203I33852K75525P8221j00783L09364j0117j64498l1500N4877J11676L42312
2193A798929N3597k3952K54637N7131J01781q7940K8324l6337q065K19301K02425
2182B559831k26337K39731N6098N0829N5331R9349J53591p4086M170l79963K84000
2171B822544L65960J14999K6653l558r583M51834K1429m9848J05826J22738J17083
2160D086077q1317N3206l85870n0605K44330J82569J62373L37124j00410j7536
2150D429941j46614L4439L95593l4348l64863M21255K58251K92909J96982J31069
2140E614614K36234O78826J05968J16000K85713J54100J59662O21121K67848K50724
$$ plain form
2214 752107 748603 891477 747553 871811 1048938 1021958 993617 1255094 1157557 879957 933852
2203 933852 1209377 1287598 1186815 1496179 1486062 1321564 1290064 1344941 1456617 1798929
2193 1798929 1852526 1828574 2083211 2140342 2242123 2154183 2182507 2146170 2138105 2357406 2559831
2182 2559831 2333494 2573225 2629323 2680152 2735483 2834832 2988423 2914337 2918507 2538544 2822544
2171 2822544 3188504 3303503 3330156 3326598 3317015 3768849 3790278 3740430 3846256 3968994 4086077
2160 4086077 4004760 4057966 3672096 3621491 3865821 4048390 4210763 4547887 4447477 4429941
2150 4429941 4283327 4317766 4713359 4679011 4314148 4735403 4993654 5286563 5483545 5614614
2140 5614614 5850848 6529674 6635642 6751642 7037355 7191455 7351117 7972238 8240086 8490810
2130H490810L48266O94159O84203L02072Q16311J070311M33678L51874P57606
2121A3949290N38663P78076Q32583J068885J018370J577371K461505K249831K194699
2112B6669273J553573J678836K177279K299641L534914M040762N424294O497003
2104E3875575Q770651J1939439J5694590J9286099K7774617L0960938J5361977
2097A83663886j6514656k8459808k4069151k2324086j5816632j3171564r978738
2090E3329251p266995n558368m076162l164984k943456j720917j332105j260502
2082B6005762j962471k137296j581249j633838j299126j658299r54532p71098
2074A4007853p73333p34251n85825o12322q11676m13133k70945m72590k07500
$$ plain form
2130 8490810 8839076 9533235 10217438 10519510 11335821 12406132 12839810 13191684 13949290
2121 13949290 14487953 15266029 16098612 17167497 18185867 19763238 22224743 24474574 26669273
2112 26669273 28222846 29901682 32078961 34378602 37913516 41954278 47378572 53875575
2104 53875575 62646226 74585665 90280255 109566354 137340971 168301909 183663886
2097 183663886 167149230 138689422 114620271 92296185 76479553 63307989 53329251
2090 53329251 46062256 40503888 36427726 33262742 30319286 28598369 27266264 26005762
2082 26005762 24043291 21905995 20324746 18690908 17391782 15733483 14778951 14007853
2074 14007853 13234520 12500269 11914444 11302122 10490446 10077313 9806368 9333778 9126278
2065I126278j71136n96558m23738m48961l26497K0680k28256m58397m47585J3927
2055F059757l83123k76167j1177k08870n19973q5623j31558k71030j61053k7311
2045C983872j63881j96263j44643N8504o8688j0566K3816K0853j68834j97836
2035C136334j25219J140J9891m14267o821j73556l4184J86321Q2275l69483l60189
2024A942242J50930m7195J29711O3082q4153p8646m95591L01058q4j88550k98172
2013A394632J21708J07867K49004k3682J03461j11264m40913p9436j32493J3627
2003A202511R3350Q8629j12508K29355j199m77950k2597K55786j26787j83507
1993I45083j07599j31190l3860J09647K46470k40720k33010L99573r9325j3028
$$ plain form
2065 9126278 8955142 8358584 7934846 7485885 7159388 7180068 6951812 6493415 6045830 6059757
2055 6059757 5676634 5400467 5389290 5180420 4660447 4574824 4443266 4172236 4011183 3983872
2045 3983872 3819991 3623728 3479085 3537589 3468901 3458335 3482151 3503004 3334170 3136334
2035 3136334 3011115 3012255 3032146 2617879 2611058 2437502 2403318 2589639 2671914 2302431 1942242
2024 1942242 2093172 2045977 2175688 2238770 2154617 2075971 1580380 1881438 1881354 1692804 1394632
2013 1394632 1516340 1624207 1873211 1849529 1952990 1841726 1400813 1321377 1188884 1202511
2003 1202511 1295861 1384490 1271982 1501337 1500138 1022188 999591 1255377 1128590 945083
1993 945083 837484 706294 672434 782081 1028551 787831 554821 954394 855069 842041
1983H42041J52706j21339r9604k51677m849L16374J38324k42479N2594J48083
1973I30174k89761q0327N6554j27555K32233Q1151l08391P0662J73005J58610
1963H96355l62419k47416L70882K23854o09121m8506N1171J81384J5766J4177
1953D86127k58295j67733P588k6420j11243j12627N75116j07604j87173R6157
1943A93893J38538K2244K92639o0094p4498N2522Q8636l24590l17743m8927L2236
1932e144J60647N8022J42662P6553L0726k89186J16500N7255l28399P2336J42211
1921B34183O209L22073K91733k26657k44292k16909J14455l01987K46706J00406
1911C25920n8409l7493k9567N9474q5385k0205J15780O0592j51318K54259O9736
$$ plain form
1983 842041 994747 873408 773804 522127 517278 833652 971976 729497 782091 930174
1973 930174 640413 560086 616640 489085 721318 802469 494078 564740 737745 896355
1963 896355 533936 286520 657402 881256 272135 223629 274800 456184 471950 486127
1953 486127 227832 60099 67687 41267 -69976 -182603 392513 284909 97736 193893
1943 193893 332431 354675 647314 587220 512722 565244 653880 329290 11547 -37380 -5144
1932 -5144 155503 213525 356187 432740 463466 174280 290780 348035 19636 91972 234183
1921 234183 240392 562465 854198 627541 383249 166340 280795 -21192 225514 325920
1911 325920 267511 230018 200451 259925 174540 154335 270115 330707 179389 433648 503384
1900E03384p2274j45146l35927l7560K86649L23844l55642O7644J92438k18756
1890B08654J39403q5490P9880r1386k81833M6157R943J6107j61546k4484L45528
1879B00933K33866P6073m60992m6244L00927K0104j16428n0148l35819K20223
1869D2495K06536J4442o7796O6250N2755K0567o0166j75884m6399J50266j03415
1858I9651o0531J39842l679R3229p627k14545Q3092Q5389j04723o6470K78368
1847C21996j2539r8629J39711j11254l4769k78985L1556j43475J84892L47095
1837C45599m2721k80225J20583K06694J1272K13181J66031M59450n1327m09252
1827G39285m962Q7460K8076k27584M2395J73026m50134q9771L25133j22196l8782
$$ plain form
1900 503384 431110 285964 -49963 -87523 199126 522970 167328 234972 427410 208654
1890 208654 348057 262567 342447 251061 -30772 15385 25328 41435 -120111 -144595 200933
1879 200933 434799 510872 49880 3636 304563 324667 208239 158091 -177728 42495
1869 42495 249031 263473 195677 261927 314682 335249 275083 99199 52800 203066 99651
1858 99651 39120 178962 175283 268512 260885 46340 129432 214821 110098 43628 321996
1847 321996 309457 210828 350539 239285 204516 -74469 -42913 -186388 -1496 345599
1837 345599 302878 22653 143236 349930 361202 574383 740414 1199864 1148537 739285
1827 739285 734323 821783 849859 622275 664670 837696 387562 297791 622924 500728 461946
1816D61946j52628n1544l21031J34664J33340j3436J22257l75990L3473L29338
1806C00389J02633k11662Q5530k99852N6623J95215j8690n9763r9829j30045J85892
1795A06441k47791J66467J19510l52967M21769j36154k00336M3550J39500L52413
1785D12402k34142Q3021j29038l00712q6154L10928p6183j57673J48636l60J13403
1774H4128J22420j85526j16758j19851J57836O826m48995R4864J45359L63421
1764A03724J18947J18184k12969J12586J61909n0053l93202k42994r9445K02499
1754a80814l8938j20110O8860M6129L3509J92662j71600Q1667K18018J3783N4638
1743A97804j18860Q0633o8579l14251n7018L28969L27644m34673n2890K00305
$$ plain form
1816 461946 309318 257774 -63257 71407 204747 191311 313568 -62422 -28949 300389
1806 300389 403022 191360 276890 -22962 33661 228876 210186 150423 50594 -79451 106441
1795 106441 -141350 25117 144627 -208340 213429 77275 -123061 -79511 59989 412402
1785 412402 178260 261281 132243 -168469 -254623 56305 -19878 -177551 -28915 -29275 84128
1774 84128 206548 21022 -95736 -215587 -57751 -50925 -499920 -405056 -259697 103724
1764 103724 222671 340855 127886 240472 402381 352328 -40874 -283868 -383313 -180814
1754 -180814 -219752 -339862 -271002 -224873 -191364 1298 -170302 -88635 129383 143166 197804
1743 197804 78944 159577 90998 -223253 -280271 48698 376342 -58331 -111221 89084
1733H9084K24397q4104j67879l86698K12088K71427j19528j29126j18023J47466
1723f0896J8604r8087j66213p063l258J20267J49353J28330N5603j13377N6276
1712G9539K3018N1489j80641k04673J6704q924k8064J47541M1300l31915K57304
1701a37322m3178K70999K86656j68720r1312j47209r9854m3836K87256j15089
1691a609r6364J96908J39527j88299l11154r3070l6393R506l3469J434O6944J78447
1679a67592K08217p8689p9224K13682k39168j58415J68622J83182k46307j7085
1669b12777l67864J67325m2182J01640P2503J75473j92220K16769l52224K54674
1659a78883O5033K4040J61091j74252p8452L48K76296k6797m44778L26992K85230
$$ plain form
1733 89084 313481 229377 61498 -325200 -113112 158315 38787 -90339 -208362 -60896
1723 -60896 -42292 -140379 -306592 -313655 -316913 -196646 -47293 81037 136640 23263 79539
1712 79539 102557 154046 -26595 -231268 -214564 -223488 -251552 -104011 -62711 -394626 -137322
1701 -137322 -180500 90499 377155 208435 117123 -30086 -129940 -173776 113480 -1609
1691 -1609 -97973 98935 238462 50163 -260991 -354061 -390454 -380948 -414417 -412983 -346039 -167592
1679 -167592 40625 -38064 -117288 96394 -142774 -301189 -132567 50615 -195692 -212777
1669 -212777 -580641 -413316 -455498 -353858 -281355 -105882 -298102 -81333 -433557 -178883
1659 -178883 -113850 -89810 71281 -102971 -181423 -181075 95221 68424 -376354 -49362 235868
1648B35868j53700j06251n443m1175l15744L99686R0600j87743q2227L1405n391
1637a40115k1887l25874L86523Q2023j2395j3303J86211L0554j00728l93977j26051
1626d49019Q8482j68200P8650L34189J28337m04418L62375P4612k3117j44087
1616a22196J41220m5975k6697J07485l00402J08365l0669K40813j91932J4713
1606a05275J40996o9177j64350l58605J91731L09777J61640J29248j26708k8615
1596H0662l9514O0850l22104Q5028r6423m397L1273M01645n20175J902L48913
1585B7660j66815K9872j43213J4955K98237J65682k2266j25846j32724q4973k16100
1574c55531P2756J57494R5238R6823j71827J45694O8212M9884o914J01307M9581
$$ plain form
1648 235868 82168 -24083 -29526 -70701 -386445 13241 103841 -83902 -166129 -134724 -140115
1637 -140115 -162002 -487876 -101353 -19330 -31725 -45028 141183 171737 71009 -322968 -449019
1626 -449019 -360537 -528737 -450087 -115898 12439 -391979 -29604 45008 21891 -122196
1616 -122196 19024 -26951 -53648 53837 -246565 -138200 -168869 71944 -119988 -105275
1606 -105275 35721 -33456 -197806 -556411 -364680 -54903 106737 235985 109277 80662
1596 80662 41148 101998 -220106 -135078 -231501 -235898 -204625 197020 -323155 -321253 27660
1585 27660 -139155 -109283 -252496 -237541 60696 226378 204112 78266 -54458 -139431 -355531
1574 -355531 -282775 -125281 -30043 66780 -105047 40647 108859 158743 151829 253136 302717
1563C02717j94449r4469Q4957J23277N2417k47271l43020J65183K24010J97417
1553B70769R1765R231j25307k92223j10515k3999L262J32657Q8496k07695K5647
1542a37912p7942K3034O8299K99907j02907j06013J68009k68297K2967j14985
1532b25840J24811J20133n9979j74853j71998J59670L30238j62364J21856j38868
1522g7194J06849J7477k10725N2742L12305k21035K6279j09278O5104j48411N1268
1511a34619o5317L3419m7590j4602k3939j24305J57581n3372K41962j10116J68315
1500B7417R5295J32520n00594K9560L05215r657J93818J61171j51645l0776j7372
1489B34952k16181r2161M0646l3432k33648R8456Q8131O1585k47315m3019q9226
$$ plain form
1563 302717 108268 13799 98756 222033 274450 27179 -315841 -150658 73352 270769
1553 270769 362534 371765 246458 -45765 -156280 -180279 -177017 -44360 44136 -163559 -137912
1542 -137912 -215854 -192820 -124521 175386 72479 -33534 134475 -133822 -110855 -225840
1532 -225840 -101029 19104 -40875 -215728 -387726 -228056 102182 -60182 61674 -77194
1522 -77194 29655 47132 -163593 -110851 201454 -19581 6698 -102580 -37476 -185887 -134619
1511 -134619 -199936 -166517 -214107 -228709 -252648 -376953 -219372 -272744 -30782 -140898 27417
1500 27417 122712 255232 -245362 -215802 89413 79756 273574 434745 283100 252324 234952
1489 234952 18771 -73390 -32744 -66176 -299824 -201368 -113237 -51652 -298967 -341986 -431212
1478d31212L17170J05871k25342l03118K53762K8516o6913J54937n6590K31501
1468H582N1531k48200l57861p1042J90002M791K12425J67275J14348K14907p525
1457B79233k76437l8784J0157J77241j38536k27667j6668L36535P2323Q0720k15503
1446D2614j40684J58109p6167j66681l9370K11704K15778J45990j64431r7288
1436H9574O0055p4777m20963N6166J97961L73281k50961k61571P2115L89579j78932
1425E1527Q845R1783r6196k58486j89587J82597K48619q3467L67L07033k77868
1414a4833j68193K2846N7035q0504j08936j33231J71462K2530l5754K23688n3930
1403i7820j41859J30709J59857j46511J71649k31348o2188L69903K58832k33978
$$ plain form
1478 -431212 -114042 -8171 -233513 -536631 -282869 -254353 -321266 -166329 -222919 8582
1468 8582 60113 -188087 -545948 -616990 -426988 -422197 -209772 -42497 71851 286758 279233
1457 279233 2796 -35988 -25831 151410 12874 -214793 -231461 105074 177397 258117 42614
1446 42614 -98070 60039 -16128 -182809 -222179 -10475 205303 351293 186862 89574
1436 89574 149629 74852 -346111 -289945 -91984 281297 30336 -231235 -159120 230459 51527
1425 51527 60372 152155 55959 -202527 -392114 -209517 39102 -44365 -43998 263035 -14833
1414 -14833 -183026 -160180 -103145 -183649 -292585 -425816 -254354 -231824 -267578 -43890 -97820
1403 -97820 -239679 -108970 50887 -95624 76025 -155323 -217511 152392 411224 177246
1393A77246m8658Q3988J4458k51884l8118Q7247J45687J32628j80110m96147J65692
1382b07971j40450J10578K42297J18063k29209Q5872k44803J42606K12926n852
1372H4057j42522j40667L56995J49621J51692k58709j2545q1405J68568j49817
1362A25268p8701N8403r955J66J14906j67012J14402J73524j80233j54903o6503
1351g0638K6122Q4301J24550L3517J01355p1909j74657J54597l78031j3688J29286
1340e5195L12782k6631l83797J7354J53174L85772K2572l01667O9179k81372q5233
1329a73062L28488k16181k916k9702r7477k41901P9858J94197L02015K5926l12814
1318a43569K78217k11016k12208K61537J25727k11606J30191j41146K05758K8207
$$ plain form
1393 177246 128588 212576 227034 -24850 -62968 24279 169966 302594 122484 -373663 -207971
1382 -207971 -348421 -237843 4454 122517 -106692 -20820 -265623 -123017 89909 84057
1372 84057 -58465 -199132 157863 307484 459176 200467 187922 106517 275085 125268
1362 125268 46567 104970 95015 95181 210087 43075 157477 331001 150768 -4135 -70638
1351 -70638 -44516 39785 164335 197852 299207 227298 52641 207238 -170793 -184481 -55195
1340 -55195 257587 230956 -152841 -135487 17687 403459 426031 124364 193543 -87829 -173062
1329 -173062 155426 -60755 -63671 -93373 -190850 -432751 -352893 -158696 143319 169245 -143569
1318 -143569 134648 -76368 -288576 -27039 98688 -112918 17273 -123873 81885 110092
1308A10092k3818k88698P3145J62761J28600L7555l02033k00559K35083J12834
1298D4962l01770q1359N47062L4873J72510P47m98852k04106J76691K22515l9607
1287G3666L20836l47596j89866K44856k320l77278J29046M6609M2784K06234O8090
1276B15061J85284n6146l26180K5470j05293j04356J66402j55537R8446J07336
1266E0487j60048M0837j26795q9350J42204J38922J35214r0673k44600q417j56269
1255c68488L76055L62814m61173j60452L65942R6777j90925j57926Q3602k1955
1245g5729P6460J65241k25530j87723J26445J49097j19085q5223n7237k55289
1235d88573J60018J12412Q1615J76687K41056j86422m6519M7241O9171N3053j04341
$$ plain form
1308 110092 86274 -202424 -129279 33482 162082 199637 -102396 -302955 -67872 44962
1298 44962 -256808 -338167 208895 243768 416278 417025 -81827 -285933 -109242 113273 73666
1287 73666 394502 46906 -142960 101896 99576 -277702 -148656 -102047 -59263 146971 215061
1276 215061 400345 344199 18019 43489 -61804 -166160 242 -155295 -56849 50487
1266 50487 -109561 -68724 -195519 -284869 -142665 -3743 131471 40798 -203802 -212219 -368488
1255 -368488 7567 370381 -90792 -251244 114698 211475 20550 -137376 -53774 -75729
1245 -75729 731 165972 -59558 -247281 -120836 28261 -90824 -176047 -233284 -488573
1235 -488573 -328555 -216143 -134528 42159 283215 96793 50274 97515 166686 219739 115398
1224A15398j21621R9477j16095q6699O2676j59905k9295j78535K54350J36245
1214b4004J73072J6477l55265M00417m5318k96559N4659M0066j62528M1581K91336
1203A33934j16145L53211j17274l95811j7727j576j92878J14078J34931j95135
1193c00392K78036k3229l70501J25938n1528K03153L00114K6078m9056L2410J41442
1182C12465n4996j99441k48250M11653J64419l98752J0043k15005K57706m1028
1172a186k26558M8280k4102K14232J09719j21085j8967M5617o7019k04152k4530
1161b69751L16120l24930k82356J23641O4549N8643J27165K11137n5284k03171
1151b34237P3343k53307m3588j850R5624P0441J14246J8815L1565K22065j79528
$$ plain form
1224 115398 -6223 93254 -22841 -109540 -46864 -206769 -236064 -414599 -160249 -24004
1214 -24004 149068 165545 -189720 210697 165379 -131180 -76521 -36455 -198983 -157402 133934
1203 133934 17789 371000 253726 -142085 -159812 -161388 -354266 -240188 -105257 -300392
1193 -300392 -22356 -45585 -416086 -290148 -341676 -138523 161591 187669 138613 171023 312465
1182 312465 257469 58028 -190222 221431 385850 -12902 -2859 -217864 39842 -1186
1172 -1186 -227744 -179464 -203566 10666 120385 -700 -19667 25950 -41069 -245221 -269751
1161 -269751 46369 -278561 -560917 -437276 -372727 -314084 -186919 24218 -31066 -234237
1151 -234237 -160894 -414201 -457789 -459639 -364015 -293574 -179328 -160513 -128948 93117 -86411
1140h6411p7830N50041j84891j46514Q697k71048Q4566r1736j01832K544Q6055
1129b28359K10423j02994p5211k03494K01430N9093r0431J16713j65971K02979
1119g5822L5844K847j45903n1006K33556m3514K3768j00408K39019r0773Q1930
1108A09538L84795j54928m91359P5924K60107l24165m6179p175k1840M1913p327
1097a80696k06650K91296k55702K88179J69973j23450l6844K43124j89264k00128
1087b00162J20936l668q0477Q2530J9865j53079k59792M39091K98058l1120j32493
1076I9689J2398k15236O1671J21479k58287j12571J96648n6298J74049J00902
1066A24444q8990K43492n0903O591k29632l9587M7703J62464j08082r163l2508
$$ plain form
1140 -86411 -164241 385800 200909 54395 63092 -207956 -123390 -215126 -316958 -314414 -228359
1129 -228359 -17936 -120930 -196141 -399635 -198205 -139112 -229543 -112830 -278801 -75822
1119 -75822 -39978 -37131 -183034 -234040 -484 -43998 -20230 -120638 118381 27608 109538
1108 109538 494333 339405 -151954 -76030 184077 -140088 -186267 -193442 -215282 -173369 -180696
1097 -180696 -387346 -96050 -351752 -63573 106400 -17050 -53894 189230 -34 -200162
1087 -200162 -79226 -82894 -163371 -80841 -60976 -214055 -473847 -34756 263302 232182 99689
1076 99689 112087 -103149 -41478 80001 -178286 -290857 -94209 -150507 23542 124444
1066 124444 35454 278946 228043 234634 5002 -34585 13118 175582 67500 58337 25829
1055B5829n4580k75658L01843j47830R5327L26828l0765J66386K7680o030l89814
1044C9216l01347J86476n6664K6753J15619j78714l8131J15381m0977J54400o9836
1033d7824K46647l78547j20111K43560K82203Q1453k69987o1582k6457l22344
1023c72989J29694o535J16423J0300n0547J95495j01545L64646J09519k70690
1013A23771P426j75537L20429q101l02368m42877J56691L88004J29417J65597
1003C62452j09196J05764r3741L8865k82853j81341j3812j2915L23583L24930
993D61736l06600j22416J10048J33824q4367n8188j43192k1469l142K58921q7288
982A37867k36139j47105P4524k8214M09184j50362p3892k45019O0294J71275L11312
$$ plain form
1055 25829 -28751 -304409 -2566 -150396 -55069 271759 240994 407380 435060 429030 39216
1044 39216 -262131 -75655 -132319 -105566 10053 -168661 -206792 -91411 -132388 22012 -47824
1033 -47824 198823 -179724 -299835 -56275 225928 307381 37394 -24188 -50645 -372989
1023 -372989 -243295 -249830 -133407 -123107 -173654 21841 -79704 284942 394461 123771
1013 123771 131197 -44340 276089 267988 -34380 -477257 -320566 67438 196855 362452
1003 362452 253256 359020 265279 304144 21291 -160050 -173862 -186777 136806 461736
993 461736 155136 32720 142768 276592 192225 134037 -9155 -30624 -33766 225155 137867
982 137867 -98272 -245377 -170853 -199067 210117 59755 -14137 -259156 -198862 -27587 283725
971B83725j73287j90930n5016J69221p3845L0032n4008n8997P0753o3480J38130
960B2298J53007P1656k95418j95719M3537J80440K08930N1926j12487j71417k62936
949c06183K94820R9379O2509k19561Q3408j58369P4428K42366L9828l31832O0158
938e9049J03709r6907k79985R0279K96964j00746j89102L06148k57430M7717m2587
927a80989j36796J4716K37005Q9088m32121K36170N6781k74803j3579K04708L3674
916a66146k8598J03345L83530r8895l13659K34479j92022J00014P3461J1773K05470
905C12752l07019l7129L2300n21917j63626L71470J0183j61894P5006K79789K03072
894I2987J61121j72517n31109K44475L72519j41627k46850j08848J83776k6004
$$ plain form
971 283725 110438 -80492 -135508 33713 -40132 -10100 -64108 -123105 -52352 -115832 22298
960 22298 175305 246961 -48457 -244176 -200639 -20199 188731 240657 128170 -43247 -306183
949 -306183 -11363 88016 150525 -69036 14372 -143997 -69569 172797 212625 -119207 -59049
938 -59049 44660 -52247 -332232 -241953 55011 -45735 -234837 71311 -186119 -138402 -180989
927 -180989 -317785 -303069 -66064 23024 -409097 -172927 -116146 -390949 -404528 -199820 -166146
916 -166146 -194744 -91399 292131 193236 -120423 114056 -77966 22048 95509 107282 312752
905 312752 5733 -31396 904 -521013 -684639 -313169 -302986 -464880 -389874 -110085 92987
894 92987 254108 81591 -449518 -205043 167476 25849 -221001 -329849 -146073 -172077
884a72077K28816j80341J26421J89252m56933J03675j00381M0111J97398M0252
874A6193K9856K01955k85130J46581m6603r9242K36646j46501j67186J40093l8647
863a1985j53061k75401J22313J03027J7660P7540O0825K83049m16808K55341L6775
852I9275m19187j69149L02631J41684r958l467Q4723o8035J5239j53486j15233
841b94963p704q3192J29678J88448R308K8206k27223K1313m15n5234K95414J58511
829A62147J4901j09299K1479O9755M2462j0546J39198J3600k05879K20738j42944
818B15612j46095k62769L25800J53452j20787j47760k558j57893J63129l7580
808a7449L4759j52134o5410J98381J16627r4865R6385J15245j19915N9163k4223
$$ plain form
884 -172077 56739 -123602 2819 192071 -264862 -161187 -261568 -221457 -24059 16193
874 16193 46049 248004 -37126 109455 62852 -36390 200256 53755 -113431 26662 -11985
863 -11985 -165046 -440447 -318134 -215107 -197447 -119907 -59082 223967 -192841 62500 99275
852 99275 -319912 -489061 -186430 -44746 -54704 -58171 26552 -41483 -26244 -179730 -294963
841 -294963 -302667 -385859 -256181 -67733 -58425 -30219 -257442 -236129 -236544 -291778 3636 162147
829 162147 177048 67749 89228 158983 201445 190899 330097 343697 137818 358556 215612
818 215612 69517 -193252 132548 286000 165213 17453 14895 -142998 20131 -17449
808 -17449 17310 -134824 -200234 -1853 114774 19909 116294 231539 111624 170787 146564
797A46564M3175j73668j71364J52036N6163k35559J92970Q9361o4698n1147K2625
786F458P639N3381k14598K0608m0287N5791m7022K64650J80780j84384k84084
775a81068J91065k5629J72478N4734J4890k55027j22059M7673k7074O4261r6431
764a62187J83259J45042Q6161j30352K3924j88957l00610K36794R7019J01896
754I1989m7657m9k84251k3844K68423j01598R639L96P0120r0169q9568J66558
742c0011j15277k66316J44822J97481k19906L1502K25658K05114l49353j87085
732c63371K43956J92366Q487r0390K16825k46562M1618J6995j6225k0166L7780
721B1313K5504k99523J0296K48972J02875p2636K1597k55724N1370j0558K17199
$$ plain form
797 146564 189739 16071 -155293 -3257 52906 -182653 10317 99678 34980 -16167 6458
786 6458 14097 67478 -147120 -126512 -166799 -111008 -158030 106620 287400 103016 -181068
775 -181068 9997 -15632 156846 211580 226470 -28557 -150616 -102943 -130017 -65756 -162187
764 -162187 21072 166114 252275 121923 145847 -43110 -343720 -106926 -9907 91989
754 91989 44332 44283 -239968 -263812 4611 -96987 -87348 -86952 -16832 -107001 -196569 -30011
742 -30011 -145288 -411604 -266782 -69301 -289207 -257705 -32047 173067 -176286 -363371
732 -363371 -119415 72951 81438 -8952 207873 -38689 2929 19924 3699 -16467 21313
721 21313 46817 -252706 -242410 6562 109437 36801 58398 -197326 -145956 -156514 60685
710F0685r1103k86073K27104J89799R4272J0275k15685k9607m7631k1177J70466
699F1325M3073Q0325j93181N8901K96064j76576l88484N26703j21467j11660K77588
688C52611j36352j38636q699J01418j75249K3241j30834q2246Q8860j8991J08691
677a6186K86451K5192n8108j32872J7694J21698j21014l05764l4100L69049R8554
666B50594N7183k38449M89833K05966l41593k41498k4975j69422k4645l2001r8981
655a67988M6898j37729J52516K09078K93260k63687k16658K63535N0119k65223
645c5879j50220L5073l28798K28016P40l7812k6735J53153K58714j29236k01102
634b34086M5938K12126k8046l14185P5286K22638L39831K24490p49707j14559
$$ plain form
710 60685 -30418 -316491 -89387 100412 194684 204959 -10726 -40333 -87964 -109141 61325
699 61325 104398 184723 -8458 50443 346507 169931 -218553 308150 186683 75023 352611
688 352611 216259 77623 68924 170342 -4907 18334 -112500 -194746 -105886 -124877 -16186
677 -16186 270265 295457 237349 104477 122171 243869 122855 -182909 -217009 152040 250594
666 250594 307777 69328 559161 765127 423534 182036 157061 -12361 -37006 -69007 -167988
655 -167988 -121090 -258819 -106303 102775 396035 132348 -84310 179225 229344 -35879
645 -35879 -186099 -151026 -479824 -251808 -251068 -288880 -315615 -162462 96252 -32984 -234086
634 -234086 -188148 23978 -4068 -318253 -242967 -20329 319502 543992 -205715 -320274
$$ [...]
##END NTUPLES=NMR SPECTRUM
##END=
