##TITLE=1H_EC-3286(II-2)
 CDCl3
 8 sc, 
 17.11.2022
##JCAMPDX= 6.0         $$ Bruker NMR JCAMP-DX V2.0
##DATA TYPE= NMR SPECTRUM
##DATA CLASS= NTUPLES
##ORIGIN= UXNMR, Bruker Analytische Messtechnik GmbH
##OWNER= root
$$ XWIN-NMR		Version 3.5
$$ Thu Nov 17 15:54:38 2022 Russian Standard Time (UT+4h)  she@DPX200
##.OBSERVE FREQUENCY= 200.1313499994
##.OBSERVE NUCLEUS= ^1H
##.ACQUISITION MODE= SIMULTANEOUS
##.ACQUISITION SCHEME= undefined
##.AVERAGES= 8
##.DIGITISER RES= 18
##SPECTROMETER/DATA SYSTEM= spect
##.PULSE SEQUENCE= zg30
##.SOLVENT NAME= CDCl3
##.SHIFT REFERENCE= (INTERNAL, CDCl3, 0, 15.7447)
##AUDIT TRAIL= $$ (NUMBER, WHEN, WHO, WHERE, WHAT)
$$ ##TITLE= Audit trail, XWIN-NMR		Version 3.5
$$ ##JCAMPDX= 5.01
$$ ##ORIGIN= Bruker BioSpin GmbH
$$ ##OWNER= she
$$ F:/spectra/data/she/nmr/H-F/1/pdata/1/auditp.txt
$$ ##AUDIT TRAIL=  $$ (NUMBER, WHEN, WHO, WHERE, WHAT)
(   1,<2022-11-17 15:53:31.45 +0400>,<she>,<DPX200>,
      <created by zg, POWCHK disabled, PULCHK disabled
       configuration hash MD5:
       00 E9 B6 7A A2 85 ED C7 34 08 36 98 17 FE 4E 26
       data hash MD5: 16K
       99 99 9F 4B 42 3F 8E 95 34 73 CE EA 22 E6 A3 E3>)
(   2,<2022-11-17 15:53:33.85 +0400>,<she>,<DPX200>,
      <Start of raw data processing
       efp BC_mod = 2 LB = 0.24 FT_mod = 6 PKNL = 1 PHC0 = -18047.55 PHC1 = 32.4007 SI = 16K 
       data hash MD5: 16K
       AC 6D AF 21 77 7E 81 95 83 7F 8B F0 40 BC B4 35>)
(   3,<2022-11-17 15:53:51.06 +0400>,<she>,<DPX200>,
      <pk PHC0 = 15.14638 PHC1 = -18 
       data hash MD5: 16K
       BD BC DB AC 5B A6 F3 D1 45 6D 35 AB 1A 40 9A FF>)
(   4,<2022-11-17 15:53:53.78 +0400>,<she>,<DPX200>,
      <abs ABSG = 5 
       data hash MD5: 16K
       66 A1 79 A5 2B D0 4A 94 57 22 D0 90 62 DE 96 2C>)
$$ ##END=
$$ 
$$ hash MD5
$$ 43 09 CE 4E 43 F1 48 8F F8 75 CD 48 51 58 49 42
##$RELAX= 
##$RELAX= 
##$RELAX= 
##$RELAX= 
##$RELAX= 
##$RELAX= 
$$ Bruker specific parameters
$$ --------------------------
##$DU= <F:/spectra>
##$EXPNO= 1
##$NAME= <H-F>
##$PROCNO= 1
##$TYPE= <nmr>
##$USER= <she>
##$AMP= (0..31)
100 100 100 100 100 100 100 100 100 100 100 100 100 100 100 100 100 100 
100 100 100 100 100 100 100 100 100 100 100 100 100 100 
##$AQSEQ= 0
##$AQ_mod= 1
##$AUNM= <au_zg>
##$AUTOPOS= <>
##$BF1= 200.13
##$BF2= 200.13
##$BF3= 200.13
##$BF4= 200.13
##$BF5= 200.13
##$BF6= 200.13
##$BF7= 200.13
##$BF8= 200.13
##$BYTORDA= 1
##$CFDGTYP= 0
##$CFRGTYP= 5
##$CHEMSTR= <none>
##$CNST= (0..31)
1 1 145 1 1 1 1 1 1 1 1 1 1 1 1 1 1 1 1 1 1 1 1 1 1 1 1 1 1 1 1 1 
##$CPDPRG= <>
##$CPDPRG1= <>
##$CPDPRG2= <>
##$CPDPRG3= <>
##$CPDPRG4= <mlev>
##$CPDPRG5= <mlev>
##$CPDPRG6= <mlev>
##$CPDPRG7= <mlev>
##$CPDPRG8= <mlev>
##$CPDPRGB= <>
##$CPDPRGT= <>
##$D= (0..31)
0 1.2 0 0 0 0 0 0 0 0.06 0 0.03 0 0 0 0 0.0002 0 0 0 0 0 0 0 0 0 0 0 0 
0 0 0 
##$DATE= 1668686010
##$DBL= (0..7)
120 120 120 120 120 120 120 120 
##$DBP= (0..7)
150 150 150 150 150 150 150 150 
##$DBP07= 0
##$DBPNAM0= <>
##$DBPNAM1= <>
##$DBPNAM2= <>
##$DBPNAM3= <>
##$DBPNAM4= <>
$$ [...]
##$SUBNAM3= <"">
##$SUBNAM4= <"">
##$SUBNAM5= <"">
##$SUBNAM6= <"">
##$SUBNAM7= <"">
##$SUBNAM8= <"">
##$SUBNAM9= <"">
##$SW= 18.0517283424941
##$SWIBOX= (0..15)
0 0 2 0 0 0 0 0 0 0 0 0 0 0 0 0 
##$SW_h= 3612.71676300578
##$TD= 16384
##$TD0= 1
##$TE= 0
##$TE2= 300
##$TE3= 300
##$TEG= 300
##$TL= (0..7)
0 120 120 120 120 120 120 120 
##$TP= (0..7)
150 150 150 150 150 150 150 150 
##$TP07= 0
##$TPNAME0= <>
##$TPNAME1= <>
##$TPNAME2= <>
##$TPNAME3= <>
##$TPNAME4= <>
##$TPNAME5= <>
##$TPNAME6= <>
##$TPNAME7= <>
##$TPOAL= (0..7)
0.5 0.5 0.5 0.5 0.5 0.5 0.5 0.5 
##$TPOFFS= (0..7)
0 0 0 0 0 0 0 0 
##$TUNHIN= 0
##$TUNHOUT= 0
##$TUNXOUT= 0
##$USERA1= <user>
##$USERA2= <user>
##$USERA3= <user>
##$USERA4= <user>
##$USERA5= <user>
##$V9= 5
##$VALIST= <valist>
##$VCLIST= <CCCCCCCCCCCCCCC>
##$VD= 0
##$VDLIST= <DDDDDDDDDDDDDDD>
##$VPLIST= <PPPPPPPPPPPPPPP>
##$VTLIST= <TTTTTTTTTTTTTTT>
##$WBST= 1024
##$WBSW= 4
##$XGAIN= (0..3)
0 0 0 0 
##$XL= 0
##$YL= 0
##$YMAX_a= 356743
##$YMIN_a= -455903
##$ZGOPTNS= <>
##$ZL1= 120
##$ZL2= 120
##$ZL3= 120
##$ZL4= 120
##$ABSF1= 15.73146
##$ABSF2= -2.32039
##$ABSG= 5
##$ABSL= 3
##$ALPHA= 0
##$AQORDER= 0
##$ASSFAC= 0
##$ASSFACI= 0
##$ASSFACX= 0
##$ASSWID= 0
##$AUNMP= <proc_1d>
##$AZFE= 0.1
##$AZFW= 0.1
##$BCFW= 0
##$BC_mod= 2
##$BYTORDP= 0
##$COROFFS= 0
##$CY= -3
##$DATMOD= 1
##$DC= 0
##$DFILT= <>
##$DTYPP= 0
##$F1P= 0
##$F2P= 0
##$FCOR= 1
##$FTSIZE= 16384
##$FT_mod= 6
##$GAMMA= 0
##$GB= 0
##$INTBC= 1
##$INTSCL= 3.70164e-10
##$ISEN= 128
##$LB= 0.24
##$LEV0= 0
##$LPBIN= 0
##$MAXI= 10000
##$MC2= 0
##$MEAN= 0
##$ME_mod= 0
##$MI= 1.114404
##$NCOEF= 0
##$NC_proc= -7
##$NLEV= 6
##$NOISF1= 3.799351
##$NOISF2= 2.8
##$NSP= 0
##$NTH_PI= 0
##$NZP= 0
##$OFFSET= 15.74469
##$PC= 1
##$PHC0= -18032.4
##$PHC1= 14.4007
##$PH_mod= 1
##$PKNL= yes
##$PPARMOD= 0
##$PSCAL= 0
##$PSIGN= 0
##$REVERSE= no
##$SF= 200.130005373599
##$SI= 16384
##$SIGF1= 3
##$SIGF2= 2
##$SINO= 5.538805
##$SIOLD= 16384
##$SREGLST= <1H.CDCl3>
##$SSB= 0
##$STSI= 16384
##$STSR= 0
##$SW_p= 3612.71676300578
##$SYMM= 0
##$S_DEV= 0
##$TDeff= 16384
##$TDoff= 0
##$TI= <>
##$TILT= no
##$TM1= 0
##$TM2= 0
##$TOPLEV= 0
##$USERP1= <user>
##$USERP2= <user>
##$USERP3= <user>
##$USERP4= <user>
##$USERP5= <user>
##$WDW= 1
##$XDIM= 16384
##$YMAX_p= 448198590
##$YMIN_p= -977619
$$ End of Bruker specific parameters
$$ ---------------------------------
##NTUPLES= NMR SPECTRUM
##VAR_NAME=  FREQUENCY,     SPECTRUM/REAL,   SPECTRUM/IMAG
##SYMBOL=    X,             R,               I
##VAR_TYPE=  INDEPENDENT,   DEPENDENT,       DEPENDENT
##VAR_FORM=  AFFN,          ASDF,            ASDF
##VAR_DIM=   16384,         16384,           16384
##UNITS=     HZ,            ARBITRARY UNITS, ARBITRARY UNITS
##FACTOR=    0.220516191357247, 1,           1
##FIRST=     3150.98488257928, 0,            0
##LAST=      -461.731880426497, 0,           0
##MIN=       -461.731880426497, -977619,     0
##MAX=       3150.98488257928, 448198590,    0
$$ Real data points
##PAGE= N=1
##DATA TABLE= (X++(R..R)), XYDATA
$$ [...]
6407c10358L21762J0626j97744j01096J49169l15837J97503J4840n2967J32714
$$ -310358 11404 22030 -175714 -276810 -127641 -443478 -245975 -231135 -284102 -151388
6397a51388J349j54025p804j08126M5569L10648K53796j52934j33355J43364o4651
$$ -151388 -150039 -304064 -311868 -419994 -374425 -63777 190019 37085 -96270 47094 -17557
6386a7557n1559N4334m96410P5079K44580J99918j12606J05513l4892j50479R127
$$ -17557 -69116 -14782 -511192 -436113 -191533 8385 -104221 1292 -33600 -184079 -174952
6375a74952J33224K11256M9040r3119l32330j06590P1953L61505P5372j89378
$$ -174952 -41728 169528 218568 125449 -206881 -313471 -241518 119987 195359 5981
6365E981k35897k7882j31888L26115j63182K27678J31441m59669J40878L40470
$$ 5981 -229916 -257798 -389686 -63571 -226753 925 132366 -327303 -186425 154045
6355A54045j61448K0559j77744k09823J05935J39285p0665J91940p1450k31398
$$ 154045 -7403 13156 -164588 -374411 -268476 -129191 -199856 -7916 -79366 -310764
6345c10764n425j04802R9236p3149K82813J11285l57243J72303j54359j69051
$$ -310764 -316189 -420991 -321755 -394904 -112091 -806 -358049 -185746 -340105 -509156
6335e09156O7376j0848K50069K69790K9817j19597j11100l1872K3303J36708Q1071
$$ -509156 -441780 -452628 -202559 67231 97048 -22549 -133649 -165521 -142218 -5510 75561
6324G5561k10052l9838L35636p6676j56474R1717k6324q9188J16295J655k31894
$$ 75561 -134491 -174329 161307 84631 -71843 19874 -6450 -95638 20657 22312 -209582
6313b09582j98056J15030n1274R1899J52509Q3834o0562l35331M26446r4467P7475
$$ -209582 -407638 -292608 -343882 -251983 -99474 -15640 -76202 -411533 14913 -79554 -2079
6302b079K8742j56353j92271k10370L77966Q3978j19782N53110j46317l74022
$$ -2079 26663 -129690 -321961 -532331 -154365 -70387 -190169 362941 216624 -157398
6292a57398j94439p9585K11833k54325J39340J86934K45094P8149j1070k78103
$$ -157398 -351837 -431422 -219589 -473914 -334574 -147640 97454 175603 164533 -113570
6282a13570l55450l1806K43095J10301R1481L69288j78203j99909j67015K8167
$$ -113570 -469020 -500826 -257731 -147430 -55949 313339 135136 -64773 -231788 -203621
6272b03621J10229l18896J90963K31318N3482m57443j22344j0312k11913P3683
$$ -203621 -93392 -412288 -221325 9993 63475 -393968 -516312 -526624 -738537 -664854
6262f64854K36413J94108p4423J45774L52903m43150J80244j20988k31789K74952
$$ -664854 -428441 -234333 -308756 -162982 189921 -253229 -72985 -193973 -425762 -150810
6252a50810J52111j39401m96487L00285N3376l1206R9022J61431j90465j45340
$$ -150810 1301 -138100 -634587 -334302 -280926 -312132 -213110 -51679 -242144 -387484
6242c87484L15664K4634Q9260O412J68069r730j88680M23008k90220l46030P9592
$$ -387484 -71820 -47186 42074 48486 216555 206825 18145 441153 150933 -195097 -115505
6231a15505J05468L504l4940N2772l49097J9415L13762J12546j58506r1015J53279
$$ -115505 -10037 -6533 -41473 11299 -337798 -318383 -4621 107925 -50581 -141596 11683
6220A1683L4195j1423l94029R3914j93277J65581J10057j13407K12917K2504R0374
$$ 11683 45878 34455 -359574 -265660 -458937 -293356 -183299 -296706 -83789 -61285 29089
6209B9089o7689k55691j22045J22395q3242J75253K44970M426l24373k0318J94554
$$ 29089 -38600 -294291 -416336 -293941 -377183 -201930 43040 47466 -276907 -297225 -102671
6198a02671j27779K6862j89750J25844L18415k69476J59712j4712p021k9793k54870
$$ -102671 -230450 -203588 -393338 -267494 50921 -218555 -58843 -73555 -80576 -110369 -365239
6187c65239l8943K22521J68480J09470J91326J54895L68m73825j25641l8602j02528
$$ -365239 -404182 -181661 -13181 96289 287615 442510 442878 -30947 -156588 -195190 -297718
6176b97718J33571P0982j25895O1690L47189k01427n9428J27040m48157j31084
$$ -297718 -164147 -93165 -219060 -157370 189819 -11608 -71036 56004 -392153 -523237
6166e23237J10647K64105k9693p1401N8170j87829L51292Q9611l35398J42092
$$ -523237 -412590 -148485 -178178 -249579 -191409 -379238 -27946 61665 -273733 -131641
6156a31641M0761j55778J87783L14427l91565J31569N0688O2644j16843L53043
$$ -131641 -90880 -246658 -58875 255552 -136013 -4444 46244 108888 -7955 345088
6146C45088M7704n4643l41587j5234J75081k68209p8275K44221j32610J17249
$$ 345088 392792 338149 -3438 -18672 156409 -111800 -190075 54146 -78464 38785
6136C8785K13998k35382p3202k73796J15884j63636K31057o1075o1625K28143
$$ 38785 252783 17401 -55801 -329597 -213713 -377349 -146292 -207367 -268992 -40849
6126d0849r1847K55625K8283j94968j5617N3642J61624l8724q0430j83394J5314
$$ -40849 -132696 122929 151212 -43756 -59373 -5731 155893 117169 36739 -146655 -131341
6115a31341J50138m4531k26236R5412n2884n1155Q8582J29804l872J72489j9103
$$ -131341 18797 -25734 -251970 -156558 -209442 -260597 -172015 -42211 -46083 126406 107303
6104A07303l14109m6201m9789j75789J63400L75542k9165m9179J250J26951o1106
$$ 107303 -206806 -253007 -302796 -478585 -315185 60357 31192 -17987 -16737 110214 49108
6093D9108l16228J79179L2701j25922j21930K5029J44065N2827J227L5349N4174
$$ 49108 -267120 -87941 -55240 -181162 -303092 -278063 -133998 -81171 -79944 -44595 9579
6082I579J626m78389j2971J7900K14950K9858J79196N3168j20910k87391K0655
$$ 9579 11205 -467184 -480155 -462255 -247305 -217447 -38251 14917 -105993 -393384 -372729
6071c72729K52532M617l5900j0487R4475j43343R7852M7402k20639n561n5958
$$ -372729 -120197 -115580 -151480 -161967 -67492 -210835 -112983 -65581 -286220 -291781 -347739
6060c47739K89176L2247m7614p2576l41766N07481m5250j37745K57520N4787j13236
$$ -347739 -58563 -26316 -73930 -146506 -488272 19209 -26041 -163786 93734 148521 35285
6049C5285l96187J21445J25012p8149K04531O2777J45225K1663k33560j70356
$$ 35285 -360902 -239457 -114445 -192594 11937 74714 219939 241602 8042 -162314
6039a62314J05121l1226R7017m7072L5181j99091l43419O8691L1349J30615K3217
$$ -162314 -57193 -88419 8598 -38474 -3293 -202384 -545803 -477112 -445763 -315148 -291931
6028b91931K49814j438P8093J26933j59884N086k32764M44244n8239n7076m4776
$$ -291931 -42117 -43555 34538 161471 1587 6673 -226091 218153 159914 102838 58062
6017E8062l15995J02081k2375m2975n6209K09418L40758k1176k38211k02307j62480
$$ 58062 -257933 -155852 -178227 -221202 -277411 -67993 272765 251589 13378 -188929 -351409
6006c51409J37150J8591M19345J4655n5227k35265j63782R5341j5883L2525n4540
$$ -351409 -214259 -195668 223677 238332 183105 -52160 -215942 -120601 -136484 -103959 -158499
5995a58499J93435m5146P8798k08893K05944L51571l84664j13462J47349k13455
$$ -158499 34936 -10210 68588 -140305 65639 417210 32546 -80916 66433 -147022
5985a47022K697K95407j80616J50043J61081J00943J3529j66406k44398k05288
$$ -147022 -144325 151082 -29534 120509 281590 382533 396062 229656 -14742 -220030
5975b20030K01451J07926Q9513j1606J25092k97723O7345o2821Q2572R1257l105
$$ -220030 -18579 89347 178860 167254 292346 -5377 61968 -853 81719 172976 169871
5964A69871j37305q0135J20110J6368K0444l11063j44117O08264N9069k9731N1641
$$ 169871 32566 -47569 72541 88909 109353 -201710 -345827 262437 321506 291775 343416
5953C43416k46945l91196L00099K92855K44256j21376l65699R7374Q1125q2368
$$ 343416 96471 -294725 5374 298229 542485 421109 55410 152784 233909 151541
5943A51541r6758J20686l40362J18588K55282l31738k92234K75231J64588K04436
$$ 151541 54783 175469 -164893 -46305 208977 -122761 -414995 -139764 24824 229260
5933B29260J99988j02615R5433k38823k30128K58982K03855P1683m35362j76396
$$ 229260 429248 326633 422066 183243 -46885 212097 415952 487635 52273 -124123
5923a24123R7236R75q7014K14113J11293j03674Q6509j32108j25301k67210j54143
$$ -124123 -26887 -25912 -112926 101187 212480 108806 195315 63207 -62094 -329304 -483447
5912d83447L72056L07686j54613k24560J06282R1618o8720J44932P6142J99232
$$ -483447 -111391 196295 41682 -182878 -76596 15022 -53698 91234 167376 366608
5902C66608J06042q5919n9049k99706m0083J91013O1686o6086K43713J69453k73433
$$ 366608 472650 386731 327682 27976 -12107 178906 240592 174506 418219 587672 314239
5891C14239k41373Q8218j00549N3737j56372j52512o3389J68031K06772R8952
$$ 314239 72866 161084 60535 114272 -42100 -194612 -258001 -89970 116802 215754
5881B15754L2675j10038j94071K34496K00008j81197O4114j65779J65877l87992
$$ 215754 248429 138391 -55680 178816 378824 197627 261741 95962 261839 -126153
5871a26153K7496M01885j51745k1253K67190P1836j92874l44357J11380k02398
$$ -126153 -98657 303228 151483 130230 397420 469256 276382 -67975 43405 -158993
5861a58993p817K85950J44672j32702l4749K69538J20489l4280r4137O6815m6583
$$ -158993 -166810 119140 263812 131110 96361 365899 486388 452108 357971 424786 378203
5850C78203p193j32518J9112Q1743R6252j52011J52081j99972K55921k37656k6466
$$ 378203 371010 238492 257604 339347 435599 283588 435669 235697 491618 253962 227496
5839B27496j2121J17766O3920n1238k09421K01232K32295K29399J07459j58112
$$ 227496 215375 333141 397061 345823 136402 337634 569929 799328 906787 748675
5829G48675j68801k18465J37959L70908m15706j98217J30497J90093M6399l5938
$$ 748675 579874 361409 499368 870276 454570 256353 386850 576943 623342 587404
5819E87404K15822l57l3000l25846J85591K01684K9046M0355m7831k7491j16889
$$ 587404 803226 802869 769869 444023 629614 831298 860344 900699 852868 825377 708488
5808G08488J70884O04584L26892K86153j01771N9715M47194M92921L66079M06021
$$ 708488 879372 1483956 1810848 2097001 1995230 2054945 2502139 2995060 3361139 3767160
5798C767160j59903o24201n82974l20582l88573l12975o9222r6726j54723N70
$$ 3767160 3607257 2983056 2400082 2079500 1690927 1377952 1308730 1212004 1057281 1057851
5788A057851k8478j7830k66909J37853m11J25078j65829n9026j00057N04511k73177
$$ 1057851 1029373 1011543 744634 882487 882076 1007154 841325 782299 682242 1186753 913576
5777I13576m81640M23870K62520N7134j30105l2355k82393J25123M4783j31313
$$ 913576 431936 855806 1118326 1175460 1045355 1013000 730607 855730 900513 769200
5767G69200m42166q3066L45070P520j99230j10381J30875j07537J8337K99405
$$ 769200 327034 243968 589038 596558 397328 286947 417822 310285 328622 628027
5757F28027R0867m08214J55583J16388J13389K83723m00328l85334J98732J7115
$$ 628027 718894 310680 466263 582651 696040 979763 579435 194101 392833 409948
5747D09948l2177J16600o6384j35600k97196L03582J61985l06704L54812O5696
$$ 409948 377771 494371 427987 292387 -4809 298773 460758 154054 508866 574562
5737E74562J49606j00416l76637j49315K1394J25208J19725k47105q0413L68393
$$ 574562 724168 623752 247115 97800 119194 244402 364127 117022 36609 405002
5727D05002k31630r7596j26596J36407J35407J94642m0932r6633J50511n4545
$$ 405002 173372 75776 -50820 85587 220994 415636 374704 278071 428582 374037
5717C74037l05265K1915K98761J79733j39490K0305k41242K77796j28938J75373
$$ 374037 68772 90687 389448 569181 429691 449996 208754 486550 357612 532985
5707E32985l18716K00999K90130o68185J18659K3511M668L1595j67796J08981
$$ 532985 214269 415268 705398 37213 155872 179383 184051 215646 47850 156831
5697A56831q4401j01314J52427L2150J03143j91084j91356P2965l24966J87750
$$ 156831 72430 -28884 123543 155693 258836 67752 -123604 -50639 -375605 -187855
5687a87855K91572j54405R6209N9726o5708J47903L74776r4143j52490r8596J50454
$$ -187855 103717 -50688 45521 105247 39539 187442 562218 468075 315585 216989 367443
5676C67443k00815j35669J39040O7530r0089L74465j70853J52438q9017j69538
$$ 367443 166628 30959 169999 237529 147440 521905 351052 503490 414473 244935
5666B44935K0015j78034R519k513J52706J89074l95318Q0952J59265p8747j08317
$$ 244935 264950 86916 96435 93922 246628 435702 40384 121336 280601 201854 93537
5655I3537J86543K516M6304J84685k13131k39184M21806J27944l07779R9768j56802
$$ 93537 280080 282596 328900 513585 300454 61270 483076 611020 303241 403009 246207
5644B46207j09312J63480m73517M2984M60199j45551M31003l50003j13356R4566
$$ 246207 136895 300375 -173142 -130158 330041 184490 615493 265490 152134 246700
5634B46700P3274J41331o7631k43023J83365K21863L0161l15945j31060m0681
$$ 246700 319974 461305 393674 150651 334016 555879 586040 270095 139035 98354
5624I8354J31135P8508L06396j05875l43269K07626L8975J70176l19439j37261
$$ 98354 229489 307997 614393 508518 165249 372875 411850 582026 262587 125326
5614A25326K56742M7836j38593j17757L36157m5463j18210O7575J87736m9313
$$ 125326 382068 429904 291311 173554 509711 464248 346038 413613 601349 552036
5604E52036j12763j81611P6253j70060j00352K49844K33465J62996L9925R2380
$$ 552036 439273 257662 333915 163855 63503 313347 546812 709808 749733 842113
5594H42113o6767k56886J78591Q2855N4010k46416J89323K31869l8291R7717K91042
$$ 842113 775346 518460 697051 779906 833916 587500 776823 1008692 970401 1068118 1359160
5583A359160k30392j22094K23230r8268K75126k97677K9763m6206q6019L77362
$$ 1359160 1128768 1006674 1229904 1131636 1406762 1109085 1138848 1092642 1006623 1383985
5573A383985k24348k02665M04325o0999l6675L0160p6579k04411M7424K71768
$$ 1383985 1159637 956972 1361297 1300298 1263623 1293783 1217204 1012793 1060217 1331985
5563A331985K66195j00646K59831J57975K49733J65543J1624J69799J37703M81242
$$ 1331985 1598180 1497534 1757365 1915340 2165073 2330616 2342240 2512039 2649742 3130984
5553C130984O35383M37872K73314P62371J054581L29251n05370m25313o90268
$$ 3130984 3766367 4204239 4477553 5239924 6294505 6623756 6118386 5693073 5002805
5544E002805r51446j11148n25889m32251l56483l26726r7146J36411M03367l6690
$$ 5002805 4051359 3940211 3414322 2982071 2625588 2298862 2201716 2338127 2741494 2704804
5534B704804n0116j0718J3289j75391o7789k28102L06272J02445J4397l71052
$$ 2704804 2654688 2643970 2657259 2481868 2414079 2185977 2492249 2594694 2609091 2238039
5524B238039r1183J29035n6015l4889j11216O2315j86370J52362k30704J710k54202
$$ 2238039 2146856 2275891 2219876 2184987 2073771 2136086 1949716 2102078 1871374 1873084 1618882
5513A618882k77330Q3149k570L9373l2486n2001J50383j94267J91447k48439l77537
$$ 1618882 1341552 1424701 1422131 1461504 1429018 1377017 1527400 1333133 1524580 1276141 898604
5502H98604L35332l49940K81620M63467l75951q3891J6781j95808k02690N4191
$$ 898604 1233936 883996 1165616 1629083 1253132 1169241 1186022 990214 787524 841715
5492H41715K87899q8986K90824K54151k65287j93895J0256L63923l01543N1866
$$ 841715 1129614 1040628 1331452 1585603 1320316 1126421 1136677 1500600 1199057 1250923
5482A250923L8606J92957M25947l1738k27565K07619J74366o9775m17956k01630
$$ 1250923 1289529 1482486 1908433 1876695 1649130 1856749 2031115 1961340 1543384 1341754
5472A341754N4227P6450k36229J1806R5738j87876K87058J28961j76462J56084
$$ 1341754 1395981 1472431 1236202 1248008 1343746 1155870 1442928 1571889 1395427 1551511
5462A551511J26187L57275L29214j77002J17861q2359K4267M44L07792q8145l21955
$$ 1551511 1677698 2034973 2364187 2187185 2305046 2222687 2246954 2247398 2555190 2467045 2145090
5451B145090j10723j21407L55801j79785K18R957J48610K95008r641O4378j78837
$$ 2145090 2034367 1912960 2268761 2088976 2089194 2099151 2247761 2542769 2533128 2597506 2418669
5440B418669k7152K52126K52114m25353j70929L0601L12734M03742M89914R9292
$$ 2418669 2391517 2643643 2895757 2470404 2299475 2330076 2642810 3046552 3536466 3635758
5430C635758K16749q683j50137l78922j53641M8725l56743j39583J33215r2724
$$ 3635758 3852507 3843824 3693687 3314765 3161124 3209849 2853106 2713523 2846738 2754014
5420B754014j07997p1964m2684n470k06860K72506J21827P2343j55583j64564
$$ 2754014 2646017 2574053 2531369 2525899 2319039 2591545 2713372 2785715 2630132 2465568
5410B465568J02109l60086K21998o6214O7089P3719k298p483K5922m44905L509
$$ 2465568 2567677 2207591 2429589 2363375 2430464 2504183 2501885 2494402 2520324 2075419 2078928
5399B078928P6091k1283j88155K64156l31043J07984K20332J05555J1235l23518
$$ 2078928 2155019 2133736 1945581 2209737 1878694 1986678 2207010 2312565 2323800 2000282
5389B000282K64328P1804j98430k76829k17413N9976O643o0363m5837l13112o4474
$$ 2000282 2264610 2336414 2137984 1861155 1643742 1703718 1710361 1649998 1604161 1291049 1226575
5378A226575J9291M16740k86059J20985l2397j45486o6773Q3402j20475J50887
$$ 1226575 1245866 1662606 1376547 1497532 1465135 1319649 1252876 1336278 1215803 1366690
5368A366690j34367k65332J18176J89810K94572K7805M1329L44329l00457k3330
$$ 1366690 1232323 966991 1085167 1274977 1569549 1597354 1638683 1983012 1682555 1659225
5358A659225q1345m80683j32495K93772L10735j76614k10173K51102o2186l8394
$$ 1659225 1577880 1097197 964702 1258474 1569209 1392595 1182422 1433524 1371338 1332944
5348A332944l05857k07989j94527M0613K36526L07119k6339l6852J11840j62777
$$ 1332944 1027087 819098 624571 665184 901710 1208829 1182490 1145638 1257478 1094701
5338A094701J8554j64861k30513J2006K70491l7308Q0090L82778J78981J2621
$$ 1094701 1113255 948394 717881 729887 1000378 963070 1043160 1425938 1604919 1617540
5328A617540J75623J11722n69513J72281j8484l57367J24557q2828J5533j75328
$$ 1617540 1793163 1904885 1335372 1507653 1489169 1131802 1256359 1173531 1189064 1013736
5318A013736J93714k3203r1388L31543k63826m5683q1144J89659K50647J02171
$$ 1013736 1207450 1184247 1092859 1424402 1160576 1114893 1033749 1223408 1474055 1576226
5308A576226J20350m55520j45556j89720p993J51818R5294K44902N2301Q7876
$$ 1576226 1696576 1241056 1095500 905780 897787 1049605 1144899 1389801 1442102 1529978
5298A529978p1121j28490j59428L36413J85264k67772j55509l11368j06466o6180
$$ 1529978 1458857 1330367 1170939 1507352 1692616 1424844 1269335 957967 851501 785321
5288G85321K19396j38447J5844r8534K38970j67290J10411n5959N3707K38459
$$ 785321 1004717 866270 882114 783580 1022550 855260 965671 909712 963419 1201878
5278A201878O4877j71064l4821K19038j14094N6230K12203O7099Q4321j03076
$$ 1201878 1266755 1095691 1060870 1279908 1165814 1222044 1434247 1501346 1585667 1482591
5268A482591J33186L9934J20234J72900k05488K9762m23426k45183N587J93500
$$ 1482591 1615777 1655711 1775945 1948845 1743357 1773119 1349693 1104510 1110097 1303597
5258A303597K93197l19421p6727k6755k2048j08762k48305r7814K65361L40439
$$ 1303597 1596794 1277373 1200646 1173891 1151843 1043081 794776 696962 962323 1302762
5248A302762j43894K4555j15613J17047L4162p5575J75210K2949j018J56783k21404
$$ 1302762 1158868 1183423 1067810 1184857 1219019 1143444 1318654 1341603 1340585 1497368 1275964
5237A275964M01328j54302J29005K12652K36440J2513n53098R3496K54935J39684
$$ 1275964 1677292 1522990 1651995 1864647 2101087 2113600 1560502 1653998 1908933 2048617
5227B048617n3632m21843K5826k4028l1678r0357k82406J43951L3820m96641M5488
$$ 2048617 1994985 1573142 1598968 1574940 1543262 1452905 1170499 1314450 1348270 851629 897117
5216H97117N92858L4977j05789n3268N7528n8418j07754j79965m5168Q0829l3897
$$ 897117 1489975 1524952 1419163 1365895 1423423 1365005 1257251 1077286 1032118 1112947 1079050
5205A079050j03260K16607K213L0473J89323J5089j64274r2601k55015K42803
$$ 1079050 975790 1192397 1194610 1225083 1414406 1429495 1265221 1172620 917605 1160408
5195A160408K7589k8961j16766k93262M63865J04259m8298J11115j071m8995j89991
$$ 1160408 1187997 1159036 1042270 749008 1212873 1317132 1268834 1379949 1378878 1329883 1139892
5184A139892j58853L39590K4182l04816L34048j28689j45359K12576M00478J08938
$$ 1139892 981039 1320629 1344811 1039995 1374043 1245354 1099995 1312571 1713049 1821987
5174A821987k07183l21434K37513M5880m2160L12640j73774R8111r0401j34070
$$ 1821987 1614804 1293370 1530883 1576763 1534603 1847243 1673469 1771580 1681179 1547109
5164A547109j53870L8354L51274J5545k59242k5452q1161J97484J94115m648N0106
$$ 1547109 1393239 1431593 1782867 1798412 1539170 1513718 1432557 1630041 1824156 1819508 1869614
5153A869614K82631k8199n4452J99921N6565l3777K04851m01569j30760M11462
$$ 1869614 2152245 2124046 2069594 2269515 2326080 2292303 2497154 2095585 1964825 2376287
5143B376287K16034m3563L52425J10847M0969N23199J01165K65237J86278J65905
$$ 2376287 2592321 2548758 2901183 3012030 3052999 3576198 3677363 3942600 4128878 4294783
5133D294783L92712J25774N2576N3028Q6868o238L6251k0483l73365l74892m42791
$$ 4294783 4687495 4813269 4865845 4918873 5005741 4999503 5035754 5015271 4641906 4267014 3824223
5122C824223K72664k23469J43264J55127j6505L6117K55445J27769J10729O20138
$$ 3824223 4096887 3873418 4016682 4171809 4155304 4191421 4446866 4574635 4685364 5305502
5112E305502J82793K49381K17509J8505R9830J1699Q9150n02236l86064L6492
$$ 5305502 5488295 5737676 5955185 5973690 6073520 6085219 6174369 5672133 5286069 5322561
5102E322561l95146l75299N500M6939K95265Q4218J47920M4592L14647M16761
$$ 5322561 4927415 4552116 4557616 4604555 4899820 4984038 5131958 5176550 5491197 5907958
5092E907958L53353L71460J74197L33641J68052L21559l35586o02872K701j1004
$$ 5907958 6261311 6632771 6806968 7140609 7308661 7630220 7294634 6691762 6694463 6683459
5082F683459l48086j32931m2687j02443M4581l24557k76374L00989O6995r0152
$$ 6683459 6335373 6202442 6159755 6057312 6101893 5777336 5500962 5801951 5868946 5778794
5072E778794n5434P112K16527K28554M635j06353p7055L7103m5473M6469l90355
$$ 5778794 5723360 5730472 5946999 6175553 6180188 6073835 5996780 6033883 5988410 6034879 5644524
5061E644524n50866k67266k69499l21360l18917j6160l5146k32317Q2433r0719
$$ 5644524 5093658 4826392 4556893 4235533 3916616 3900456 3865310 3632993 3715426 3624707
5051C624707j7511k62263j80810n0657k6116j19806L5342l1514J65053Q2430R4545
$$ 3624707 3607196 3344933 3164123 3113466 3087350 2967544 3002886 2971372 3136425 3218855 3313400
5040C313400M8008k72766L8714K90050J30234o9239P8036J35176k66485J47348
$$ 3313400 3361408 3088642 3127356 3417406 3547640 3478401 3556437 3691613 3425128 3572476
5030C572476j8521j18752K95270j65645M24691J09003L68334M0315L56465Q08795
$$ 3572476 3553955 3435203 3730473 3564828 3989519 4098522 4466856 4507171 4863636 5672431
5020E672431n0789M8313K41273j49712m44515p6860j04542m63603l18403j98534
$$ 5672431 5621642 5669955 5911228 5761516 5317001 5240141 5135599 4671996 4353593 4155059
5010D155059J40278M5597j93595n3858p396K22454N7746k61795J54088L61203
$$ 4155059 4295337 4340934 4147339 4093481 4086085 4308539 4366285 4104490 4258578 4619781
5000D619781j38610l88720L24333K81413l65290j07728J44713L73027k04093l01781
$$ 4619781 4481171 4092451 4416784 4698197 4332907 4225179 4369892 4742919 4538826 4237045
4990D237045M7672j9653l28716J45656j77303j54490q942Q4398M00941L9896J41904
$$ 4237045 4284717 4265064 3936348 4082004 3904701 3750211 3741269 3825667 4226608 4266504 4408408
4979D408408N21240N8618l01807J60607J75287N40047J05313L09586N7510j78254
$$ 4408408 4929648 4988266 4686459 4847066 5022353 5562400 5667713 5977299 6034809 5856555
4969E856555k3228k64001n9678O7885j43643k33057M9869K56770J44938P8421
$$ 5856555 5833327 5569326 5509648 5577533 5433890 5200833 5250702 5507472 5652410 5730831
4959E730831M57753K27403j22949P3787k79453l12009o6032j17363M16353K35330
$$ 5730831 6188584 6415987 6293038 6366825 6087372 5775363 5709331 5591968 6008321 6243651
4949F243651k66993k9888L65428q7810J12407J85665J219K69561J19799m37105
$$ 6243651 5976658 5946770 6312198 6224388 6336795 6522460 6523679 6793240 6913039 6475934
4939F475934K55146J080j57156l74119k73858L37864J97883j75471k8470L50409
$$ 6475934 6731080 6732160 6575004 6200885 5927027 6264891 6462774 6287303 6258833 6609242
4929F609242O6625p4702K33118j47807r8578K96785M4896r4285l64959j28563
$$ 6609242 6675867 6601165 6834283 6686476 6587898 6884683 6929579 6835294 6470335 6341772
4919F341772j98756K87145k23616j61981K23927l77486k45900J09952K08807K42085
$$ 6341772 6143016 6430161 6206545 6044564 6268491 5891005 5645105 5755057 5963864 6205949
4909F205949j52599j29440j4199L79328J90006L40680M25068P07154L29966L72562
$$ 6205949 6053350 5923910 5909711 6289039 6479045 6819725 7244793 7951947 8281913 8654475
4899H654475J97204j20136l5533K36410j01603m38306M1306J14620o39326p9105
$$ 8654475 8851679 8731543 8696010 8932420 8830817 8392511 8433817 8548437 7909111 7830006
4889G830006J62480N08824J00014N6785J62777j26462L38364K6552m5139J34029
$$ 7830006 7992486 8501310 8601324 8658109 8820886 8694424 9032788 9059340 9014201 9148230
4879I148230p3164j22737l0269O492j82259Q7954K45049L6411n31j76647n5137
$$ 9148230 9075066 8952329 8922060 8928552 8746293 8834247 9079296 9115707 9115176 8938529 8883392
4868H883392K75197J11351L05627L57733O2356r1325j98624L72050L24963K03445
$$ 8883392 9158589 9269940 9575567 9933300 9995656 9904331 9705707 10077757 10402720 10606165
4858A0606165k54785j43682O7758K49999N9176m3089N5445p3612K17781j399n0501
$$ 10606165 10351380 10207698 10275456 10525455 10584631 10541542 10596987 10523375 10741156 10739757 10689256
4847A0689256J6478j55343O09684J08078O4496Q5260K91093J45669j15514L36356
$$ 10689256 10705734 10550391 11160075 11268153 11332649 11417909 11709002 11854671 11739157 12075513
4837A2075513m3155L69030M06138L04143M05447K30894L70083J02157O76515P9407
$$ 12075513 12032358 12401388 12807526 13111669 13517116 13748010 14118093 14220250 14896765 14976172
4827A4976172K9050N3674M57650K96380J81937K36635M6653L12490O39919P82648
$$ 14976172 15005222 15058896 15516546 15812926 15994863 16231498 16278151 16590641 17230560 18013208
4817A8013208P42185Q07176M82661Q24676R09866R16293R34646J288491J111647
$$ 18013208 18755393 19562569 20045230 20869906 21779772 22696065 23630711 24919202 26030849
4808B6030849R08366Q31271Q59399J344610Q37916J046949J028311J161217J121625
$$ 26030849 26939215 27770486 28629885 29974495 30812411 31859360 32887671 34048888 35170513
4799C5170513J214755J604126J841851J525466K500893K387391K632493L152138
$$ 35170513 36385268 37989394 39831245 41356711 43857604 46244995 48877488 52029626
4791E2029626M193837M632035N106081O206131P448099Q780720J0161165J2099558
$$ 52029626 56223463 60855498 65961579 72167710 79615809 88396529 98557694 110657252
4783A10657252J5512655K0071601K5586075L1917097L8305874L9339177L4201086
$$ 110657252 126169907 146241508 171827583 203744680 242050554 281389731 315590817
4776C15590817J3902267j1808821l0998083m5623933m4119229l5827856k6599172
$$ 315590817 329493084 317684263 286686180 241062247 196943018 161115162 134515990
4769A34515990j9642060j4969732j1685862q901082p476747o304890n323866m203706
$$ 134515990 114873930 99904198 88218336 79317254 71840507 65535617 60211751 56008045
4761E6008045l289845k859641k470742j974463k406175j957935j477834j265285
$$ 56008045 52718200 49858559 47387817 45413354 43007179 41049244 39571410 38306125
4753C8306125q73035j051894j211448q33132o31151o50892l32200J23445j72290
$$ 38306125 37433090 36381196 35169748 34336616 33705465 33054573 32722373 32845818 32673528
4744C2673528j89436Q5906N1880J3146M02817P45604L90531O38600J009143P55853
$$ 32673528 32484092 32569998 32621878 32635024 33037841 33783445 34173976 34812576 35821719 36577572
4734C6577572Q42154R32230O43821N49975O37117P04748R72104J054945J369866
$$ 36577572 37419726 38351956 38995777 39545752 40182869 40887617 41859721 42914666 44284532
4725D4284532J699873J853930J880445K469944L539354M038995M779188N612052
$$ 44284532 45984405 47838335 49718780 52188724 55728078 59767073 64546261 70158313
4717G0158313O625059P666200R160968J1438744J4475095J8735750K3616200K9517815
$$ 70158313 76783372 84449572 93610540 105049284 119524379 138260129 161876329 191394144
4709A91394144L5621946L5902276L0382062J4360705o186783j7679500l2586416
$$ 191394144 227016090 262918366 293300428 307661133 301474350 283794850 251208434
4702B51208434m2615571l8232521l0014157k2811701j7246519j2998186j0271492
$$ 251208434 208592863 170360342 140346185 117534484 100287965 87289779 77018287
4695G7018287q473715p053551o085569m688473l669439l118607k439604k486649
$$ 77018287 68544572 61491021 55405452 50716979 47047540 43928933 41489329 39002680
4687C9002680k558933k071273j534204j800722j654255j473728j157847r84299
$$ 39002680 36443747 34372474 32838270 31037548 29383293 27909565 26751718 25767419
4679B5767419r29376j057093r25164j218550j003375r96776q81417j090216p01060
$$ 25767419 24838043 23780950 22855786 21637236 20633861 19637085 18755668 17665452 16964392
4670A6964392m65524o92476m61902o11266l04891m37506o7087m9310k76758l75901
$$ 16964392 16498868 15806392 15344490 14733224 14428333 13990827 13923740 13874430 13597672 13221771
4660A3221771k42336o55591m19230k12861l33139j12141o54144m62081l19195
$$ 13221771 12979435 12323844 11904614 11691753 11358614 11246473 10592329 10130248 9811053
4651I811053j26921o2675n4042l41639m3845N2037k08289N7383M5781l26348j59260
$$ 9811053 9684132 9621457 9567415 9225776 9181931 9233968 9025679 9083062 9128843 8802495 8643235
4640H643235l24838l71153J31642J08439j1016J37224k10188k66766k0104l49092
$$ 8643235 8318397 7947244 8078886 8187325 8176309 8313533 8103345 7836579 7816475 7467383
4630G467383j7264q4000k55253K6976k0793o2867Q94p1055o41598j45746P7966
$$ 7467383 7450119 7366119 7110866 7137842 7117049 7054182 7055076 6984021 6342423 6196677 6274643
4619F274643R6614J3972P2064J38983r0585k54718l71066l079N747k18181K01015
$$ 6274643 6371257 6385229 6457293 6596276 6505691 6250973 5879907 5876828 5882575 5664394 5865409
4608E865409j86899P6460k66036j26376q9189j08114K52645k45073L23862J71026
$$ 5865409 5678510 5754970 5488934 5362558 5273369 5165255 5417900 5172827 5496689 5667715
4598E667715J01278N8905k2062J88514J23460J05154l80377j49797r0287n7384
$$ 5667715 5768993 5827898 5805836 5994350 6117810 6222964 5842587 5692790 5602503 5545119
4588E545119R8619K00084j64424k55286j89215K83333J10964j13j24118M9401
$$ 5545119 5643738 5843822 5679398 5424112 5234897 5518230 5629194 5629081 5504963 5554364
4578E554364J77044J40289L00825j26992J06564k37123k24352k48791j3505j85859
$$ 5554364 5731408 5871697 6172522 6045530 6152094 5914971 5690619 5441828 5428323 5242464
4568E242464J05981J1031J19371j86248l85025J65301J64088O8814L3672j39799
$$ 5242464 5348445 5359476 5478847 5292599 4907574 5072875 5236963 5305777 5339449 5199650
4558E199650J37109N8624j13834J05346m49965K88475K32857J54845n1165L4123
$$ 5199650 5336759 5395383 5281549 5386895 4936930 5225405 5458262 5613107 5561942 5596065
4548E596065r8713R2882N5633k42012O81052j95462k47542J50828K79589O6287
$$ 5596065 5497352 5590234 5645867 5403855 6084907 5889445 5641903 5792731 6072320 6138607
4538F138607j7388r7701K17985Q6212O2544r50L8512j02614Q6383J40889J77895
$$ 6138607 6121219 6023518 6241503 6327715 6390259 6389309 6427821 6325207 6411590 6552479 6730374
4527F730374K6237j27265J25749L78028K86691l98886l188L62034l3824j46344
$$ 6730374 6756611 6629346 6755095 7133123 7419814 7020928 7017740 7379774 7345950 7199606
4517G199606l7196M94999m6586m23279K94614P47831L7567L6967J80468m03840
$$ 7199606 7162410 7657409 7610823 7187544 7482158 8229989 8267556 8304523 8484991 8081151
4507H081151M66536L16690J23230J09390R480L9956j12493K49707J37801K70825
$$ 8081151 8547687 8864377 8987607 9096997 9106477 9146433 9033940 9283647 9421448 9692273
4497I692273K7497J08572J70321M65299L97296L4832l4445N10844K74380L1713
$$ 9692273 9719770 9828342 9998663 10463962 10861258 10896090 10861645 11372489 11646869 11678582
4487A1678582L49122M47955L23412P7780K69584L90396L75817P5371K95382N66658
$$ 11678582 12027704 12475659 12799071 12876851 13146435 13536831 13912648 13988019 14283401 14850059
4477A4850059K98687M60333O25473K87250O30276L69683O93124Q54187O08579
$$ 14850059 15148746 15609079 16234552 16521802 17152078 17521761 18214885 19069072 19677651
4468A9677651J120313J172990J114462J456172J592546J683864J387089O01629
$$ 19677651 20797964 21970954 23085416 24541588 26134134 27817998 29205087 29806716
4460B9806716P54635R94679J267386J185937J434623K832201K203519J816059
$$ 29806716 30561351 31556030 32823416 34009353 35443976 38276177 40479696 42295755
4452D2295755J679454Q73238Q03014J235415Q28532j10276Q3734m8356L79660
$$ 42295755 43975209 44848447 45651461 46886876 47715408 47605132 47688866 47640510 48020170
4443D8020170N56776O43883J250496R30453J210375J507677J222587Q58873N68136
$$ 48020170 48576946 49220829 50471325 51401778 52612153 54119830 55342417 56201290 56769426
4434E6769426O90977J15741J5761L11915j71112j87837r8236o1069J26149L11848
$$ 56769426 57460403 57576144 57591905 57903820 57732708 57544871 57446635 57385566 57511715 57823563
4424E7823563J2007K8254p81798j050674q49898r78567k95134K65069P31343J850688
$$ 57823563 57835570 57863824 57082026 56031352 55181454 54202887 53907753 54172822 54904165 56754853
4414E6754853J911454K706011K837662K518909K642196J551204J606028J430873
$$ 56754853 58666307 61372318 64209980 66728889 69371085 70922289 72528317 73959190
4406G3959190R59224J027094R97060Q01550R13476O56164l36893p37190j452455
$$ 73959190 74918414 75945508 76942568 77744118 78657594 79313758 78976865 78239675 76787220
4397G6787220j417285j837809k719696l334210l841105m315980m616724l988056
$$ 76787220 75369935 73532126 70812430 67478220 63637115 59321135 54704411 50716355
4389E0716355l401125l136497l089788k828313j825168j480215j662855r48867
$$ 50716355 47315230 44178733 41088945 38260632 36435464 34955249 33292394 32343527
4381C2343527q28891r80837r54333n60704n21038q48641j52736r81618m46083
$$ 32343527 31514636 30533799 29579466 29018762 28497724 27649083 27496347 26514729 26068646
4372B6068646l38833o27069l14134k30310m61801m77874M0730M43526j24819Q268
$$ 26068646 25729813 25102744 24788610 24558300 24096499 23618625 23659355 24102881 23978062 23986330
4362B3986330q4282J18966K25602K87036P27186L66939O17677L27664O72312Q94541
$$ 23986330 23902048 24021014 24246616 24533652 25260838 25627777 26245454 26573118 27245430 28139971
4352B8139971N16040P71930J015254Q28464P97915Q32849J276763J272276J631475
$$ 28139971 28656011 29427941 30443195 31271659 32069574 32902423 34179186 35451462 37082937
4343C7082937J783385J721481J816213K155037J828280K599382K844887K853745
$$ 37082937 38866322 40587803 42404016 44559053 46387333 48986715 51831602 54685347
4335E4685347L456995L879013L762767M052276L367733K082132K544743J731754
$$ 54685347 58142342 62021355 65784122 69836398 73204131 75286263 77831006 79562760
4327G9562760J055404N80316K56810J47602l60723j105156j514097j615696j853356
$$ 79562760 80618164 81198480 81455290 81602892 81242169 80137013 78622916 77007220 75153864
4318G5153864r33953j448399j663206k158559k242784j900392j894073j803622
$$ 75153864 74219911 72771512 71108306 68949747 66706963 64806571 62912498 61108876
4310F1108876j096179j158674k42763K86636M28484O34598Q81366P91332O54034
$$ 61108876 60012697 58854023 58611260 58897896 59326380 59960978 60842344 61633676 62287710
4301F2287710L41984K7439r4196K9668N07262J73131K69187J43401m5036q2709
$$ 62287710 62629694 62657133 62562937 62592605 63099867 63272998 63542185 63685586 63640550 63557841
4291F3557841k75878k10622r59054j288789j440526j631731j246354j349420j269547
$$ 63557841 63281963 63071341 62112287 60823498 59382972 57751241 56504887 55155467 53885920
4282E3885920j112121p32225o15175p58755o19560o51858p18907j079532j504500
$$ 53885920 52773799 52041574 51426399 50667644 50048084 49396226 48677319 47597787 46093287
4273D6093287j492022j589300j683504j989543j712925j601013j565118j517028
$$ 46093287 44601265 43011965 41328461 39338918 37625993 36024980 34459862 32942834
4265C2942834j315967j047067j140803o78311p97444o24721m92697r44003n07175
$$ 32942834 31626867 30579800 29438997 28760686 27963242 27338521 26845824 25901821 25394646
4256B5394646n86924m64807k14995k67027l87643q98324o56900m46342m38161
$$ 25394646 24807722 24342915 24127920 23860893 23473250 22574926 21918026 21471684 21033523
4247B1033523k70112k74124n0452j07872k7062N8913K35246K23884K86044K8718
$$ 21033523 20763411 20489287 20438835 20330963 20303901 20362814 20598060 20821944 21107988 21136706
4237B1136706n1576P844O24844L37533L34216N06812M51885j85087l03939j28039
$$ 21136706 21085130 21092974 21717818 22055351 22389567 22896379 23348264 23163177 22859238 22731199
4227B2731199n01795p38829m44617l08987l58365k37975O9137K2077J78507j78048
$$ 22731199 22229404 21490575 21045958 20736971 20378606 20140631 20209768 20231845 20410352 20232304
4217B0232304J59825O66517j36190J75171J07932o1200j05822L3311K67126J16183
$$ 20232304 20392129 21058646 20922456 21097627 21205559 21144359 21038537 21071848 21338974 21455157
4207B1455157L99861J30686K15989l5115M00359K61906k33322j554k38572l99472
$$ 21455157 21855018 21985704 22201693 22166578 22566937 22828843 22595521 22593967 22355395 21955923
4197B1955923m27216k62755j82293J43797M48134K39289k24241J9523j486J52419
$$ 21955923 21528707 21265952 21083659 21227456 21675590 21914879 21690638 21710161 21708675 21861094
4187B1861094K88259N60068M68382M7282N08124M38201K83676M74371M19389K30984
$$ 21861094 22149353 22709421 23177803 23225085 23733209 24171410 24455086 24929457 25348846 25579830
4177B5579830M89431J69470J11852k35554p9577n2159l30360j77298K42529N8391
$$ 25579830 26069261 26238731 26350583 26115029 26035452 25983293 25652933 25475635 25718164 25776555
4167B5776555K13797j16350j3221P57807P71969N04551O00708O1528L84359L73529
$$ 25776555 25990352 25874002 25860781 26618588 27390557 27895108 28495816 28557344 28941703 29315232
4157B9315232N26241O46053K92996Q88513P24790O17830P69707J09943p2950M14183
$$ 29315232 29841473 30487526 30780522 31669035 32393825 33011655 33781362 33891305 33818355 34232538
4147C4232538Q8058n998n93210m50313j59250k68897o7344r9977k86569J90080
$$ 34232538 34320596 34314598 33721388 33271075 33111825 32842928 32775584 32675607 32389038 32579118
4137C2579118m8259k53614m40088l45466n60200K0153m18168p1692J50439m1385
$$ 32579118 32530859 32277245 31837157 31491691 30931491 30951644 30533476 30461784 30612223 30570838
4127C0570838j60426L40347L54719N37283J12920L01244J51559Q09911N46484
$$ 30570838 30410412 30750759 31105478 31642761 31755681 32056925 32208484 33018395 33564879
4118C3564879L88437N72806L26375L95408N86805O58227M97847M95867N37203
$$ 33564879 33953316 34526122 34852497 35247905 35834710 36492937 36990784 37486651 38023854
4109C8023854L61882P22059P20903O86256O04372M83832K96566L99635R74460
$$ 38023854 38385736 39107795 39828698 40514954 41119326 41603158 41899724 42299359 43273819
4100D3273819Q85541O23219J048712J179152J024460J187081J021312J132982
$$ 43273819 44159360 44782579 45831291 47010443 48034903 49221984 50243296 51376278
4092E1376278R74159J517066J397927J017267J302915R99229J429460J159998
$$ 51376278 52350437 53867503 55265430 56282697 57585612 58584841 60014301 61174299
4084F1174299J587929K017295K057287K137986K377697K292618K657370L007438
$$ 61174299 62762228 64779523 66836810 68974796 71352493 73645111 76302481 79309919
4076G9309919L077874L311196L714884M585433N441187O530883P396642R139449
$$ 79309919 82387793 85698989 89413873 93999306 99440493 105971376 113368018 122507467
4068A22507467J0466564J2181017J4019342J5549912J7030529J8132687J8719051
$$ 122507467 132974031 145155048 159174390 174724302 191754831 209887518 228606569
4061B28606569K1535369K5189152K9032030L3419821L5277015K5812484M392965
$$ 228606569 250141938 275331090 304363120 337782941 373059956 398872440 403265405
4054D03265405k6143321m4370401m4798536l7786437k9658445k2025868j6040542
$$ 403265405 377122084 332751683 287953147 250166710 220508265 198482397 182441855
4047A82441855j0396950p136005l966166n45353Q51762o3303l489504q475817
$$ 182441855 172044905 164908900 160942734 160397381 161249143 161185840 157696336 149220519
4039A49220519j0726546j0585293q602190p134869n920076m269403l196159k443663
$$ 149220519 138493973 127908680 119306490 112171621 106251545 101982142 98785983 96342320
4031I6342320j861135j114483m21397m98782M6233R80988J666744K229908K759706
$$ 96342320 94481185 93366702 92945305 92446523 92492756 93473744 95140488 97370396 100130102
4022A00130102L628470M255460M261839K998190Q20017k512425l855185m542030
$$ 100130102 103758572 108014032 112275871 115274061 116094078 113581653 109726468 105184438
4014A05184438l247016k529983j932510j475306n93158n5311Q5816M97515J337628
$$ 105184438 101937422 99407439 97474929 95999623 95406465 95351154 95436970 95934485 97272113
4005I7272113J263808J458792J941821J750942K200414K200264K233451K817661
$$ 97272113 98535921 99994713 101936534 103687476 105887890 108088154 110321605 113139266
3997A13139266K783777K752770K829019L265019L425577L179750L395977L419203
$$ 113139266 115923043 118675813 121504832 124769851 128195428 131375178 134771155 138190358
3989A38190358L815069L897468L082741L335898L540783L405851L070417L391159
$$ 138190358 142005427 145902895 148985636 152321534 155862317 159268168 162338585 165729744
3981A65729744L177246L535951L524685L654385L286331L434091L607149L201208
$$ 165729744 168906990 172442941 175967626 179622011 182908342 186342433 189949582 193150790
3973A93150790L080544L413663K952272K882146K745917K650617K173625K001809
$$ 193150790 196231334 199644997 202597269 205479415 208225332 210875949 213049574 215051383
3965B15051383K397102K034697J716477J367221J266661J354675J068086Q73262
$$ 215051383 217448485 219483182 221199659 222566880 223833541 225188216 226256302 227129564
3957B27129564R79575J21090J44194K00409L80640L57521L81690Q3090J15132
$$ 227129564 228109139 228230229 228374423 228574832 228955472 229312993 229694683 229777773 229892905
3948B29892905J08135m79557o29217j523137k174657k971848l850716m433108
$$ 229892905 230001040 229521483 228892266 227369129 225194472 222222624 218371908 213938800
3940B13938800m407217m496843m557111m360446l826986l401048l544826l816498
$$ 213938800 209531583 205034740 200477629 196117183 192290197 188889149 185344323 181527825
3932A81527825l560470l805896l454318l693076l756942l356412k958351l110844
$$ 181527825 177967355 174161459 170707141 167014065 163257123 159900711 156942360 153831516
3924A53831516k786977k168152j311179o44590m32518R36177P83758J218315J710827
$$ 153831516 151044539 148876387 147565208 146920618 146488100 147424277 148208035 149426350 151137177
3915A51137177K368051K960673L396056L503289L836712L652440L065928K060109
$$ 151137177 153505228 156465901 159861957 163365246 167201958 170854398 173920326 175980435
3907A75980435J153196R75832P17443P06342R76206J256915J299018J965766K345065
$$ 175980435 177133631 178109463 178826906 179533248 180509454 181766369 183065387 185031153 187376218
3898A87376218L256963L579800L680426M200068M092097M025193L441098K945682
$$ 187376218 190633181 194212981 197893407 202093475 206185572 210210765 213651863 216597545
3890B16597545L036926K722002K441720K594530K805572L711562M572202N458804
$$ 216597545 219634471 222356473 224798193 227392723 230198295 233909857 238482059 243940863
3882B43940863P164545Q605224R764166J1935550J3288300J4698012J5902718
$$ 243940863 251105408 259710632 269474798 281410348 294698648 309396660 325299378
3875C25299378J6485988J5482507J4473047J2100003Q627672M663436J033733
$$ 325299378 341785366 357267873 371740920 383840923 392468595 397132031 398165764
3868C98165764k184078m634699o276898o514910o325764n932248n333261m752798
$$ 398165764 395981686 391346987 385070089 378555179 372229415 366297167 360963906 356211108
3860C56211108m702357n295298n497658o876290r357584j1596499j3563577j5376946
$$ 356211108 351508751 346213453 340715795 333839505 324481921 312885422 299321845 283944899
3852B83944899j6860357j7146264j6615396j5940984j4337784j2849762j1129556
$$ 283944899 267084542 249938278 233322882 217381898 203044114 190194352 179064796
3845A79064796r822625q445100p169874o207624m812580m066335l200071j934097
$$ 179064796 169242171 160797071 153627197 147419573 142606993 138540658 135340587 133406490
3837A33406490j008025p00858N32221J183301J752705K833712K977556L202153
$$ 133406490 132398465 131697607 132229828 133413129 135165834 137999546 140977102 144179255
3829A44179255L627935K928786J329966l31346j006727j832064k625203k812095
$$ 144179255 147807190 150735976 152065942 151734596 150727869 148895805 146270602 143458507
3821A43458507k797195k517685k395940k188478j669611j232687j529821k096500
$$ 143458507 140661312 138143627 135747687 133559209 131889598 130656911 129127090 127030590
3813A27030590l288552l533163l892837m933255n234392n996590o096473n397662
$$ 127030590 123742038 120208875 116316038 111382783 106148391 100151801 94055328 88657666
3805H8657666m950709m242393m128441l541195k629480k305914k636119k001236
$$ 88657666 83706957 79464564 75336123 71794928 69165448 66859534 64223415 62222179
3797F2222179j716213j531783j508398j386118o79952r93260j001737r55078j023662
$$ 62222179 60505966 58974183 57465785 56079667 55399715 54406455 53404718 52449640 51425978
3788E1425978r21110p20977p83724p00868q51365q05540q39002j379595p72487
$$ 51425978 50504868 49783891 49000167 48299299 47447934 46642394 45803392 44423797 43651310
3779D3651310j042781r53824o89407n17182m23938l97916m26523l27313j99857
$$ 43651310 42608529 41654705 40965298 40448116 40024178 39626262 39199739 38872426 38672569
3770C8672569m75361o70578l26485k41916J8405k67094l38021o20069k94787J95657
$$ 38672569 38197208 37526630 37200145 36958229 36976634 36709540 36371519 35751450 35456663 35652320
3760C5652320J18125Q3158L29669P2250r4815K57904q4077j77184l32109r75302
$$ 35652320 35770445 35853603 36183272 36255522 36160707 36418611 36334534 36157350 35825241 34849939
3750C4849939q23043p86093n24809q02382o54529o92506o64205m95809l88971
$$ 34849939 34026896 33240803 32715994 31913612 31259083 30566577 29902372 29406563 29017592
3741B9017592j85164l41715k63113J01088K6705p2143j32311l44058j96323J55684
$$ 29017592 28832428 28490713 28227600 28328688 28355393 28283250 28150939 27806881 27610558 27766242
3731B7766242j38099K51782R7903j90207P7863k71127J24337K65454L53131n1099
$$ 27766242 27628143 27879925 27977828 27787621 27865484 27594357 27718694 27984148 28337279 28286180
3721B8286180L95395r1862J72193K56535n85133j19414q913j04986Q7255k67685
$$ 28286180 28681575 28589713 28761906 29018441 28433308 28313894 28304981 28199995 28287250 28019565
3711B8019565l26406J01786Q1376j51437L00638K18281K73271N61055M72293O5079
$$ 28019565 27693159 27794945 27876321 27724884 28025522 28243803 28517074 29078129 29550422 29615501
3701B9615501O36776K00145K03013O46220J03640K84813K20883J99878L02825
$$ 29615501 30252277 30452422 30655435 31301655 31405295 31690108 31910991 32110869 32413694
3692C2413694N74253M86309N25540M68699L36462O31374M28719N60992L17856
$$ 32413694 32987947 33474256 33999796 34468495 34804957 35436331 35865050 36426042 36743898
3683C6743898M01080r00L4972M11119K28764O60151K93590M06030P05656N71193
$$ 36743898 37144978 37144078 37179050 37590169 37818933 38479084 38772674 39178704 39884360 40455553
3673D0455553N16300N31773J033853O32862P25581J014751J018484M71356O72781
$$ 40455553 40971853 41503626 42537479 43170341 43895922 44910673 45929157 46400513 47073294
3664D7073294M80725J066530R69740R02861R52629J044209J025640J469693J349828
$$ 47073294 47554019 48620549 49590289 50493150 51445779 52489988 53515628 54985321 56335149
3655E6335149J257872J303920J275007J344798J598388J882925J916707K394317
$$ 56335149 57593021 58896941 60171948 61516746 63115134 64998059 66914766 69309083
3647F9309083K123965K545779K467910L338515L496973L613087L898535M121380
$$ 69309083 71433048 73978827 76446737 79785252 83282225 86895312 90793847 94915227
3639I4915227M486055M364371M947162M821315N029069N494511N566526O202427
$$ 94915227 99401282 103765653 108712815 113534130 118563199 124057710 129624236 135826663
3631A35826663O579521O622405O575333P102202P191550P417934P838591P830052
$$ 135826663 142406184 149028589 155603922 162706124 169897674 177315608 185154199 192984251
3623A92984251Q307913R021007R664099R862626J0927348J1744988J1519842J2487374
$$ 192984251 201292164 210313171 219977270 229839896 240767244 252512232 264032074 276519448
3615B76519448J2300456J2921347J2730402J2885656J2562594J1435611J0165000
$$ 276519448 288819904 301741251 314471653 327357309 339919903 351355514 361520514
3608C61520514Q411064O969398O436940N915122N942804O811042P544475Q021222
$$ 361520514 369931578 376900976 383337916 389253038 395195842 402006884 409551359 417572581
3600D17572581Q125061P786232P017577N302510K394629p69696l944355p284336
$$ 417572581 425697642 433483874 440501451 445803961 448198590 447428894 443484539 436200203
3592D36200203r942926j1569553j2408466j2147537j1381903j0066075r405985
$$ 436200203 426257277 414687724 402279258 390131721 378749818 368683743 359277758
3585C59277758q924816q832355q574037q962251j0470337j2186002j3694502j5063956
$$ 359277758 350352942 341520587 332946550 323984299 313513962 301327960 287633458 272569502
3577B72569502j5968539j6328704j5695073j4905120j3566220j1993826j0594193
$$ 272569502 256600963 240272259 224577186 209672066 196105846 184112020 173517827
3570A73517827r483668r088195p841812p339988p596877p193284o945280o609524
$$ 173517827 164034159 154945964 147104152 139764164 132167287 124974003 118028723 111419199
3562A11419199o352042o247226n557896n058668m504819m222421l661710l458703
$$ 111419199 105067157 98819931 93262035 88203367 83698548 79476127 75814417 72355714
3554G2355714l029196l467211k499596k466404k445390j918021j932928j835710
$$ 72355714 69326518 65859307 63359711 60893307 58447917 56529896 54596968 52761258
3546E2761258j667286j678347j546510j000289j441914j282144j267020o28035
$$ 52761258 51093972 49415625 47869115 46868826 45426912 44144768 42877748 42249713
3538D2249713j096723j278351p84264j305423j113269p22492p70175n31165j151208
$$ 42249713 41152990 39874639 39090375 37784952 36671683 35949191 35179016 34647851 33496643
3529C3496643r85901m14616n62188q16954j014410j050659k13325m59544o86557
$$ 33496643 32510742 32096126 31533938 30716984 29702574 28651915 28438590 27979046 27292489
3520B7292489n45242q59734p98815m31803k99891k92182r01562n84867m90079
$$ 27292489 26747247 25887513 25088698 24656895 24357004 24064822 23163260 22578393 22088314
3511B2088314j97620n51542p79721o39688l95742j74911k54724k64278k29274
$$ 22088314 21890694 21339152 20559431 19919743 19524001 19349090 19094366 18830088 18600814
3502A8600814m75753k12412n07242n43323J00697n97408l50295j05810j84572
$$ 18600814 18125061 17912649 17405407 16862084 16962781 16365373 16015078 15909268 15724696
3493A5724696m01602j21203n69380k26180J22612j87065l03309l17461l02917
$$ 15724696 15323094 15201891 14632511 14406331 14528943 14341878 14038569 13721108 13418191
3484A3418191n56247k95530O8823m30145l9047j13570l56831L2527k63560l61780
$$ 13418191 12861944 12566414 12635237 12205092 12166045 12052475 11695644 11728171 11464611 11102831
3474A1102831J14964j91668p4617l84845m04598P8895r4711M4996k08395o57434
$$ 11102831 11217795 11026127 10951510 10566665 10162067 10240962 10146251 10191247 9982852 9325418
3464I325418k13856J9064l32646j32148J0742p695k19171q3620l19654k51103
$$ 9325418 9111562 9130626 8797980 8665832 8676574 8668879 8449708 8366088 8046434 7795331
3454G795331L240k2881M6796l53734r6517j41549J7631k48981k85085M37673K5069
$$ 7795331 7798571 7775690 7822486 7468752 7372235 7230686 7248317 6999336 6714251 7151924 7176993
3443G176993l43470l78803J14655K071k25934J77147k79933n238j00748m54065
$$ 7176993 6833523 6454720 6569375 6571446 6345512 6522659 6242726 6237488 6136740 5682675
3433E682675k24970J31987L25434Q2058k19013p6859K34731m54209k19494l39901
$$ 5682675 5457705 5589692 5915126 5997184 5778171 5701312 5936043 5481834 5262340 4922439
3423D922439R9671L39706q4102j07722j10070K64193j56888r7530J20479j18298
$$ 4922439 5022110 5361816 5277714 5169992 5059922 5324115 5167227 5069697 5190176 5071878
3413E071878j86110R5373j00623R12j14130J42752K45120k04685k2561p6602j78959
$$ 5071878 4885768 4981141 4880518 4881430 4767300 4910052 5155172 4950487 4927926 4851324 4672365
3402D672365N4712N6432J63077K45503l21297j11885n53J56825o1169j5271L2168
$$ 4672365 4727077 4783509 4946586 5192089 4870792 4758907 4758354 4915179 4854010 4838739 4870907
3391D870907j18086K19800J20917n28993J03795m892n9776j19246j04140R734
$$ 4870907 4752821 4972621 5093538 4564545 4668340 4663448 4603672 4484426 4380286 4390020
3381D390020l706J32695p0307L11020J13600k39941N7130Q4247j25002m8854r1237
$$ 4390020 4386314 4519009 4448702 4759722 4873322 4633381 4690511 4774758 4649756 4600902 4509665
3370D509665M4716J7553N4997L0338J97068K02685j41383J88860j69758k20458
$$ 4509665 4554381 4571934 4626931 4657269 4854337 5057022 4915639 5104499 4934741 4714283
3360D714283L07065j1277k597k2599N87L18272p307j4460m52101L83837Q4893
$$ 4714283 5021348 5010071 5007474 4984875 4985462 5303734 5296427 5281967 4829866 5213703 5298596
3349E298596L96200j03081q8085K34708J3814J57332j71273K60498n2493k39207
$$ 5298596 5694796 5591715 5503630 5738338 5752152 5909484 5738211 5998709 5946216 5707009
3339E707009R5604L51763Q3213J12554J39480L6940n7772N5073K06901L63890
$$ 5707009 5802613 6154376 6237589 6350143 6489623 6526563 6468791 6523864 6730765 7094655
3329G094655L6971L23400L21261m8813k87966L19923J10240K33342N5784J02629
$$ 7094655 7131626 7455026 7776287 7727474 7439508 7759431 7869671 8103013 8158797 8261426
3319H261426K25659K67222j93604K35555K58132m0142M35167K37286n2232r4825
$$ 8261426 8487085 8754307 8560703 8796258 9054390 9014248 9449415 9686701 9634469 9539644
3309I539644J73711O2222J0216L25864K03529k13359n753j09367l1326L91572
$$ 9539644 9713355 9775577 9785793 10111657 10315186 10101827 10096074 9986707 9955381 10346953
3299A0346953J20161k53452K98260L33517m1952J49970K5825M09796p8711P1247
$$ 10346953 10467114 10213662 10511922 10845439 10803487 10953457 10979282 11389078 11310367 11381614
3289A1381614J60945l928J18115L19781K12161L19827R6936Q1743J77083K52858
$$ 11381614 11542559 11538631 11656746 11976527 12188688 12508515 12605451 12687194 12864277 13117135
3279A3117135L22791L16482K20140K10025M88925N59975k22237L92489M34134
$$ 13117135 13439926 13756408 13976548 14186573 14675498 15235473 15013236 15405725 15839859
3270A5839859P94124L07311M3746M42225L2236L87142M67221N23592N80533P10436
$$ 15839859 16633983 16941294 16985040 17427265 17459501 17846643 18313864 18837456 19417989 20128425
3260B0128425K81323N71902K97516R50326Q37289O38699P85603R45017O06479
$$ 20128425 20409748 20981650 21279166 22229492 23066781 23705480 24491083 25436100 26042579
3251B6042579R90985J426798J074275J372800J518097J688197J773565J935363
$$ 26042579 27033564 28460362 29534637 30907437 32425534 34113731 35887296 37822659
3243C7822659K126934J787806K634013K641572K971019L693997L652720L708588
$$ 37822659 39949593 41737399 44371412 47012984 49984003 53678000 57330720 61039308
3235F1039308L390841L199420K217633J053392m66265k449068l657074m888598
$$ 61039308 64430149 67629569 69847202 70900594 70434329 67985261 64328187 59439589
3227E9439589n248621n131057n052997m535049l754916l473893l064239k492560
$$ 59439589 54190968 49059911 44006914 39471865 35716949 32243056 29178817 26686257
3219B6686257j953333j851971j620530j393315q69984n58263r12992j115766o90110
$$ 26686257 24732924 22880953 21260423 19867108 18997124 18438861 17525869 16410103 15719993
3210A5719993j239962j140378l64048o33033o76438m28910m68379k98559l10291
$$ 15719993 14480031 13339653 12975605 12342572 11666134 11237224 10768845 10470286 10159995
3201A0159995p30396n55643l2956j69718k37536j18283j97634q1778l11292k62889
$$ 10159995 9429599 8873956 8841000 8671282 8433746 8315463 8117829 8036051 7724759 7461870
3191G461870l27132j66178p3049k13728J6492m79762J67492n1323j4930J43023
$$ 7461870 7134738 6968560 6895511 6681783 6698275 6218513 6386005 6334682 6319752 6462775
3181F462775n8159n07047l83889j29274k96714k65752J80671j9144j55500q8753
$$ 6462775 6404616 5897569 5513680 5384406 5087692 4821940 5002611 4983467 4827967 4739214
3171D739214m30353j04632M0922k66231j33546J15955p800J27508o4184l25768
$$ 4739214 4308861 4204229 4245151 3978920 3845374 3961329 3953529 4081037 4016853 3691085
3161C691085k76707J27394K07895k32876k39066O7394j45399K29547k37172m47211
$$ 3691085 3414378 3541772 3749667 3516791 3277725 3345119 3199720 3429267 3192095 2744884
3151B744884K0987l8781J1819l9411l902K53116l70291K38844j13492l92019J08235
$$ 2744884 2765871 2727090 2738909 2699498 2695596 2948712 2578421 2817265 2703773 2311754 2419989
3140B419989M50969m0142K8935l52440k59626k25012P000J8278n0562j46021j86043
$$ 2419989 2870958 2830816 2859751 2507311 2247685 2022673 2029673 2047951 1997389 1851368 1665325
3129A665325J00685L6888L22956P1032k99724j6482l3101J01866M8318j32209
$$ 1665325 1766010 1802898 2125854 2196886 1897162 1880680 1847579 1949445 1997763 1865554
3119A865554R8978N30848j03847m08767k59174J15748n5963o25355K32225q0295
$$ 1865554 1964532 2495380 2391533 1982766 1723592 1839340 1783377 1158022 1390247 1309952
3109A309952J46978k89485l586J4143J27296M14800J1369l29533J3041Q6780j20540
$$ 1309952 1456930 1167445 1163859 1178002 1305298 1720098 1731467 1401934 1414975 1501755 1381215
3098A381215J8107L32020j5352p1054J62766J36841k23550n03925L26198k73383
$$ 1381215 1399322 1731342 1715990 1644936 1807702 1944543 1720993 1217068 1543266 1269883
3088A269883q4333k66390k36461P825M18221L2121j3300j2878J95995k12745k19426
$$ 1269883 1185550 919160 682699 690524 1108745 1140866 1127566 1114688 1310683 1097938 878512
3077H78512R945L0358M9339k21145R8603L1667l577M0434J56493J50132K33930
$$ 878512 888457 918815 968154 747009 845612 877279 873702 914136 1070629 1220761 1454691
3066A454691j60993k9944j75273M6850j30465k07997j85328k64288L15877K30966
$$ 1454691 1293698 1263754 1088481 1135331 1004866 796869 611541 347253 663130 894096
3056H94096j69380L1318J44293J75859J64360j99301n30439J68062K83116j12855
$$ 894096 724716 756034 900327 1076186 1240546 1041245 510806 678868 961984 849129
3046H49129J93064j1552q2224K52862o5697O4227j17302J16692o2905j07912K29511
$$ 849129 1042193 1030641 948417 1201279 1135582 1199809 1082507 1199199 1136294 1028382 1257893
3035A257893L0579k04142j60466k3679P0441J20535J87346k64130j05747K00888
$$ 1257893 1288472 1084330 923864 900185 970626 1091161 1278507 1014377 908630 1109518
3025A109518k46717q6457k295L9345l1301K47508j19520j58430j5729j09497K41594
$$ 1109518 862801 776344 774049 813394 782093 1029601 910081 751651 735922 626425 868019
3014H68019R8267l00441N456K60248K87938j94642l6698M2143M553j81550j65745
$$ 868019 966286 665845 671301 931549 1219487 1024845 988147 1030290 1034843 853293 687548
3003F87548O1766o3238K18356j38536l7240p1676M05720K05314m11463k53110
$$ 687548 749314 686076 904432 765896 728656 656980 1062700 1268014 856551 603441
2993F03441L32679k20293p6491K38784K37297Q1569k15958L44123J20903j15953
$$ 603441 936120 715827 639336 878120 1115417 1196986 981028 1325151 1446054 1330101
2983A330101j7070k21932J9514J12132n5579j25588O1610J77259m3572j45566
$$ 1330101 1313031 1091099 1110613 1222745 1167166 1041578 1103188 1280447 1236875 1091309
2973A091309l245j45610J82582K44261j10640N8089j11261J26700j30461q0689
$$ 1091309 1088064 942454 1125036 1369297 1258657 1316746 1205485 1332185 1201724 1121035
2963A121035J82363R2522j18691O2631q5990k81854K5047M01032L1596j43249
$$ 1121035 1303398 1395920 1277229 1339860 1253870 972016 997063 1398095 1429691 1286442
2953A286442K51242J39181K37828K958p4124l24549L15981J00968M2689P5118
$$ 1286442 1537684 1676865 1914693 1917651 1843527 1518978 1834959 1935927 1978616 2053734
2943B053734k64458M23675q7527J03083L7149p0997M05598K18640p1115j71221
$$ 2053734 1789276 2212951 2125424 2228507 2265656 2194659 2600257 2818897 2747782 2576561
2933B576561J98177R898J03050m14602P9418M50365M61354J2617k97022K01824
$$ 2576561 2774738 2784636 2887686 2473084 2552502 3002867 3464221 3476838 3179816 3381640
2923C381640K95776J30286L81584r0876n6176j19213j39782j04686l91747M19469
$$ 3381640 3677416 3807702 4189286 4098410 4042234 3923021 3783239 3678553 3286806 3706275
2913C706275M07412K42084n8511K42500J3927O2576k48959l8343J63853n4622
$$ 3706275 4113687 4355771 4297260 4539760 4553687 4616263 4367304 4328961 4492814 4438192
2903D438192k67674R6991K09160J85935K02044L30772N46996J94881J92204N24554
$$ 4438192 4170518 4267509 4476669 4662604 4864648 5195420 5742416 5937297 6129501 6654055
2893F654055J97726j71518l65084l25090l38671n62581l80570k54864l73210N9866
$$ 6654055 6851781 6680263 6315179 5990089 5651418 5088837 4708267 4453403 4080193 4140059
2883D140059j14957n24652m35325J48106L70453k49973j10668M751n4464N7289
$$ 4140059 4025102 3500450 3065125 3213231 3583684 3333711 3223043 3227794 3173330 3230619
2873C230619M4577N76942L3751n56788m51201K40572j8904K29996J38778J59374
$$ 3230619 3275196 3852138 3885889 3329101 2877900 3118472 3099568 3329564 3468342 3627716
2863C627716l05749k16179J16962K53212P9104m11173k79932q4448q559m09101
$$ 3627716 3321967 3105788 3222750 3475962 3555066 3143893 2863961 2779513 2770954 2361853
2853B361853J42093Q4809J62643J17021m33258l84062J21615J98612j00944k03377
$$ 2361853 2503946 2588755 2751398 2868419 2435161 2051099 2172714 2371326 2270382 2067005
2843B067005j89165l99050j40681j72504j28772K9507N2073J12013J85863l45695
$$ 2067005 1877840 1478790 1338109 1165605 1036833 1066340 1118413 1230426 1416289 1070594
2833A070594j4647J77058m1697o2335n78j83889l9704r067k69742r9826J26441
$$ 1070594 1055947 1233005 1191308 1128973 1128395 944506 904802 895735 625993 526167 652608
2822F52608K24779l0411l41285q5716J90071j17144K95765K21160j06873j98612
$$ 652608 877387 846976 505691 419975 610046 492902 788667 1009827 902954 704342
2812G04342r4544P8446J50031k58069j66523K2445j25049N1582K62687J73732
$$ 704342 609798 688244 838275 580206 413683 436128 311079 362661 625348 799080
2802G99080j63041j82501k13541J02376J155J95913m8851R0461j40750n3099K6216
$$ 799080 636039 453538 239997 342373 343528 539441 490590 581051 440301 387202 413418
2791D13418N9087N0000k46711j28326J06627k243P806M5389j82479l11210J77834
$$ 413418 472505 522505 275794 147468 254095 251852 259658 305047 122568 -188642 -10808
2780a0808L34264J04152k24467Q1503M11046l47731k20089K8176j16892k3704
$$ -10808 323456 427608 203141 284644 695690 347959 127870 156046 39154 15450
2770A5450K32024o7706K06355R1653m66064J19437L84112K2064J03388R5623j98974
$$ 15450 247474 179768 386123 477776 11712 131149 515261 537325 640713 736336 537362
2759E37362j46601j1890J77668j66444J03266p9628j34694R2327J10394L48282
$$ 537362 390761 378871 556539 390095 493361 413733 279039 371366 481760 830042
2749H30042p5666m10784j02145q6873j0978J73480p2380O7757J15452l32770K6216
$$ 830042 754376 343592 241447 154574 143596 317076 244696 312453 427905 95135 121351
2738A21351J13376J68732j07460l56234r6965J0042o7010J78988O7899J36760
$$ 121351 234727 403459 295999 -60235 -157200 -147158 -214168 -35180 32719 169479
2728A69479M0258J51454K88167j53465k66193j35386J39216j81048P0912j15114
$$ 169479 209737 361191 649358 495893 229700 94314 233530 52482 123394 8280
2718H280J91961Q799Q6861q0689J5840K73757j99053k15991j8735R8458M1867
$$ 8280 200241 209040 295901 215212 231052 504809 305756 89765 71030 169488 211355
2707B11355p7931K41181l09113q917J7655k43585j8022J22904K34138k86704J91514
$$ 211355 133424 374605 65492 56575 74230 -169355 -187377 -64473 169665 -117039 74475
2696G4475j16062k54739K28569k25262K20949J34074j75720j17265L43845j59308
$$ 74475 -41587 -296326 -67757 -293019 -72070 62004 -113716 -230981 112864 -46444
2686d6444k98170J16815j3494N76414O325p9217l62075R6509J73871k9865k74881
$$ -46444 -344614 -227799 -241293 335121 341446 262229 -99846 -3337 170534 140669 -134212
2675a34212J67349K87433J85872r7357k4125j77243q2751r3088l17462O6958k11173
$$ -134212 33137 320570 506442 409085 384960 207717 124966 31878 -285584 -218626 -429799
2664d29799Q4983Q0843L39728K08967j25400k25699K99323k5467J06225j25243
$$ -429799 -344816 -263973 75755 284722 159322 -66377 232946 207479 313704 188461
2654A88461q9521J7126L16101m6104j58413k12712J3276l5927k88258J46214o1643
$$ 188461 98940 116066 432167 386063 227650 14938 28214 -7713 -295971 -149757 -211400
2643b11400L13917L25749j50357J39006m5936j54652q1497r0005N7139J77681
$$ -211400 102517 428266 277909 416915 370979 216327 134830 44825 101964 279645
2633B79645j01464L3814l1074k30266K75937j61918N5328K523K71990P1573k70807
$$ 279645 178181 211995 180921 -49345 226592 64674 120002 122525 394515 466088 195281
2622A95281K6208J51972J0912j72303k9586K3237j4403j00226q1682k88010K03817
$$ 195281 221489 373461 384373 212070 182484 205721 191318 91092 9410 -278600 -74783
2611g4783P7778K94537j88635j01087K26612r2939J31280O3253l61778R9626L11228
$$ -74783 2995 297532 108897 7810 234422 141483 272763 336016 -25762 73864 385092
2600C85092j8694j63047P5602R3369j90327M5872l8065M6905P5512j1869J08054
$$ 385092 366398 203351 278953 372322 181995 227867 189802 236707 312219 300350 408404
2589D08404l59873k24334J94434L5151j829l73752L70885J92501r652l4010m20485
$$ 408404 48531 -175803 18631 53782 51953 -321799 49086 241587 231935 197925 -222560
2578b22560P4578K60821j8837k7000K32647j28715l20232k01104j26538J73389
$$ -222560 -147982 112839 94002 67002 299649 170934 -149298 -350402 -476940 -303551
2568c03551K36362K55941Q703K29230j67078J89194j0589k38466j71062J41770
$$ -303551 -67189 188752 197455 426685 259607 448801 438212 199746 28684 170454
2558A70454N2938j89101j13478j37391j89455r7236j59812N3535L23056J50585
$$ 170454 223392 34291 -79187 -216578 -406033 -503269 -663081 -609546 -286490 -135905
2548a35905n6213j5976J06884O5403J44164n6000m77496J23280J63961K71154
$$ -135905 -192118 -208094 -101210 -35807 108357 52357 -425139 -301859 -137898 133256
2538A33256l77601J33903K95514j82741j12404L21673K40711l06991J5100k14722
$$ 133256 -244345 -110442 185072 2331 -110073 211600 452311 145320 160420 -54302
2528e4302M8694j60672l0818q6445J19710Q9410J0182p5096K0451J4369j26022
$$ -54302 -5608 -166280 -197098 -283543 -163833 -74423 -64241 -139337 -118886 -104517 -230539
2517b30539J01542j41207J07098R8952j024J17898m960k00585k1090M36875k89726
$$ -230539 -128997 -270204 -163106 -64154 -65178 52720 47760 -152825 -173915 262960 -26766
2506b6766m60256K99309m8236k7686o3762r2119L22763P6808j39271J42653k2319
$$ -26766 -487022 -187713 -235949 -263635 -327397 -419516 -96753 -19945 -159216 -16563 -38882
2495c8882j53529N5699J41660M9310J48849n5687N6764P4355m3423k2256k38542
$$ -38882 -192411 -136712 4948 54258 203107 147420 204184 278539 235116 212860 -25682
2484b5682P1043k1318M5921K8374l32291j47908K24028j35005R2914l8915K77736
$$ -25682 45361 24043 69964 98338 -233953 -381861 -157833 -292838 -199924 -238839 38897
2473C8897j22113M3076K03741k01924J6804k6237o7182N3491R4048j16864N5871
$$ 38897 -83216 -40140 163601 -38323 -21519 -47756 -114938 -61447 32601 -84263 -28392
2462b8392m6579r8489k3618j8376J74516o6786m8183j60484M5263K21711r708
$$ -28392 -74971 -173460 -197078 -215454 -40938 -107724 -155907 -316391 -271128 -49417 -59125
2451e9125K15869J192k24129n7688K70954j03729k05968J86936J22288P4955k03206
$$ -59125 156744 157936 -66193 -123881 147073 43344 -162624 24312 146600 221555 18349
2440A8349j79516K60766l3459n7082L49666k06241m3970r7667k75149K16797R8317
$$ 18349 -161167 99599 66140 9058 358724 152483 108513 10846 -264303 -47506 50811
2429E0811l6066m0980K55557j10588j79646K37916O4181j4995m310L27647k27828
$$ 50811 14745 -26235 229322 118734 -60912 177004 241185 226190 221880 549527 321699
2418C21699n5100N6736r1342J3672N9992P3865j05802k65082l2979J92292J95799
$$ 321699 266599 323335 231993 245665 305657 379522 273720 8638 -24341 167951 363750
2407C63750l29271J9784K60994K55690l70604j33069J26997M4980k59273j1957
$$ 363750 34479 54263 315257 570947 200343 67274 194271 239251 -20022 -31979
2397c1979M4475R4806J43334K12272j67585l4206j11191r6881j7200k5891J26241
$$ -31979 12496 107302 250636 462908 295323 261117 149926 53045 35845 9954 136195
2386A36195j95307J24011L67967j0571k54593k6084P4685L3562l05274J60021
$$ 136195 -59112 64899 432866 422295 167702 141618 216303 249865 -55409 104612
2376A04612J09119N39736N7347l66074j70464k7703P0620L82077J96050n6506
$$ 104612 213731 753467 810814 444740 274276 246573 317193 699270 895320 838814
2366H38814l45950k09377K39290P16700k8446J12020j2540n05693J4427m02508
$$ 838814 492864 283487 522777 1239477 1211031 1323051 1310511 804818 819245 416737
2356D16737r5611J42517J47959M1151k44869p1402L5933m736j18463J22068J97929
$$ 416737 321126 463643 611602 652753 407884 336482 372415 367679 249216 371284 569213
2345E69213l2840q1530j34116L676J58437J80045j69512o17182J50515K34376
$$ 569213 536373 454843 320727 324403 482840 662885 493373 -123809 26706 261082
2335B61082l9323j6752q1530k15211K97416m5881J73618k2703K10817j08708j89057
$$ 261082 221759 205007 123477 -91734 205682 159801 333419 310716 521533 412825 223768
2324B23768r8561J08504L20569p6979Q239J98046k54523k6978R1071q9438M9937
$$ 223768 125207 233711 554280 477301 485540 683586 429063 402085 493156 403718 453655
2313D53655K30330l88748L49240K71662j67560j82696J8553J28383j72831k09015
$$ 453655 683985 295237 644477 916139 748579 565883 584436 712819 539988 330973
2303C30973o773o5763J69597M2645j8962j15442O3858k99988j70266M12430j53653
$$ 330973 324200 258437 428034 470679 451717 336275 400133 100145 -70121 342309 188656
2292A88656N7711N6249J44977k06126J01354K32682N3988L42145l41470J60619
$$ 188656 246367 302616 447593 241467 342821 575503 629491 971636 630166 790785
2282G90785K25914o18819J69719j86321p7385J8518M24662N0742j1120K3680n28991
$$ 790785 1016699 397880 567599 381278 303893 322411 747073 797815 786695 810375 281384
2271B81384J08305N52446k0460R2788j09886k24668q0254j66612L8172K49687
$$ 281384 389689 942135 921675 1014463 904577 679909 599655 433043 471215 720902
2261G20902j1945j68922j42430J54051K80624j67063k66219j45059J69074L22975
$$ 720902 708957 540035 397605 551656 832280 665217 398998 253939 423013 745988
2251G45988k11361M8936N7418j44306j39049L22553O758K50104j56776j26967
$$ 745988 534627 583563 640981 496675 357626 680179 686937 937041 780265 653298
2241F53298k14045K71094O7751j46748l4139J58624K9164k99155N7247M54326
$$ 653298 439253 710347 778098 631350 597211 755835 784999 485844 543091 997417
2231I97417j09895L00218j24205J34812P9365l32269J00001l22164K45300L1671
$$ 997417 887522 1187740 1063535 1198347 1277712 945443 1045444 723280 968580 1000251
2221A000251p1076j34024J01222M15402k23578J76000J36888l7499k03116j91892
$$ 1000251 929175 795151 896373 1311775 1088197 1264197 1401085 1363586 1160470 968578
2211I68578k45689K59923O6816j54600J85677M19312r505Q906L16632l44240j05250
$$ 968578 722889 982812 1049628 895028 1080705 1500017 1490512 1499418 1816050 1471810 1366560
2200A366560K10813k6171k53390M98646J62623j90919l0485r0362L85893J51049
$$ 1366560 1577373 1551202 1297812 1796458 1959081 1768162 1737677 1647315 2033208 2184257
2190B184257k45801K7354K57767J72187m32548J07343K7153J27933L82608K90692
$$ 2184257 1938456 1965810 2223577 2395764 1963216 2070559 2097712 2225645 2608253 2898945
2180B898945K13908j78660P7893k3951k13659O8610K3635L439M58848j44079m53073
$$ 2898945 3112853 2934193 3012086 2988135 2774476 2843086 2866721 2870160 3329008 3184929 2731856
2169B731856P5431l4923K79525K37975k24325J70200M53128J81431J31679k76474
$$ 2731856 2807287 2772364 3051889 3289864 3065539 3235739 3688867 3870298 4001977 3725503
2159C725503J55297J16230p7165q0977K09026M3594j13733L3390j8736J25710
$$ 3725503 3880800 3997030 3919865 3838888 4047914 4091508 3977775 4011165 3992429 4118139
2149D118139L22417r4819J29358L84719K11713m9955M63836J63288r2703K29223
$$ 4118139 4440556 4345737 4475095 4859814 5071527 5021572 5485408 5648696 5555993 5785216
2139E785216K30197K15060O1003M77024M18942L42210J79339J03847N32213M47821
$$ 5785216 6015413 6230473 6291476 6768500 7187442 7529652 7708991 7812838 8345051 8792872
2129H792872P04330O21618O09246J26926P16375L26498O01196O65927O10013K52463
$$ 8792872 9497202 10118820 10728066 10854992 11571367 11897865 12499061 13164988 13775001 14027464
2119A4027464Q09184R13639Q15877Q55034J143887J253214J802406J527090K241630
$$ 14027464 14836648 15750287 16566164 17421198 18565085 19818299 21620705 23147795 25389425
2110B5389425J963817K164109J731912K689859K444710L293316M418945O092765
$$ 25389425 27353242 29517351 31249263 33939122 36383832 39677148 44096093 50188858
2102E0188858O939848R422950J2254279J6704396J8549779K4770799K2336888
$$ 50188858 57128706 66551656 78805935 95510331 114060110 138830909 161167797
2095A61167797J5984919K351840k7769628l0401889k4758690j8009669j3262090
$$ 161167797 177152716 179504556 151734928 121333039 96574349 78564680 65302590
2088F5302590r938912p715319n873496m829772l587863k567890j500251j942468
$$ 65302590 55363678 47648359 41774863 36945091 33357228 30789338 29289087 27346619
2080B7346619j242096j427028j645589k363646j962778j328794j411557r55812
$$ 27346619 26104523 24677495 23031906 20668260 18705482 17376688 15965131 15009319
2072A5009319r59312p62317o45586m45965q95607q19724p93977k60676k59905
$$ 15009319 14050007 13287690 12642104 12196139 11300532 10480808 9686831 9426155 9166250
2063I166250k40037m69349p92131r08043q0272j84061l94281k36879j74507p2225
$$ 9166250 8926213 8456864 7664733 6756690 6676418 6492357 6098076 5861197 5686690 5614465
2053E614465p9368j16476r5285Q671L7678l81438p2009p7938j41490k77238m09692
$$ 5614465 5535097 5418621 5323336 5332007 5369685 4988247 4916238 4838300 4696810 4419572 4009880
2042D009880j77316r5823j24490j49003K8669j79498J68765j52125j37437M6278
$$ 4009880 3832564 3736741 3612251 3463248 3491917 3312419 3481184 3329059 3191622 3237900
2032C237900L58633o7552j28994j77462k15144K2976k73449k501L9249l99157
$$ 3237900 3596533 3528981 3399987 3222525 3007381 3030357 2756908 2754407 2793656 2394499
2022B394499K08787k18992k7896K37411l87642k02496J83672J69343l38873j85110
$$ 2394499 2603286 2384294 2356398 2593809 2206167 2003671 2187343 2356686 2017813 1832703
2012A832703r289J25773l28218K60464M19718l92273j09105o5437l23863J06777
$$ 1832703 1823414 1949187 1620969 1881433 2301151 1908878 1799773 1734336 1410473 1517250
2002A517250r7734j04274J14884J12225j0242j83823n5349m0982j3679j55394
$$ 1517250 1419516 1315242 1430126 1542351 1532109 1348286 1292937 1251955 1238276 1082882
1992A082882J6955L89480n8400J29263l9129n3363j14996j60884L8027l7420j91406
$$ 1082882 1099837 1489317 1430917 1560180 1521051 1467688 1352692 1191808 1229835 1192415 1001009
1981A001009M6026j79064K41519l95927J47121M36095l00713J253J17243r4560
$$ 1001009 1047035 867971 1109490 713563 860684 1296779 996066 997319 1114562 1020002
1971A020002j79744k54889M3213K43500l8736p3115K1612k11472j71818r4291
$$ 1020002 840258 585369 628582 872082 833346 760231 781843 570371 398553 304262
1961C04262p0580M07286j5761J6733K85982J14657Q5399k81945K1112k69416r1314
$$ 304262 233682 640968 625207 641940 927922 1042579 1127978 846033 867145 597729 506415
1950E06415J24834q3699Q3427K259l8754K93983P7804k70922q3444K8095j28136
$$ 506415 631249 547550 630977 633236 594482 888465 966269 695347 611903 639998 511862
1939E11862J1858r0139j38731p6992L19006R0855m76116L62433j78237l79987
$$ 511862 523720 433581 294850 217858 536864 627719 151603 514036 335799 -44188
1929d4188J24098j33794L92293K8283J61619k56106j96884J50616K587l6544j7375
$$ -44188 79910 -53884 338409 366692 528311 272205 75321 225937 228524 191980 174605
1918A74605J49701m24566K42415p4179J03530K59039j39876R7046r7517J45799
$$ 174605 324306 -100260 142155 67976 171506 430545 290669 387715 290198 435997
1908D35997N790k18969Q2300M3183j40076j19284L6557J31977m4128j63485L12951
$$ 435997 441787 222818 305118 348301 208225 88941 125498 257475 213347 49862 362813
1897C62813M08418j63529m10245K31827l7945k71216J53543O0076J18130K00688
$$ 362813 771231 607702 197457 429284 391339 120123 273666 333742 451872 652560
1887F52560p1717j454K3592j35342k70255j04041L07943j99692R4375J20517k13162
$$ 652560 580843 579389 602981 467639 197384 93343 401286 201594 295969 416486 203324
1876B03324j98672J26010J24433r4021R1147n2626q1756J4094M9204p2290j01499
$$ 203324 4652 130662 255095 161074 252221 199595 117839 131933 181137 108847 7348
1865G348j37223K36402N9245P0155J61519k41013m6171K55433n9188J37635k83769
$$ 7348 -129875 106527 165772 235927 397446 156433 110262 365695 306507 444142 160373
1854A60373j92686P6074K13462K62570j26145j44536j16531k6356J12633P8563
$$ 160373 -32313 43761 257223 519793 393648 249112 132581 106225 218858 297421
1844B97421K15315l42023J66288J07032N5405K63884P7736m20798k8359k05259
$$ 297421 512736 170713 337001 444033 499438 763322 841058 420260 391901 186642
1834A86642J09433K3282j30707J09838K29889K43220J92200J95005o2233j89459
$$ 186642 296075 319357 188650 298488 528377 771597 963797 1158802 1096569 907110
1824I07110l35515n9491J46611K21732r5028k06588m58566J98617j00255J04608
$$ 907110 571595 512104 658715 880447 785419 578831 120265 318882 218627 323235
1814C23235J29783J212m17037R9507N6566J10778r9059L34043j8772j41875J72434
$$ 323235 453018 454230 37193 136700 193266 304044 204985 539028 520256 378381 550815
1803E50815k16188j28908l53462J43604l8333L5772n3287r9747Q7596N4558L8837
$$ 550815 334627 205719 -147743 -4139 -42472 -6700 -59987 -159734 -72138 -17580 21257
1792B1257J55981k38053M8339J39424l5792j25307j01012K44018L8236k20871
$$ 21257 177238 -60815 -12476 126948 91156 -34151 -135163 108855 147091 -73780
1782g3780K54791K57893k77767o4361j64178l1518J7897o2628K44370R8431K42713
$$ -73780 181011 438904 161137 96776 -67402 -98920 -81023 -143651 100719 199150 441863
1771D41863n8792j99787n4762j05325j35861R3729J37963n6764k20173j94132
$$ 441863 383071 183284 128522 23197 -112664 -18935 119028 62264 -157909 -352041
1761c52041J4203l710J81783K75446j12858n0972M6542K59506j40068j56607J98913
$$ -352041 -337838 -341548 -159765 115681 2823 -48149 -1607 257899 117831 -38776 160137
1750A60137L3002M4423k21748j0293j41664j50216K37243q4419j23945J90490
$$ 160137 193139 237562 15814 5521 -136143 -286359 -49116 -133535 -257480 -66990
1740f6990O7314l12897k1177N37073j26228m3304j04087Q770K31621k9725r4658
$$ -66990 324 -312573 -333750 203323 77095 33791 -70296 -61526 170095 140370 45712
1729D5712J81382k29923K48253K75391j16019j09222k91149j3443J76133L0809
$$ 45712 227094 -2829 245424 520815 404796 295574 4425 -9018 167115 197924
1719A97924o181k22681m370O7163N7513K46986J00101k21131l6096K34293r1757
$$ 197924 191743 -30938 -35308 31855 89368 336354 436455 215324 179228 413521 321764
1708C21764k16215k48694O6369L8153K07994J85333j09861o9149q6970k48545
$$ 321764 105549 -143145 -76776 -38623 169371 354704 244843 175694 88724 -159821
1698a59821j77365o9204L40480K22434j64145J5921O3020p9274r8999o1230j33907
$$ -159821 -337186 -406390 -65910 156524 -7621 8300 71320 -7954 -106953 -168183 -302090
1687c02090K78859K21577l24797L70621j57084k23423K1264j17941M37201J55628
$$ -302090 -23231 198346 -126451 244170 87086 -136337 -115073 -233014 204187 359815
1677C59815k46103P6179J2053m86803l59501J46833j9778J08195j17505P1028
$$ 359815 113712 189891 201944 -284859 -644360 -497527 -517305 -409110 -526615 -455587
1667d55587J19097K07761R9575K00511j88691k56905l6130K9672M36554k43473
$$ -455587 -336490 -128729 -29154 171357 -17334 -274239 -310369 -280697 155857 -87616
1657h7616r618p2270M6666k59386J19033M19678J46201k45883K7889m75186K31516
$$ -87616 -97234 -169504 -122838 -382224 -263191 156487 302688 56805 84694 -390492 -158976
1646a58976j16815n8018K28007p3842j19175K45468J93207O1708o4469m08660
$$ -158976 -275791 -333809 -105802 -179644 -298819 -53351 139856 201564 137095 -271565
1636b71565J37724P4547K35110J91470q4828p2561j21974j37307p5864j03056
$$ -271565 -133841 -59294 175816 367286 282458 209897 87923 -49384 -125248 -228304
1626b28304L9324J73283j03573o5824K29368P5056J89646O3327p2800j14495l69723
$$ -228304 -188980 -15697 -119270 -185094 44274 119330 308976 372303 299503 185008 -184715
1615a84715j57451P2704r2440j49404j3950K81426j83683L62583N060k07045K44302
$$ -184715 -342166 -269462 -361902 -511306 -525256 -243830 -427513 -64930 -59870 -266915 -22613
1604b2613L55046k32233l7524q3862p1107k57420j71898Q479K38250J68286N9827
$$ -22613 332433 100200 62676 -21186 -92293 -349713 -521611 -513132 -274882 -106596 -46769
1593d6769k02919k1451N6919K1050K20550o7786k23634L8824j93805p2931Q8337
$$ -46769 -249688 -271139 -214220 -193170 27380 -40406 -264040 -225216 -419021 -491952 -403615
1582d03615N21015K11490k85717l85876k7753R8698N20665k67431k60800l8654
$$ -403615 117400 328890 43173 -342703 -370456 -271758 248907 -18524 -279324 -317978
1572c17978l40865K41850M25737j88714k45861K62072P7244j7733k12733N5776
$$ -317978 -658843 -416993 8744 -179970 -425831 -163759 -86515 -104248 -316981 -261205
1562b61205l8782L44004k29891k46171M3930N12089J20150m74182R9224m4437
$$ -261205 -299987 44017 -185874 -432045 -388115 123974 244124 -230058 -130834 -175271
1552a75271j4669O9441k01632K52645j1462n3787n0414J0233N1227P4364k48792
$$ -175271 -189940 -120499 -322131 -69486 -80948 -134735 -185149 -174916 -123689 -49325 -298117
1541b98117j13389L32581j1051l26189L7748N5185J93467k01384J61169K6802
$$ -298117 -411506 -78925 -89976 -416165 -378417 -323232 -129765 -331149 -169980 -143178
1531a43178P6994P2078k58102q0220k77660J41441M28311M8338l60m313J15867
$$ -143178 -66184 5894 -252208 -332428 -610088 -468647 -40336 8002 7642 3329 119196
1520A19196r4658J74848o9336K8980P2911l36294J20833j32089j57078M9549K67326
$$ 119196 24538 199386 130050 159030 231941 -104353 16480 -115609 -272687 -223138 44188
1509D4188j72034k39057J78866K49457K02467q5989Q5562j22677L0737P4472j12847
$$ 44188 -127846 -366903 -188037 61420 263887 177898 263460 140783 171520 245992 133145
1498A33145k66166j58513J88000M1258j60338J23668J35526P2629j26742l1604
$$ 133145 -133021 -291534 -103534 -62276 -222614 -98946 36580 109209 -17533 -49137
1488d9137N0729j17143j62541L22847M07795l28189l62763q1535L89509k48839
$$ -49137 1592 -115551 -278092 44755 452550 124361 -238402 -319937 69572 -179267
1478a79267m6610L51181k5191n1494O956j87146J44740P9618P1653j87822j99442
$$ -179267 -225877 125304 100113 48619 55575 -131571 13169 92787 164440 -23382 -222824
1467b22824l5795k02577L69635J11526K62758o2002k5428o9866n7106j45798r222
$$ -222824 -258619 -461196 -91561 19965 282723 220721 195293 125427 68321 -77477 -86699
1456h6699K52580J88636m99710l29998O18621K05119l5728n45187J2860K16487
$$ -86699 165881 354517 -145193 -475191 143430 348549 312821 -232366 -219506 -3019
1446c019k8731N4845L19600k29944j81261m7326l6953Q8415j41032r7691J22120
$$ -3019 -31750 23095 342695 112751 -68510 -115836 -152789 -64374 -205406 -303097 -180977
1435a80977Q5443J70507M1592p3108J60118l09743j54763j55452k69774N95883
$$ -180977 -95534 74973 116565 43457 203575 -106168 -260931 -416383 -686157 -90274
1425i0274K09049k44205l09956O9085k7118K87923N5135k01248m8165M6681R8507
$$ -90274 118775 -125430 -435386 -366301 -393419 -105496 -50361 -251609 -299774 -253093 -154586
1414a54586K62043J79080j30021j78984l0165K61614L7203l53940P9104j5984
$$ -154586 107457 286537 156516 -22468 -52633 208981 246184 -107756 -28652 -44636
1404d4636j88532L45533j1622R7950n9228m9271K1751r8054K25893K66694k11850
$$ -44636 -233168 112365 100743 198693 139465 90194 111945 13891 239784 506478 294628
1393B94628n0050m43193j76869J32409L8187J4653j08683R7578M6811J74721j82220
$$ 294628 244578 -198615 -375484 -243075 -204888 -190235 -298918 -201340 -154529 20192 -162028
1382a62028L5639j42114N0303K32372J94069m5115N329k12854j7711K37772j79639
$$ -162028 -126389 -268503 -218200 14172 208241 163126 168455 -44399 -62110 175662 -3977
1371c977N51k63164J31333O66J77025J77306l16294j24248K45339J8125q4715
$$ -3977 -3426 -266590 -135257 -134591 42434 219740 -96554 -220802 24537 42662 -42053
1360d2053j40391l30649j8218K9609j28738J63652L99506Q1508l09779N2693J83746
$$ -42053 -182444 -513093 -531311 -501702 -630440 -466788 -67282 14226 -295553 -242860 -59114
1349e9114P4934J21271O0674k63400j70195L1894j10790j19188M22482J3249M4818
$$ -59114 15820 137091 197765 -65635 -235830 -203936 -314726 -433914 -11432 1817 46635
1338D6635j56491k24482L47747o3889k51859L32684N7108l54674L04902j08537
$$ 46635 -109856 -334338 13409 -50480 -302339 30345 87453 -267221 37681 -70856
1328g0856k08309K56493m0925o364J21500L85611n01017j31795j4108k28176K13118
$$ -70856 -279165 -22672 -63597 -69961 51539 437150 -63867 -195662 -209770 -437946 -224828
1317b24828k7569K94820J07984K1679o5738j68200q6829J6999J6877k89565J22409
$$ -224828 -252397 42423 150407 172086 106348 -61852 -148681 -131682 -114805 -404370 -281961
1306b81961M84670k54206m3109M82836K05224k03079j65215o4198j46613j43313
$$ -281961 202709 -51497 -94606 388230 593454 390375 225160 160962 14349 -128964
1296a28964J03797J60071J42142l35180J28528r1288j22953k42828j73700M9565
$$ -128964 -25167 134904 277046 -58134 70394 -20894 -143847 -386675 -560375 -510810
1286e10810J85438K59757J25672q8716j24826k6094j98053L70834R2208J6317
$$ -510810 -325372 -65615 60057 -28659 -153485 -179579 -377632 -6798 85410 101727
1276A01727j33189q2111j30639j71050J10132K66095k25866l0268L92436K77308
$$ 101727 -31462 -113573 -244212 -415262 -305130 -39035 -264901 -295169 97267 374575
1266C74575j98777j06152k45224k0877J79469J16382P3868p8408L2769n0058L5151
$$ 374575 175798 69646 -175578 -196455 -16986 99396 173264 94856 127625 77567 112718
1255A12718m17680L78994j22576p7693q3169M80260j9624j15951J18524j80945
$$ 112718 -304962 74032 -48544 -126237 -209406 270854 251230 135279 253803 72858
1245G2858o5138r2663P5678j1258K28978j32129R3873k74249n1440k74962K27247
$$ 72858 7720 -84943 -9265 -20523 208455 76326 170199 -104050 -155490 -430452 -203205
1234b03205K75312P5470j38009j40562M48461j81996k58907j55803Q0173J0548
$$ -203205 72107 147577 9568 -130994 317467 135471 -123436 -279239 -199066 -188518
1224a88518J9598J55295k22831J43194o3628L99136K84299l98199k5239J7571
$$ -188518 -168920 -13625 -236456 -93262 -156890 242246 526545 128346 103107 120678
1214A20678m36260p2742M26774j06349j74746o8473O785o316M6144L24139j42309
$$ 120678 -315582 -388324 38450 -67899 -242645 -311118 -304333 -310649 -264505 59634 -82675
1203h2675j78395K69773j00742j72487J50974J43189o6541j36329Q5031k51346
$$ -82675 -261070 8703 -92039 -264526 -113552 29637 -36904 -173233 -88202 -339548
1193c39548l8466K1568m5316Q2256j17519J87506L5767k8313P2222j35248k67395
$$ -339548 -378014 -356446 -401762 -319506 -437025 -249519 -213752 -242065 -169843 -305091 -572486
1182e72486K07289R9731j69992R1893J88250K36188j30386M6420J10885k43310
$$ -572486 -365197 -265466 -435458 -343565 -155315 80873 -49513 -3093 107792 -135518
1172a35518M4569K38640J01477j40131k21482j27814M48307j29205j01576n6678
$$ -135518 -90949 147691 249168 109037 -112445 -240259 208048 78843 -22733 -79411
1162g9411J5025J34919l23357o119J53320o0411q3163j57606q0672J98738K19893
$$ -79411 -64386 70533 -252824 -258943 -105623 -166034 -249197 -406803 -487475 -288737 -68844
1151f8844J68981j00999R2780K06737m35901n8817N21759l08906O3826J47001
$$ -68844 100137 -862 91918 298655 -137246 -196063 325696 16790 80616 227617
1141B27617M9621j1941k37308j58035k15850j50689M43204k44061J21685N41882
$$ 227617 277238 265297 27989 -130046 -345896 -496585 -53381 -297442 -175757 366125
1131C66125j68076Q8515K2000k59363K42872l00520k23841K88990q1666l50943
$$ 366125 198049 286564 308564 49201 292073 -8447 -232288 56702 -24964 -375907
1121c75907J06352N60575k89588r6478r6337L94421q0419j04512k09397j21201
$$ -375907 -269555 291020 1432 -95046 -191383 203038 122619 18107 -191290 -312491
1111c12491J62706K23457j03963J91904J20491n8404k19070L1921L31055l14206
$$ -312491 -149785 73672 -30291 161613 282104 223700 4630 36551 367606 53400
1101E3400r4439M14303j38925m93756K34783J28097l6766N5248O7290j70291j69200
$$ 53400 -41039 373264 234339 -259417 -24634 103463 66697 121945 189235 18944 -150256
1090a50256J18982J3265K30438K8894l08119M4043J64241k62110L8778J08871
$$ -150256 -31274 -18009 212429 241323 -66796 -22753 141488 -120622 -81844 27027
1080B7027k22428Q6970j69763J95456L328j55468J52472J18157P9J33323j70579
$$ 27027 -195401 -108431 -278194 -82738 -79410 -234878 -82406 35751 35830 169153 -1426
1069a426l42769j20134K40012J69747j40036L05980j52009k03542R2800k0167
$$ -1426 -344195 -464329 -224317 -54570 -194606 111374 -40635 -244177 -151377 -171544
1059a71544Q3726j77001J15906J87658p4158k33841j7708N5263k94270j0481L92005
$$ -171544 -87818 -264819 -148913 38745 -35413 -269254 -286962 -231699 -525969 -536450 -144445
1048a44445n7651j56581j01060K20980J13794R7217k80082K52434Q6731k79011
$$ -144445 -202096 -358677 -459737 -238757 -124963 -27746 -307828 -55394 31337 -247674
1038b47674J3762K36765J63253j69124r7513r4297l1447m5511J29466L989k03871
$$ -247674 -233912 2853 166106 -3018 -100531 -194828 -226275 -271786 -142320 -138331 -342202
1027c42202L4744K74140O2978K70609J54594j69058j33579j0670J42548R4888
$$ -342202 -307458 -33318 29660 300269 454863 285805 152226 141556 284104 378992
1017C78992J6578l17041p1102j87090j3221J63660J0111j58630J81951L89990
$$ 378992 395570 78529 7427 -179663 -192884 -29224 -19113 -177743 4208 394198
1007C94198n28036J60891J52526k14773k55538j24345P5149K9469M34835M7141
$$ 394198 -133838 27053 179579 -35194 -290732 -415077 -339928 -310459 124376 171517
997A71517j27048M5446j94415J54533l19930j22715J09174M3575J43193k1645
$$ 171517 44469 89915 -104500 50033 -269897 -392612 -283438 -239863 -96670 -118315
987a18315j16290L89410J40295j0344j40072K2206K20164k80572k13102k02552
$$ -118315 -234605 154805 295100 284756 144684 166890 387054 106482 -106620 -309172
977c09172K13633K05210l7644j56722n3961J06521L4973J53664K01783q1243k55174
$$ -309172 -95539 109671 72027 -84695 -138656 -32135 2838 156502 358285 277042 21868
966B1868J29893J76456K09246l05996j13341j2609J88971m4045l12240J52851
$$ 21868 151761 328217 537463 231467 118126 105517 294488 250443 -61797 91054
956I1054l8737P2989k78229J56165j25130J15993k4506j98431J12615N0678j32088
$$ 91054 52317 125306 -152923 3242 -121888 -5895 -30401 -228832 -116217 -65539 -197627
945a97627J65916R9554j18657K5138j83730L3183N2331M6677k13659Q8733N0616
$$ -197627 -31711 67843 -50814 -25676 -209406 -176223 -123892 -77215 -290874 -202141 -151525
934a51525L30700J75170L4161J92501l17890k07218K08767M4651k08762m8160
$$ -151525 179175 354345 388506 581007 263117 55899 264666 309317 100555 52395
924E2395p8606q5364q8066P3067J02957M3815J93008k9102j51209m19449J58085
$$ 52395 -26211 -111575 -199641 -126574 -23617 20198 213206 184104 32895 -386554 -228469
913b28469K56584j94701m5925Q702J76440L1347O1585j78419J26822J09231l4169
$$ -228469 28115 -166586 -212511 -203809 -27369 3978 65563 -112856 13966 123197 89028
902H9028J523k20937k21472P6577J41629k29948K33165M0728j23959J78092J19319
$$ 89028 90551 -130386 -351858 -275281 -133652 -363600 -130435 -89707 -213666 -35574 83745
891H3745j82766J76558k2858j02597n61812K22041o2717j6698M6778k0376J44519
$$ 83745 -99021 77537 54679 -47918 -609730 -387689 -450406 -467104 -420326 -440702 -296183
880b96183L9104J00496n1103K38507p4125m990k67888K91317k373K05176M4523
$$ -296183 -257079 -156583 -207686 30821 -43304 -48294 -316182 -24865 -27238 177938 222461
869B22461p5112j02608J11883j5981j29130r0308K02754n0491R9613K8929p2988
$$ 222461 147349 44741 156624 140643 11513 -78795 123959 73468 173081 202010 129022
858A29022o0340K15524j02623j884q0431Q3721Q2234l9154K22209p5684m30112
$$ 129022 68682 284206 181583 179699 99268 182989 265223 226069 448278 372594 -57518
847e7518l1716Q2238l31823J40191K16498m1667k26810J05632J40797j82333p5602
$$ -57518 -89234 -6996 -338819 -198628 17870 -23797 -250607 -144975 -4178 -186511 -262113
836b62113K59718J14077l73601k10919N6243J05870J04650q4958K70560L2707
$$ -262113 -2395 111682 -261919 -472838 -416595 -310725 -206075 -291033 -20473 12234
826A2234K3541K32075m14118O8771J73429j04297K2667l95376J87623M1563N0177
$$ 12234 35775 267850 -146268 -77497 95932 -8365 14302 -381074 -193451 -151888 -101711
815a01711J12710L3187J43811j5282l80806J9914p256J23743j47491J55173K00349
$$ -101711 10999 44186 187997 172715 -208091 -188177 -195433 -71690 -219181 -64008 136341
804A36341Q5523k12323J87717q5796j75278J1178J05399P1389k07777J4415j30814
$$ 136341 221864 9541 197258 111462 -63816 -52638 52761 124150 -83627 -69212 -200026
793b00026j63448J7553J95777J20208k01477L76709m5031j63795K5418J6629J30622
$$ -200026 -363474 -345921 -150144 -29936 -231413 145296 100265 -63530 -38112 -21483 109139
782A09139k75580k03318J76277O9052O3557R7994j21893N8262j69480n8644J60823
$$ 109139 -166441 -369759 -193482 -124430 -60873 37121 -84772 -26510 -195990 -254634 -93811
771i3811K22326k49926k7678J41464J45629l0839p1615m4974K67920k3506M5362
$$ -93811 128515 -121411 -149089 -7625 138004 107165 35550 -9424 258496 234990 280352
760B80352N8685l11935R3074l6673l19772J82973L12931K29060k50309r7482k95903
$$ 280352 339037 27102 120176 83503 -236269 -53296 259635 488695 238386 140904 -154999
749a54999J30660k5492J47619N6914j90597l23421j32990j06853Q4854K92660
$$ -154999 -24339 -49831 97788 154702 -35895 -359316 -492306 -599159 -514305 -221645
739b21645l7429L02568J23153r8310l6437O7121R5401j34317m10435L77947L00395
$$ -221645 -259074 43494 166647 68337 31900 99021 194422 60105 -350330 27617 328012
728C28012j72600k74264j9914K84677l27541j00637j33937N938L78223Q4184L7691
$$ 328012 155412 -118852 -138766 145911 -181630 -282267 -416204 -410266 -32043 52141 89832
717H9832J68879j90896O7887r3344j04097L79930J07459k16113p7552j30927k82371
$$ 89832 258711 67815 135702 42358 -61739 318191 425650 209537 131985 1058 -281313
706b81313k986P1782L87597j45667j63071n4588q3419J12324J43400O6826j55894
$$ -281313 -284299 -212517 175080 29413 -133658 -188246 -271665 -159341 -15941 50885 -105009
695a05009k66255M33943L8497n9372P9646j29473J47879j2584J61092o2547j31170
$$ -105009 -371264 62679 101176 41804 121450 -8023 139856 127272 288364 225817 94647
684I4647O0601J14471L1197m50180K25223L01088j74439l71734k56535j10967
$$ 94647 155248 269719 300916 -149264 75959 377047 202608 -169126 -425661 -536628
674e36628J85122K32485Q4461l4994K025m60544p4831L03038p486K86251J50828
$$ -536628 -351506 -119021 -34560 -69554 -67529 -528073 -602904 -299866 -307352 -21101 129727
663A29727m34409K57787J12238n2807m1099J12365j47129l1592j29184n0056K72836
$$ 129727 -304682 -46895 65343 12536 -28563 83802 -63327 -94919 -224103 -274159 -1323
652a323J29901n7477j37480N4435N2704q3714j42053M30369j64582j423m8636
$$ -1323 128578 71101 -66379 -11944 40760 -42954 -185007 245362 80780 79357 30721
641C0721K0905J4211J95196l8111q4590j17199l64898K48682J52162K844K81314
$$ 30721 51626 65837 261033 222922 138332 21133 -343765 -95083 57079 59923 341237
630C41237k93557l40772J84121J58004J7687J93152o5452q5228o169P3982M0848
$$ 341237 47680 -293092 -108971 49033 66720 259872 194420 109192 103023 177005 217853
619B17853q7464M4153P5638j31670m529j42317j7524j18806l9780L64180k3258
$$ 217853 130389 174542 250180 118510 113981 -28336 -45860 -164666 -204446 159734 136476
608A36476Q353j12002q8937J47208j79924j50858J15647q5844J00967J86195L13020
$$ 136476 144829 32827 -56110 91098 -88826 -239684 -124037 -209881 -108914 77281 390301
597C90301k19057j02768j8611k83548L23038R5190O4711j17895j87423l1527K65555
$$ 390301 171244 68476 49865 -233683 89355 184545 249256 131361 -56062 -87589 177966
586A77966l81469J49414K93402k24984k34091P0470n6498j12226L70437j2018
$$ 177966 -203503 -54089 239313 14329 -219762 -149292 -205790 -318016 52421 40403
$$ [...]
##END NTUPLES=NMR SPECTRUM
##END=
