##TITLE=1H_EC-3286(II-1)
 CDCl3
 8 sc, 
 17.11.2022
##JCAMPDX= 6.0         $$ Bruker NMR JCAMP-DX V2.0
##DATA TYPE= NMR SPECTRUM
##DATA CLASS= NTUPLES
##ORIGIN= UXNMR, Bruker Analytische Messtechnik GmbH
##OWNER= root
$$ XWIN-NMR		Version 3.5
$$ Thu Nov 17 16:01:37 2022 Russian Standard Time (UT+4h)  she@DPX200
##.OBSERVE FREQUENCY= 200.1313499994
##.OBSERVE NUCLEUS= ^1H
##.ACQUISITION MODE= SIMULTANEOUS
##.ACQUISITION SCHEME= undefined
##.AVERAGES= 8
##.DIGITISER RES= 18
##SPECTROMETER/DATA SYSTEM= spect
##.PULSE SEQUENCE= zg30
##.SOLVENT NAME= CDCl3
##.SHIFT REFERENCE= (INTERNAL, CDCl3, 0, 15.7656)
##AUDIT TRAIL= $$ (NUMBER, WHEN, WHO, WHERE, WHAT)
$$ ##TITLE= Audit trail, XWIN-NMR		Version 3.5
$$ ##JCAMPDX= 5.01
$$ ##ORIGIN= Bruker BioSpin GmbH
$$ ##OWNER= she
$$ F:/spectra/data/she/nmr/H-F/1/pdata/1/auditp.txt
$$ ##AUDIT TRAIL=  $$ (NUMBER, WHEN, WHO, WHERE, WHAT)
(   1,<2022-11-17 15:59:47.85 +0400>,<she>,<DPX200>,
      <created by zg, POWCHK disabled, PULCHK disabled
       configuration hash MD5:
       00 E9 B6 7A A2 85 ED C7 34 08 36 98 17 FE 4E 26
       data hash MD5: 16K
       8E B2 EF 2F F3 20 45 80 90 BA 88 91 0B 02 0A 9E>)
(   2,<2022-11-17 15:59:49.90 +0400>,<she>,<DPX200>,
      <Start of raw data processing
       efp BC_mod = 2 LB = 0.24 FT_mod = 6 PKNL = 1 PHC0 = -18032.4 PHC1 = 14.4007 SI = 16K 
       data hash MD5: 16K
       A8 01 0F 91 45 71 EC CF E5 9F 6E 55 39 FD E8 2C>)
(   3,<2022-11-17 16:00:05.90 +0400>,<she>,<DPX200>,
      <pk PHC0 = -1.217234 PHC1 = 1.6 
       data hash MD5: 16K
       20 3E 47 83 C1 F4 67 AD 88 06 3A C2 97 94 AD F8>)
(   4,<2022-11-17 16:00:08.89 +0400>,<she>,<DPX200>,
      <abs ABSG = 5 
       data hash MD5: 16K
       A8 0E 49 82 FC 98 D8 19 33 40 76 AC CF C0 13 24>)
$$ ##END=
$$ 
$$ hash MD5
$$ FA 12 69 3E DA B1 D4 22 CB 22 6A 96 A0 87 DF 53
##$RELAX= 
##$RELAX= 
##$RELAX= 
##$RELAX= 
##$RELAX= 
##$RELAX= 
$$ Bruker specific parameters
$$ --------------------------
##$DU= <F:/spectra>
##$EXPNO= 1
##$NAME= <H-F>
##$PROCNO= 1
##$TYPE= <nmr>
##$USER= <she>
##$AMP= (0..31)
100 100 100 100 100 100 100 100 100 100 100 100 100 100 100 100 100 100 
100 100 100 100 100 100 100 100 100 100 100 100 100 100 
##$AQSEQ= 0
##$AQ_mod= 1
##$AUNM= <au_zg>
##$AUTOPOS= <>
##$BF1= 200.13
##$BF2= 200.13
##$BF3= 200.13
##$BF4= 200.13
##$BF5= 200.13
##$BF6= 200.13
##$BF7= 200.13
##$BF8= 200.13
##$BYTORDA= 1
##$CFDGTYP= 0
##$CFRGTYP= 5
##$CHEMSTR= <none>
##$CNST= (0..31)
1 1 145 1 1 1 1 1 1 1 1 1 1 1 1 1 1 1 1 1 1 1 1 1 1 1 1 1 1 1 1 1 
##$CPDPRG= <>
##$CPDPRG1= <>
##$CPDPRG2= <>
##$CPDPRG3= <>
##$CPDPRG4= <mlev>
##$CPDPRG5= <mlev>
##$CPDPRG6= <mlev>
##$CPDPRG7= <mlev>
##$CPDPRG8= <mlev>
##$CPDPRGB= <>
##$CPDPRGT= <>
##$D= (0..31)
0 1.2 0 0 0 0 0 0 0 0.06 0 0.03 0 0 0 0 0.0002 0 0 0 0 0 0 0 0 0 0 0 0 
0 0 0 
##$DATE= 1668686387
##$DBL= (0..7)
120 120 120 120 120 120 120 120 
##$DBP= (0..7)
150 150 150 150 150 150 150 150 
##$DBP07= 0
##$DBPNAM0= <>
##$DBPNAM1= <>
##$DBPNAM2= <>
##$DBPNAM3= <>
##$DBPNAM4= <>
$$ [...]
##$SUBNAM3= <"">
##$SUBNAM4= <"">
##$SUBNAM5= <"">
##$SUBNAM6= <"">
##$SUBNAM7= <"">
##$SUBNAM8= <"">
##$SUBNAM9= <"">
##$SW= 18.0517283424941
##$SWIBOX= (0..15)
0 0 2 0 0 0 0 0 0 0 0 0 0 0 0 0 
##$SW_h= 3612.71676300578
##$TD= 16384
##$TD0= 1
##$TE= 0
##$TE2= 300
##$TE3= 300
##$TEG= 300
##$TL= (0..7)
0 120 120 120 120 120 120 120 
##$TP= (0..7)
150 150 150 150 150 150 150 150 
##$TP07= 0
##$TPNAME0= <>
##$TPNAME1= <>
##$TPNAME2= <>
##$TPNAME3= <>
##$TPNAME4= <>
##$TPNAME5= <>
##$TPNAME6= <>
##$TPNAME7= <>
##$TPOAL= (0..7)
0.5 0.5 0.5 0.5 0.5 0.5 0.5 0.5 
##$TPOFFS= (0..7)
0 0 0 0 0 0 0 0 
##$TUNHIN= 0
##$TUNHOUT= 0
##$TUNXOUT= 0
##$USERA1= <user>
##$USERA2= <user>
##$USERA3= <user>
##$USERA4= <user>
##$USERA5= <user>
##$V9= 5
##$VALIST= <valist>
##$VCLIST= <CCCCCCCCCCCCCCC>
##$VD= 0
##$VDLIST= <DDDDDDDDDDDDDDD>
##$VPLIST= <PPPPPPPPPPPPPPP>
##$VTLIST= <TTTTTTTTTTTTTTT>
##$WBST= 1024
##$WBSW= 4
##$XGAIN= (0..3)
0 0 0 0 
##$XL= 0
##$YL= 0
##$YMAX_a= 620891
##$YMIN_a= -878023
##$ZGOPTNS= <>
##$ZL1= 120
##$ZL2= 120
##$ZL3= 120
##$ZL4= 120
##$ABSF1= 15.74469
##$ABSF2= -2.307159
##$ABSG= 5
##$ABSL= 3
##$ALPHA= 0
##$AQORDER= 0
##$ASSFAC= 0
##$ASSFACI= 0
##$ASSFACX= 0
##$ASSWID= 0
##$AUNMP= <proc_1d>
##$AZFE= 0.1
##$AZFW= 0.1
##$BCFW= 0
##$BC_mod= 2
##$BYTORDP= 0
##$COROFFS= 0
##$CY= -3
##$DATMOD= 1
##$DC= 0
##$DFILT= <>
##$DTYPP= 0
##$F1P= 0
##$F2P= 0
##$FCOR= 1
##$FTSIZE= 16384
##$FT_mod= 6
##$GAMMA= 0
##$GB= 0
##$INTBC= 1
##$INTSCL= 3.70164e-10
##$ISEN= 128
##$LB= 0.24
##$LEV0= 0
##$LPBIN= 0
##$MAXI= 10000
##$MC2= 0
##$MEAN= 0
##$ME_mod= 0
##$MI= 1.114404
##$NCOEF= 0
##$NC_proc= -6
##$NLEV= 6
##$NOISF1= 3.799351
##$NOISF2= 2.8
##$NSP= 0
##$NTH_PI= 0
##$NZP= 0
##$OFFSET= 15.76562
##$PC= 1
##$PHC0= -18033.62
##$PHC1= 16.0007
##$PH_mod= 1
##$PKNL= yes
##$PPARMOD= 0
##$PSCAL= 0
##$PSIGN= 0
##$REVERSE= no
##$SF= 200.130001184888
##$SI= 16384
##$SIGF1= 3
##$SIGF2= 2
##$SINO= 5.538805
##$SIOLD= 16384
##$SREGLST= <1H.CDCl3>
##$SSB= 0
##$STSI= 16384
##$STSR= 0
##$SW_p= 3612.71676300578
##$SYMM= 0
##$S_DEV= 0
##$TDeff= 16384
##$TDoff= 0
##$TI= <>
##$TILT= no
##$TM1= 0
##$TM2= 0
##$TOPLEV= 0
##$USERP1= <user>
##$USERP2= <user>
##$USERP3= <user>
##$USERP4= <user>
##$USERP5= <user>
##$WDW= 1
##$XDIM= 16384
##$YMAX_p= 486421502
##$YMIN_p= -497689
$$ End of Bruker specific parameters
$$ ---------------------------------
##NTUPLES= NMR SPECTRUM
##VAR_NAME=  FREQUENCY,     SPECTRUM/REAL,   SPECTRUM/IMAG
##SYMBOL=    X,             R,               I
##VAR_TYPE=  INDEPENDENT,   DEPENDENT,       DEPENDENT
##VAR_FORM=  AFFN,          ASDF,            ASDF
##VAR_DIM=   16384,         16384,           16384
##UNITS=     HZ,            ARBITRARY UNITS, ARBITRARY UNITS
##FACTOR=    0.220516191357247, 1,           1
##FIRST=     3155.17359563629, 0,            0
##LAST=      -457.543167369491, 0,           0
##MIN=       -457.543167369491, -497689,     0
##MAX=       3155.17359563629, 486421502,    0
$$ Real data points
##PAGE= N=1
##DATA TABLE= (X++(R..R)), XYDATA
$$ [...]
6922C818187r2223K6733p7484N125n6256M382j7969n3418K79758N7166k5799j57474
$$ 3818187 3725964 3752697 3675213 3680338 3624082 3628464 3610495 3557077 3836835 3894001 3868202 3710728
6910C710728N632J19124k00922k7195O0514j3514O2904K53180k29298q7941R0331
$$ 3710728 3716360 3835484 3634562 3607367 3667881 3654367 3717271 3970451 3741153 3653212 3743543
6899C743543K3000k3354J74590j4912J39998P3570n6228q1073j69430K60163J87595
$$ 3743543 3766543 3743189 3917779 3902867 4042865 4116435 4060207 3979134 3809704 4069867 4257462
6888D257462j13313r4147L3283K59673J98897o6187j71345k6520K10569J81943
$$ 4257462 4144149 4050002 4083285 4342958 4541855 4475668 4304323 4277803 4488372 4670315
6878D670315Q7176K03305J32692J41436J39050l0625J19606J14897L38248K40296
$$ 4670315 4757491 4960796 5093488 5234924 5373974 5343349 5462955 5577852 5916100 6156396
6868F156396M7925J00527L6586J08532K62038L10208L68683K27821K99482K13869
$$ 6156396 6204321 6304848 6341434 6449966 6712004 7022212 7390895 7618716 7918198 8132067
6858H132067K14557J89596K82637M97429P01243M90732N25851N07678N41770M97617
$$ 8132067 8346624 8536220 8818857 9316286 10017529 10508261 11034112 11541790 12083560 12581177
6848A2581177P50677Q75159O96495Q60432Q50932J059650J086877J056024J070778
$$ 12581177 13331854 14207013 14903508 15763940 16614872 17674522 18761399 19817423 20888201
6839B0888201J074042J342489J132515J066408R85596R86283O29595N18200L25195
$$ 20888201 21962243 23304732 24437247 25503655 26489251 27475534 28105129 28623329 28948524
6830B8948524K4943k83708l71790o43834r17170r19736r62478j146018j244332
$$ 28948524 28973467 28689759 28317969 27674135 26756965 25837229 24874751 23728733 22484401
6821B2484401j177739j067253j221323j146318j015503j138970j058991p19827
$$ 22484401 21306662 20239409 19018086 17871768 16856265 15717295 14658304 13938477
6813A3938477n82064q36619p87150p47745o81869o27460k97068m07918n67410
$$ 13938477 13356413 12519794 11732644 10984899 10303030 9675570 9378502 8970584 8403174
6804H403174m64470l96355l62583k98722l26333m12172p7690j76564m09407j69149
$$ 8403174 7938704 7542349 7179766 6881044 6554711 6142539 6064849 5888285 5478878 5309729
6794E309729l16708k25633j44057j5777l2440j15040l89782m9640q2919n6996
$$ 5309729 4993021 4767388 4623331 4607554 4575114 4460074 4070292 4020652 3937733 3880737
6784C880737j77887j06725r9700l0095j72665j41745q9315p3909j52307k6749
$$ 3880737 3702850 3596125 3496425 3466330 3293665 3151920 3062605 2988696 2836389 2809640
6774B809640K149j80435J11789l9537j06988p424r1509j02477k1735j64169l7301
$$ 2809640 2811789 2631354 2743143 2703606 2596618 2589194 2497685 2395208 2373473 2209304 2172003
6763B172003j53212l3106J61049j97643k07042L3835L7037o4587m6019l3435r5011
$$ 2172003 2018791 1985685 2146734 1949091 1742049 1775884 1812921 1748334 1702315 1668880 1573869
6752A573869L2361n9835P489k2779j3673n1742k5828J0979n7499K8841j14443
$$ 1573869 1606230 1546395 1553884 1531105 1517432 1465690 1439862 1450841 1393342 1422183 1307740
6741A307740P7300m6756j0080k6632p3995N4559j06123k4209o8147j2029O4669
$$ 1307740 1385040 1338284 1328204 1301572 1227577 1282136 1176013 1151804 1083657 1071628 1136297
6730A136297o154r8461O4808o0396k13572R8268J0093j97647J59454J16384r152
$$ 1136297 1130143 1031682 1096490 1036094 822522 920790 930883 733236 892690 1009074 999922
6719I99922L3070q3442m1195j13097m1540Q6200m4010j59197J36382R434j07228
$$ 999922 1032992 949550 908355 795258 753718 839918 795908 636711 773093 782527 675299
6708F75299j51602J1177J93937j40957R3499O3472j35013j00690O0182N4526J3328
$$ 675299 523697 534874 728811 587854 681353 744825 609812 509122 569304 623830 637158
6697F37158l3476P5844N0338j40969k0635q5731l8108M0411l1224k6435L4485
$$ 637158 603682 679526 729864 588895 568260 482529 444421 484832 453608 427173 461658
6686D61658j53116l2377N1025L2062k61965k3099K44454J09253Q28R8330n0715
$$ 461658 308542 276165 327190 359252 97287 74188 318642 427895 428723 527053 476338
6675D76338m6144n3711L437k663L9225l7690j26010p6359j1078R9534R8409J5686
$$ 476338 430194 376483 379920 377257 416482 378792 252782 176423 165345 264879 363288 378974
6663C78974j18091K5534p8161R2457j34013L0427K01347j10164r6691n1352L378
$$ 378974 260883 286417 208256 300713 166700 197127 398474 288310 191619 140267 143645
6652A43645K72150o4109J21881j57503n6376o4186l2992K5385m870L6084L3193
$$ 143645 415795 351686 473567 316064 259688 195502 162510 187895 183025 219109 252302
6641B52302j31404O9876q7653R3420K0606p9053K3811j16069N8718N9566M2453
$$ 252302 120898 190774 103121 196541 217147 138094 161905 45836 104554 164120 206573
6630B06573l8670K4580o3594m3228l8717Q7329o623L2542q024l5423j9103K604
$$ 206573 167903 192483 128889 85661 46944 134273 127650 160192 152168 116745 97642 100246
6618A00246k6529m8904J75742o0119j93540O1107j212O2024J10359k48118J93375
$$ 100246 73717 24813 200555 140436 -53104 8003 6791 68815 179174 -68944 124431
6607A24431J66309j33314l7917k27994o0393J56697J2262J61039J14970j78777
$$ 124431 290740 157426 119509 -108485 -168878 -12181 81 161120 276090 97313
6597I7313j46579m2384J18528m5393m9225K5851L0530j09439J10494J87175N157
$$ 97313 -49266 -91650 26878 -18515 -67740 -41889 -11359 -120798 -10304 176871 182028
6586A82028q1214j26800q6574R6888O534N8071m6444L8209q2795r1976r155J01934
$$ 182028 100814 -25986 -112560 -15672 -9138 48933 2489 40698 -42097 -134073 -143228 -41294
6574d1294l7845p8339q5868K36537J36115j42157Q51O4601r072K8819l9817r2280
$$ -41294 -79139 -157478 -243346 -6809 129306 -12851 -12000 52601 43529 72348 32531 -59749
6562e9749Q5817j8237l9253P7696j89409Q483J0210L8858M2824o6431K01699R370
$$ -59749 26068 7831 -31422 46274 -143135 -134652 -124442 -85584 -42760 -109191 92508 101878
6550A01878o4110j50457r5982L5256J08408P3668l4251J07162M7339j08757r2234
$$ 101878 37768 -112689 -208671 -173415 -65007 8661 -25590 81572 128911 20154 -72080
6539g2080k7854N3198P9340n2361J24450k01406p6330R8325J04425m8341k24380
$$ -72080 -99934 -46736 32604 -19757 104693 -96713 -173043 -74718 29707 -18634 -243014
6528b43014J90975k141j723p517j0073q2703m7945m6519K8190J46294P5435p1316
$$ -243014 -52039 -54180 -55903 -63420 -73493 -156196 -204141 -250660 -222470 -76176 -741 -72057
6516g2057r633J79138J38126q4669j75839j84008K2963p5563P5887Q7769J01863
$$ -72057 -81690 97448 235574 150905 -24934 -208942 -185979 -261542 -185655 -97886 3977
6505C977r0077J65229J05501j18024l1079n031O5280r3971n6716Q7433R4470R4427
$$ 3977 -86100 79129 184630 66606 35527 30496 95776 1805 -54911 32522 126992 221419
6493B21419k33222J6175J17396N1662k8714r4824L6116K3232k7038j35630o3590
$$ 221419 -11803 4372 121768 173430 144716 49892 86008 109240 82202 -53428 -117018
6482a17018n8072J19802q9643K85743l2447j27730J45009P2721r4604j39163L9767
$$ -117018 -175090 -55288 -144931 140812 108365 -19365 125644 198365 103761 -35402 4365
6471D365Q5574J0987O6029j8196k2521N1065J8939n3837l9283j24611J5614o8019
$$ 4365 89939 100926 166955 148759 126238 177303 196242 142405 103122 -21489 -5875 -73894
6459g3894o9756L10697l1070n5201n6323o4608P2355q4028l6599J41306j2253
$$ -73894 -143650 167047 135977 80776 24453 -40155 32200 -51828 -88427 52879 40626
6448D0626n8082j9565o2729L7665J22378p2246j29941N0255M8965N1029J8301
$$ 40626 -17456 -37021 -99750 -62085 60293 -11953 -141894 -91639 -42674 8355 26656
6437B6656j55185j34339J18946O1078J4019j1042O1693p722j66637J00658J10691
$$ 26656 -128529 -262868 -143922 -82844 -68825 -79867 -18174 -25896 -192533 -91875 18816
6426A8816l9180j33869P7525k42317J33987N0636l298N106O163k9342M1220R3821
$$ 18816 -20364 -154233 -76708 -319025 -185038 -134402 -137700 -132594 -126431 -155773 -114553 -20732
6414b0732Q0221Q6692k05319k8924k3589p3995J00295J74763o9557l9461O2450
$$ -20732 59489 146181 -59138 -88062 -111651 -185646 -85351 89412 19855 -19606 42844
6403D2844M945j12245K2836R0321n8664Q0274O2811j34749p3423k4446k76M4827
$$ 42844 47789 -64456 -41620 48701 -9963 70311 133122 -1627 -75050 -99496 -99772 -54945
6391e4945m6521o3958N3558J40633K3825j30249K1244m2936l1386n0767K15484
$$ -54945 -101466 -165424 -111866 28767 52592 -77657 -56413 -99349 -130735 -181502 33982
6380C3982k0791j4457K9615q9127J6389o2177J24955l4138j52114o221N2488O7982
$$ 33982 13191 -1266 28349 -60778 -44389 -106566 18389 -15749 -167863 -174084 -121596 -53614
6368e3614j00361J45375J62781k7392J35567K7670j84874j34968j6358r563L9492
$$ -53614 -153975 -8600 154181 126789 262356 290026 105152 -29816 -46174 -55737 -16245
6357a6245J35534n3084j27803R2575N5557j20391r9173J58595n4117l9438R4244
$$ -16245 119289 66205 -61598 30977 86534 -33857 -133030 25565 -28552 -67990 26254
6346B6254J46151l8501M6055N5979L3276Q2633k7829J68310L8326P497j42598
$$ 26254 172405 133904 179959 235938 269214 351847 324018 492328 530654 538151 395553
6335C95553J27387J09126l8791Q2132K4996L6380j21626j43436L2800j77090n9228
$$ 395553 522940 632066 593275 675407 700403 736783 615157 471721 504521 327431 268203
6324B68203q1255o3539m7544J01296j67649J38195J01557j87j40670l5221R1860
$$ 268203 186948 123409 75865 177161 9512 147707 249264 249077 108407 73186 165046
6313A65046j60768o2818N4321M5364K9713M9756j85107Q1797R3324j05951J54442
$$ 165046 4278 -58540 -4219 41145 70858 120614 -64493 17304 110628 4677 159119
6302A59119n2516n4860K7982O6463K8401j36509j6441M7208L1215k24176J25392
$$ 159119 106603 51743 79725 146188 174589 38080 21639 68847 100062 -124114 1278
6291A278q4141P4819J45362j1156j35811P0443L1990k7189n7889q5397M5779n2605
$$ 1278 -82863 -8044 137318 126162 -9649 60794 92784 65595 7706 -77691 -31912 -84517
6279h4517P7000J54272j03850n8900j3710J17857L482R8045o7680M5598o774k54761
$$ -84517 -7517 146755 42905 -15995 -29705 88152 91634 189679 121999 167597 160823 -93938
6267i3938j01679R8056j100Q6164k8808j78856K00840P1053j83860o09J70404
$$ -93938 -195617 -97561 -98661 -12497 -41305 -220161 -19321 51732 -132128 -132737 37667
6256C7667n4275j49548J07785J33757N6191j99839j05298J17314P823j70835O566
$$ 37667 -16608 -166156 -58371 75386 131577 -68262 -173560 -56246 -48423 -219258 -212692
6245b12692J24005m554J4937j0519J22385J76L5087K6348o2112q8053m9281O3752
$$ -212692 -88687 -93241 -78304 -88823 33562 33738 68825 95173 33061 -54992 -104273 -40521
6233d0521K15605k26243j84387K7535K6637Q6020K2854P4473j3954j9249J0639
$$ -40521 175084 -51159 -235546 -208011 -181374 -95354 -72500 1973 -11981 -31230 -20591
6222b0591J11910n9469j00075J40903p0352j33394R1613Q1320j35237m0078J3300
$$ -20591 91319 31850 -68225 72678 2326 -131068 -39455 41865 -93372 -133450 -120150
6211a20150L2117r4625P7277L0068j8204o7367N415p2795J66088L2303r7489K2645
$$ -120150 -88033 -182658 -105381 -75313 -93517 -160884 -155469 -228264 -62176 -29873 -127362 -104717
6199a04717Q6663N7120J04187k21224L1212P9809K0864M8212j47435J19049l900
$$ -104717 -18054 39066 143253 -77971 -46759 33050 53914 102126 -45309 73740 69840
6188F9840j99961l4486O7203n7142k3540j607M564P934J21866M5638r8585L1311
$$ 69840 -130121 -164607 -97404 -154546 -178086 -179693 -175129 -167195 -45329 309 -98276 -66965
6176f6965J25344j12141n5835J8616P1733j10267j29572l7773J03655R9620J4195
$$ -66965 58379 -53762 -109597 -90981 -19248 -129515 -259087 -296860 -193205 -93585 -79390
6165g9390j77728R7423J27978J2902r6217j10914J48397Q3961j31304k2889j08616
$$ -79390 -257118 -159695 -31717 -18815 -115032 -225946 -77549 6412 -124892 -147781 -256397
6154b56397q7811N64J09637J52348o3653L6251J51050j10748R8420j72858j44796
$$ -256397 -344208 -343644 -234007 -81659 -145312 -109061 41989 -68759 29661 -143197 -287993
6143b87993K575K12757R2824p8222j85112J1557K14402J68772n0417j57822J15054
$$ -287993 -285418 -72661 20163 -58059 -243171 -231614 -17212 151560 101143 -56679 58375
6132E8375J2877m000j21623K33146q8821k11235Q0617q2652o9904J30073j13128
$$ 58375 71252 67252 -54371 178775 89954 -121281 -40664 -123316 -193220 -63147 -176275
6121a76275p2559L6148J12809q3794K02501P5824k65209O2867J59477j68810n8485
$$ -176275 -248834 -212686 -99877 -183671 18830 94654 -170555 -107688 51789 -117021 -175506
6110a75506J41020q3805M6095J248j37813m2259J18299q099J56364P0419R3918
$$ -175506 -34486 -118291 -72196 -70948 -208761 -251020 -132721 -140820 15544 85963 179881
6099A79881n9241j13302p0724M4533O4799K894k7775j71717J27278j2504n8668
$$ 179881 120640 7338 -63386 -18853 45946 48840 21065 -150652 -23374 -35878 -94546
6088i4546P823L283P3870P9989P8458l5789j28635m934L4387K03769j14506j11473
$$ -94546 -86723 -83440 -9570 70419 148877 113088 -15547 -20481 13906 217675 103169 -8304
6076h304J42630N3478k51775r530n8457O6858J02643L8590k4656R9529J45258
$$ -8304 134326 187804 -63971 -73501 -131958 -65100 37543 76133 51477 151006 296264
6065B96264j78088r8043r0311P8042N2261l5039l6133J20941L1630j06516N3824
$$ 296264 118176 20133 -70178 7864 60125 25086 -11047 109894 141524 35008 88832
6054H8832M8305j32952j06502k4066J58209L7166r8609o0305J53805m6325j50450
$$ 88832 137137 4185 -102317 -126383 31826 68992 -29617 -89922 63883 17558 -132892
6043a32892M4930K7554P7668N0212o7913Q4472n6251j38776o697j0210K1837J27170
$$ -132892 -87962 -60408 17260 67472 -441 84031 27780 -110996 -117693 -127903 -106066 21104
6031B1104k5226J01514j19643M613J35725r9615K4424L8580k22295o889J63811
$$ 21104 -4122 97392 -22251 -17638 118087 18472 42896 81476 -140819 -147708 16103
6020A6103o0968Q3147M7384J02351r4427j7715j10423m2577J64003J32902j58016
$$ 16103 -44865 38282 85666 188017 93590 75875 -34548 -77125 86878 219780 61764
6009F1764q4034j00703J03854N3401J0459k9072J16776n6494q1916L5299r2089
$$ 61764 -22270 -122973 -19119 34282 44741 15669 132445 75951 -5965 29334 -62755
5998f2755q2513L3249J1988l7141J33489Q4401J8092m6828p2280q1895j58427
$$ -62755 -145268 -112019 -100031 -137172 -3683 80718 98810 51982 -20298 -102193 -260620
5987b60620J39821J47416j3237J72723j52765k1837J7917Q4618n3214j73326J48667
$$ -260620 -120799 26617 13380 186103 33338 11501 29418 114036 60822 -112504 36163
5976C6163O5699k3714J07752k17401J7325K8747Q3700O2876J6803q4096J0549
$$ 36163 101862 78148 185900 -31501 -14176 14571 98271 161147 177950 93854 104403
5965A04403L935m6225q0616O9231J09095j10149J59001R5617j90034K7818J4549
$$ 104403 108338 62113 -18503 50728 159823 49674 208675 304292 114258 142076 156625
5954A56625o2453J04183k0972L5413n0804L6368j8233j90502J8095O7736n2997
$$ 156625 94172 198355 177383 212796 161992 198360 180127 -10375 7720 75456 22459
5943B2459O7995P7829m9547o1168Q2640q3969L5728N6175j56459J8297n4239K3648
$$ 22459 90454 168283 118736 57568 140208 56239 91967 148142 -8317 9980 -44259 -20611
5931b0611K60819k6690j15252J59484m0132m4000K3364j38524m6953J31133L359
$$ -20611 240208 213518 98266 257750 217618 173618 196982 58458 11505 142638 145997
5920A45997O3251n2560l5520O8669J5952l598r8224j25019l7316O6021M4947M6923
$$ 145997 209248 156688 121168 189837 205789 202191 103967 -21052 -58368 7653 52600 99523
5908I9523J35051j46890N4725Q4771q3492j33615J31606J74850K10489j66577
$$ 99523 234574 87684 142409 227180 143688 10073 141679 316529 527018 360441
5898C60441k43015P1760J97686J7070p5036P3678q9457j12366j39355P4822o5505
$$ 360441 117426 189186 386872 403942 328906 402584 313127 200761 61406 136228 70723
5887G0723j19853J09336q3127O5729K8035M9977M9527k376J44840R1684j4770
$$ 70723 -49130 60206 -22921 42808 70843 120820 170347 167971 312811 404495 389725
5876C89725k43466Q5680k4554Q0621k9422J05658o0031O1865N0071J3799j9753
$$ 389725 146259 231939 207385 288006 258584 364242 304211 366076 416147 429946 410193
5865D10193m1456r4987L4991K526J77303K5497j33256n7760J91010j1550j43459
$$ 410193 368737 273750 308741 311267 488570 514067 380811 323051 514061 502511 359052
5854C59052L844R3932Q9076j12826r6468O5314M909k17779L9379J48619m3727
$$ 359052 362896 456828 545904 433078 336610 401924 406833 189054 228433 377052 333325
5843C33325J22467j73166m0937P5611M0518j1445l6535J38222p2199J18044K25112
$$ 333325 455792 282626 241689 317300 357818 346373 309838 448060 375861 493905 719017
5832G19017j01078j4603r6548m4435R0841N6295J95854m0907o3456j69806J28492
$$ 719017 617939 603336 506788 462353 553194 609489 805343 764436 700980 531174 659666
5821F59666Q3275k3802q78J4100q982n4783J4944J30736p8795J07575q1576j20225
$$ 659666 742941 719139 718261 732361 723379 668596 683540 814276 735481 843056 761480 641255
5809F41255P2690K4359P683N7106l8509n2895n883J62729O9359L2567P6405N0942
$$ 641255 713945 738304 745987 803093 764584 711689 705806 868535 937894 970461 1046866 1097808
5797A097808J16565R0429J53043J69884K9164l0455K98173L85146K55508J88056
$$ 1097808 1214373 1304802 1457845 1627729 1656893 1626438 1924611 2309757 2565265 2753321
5787B753321M02392O71392Q22518Q97340O48296N4251o11373q37756r53835o31096
$$ 2753321 3155713 3827105 4649623 5546963 6195259 6249510 5638137 4800381 3846546 3215450
5777C215450o83054k07421m17095l10761k00660n9960r0018r3572J21944o1913
$$ 3215450 2532396 2324975 1907880 1597119 1396459 1336499 1246481 1152909 1274853 1212940
5767A212940R6728m4478j4359o7085O1808k33856o2781J27373r549P42J54562
$$ 1212940 1309668 1265190 1250831 1183746 1245554 1011698 948917 1076290 1066741 1067483 1222045
5756A222045P4312N4889J29988J23285o2024p1765k9932j56375k55765l6031l9447
$$ 1222045 1296357 1351246 1481234 1604519 1542495 1470730 1440798 1284423 1028658 992627 953180
5745I53180q4593p3041j01439L811J0788j19818q3795J67664p4915j87772k3127
$$ 953180 868587 795546 694107 697918 708706 588888 505093 672757 597842 410070 386943
5734C86943Q3494J51O5901M5042l1355k9915k30396P7050Q7592j28727J20543
$$ 386943 470437 470588 536489 581531 550176 520261 289865 366915 454507 325780 446323
5723D46323J50571j16411r0399K4037j31227j12734r4904O4799J51045J01796
$$ 446323 596894 480483 390084 414121 282894 170160 75256 140055 291100 392896
5713C92896j40937n9078J95597j28416m0485O1956R8690r7620q0239o7295J41677
$$ 392896 251959 192881 388478 260062 219577 281533 380223 282603 202364 135069 276746
5702B76746J34525j08385j08913q5533J25645q3070J24362N2755m5121J37744
$$ 276746 411271 302886 193973 108440 234085 151015 275377 328132 283011 420755
5692D20755n6507l5508P1021k10830l7852Q6856N1981M5202j26832J56886K4083
$$ 420755 364248 328740 399761 188931 151079 237935 289916 335118 208286 365172 389255
5681C89255j08295n9752j67101J62026J9437o2896J08781J63974l8567m1538j08317
$$ 389255 280960 221208 54107 216133 235570 172674 281455 445429 406862 365324 257007
5670B57007q7723Q3056m3437J31686p7329k1929O5911M4896k06804r4267K30725
$$ 257007 169284 252340 208903 340589 263260 241331 307242 352138 145334 51067 281792
5659B81792M9380l3751o130j1950n6786k0859o9546L2071L2982j5949R4381j00890
$$ 281792 331172 297421 291291 279341 222555 201696 132150 164221 197203 181254 275635 174745
5647A74745J4260J89969K7805K3809R3436j26452M2155m5870L315r8031k6377
$$ 174745 189005 378974 406779 430588 524024 397572 439727 393857 397172 299141 272764
5636B72764j3056n3655J15766k0788l2447J23207j09953m9304k401N211K26069
$$ 272764 259708 206053 321819 301031 268584 391791 281838 232534 230133 235344 461413
5625D61413R599K6873j55378J21647J18702j2339j34044j5589K3989J6233M2206
$$ 461413 471012 497885 342507 464154 582856 570517 436473 420884 444873 461106 503312
5614E03312j24474R1584j5211N3409J04711o3238o4642r2349r5629Q9438K17711
$$ 503312 378838 470422 455211 508620 613331 550093 485451 393102 297473 386911 604622
5603F04622l1033m9216N3752k2505j25842L6372R0762O2860q7003J29917M6258
$$ 604622 573589 524373 578125 555620 429778 466150 556912 619772 532769 662686 708944
5592G08944l3039R9654o9252Q8634j11809j17188J5839L6731R1634J9015r9892
$$ 708944 675905 775559 706307 794941 683132 565944 581783 618514 710148 729163 629271
5581F29271J9353J4003J42481j53056M7943J25145j6977j9322J04812Q7155k9206
$$ 629271 648624 662627 805108 652052 699995 825140 808163 788841 893653 980808 951602
5570I51602j06425J12318k8705j9061P6059J15565p40j43768R6588K2328K18688
$$ 951602 845177 957495 928790 909729 985788 1101353 1100613 956845 1053433 1075761 1294449
5559A294449m8599K07689k2063n1170j558K08620j0653K0212M7018k7273P7105
$$ 1294449 1245850 1453539 1431476 1380306 1378748 1587368 1576715 1596927 1643945 1616672 1693777
5548A693777l5078j8609N8560J89395J63626L39689K10811J9881J09248L9793
$$ 1693777 1658699 1640090 1698650 1888045 2051671 2391360 2602171 2622052 2731300 2771093
5538B771093R4389L19000L04676N17661O34142O09691Q11856J097323J453169
$$ 2771093 2865482 3184482 3489158 4006819 4640961 5250652 6062508 7159831 8613000
5529H613000R88086J56812r13976j317092j074649j014253p70473o87115m34665
$$ 8613000 9601086 9757898 8843922 7526830 6452181 5437928 4667455 3980340 3545675
5520C545675l29376l19997j27874k52952j77179q7672m0543L6217j30285J00114
$$ 3545675 3216299 2896302 2768428 2515476 2338297 2250625 2210082 2246299 2116014 2216128
5510B216128j29763L7220Q4062k07373L5994j71774R0385N7612P4946J92045J74093
$$ 2216128 2086365 2123585 2207647 2000274 2036268 1864494 1954879 2012491 2087437 2279482 2453575
5499B453575K06847J40875L5460k21778j38981j65235k18396j68909j82743j8697
$$ 2453575 2660422 2801297 2836757 2614979 2475998 2310763 2092367 1923458 1740715 1722018
5489A722018q960j03791p5173j49857j72695M3622J35769n8165L4794q4963j03199
$$ 1722018 1713058 1609267 1534094 1384237 1211542 1255164 1390933 1332768 1367562 1282599 1179400
5478A179400l4132K2549p7308p9987p596J11721K6434P6831q6123j31849K37689
$$ 1179400 1145268 1167817 1090509 1010522 1002926 1114647 1141081 1217912 1131789 999940 1237629
5467A237629O4636J04827q3006l00040P689J89052o523j8914J38799J01717P226
$$ 1237629 1302265 1407092 1324086 1024046 1031735 1220787 1214264 1195350 1334149 1435866 1443092
5456A443092N989r461N6592j53435R1035m2958j10301j61713j32054O9445m5361
$$ 1443092 1449081 1439620 1496212 1342777 1433812 1390854 1280553 1118840 986786 1056231 1010870
5445A010870j7109m0144j7956P1302R13j35017K28125O3592O5802J32037R7497
$$ 1010870 993761 953617 935661 1006963 1007876 872859 1100984 1164576 1230378 1362415 1459912
5434A459912k8550l3597O7147k6598n8476K3924l1681j00041P9994J41632p602
$$ 1459912 1431362 1397765 1464912 1438314 1379838 1403762 1372081 1272040 1352034 1493666 1486064
5423A486064N4592M4126m7587q8235J88079j91559m697P8713p7541M5279P3377
$$ 1486064 1540656 1584782 1537195 1448960 1637039 1445480 1440783 1519496 1441955 1487234 1560611
5412A560611p2411Q1201p48O2046J70955j60110K63645J34590j79559J82143K84302
$$ 1560611 1488200 1569401 1568653 1630699 1801654 1641544 1905189 2039779 1860220 2042363 2326665
5401B326665L7456J22361m820l2486K16393M4514j36657M2283Q5995j88499r2389
$$ 2326665 2364121 2486482 2481662 2449176 2665569 2710083 2573426 2615709 2701704 2513205 2420816
5390B420816j58291j79630l7175q3605K8300m0221l911J1440n3072j541Q6457
$$ 2420816 2262525 2082895 2045720 1962115 1990415 1950194 1946283 1957723 1904651 1903110 1989567
5379A989567M8537K13816J42365L5047K00945O4563J81139J90716J60116J84982
$$ 1989567 2038104 2251920 2394285 2429332 2630277 2694840 2875979 3066695 3226811 3411793
5369C411793J9477N2271j91067r7013l40812j11607p2098l16860j32641k97486
$$ 3411793 3431270 3483541 3292474 3195461 2854649 2743042 2670944 2354084 2221443 1923957
5359A923957q4371K4192j14224J8530p8096J2187j302o9199l693J76255j01645
$$ 1923957 1839586 1863778 1749554 1768084 1689988 1702175 1700873 1631674 1627981 1804236 1702591
5348A702591R4626N5537N7691J75115K394J33799K3062J25978o7025j45352j74069
$$ 1702591 1797217 1852754 1910445 2085560 2087954 2221753 2244815 2370793 2303768 2158416 1984347
5337A984347k3303k55146j21323l4916l4545j47657j33086J55448P8005k20206
$$ 1984347 1961044 1705898 1584575 1549659 1515114 1367457 1234371 1389819 1467824 1247618
5327A247618O2398N029n9705J6332k6117j5064j8586O7604j67341J37292N7692
$$ 1247618 1310016 1315045 1255340 1271672 1245555 1230491 1211905 1279509 1112168 1249460 1307152
5316A307152L4275Q0068J68060l0278J05648J56299k0136j14226k01312k05602
$$ 1307152 1341427 1421495 1589555 1559277 1664925 1821224 1801088 1686862 1485550 1279948
5306A279948m8991P8425q0052R8223j25222j8192j28323J8091O7456j17627J14480
$$ 1279948 1230957 1309382 1229330 1327553 1202331 1184139 1055816 1073907 1141363 1023736 1138216
5295A138216j32693P6926M6698P1528j8229J44716J13513J0906j60479J95616
$$ 1138216 1005523 1082449 1129147 1200675 1182446 1327162 1440675 1451581 1291102 1486718
5285A486718J13638O1019R5979Q516K84723L56212J04018l8104K0471j71970k97008
$$ 1486718 1600356 1661375 1757354 1765870 2050593 2406805 2510823 2472719 2493190 2321220 2024212
5274B024212j52697j85188j09744k2961p5110l2139m4412j5309O7102q7430j39827
$$ 2024212 1871515 1686327 1576583 1553622 1478512 1446373 1401961 1386652 1453754 1366324 1226497
5263A226497O2627M1960R1067K6867J28572j57558n4488K8672P9236P0813J21968
$$ 1226497 1289124 1331084 1422151 1449018 1577590 1420032 1365544 1394216 1473452 1544265 1666233
5252A666233K42043J72813J24488J51839J45965L05631l4992l36742j67639j85076
$$ 1666233 1908276 2081089 2205577 2357416 2503381 2809012 2774020 2437278 2269639 2084563
5242B084563j47539j47622l10528n0986q2154l5684k469L470p3072k2729J8070
$$ 2084563 1937024 1789402 1478874 1427888 1345734 1310050 1307581 1311051 1237979 1215250 1233320
5231A233320o7603J29237k1102q592j0574J8975l5973R4691j8165j03427R8957
$$ 1233320 1165717 1294954 1273852 1265260 1254686 1273661 1237688 1332379 1314214 1210787 1309744
5220A309744J85789K07941O6906J10347P1397m3632J10751L51693r6395o1382
$$ 1309744 1495533 1703474 1770380 1880727 1952124 1908492 2019243 2370936 2274541 2213159
5210B213159K90372L28306n5472k58082m01022k30863j52314j26107k10850j24650
$$ 2213159 2503531 2831837 2776365 2518283 2117261 1886398 1734084 1607977 1397127 1272477
5200A272477J06532p2336j03959q0665r9957J2269q9869n3216M9965N8719Q48
$$ 1272477 1379009 1306673 1202714 1122049 1022092 1034361 944492 891276 941241 999960 1000808
5189A000808l6515j88819J26716L9222o966L3927o9198n3799l9346M1449j3567
$$ 1000808 964293 775474 902190 941412 934446 968373 899175 845376 806030 847479 833912
5178H33912J25487j7386n6023R7631P618r7403N1319k8942j78173k75099Q7048
$$ 833912 959399 942013 885990 983621 991239 893836 945155 916213 738040 462941 549989
5167E49989N6648N2522R327o1733N2089J40229l7790O1217K1785q1719j53428
$$ 549989 606637 659159 668486 606753 658842 799071 761281 822498 844283 762564 609136
5156F09136q0498K39423O2954q9788M3445o6186L8230o0250L6668j2796O9504
$$ 609136 528638 768061 831015 741227 784672 718486 756716 696466 733134 720338 789842
5145G89842J57101Q7649o4465M8383q1891j8877j75926o7979R4637j26084P374
$$ 789842 946943 1034592 970127 1018510 936619 917742 741816 673837 768474 642390 649764
5134F49764L4319J13208J01636m9255J2042J25677K0955O999k1137j27943N6248
$$ 649764 684083 797291 898927 849672 861714 987391 1008346 1015345 994208 866265 922513
5123I22513N3849p0133O2735N0246q8211r9684M2973M3987Q7570J6182n9980K4680
$$ 922513 976362 906229 968964 1019210 930999 831315 874288 918275 1005845 1022027 962047 986727
5111I86727O7896n5987P0336l7702N0851r2334J1990m3408m8198P3436J49008
$$ 986727 1054623 998636 1068972 1031270 1082121 989787 1001777 958369 910171 983607 1132615
5100A132615o6078j36769K51318Q8663j9632o4034n291L9571J5421J31417n0739
$$ 1132615 1066537 929768 1181086 1269749 1250117 1186083 1180792 1220363 1235784 1367201 1316462
5089A316462n5576J7430K00682N8691L4838r9990M6529K04545P2900J64680Q176
$$ 1316462 1260886 1278316 1478998 1537689 1572527 1472537 1519066 1723611 1796511 1961191 1969367
5078A969367O0842J94355K19425K73614K47703j18255P2103J85894L7368P5041
$$ 1969367 2030209 2224564 2443989 2717603 2965306 2847051 2919154 3105048 3142416 3217457
5068C217457J93837M8581J57476N9827k58103j97580k84365j43347j92131R208
$$ 3217457 3411294 3459875 3617351 3677178 3419075 3221495 2937130 2793783 2601652 2610860
5058B610860k5060j44369J06640j61035O2666O6534J4523N0674L5181K32786N2798
$$ 2610860 2585800 2441431 2548071 2387036 2449702 2516236 2530759 2581433 2616614 2849400 2902198
5047B902198J68945J50061J13826J71154K66212L55049k9348j41232j81362o4692
$$ 2902198 3071143 3221204 3335030 3506184 3772396 4127445 4098097 3956865 3775503 3710811
5037C710811l34454l63298k74358k13735q3173J6409O8055r9469J2127j06k4621
$$ 3710811 3376357 3013059 2738701 2524966 2441793 2458202 2526257 2426788 2438915 2438809 2414188
5026B414188M1108K0889l9844p4480j07434M2680M9065K36358m7145P589K34262
$$ 2414188 2455296 2476185 2436341 2361861 2254427 2297107 2346172 2582530 2535385 2542974 2777236
5015B777236P0734J36967J56199K19750l7962j39228l9177j56169n0096J57241
$$ 2777236 2847970 2984937 3141136 3360886 3322924 3183696 3144519 2988350 2938254 3095495
5005C095495j07871p8454k5151L0677r3765J19608k7074k935K46968J20446P9207
$$ 3095495 2987624 2909170 2884019 2914696 2820931 2940539 2913465 2910530 3157498 3277944 3357151
4994C357151K05832J11295K4890l23585j78073M603l7521n9275j94697m7800M0527
$$ 3357151 3562983 3674278 3699168 3375583 3197510 3202113 3164592 3105317 2910620 2862820 2903347
4983B903347M8544j49386O7951m201J08103q4304j40494J01506J41587j67334
$$ 2903347 2951891 2802505 2870456 2866255 2974358 2890054 2749560 2851066 2992653 2825319
4973B825319J62819J20589m9266J29997J03541K2568J23672J27937J05686R5239
$$ 2825319 2988138 3108727 3059461 3189458 3292999 3315567 3439239 3567176 3672862 3768101
4963C768101Q9882L87795K26416J49657M26275L54356n1164k54515J19421R8847
$$ 3768101 3857983 4245778 4472194 4621851 5048126 5402482 5351318 5096803 5216224 5315071
4953E315071J22218N5315J85058P308J62120L74479K35065K49696K36595L57831
$$ 5315071 5437289 5492604 5677662 5684970 5847090 6221569 6456634 6706330 6942925 7300756
4943G300756M13613L84367M55069M31998N5091k56748l47977k18542l46923l31063
$$ 7300756 7714369 8098736 8553805 8985803 9040894 8784146 8436169 8217627 7870704 7539641
4933G539641k6189R1058j3545O3061P1625Q7795J15558J38070J38699J54077L26768
$$ 7539641 7513452 7604510 7590965 7654026 7725651 7813446 7929004 8067074 8205773 8359850 8686618
4922H686618K50996J82958q0142m92000k31882O7584j56366k35192k36202j61266
$$ 8686618 8937614 9120572 9040430 8548430 8316548 8384132 8227766 7992574 7756372 7595106
4912G595106j19055J39647N2593k0814M8744J53706K25253K05036J90368L6377
$$ 7595106 7476051 7615698 7668291 7647477 7696221 7849927 8075180 8280216 8470584 8506961
4902H506961J67265P6849K45745J13107J11072Q3459J27681p2693l0517M6020
$$ 8506961 8674226 8751075 8996820 9109927 9220999 9304458 9432139 9359446 9328929 9374949
4892I374949k5578J18045R5795N1088k1925j90659j08723J05139M430P8788K02522
$$ 9374949 9349371 9467416 9563211 9614299 9592374 9401715 9292992 9398131 9402561 9481349 9683871
4881I683871Q3562K59058J53431O2079Q7502K51217J8782L9363K00507N2231J69303
$$ 9683871 9767433 10026491 10179922 10242001 10329503 10580720 10599502 10638865 10839372 10891603 11060906
4870A1060906J62780J62337K6256J1782q6424j0884Q6773m7415M3264o4671r7359
$$ 11060906 11223686 11386023 11412279 11424061 11337637 11326753 11413526 11366111 11409375 11344704 11247345
4859A1247345p4340j34981K7942k9789k2840J44897P6676J50742K06793L68384
$$ 11247345 11173005 11038024 11065966 11036177 11013337 11158234 11234910 11385652 11592445 11960829
4849A1960829J85670J99722L58100M01469M1641K2483J30917K75090J33609M4625
$$ 11960829 12146499 12346221 12704321 13105790 13147431 13169914 13300831 13575921 13709530 13754155
4839A3754155J5704K06l3335j99830O1958j41405J7749j04043K4962J9879P8696
$$ 13754155 13769859 13770065 13736730 13536900 13598858 13457453 13475202 13371159 13396121 13416000 13494696
4828A3494696J73697o3382O4977K06067J54766L39114K25635O2979M2827L05472
$$ 13494696 13668393 13605011 13669988 13876055 14030821 14369935 14595570 14658549 14701376 15006848
4818A5006848L23893N5148K26852L7849L7895K45856Q3908N8925J79250L8839
$$ 15006848 15330741 15385889 15612741 15650590 15688485 15934341 16018249 16077174 16256424 16295263
4808A6295263J02478J93178N2834M8017K71340K22789L27300J67071K81784M10580
$$ 16295263 16397741 16590919 16643753 16691770 16963110 17185899 17513199 17680270 17962054 18372634
4798A8372634K37614O9255Q6119N29672M88181M06029N03822N12109O21346N26866
$$ 18372634 18610248 18679503 18765622 19295294 19783475 20189504 20693326 21205435 21826781 22353647
4788B2353647P95527N66401M86162O79465O62068Q98388P36614Q38082J019790
$$ 22353647 23149174 23715575 24201737 24881202 25543270 26441658 27178272 28016354 29036144
4779B9036144J031070J102564J115828J446784J740160J990292K187185K794469
$$ 29036144 30067214 31169778 32285606 33732390 35472550 37462842 39650027 42444496
4771D2444496L161646L699364M786164N255023O049463O459151P281005Q288170
$$ 42444496 45606142 49305506 54091670 59346693 65396156 71855307 79136312 87424482
4763H7424482R961403J2604955J6481726K1141561K8005838L5564695L5704569
$$ 87424482 97385885 109990840 126472566 147614127 175619965 211184660 246889229
4756B46889229K3628374N408579j5257709l0898628l5263444l2027628k7185267
$$ 246889229 270517603 275926182 260668473 229769845 194506401 162478773 135293506
4749A35293506k2250044j7184979j3068758r910562p692620o098957n060680l794462
$$ 135293506 113043462 95858483 82789725 72879163 65186543 59087586 54026906 50232444
4741E0232444l136231k900438k195331j917673j655206j600401j222980r96339
$$ 50232444 47096213 44195775 42000444 40082771 38427565 36827164 35604184 34607845
4733C4607845j142367p76377n72659n73842k92284l91610l16166l14266o75147
$$ 34607845 33465478 32689101 32116442 31542600 31250316 30858706 30542540 30228274 29553127
4724B9553127o30217m98576k95105k47801r2160j55576J25660n1671K49604L32664
$$ 29553127 28922910 28424334 28129229 27881428 27789268 27633692 27759352 27707681 27957285 28289949
4714B8289949J68866K39037M58747N44042O65143L05459N34823Q10745P74128
$$ 28289949 28458815 28697852 29156599 29700641 30365784 30671243 31206066 32016811 32790939
4705C2790939P26139Q73097J275071J541025J687642J960586K457437K724921
$$ 32790939 33517078 34390175 35665246 37206271 38893913 40854499 43311936 46036857
4697D6036857L383584M005408M340795N157342N892920O484846P618608R457742
$$ 46036857 49420441 53425849 57766644 62923986 68816906 75301752 82920360 92378102
4689I2378102J1892547J5017766J9255901K6124367L2319592K9875029J8760879
$$ 92378102 104270649 119288415 138544316 164668683 196988275 226863304 245624183
4682B45624183Q051742l739754j8998439l0212233l2161814k7766183k3573441
$$ 245624183 253675925 249936171 230937732 200725499 168563685 140797502 117224061
4675A17224061j8941907j4754716j1678737q745829o737201n315011m317636l517016
$$ 117224061 98282154 83527438 71848701 63102872 56365671 51050660 46733024 43216008
4667D3216008k830252k341937k015097j345664r34129q06287r02254j280705j854047
$$ 43216008 40385756 38043819 36028722 34683058 33748929 32942642 32040388 30759683 28905636
4658B8905636j739465j556189j510428j229213j133931j205122j096985r85579
$$ 28905636 27166171 25609982 24099554 22870341 21736410 20531288 19434303 18448724
4650A8448724q09977o54646p24383n20629o72596n33991o79876m10330m25592
$$ 18448724 17638747 16984101 16259718 15739089 15066493 14532502 13852626 13442296 13016704
4641A3016704n85230m70089l63358k29471l72240k96202k97824l33856k58124
$$ 13016704 12431474 11961385 11598027 11368556 10996316 10700114 10402290 10068434 9810310
4632I810310j64533k00659j97173l13189k14982j86740k72111n1833j04491j91147
$$ 9810310 9645777 9445118 9247945 8934756 8719774 8533034 8260923 8209090 8104599 7913452
4622G913452Q9746n2085j97991m31643k86556l4726j09441k24739j93941m3287
$$ 7913452 8003198 7951113 7753122 7321479 7034923 7000197 6890756 6666017 6472076 6428789
4612F428789K4065j30466p1475l9893j90575j21640k14587j83729j60421k16982
$$ 6428789 6452854 6322388 6250913 6211020 6020445 5898805 5684218 5500489 5340068 5123086
4602E123086R0777k19936r9315j36725j7469j5342j83422R6302J3897m8188o3436
$$ 5123086 5213863 4993927 4894612 4757887 4740418 4725076 4541654 4637956 4651853 4603665 4540229
4591D540229p6196r26J10522k6275O1979J24745J50170j82463m1354q4484R7284
$$ 4540229 4464033 4463107 4573629 4547354 4609333 4734078 4884248 4701785 4660431 4575947 4673231
4580D673231R9114M5956J25099K09006K05420j647k42473k02682j36777j4156
$$ 4673231 4772345 4818301 4943400 5152406 5357826 5356179 5113706 4911024 4774247 4760091
4570D760091k23125j6115L6071j42386o952M1529P3747K03642k4151L23541M44650
$$ 4760091 4536966 4520851 4556922 4414536 4407584 4449113 4522860 4726502 4702351 5025892 5470542
4559E470542K30597J65875J03039n8147k39057l52141l54352k19945k83203l73582
$$ 5470542 5701139 5867014 5970053 5911906 5672849 5320708 4966356 4746411 4463208 4089626
4549D089626j17285J12171k354j87258r1549R5241j1732J58136Q5030N1734Q1860
$$ 4089626 3972341 4084512 4082158 3894900 3803351 3898592 3886860 4044996 4130026 4181760 4263620
4538D263620L9047k26897k08479k70283p2581O6648n6509j76472j79779j53063
$$ 4263620 4302667 4075770 3867291 3597008 3524427 3591075 3534566 3358094 3178315 3025252
4528C025252R1201n5963j26418p2349o6666p1157J42464n771k61467l6297J60694
$$ 3025252 3116453 3060490 2934072 2861723 2795057 2723900 2866364 2860593 2599126 2562829 2723523
4517B723523K09782P3404Q4166J1789j81882j80141O6025m0061n6017j0751p6036
$$ 2723523 2933305 3006709 3090875 3102664 2920782 2740641 2806666 2766605 2710588 2699837 2623801
4506B623801j02774n9121J9608J0719n803r8668j08899M3063J7380J21109N5420
$$ 2623801 2521027 2461906 2481514 2492233 2486430 2387762 2278863 2321926 2339306 2460415 2515835
4495B515835O4697n0112p1519o9524m5816J09503L0788q3023j8962N8499n79K44393
$$ 2515835 2580532 2530420 2458901 2389377 2343561 2453064 2483852 2400829 2381867 2440366 2439787 2684180
4483B684180J59005j27838o5400O598o2560k2412J06233J79767P3187k1248Q2344
$$ 2684180 2843185 2715347 2649947 2656545 2593985 2571573 2677806 2857573 2930760 2909512 2991856
4472B991856R5422M0340K07645o0272k1763J67371j4028j02556m3798M5296J9408
$$ 2991856 3087278 3127618 3335263 3274991 3253228 3420599 3406571 3304015 3260217 3305513 3324921
4461C324921j2543j37650j0909M5816J47869M4068J9123O9856K2895M0774J78773
$$ 3324921 3312378 3174728 3163819 3209635 3357504 3401572 3420695 3490551 3513446 3554220 3732993
4450C732993J4449l2048J80962K79710K23811K23643M42092K75405J56245k18396
$$ 3732993 3747442 3715394 3896356 4176066 4399877 4623520 5065612 5341017 5497262 5278866
4440E278866j42255n73988k99422k46040k59552j10403j83460j87894n7062K4516
$$ 5278866 5136611 4562623 4263201 4017161 3757609 3647206 3463746 3275852 3218790 3243306
4430C243306j77202p8757j22168L1476J27781l1441N231l7141P8623K1765M367
$$ 3243306 3066104 2987347 2865179 2896655 3024436 2992995 2998226 2961085 3039708 3061473 3065840
4419C065840L3592o0185j4856l3631J01263J00255j45274j69103N2874K2106n4993
$$ 3065840 3099432 3039247 3024391 2990760 3092023 3192278 3047004 2877901 2930775 2952881 2897888
4408B897888j9866M4784N6285k9976o5210r9712M6399J36697r6361M8233R7540
$$ 2897888 2878022 2922806 2979091 2949115 2883905 2784193 2830592 2967289 2870928 2919161 3016701
4397C016701Q0561O0298M0659j17973m4528j5012J08864L3188j3854J47961K6676
$$ 3016701 3097262 3157560 3198219 3080246 3035718 3020706 3129570 3162758 3148904 3296865 3323541
4386C323541J4786J58273J74690J77314J3788n1243O7716K48434K21283K68520
$$ 3323541 3338327 3496600 3671290 3848604 3862392 3811149 3878865 4127299 4348582 4617102
4376D617102J15414J60225L58554Q1252R9204J19996J75960l9227m0284O3625
$$ 4617102 4732516 4892741 5251295 5332547 5431751 5551747 5727707 5688480 5648196 5711821
4366E711821k3778j9364l43014k85972k07432j61358q1340n9196r9381Q7909J70853
$$ 5711821 5688043 5668679 5325665 5039693 4832261 4670903 4589563 4530367 4430986 4518895 4689748
4355D689748m0632J7993K96782Q9573J97905J79838K57877J65991J80048J61268
$$ 4689748 4649116 4667109 4963891 5053464 5251369 5431207 5689084 5855075 6035123 6196391
4345F196391J60797L81641J2728K7990m9884j70392j88238l65112j47758r2511
$$ 6196391 6357188 6738829 6751557 6779547 6729663 6559271 6371033 6005921 5858163 5765652
4335E765652R2484J32491O7201K70421J40452j57101K7776K63610j35838m4390
$$ 5765652 5858136 5990627 6057828 6328249 6468701 6311600 6339376 6602986 6467148 6422758
4325F422758j49747n5009k769j71491j16688O4020L26485J26899P499J33995K70165
$$ 6422758 6273011 6218002 6215233 6043742 5927054 5991074 6317559 6444458 6451957 6585952 6856117
4314F856117K85551q9369o4248j04148k21751J6211j49237J1675P054M4725J03979
$$ 6856117 7141668 7052299 6988051 6883903 6662152 6678363 6529126 6540801 6547855 6592580 6696559
4303F696559m0307J97227K67128K01606K52380K84942K22210N5059J6384J0257
$$ 6696559 6656252 6853479 7120607 7322213 7574593 7859535 8081745 8136804 8153188 8163445
4293H163445n9421q0360l27083k29266m6501j76093K7191J7510j98448m9467j49940
$$ 8163445 8104024 8023664 7696581 7467315 7420814 7244721 7271912 7289422 7090974 7041507 6891567
4282F891567J75021j77917j11171K19564P8972m2789Q3760N9566K81779P2402
$$ 6891567 7066588 6888671 6777500 6997064 7076036 7033247 7117007 7176573 7458352 7530754
4272G530754N8223K3492K03957K20828j6376J85721K71256J30996J74482l2442
$$ 7530754 7588977 7612469 7816426 8037254 8020878 8206599 8477855 8608851 8783333 8750891
4262H750891J1391J6552k03243p960Q9054n8849J01282r302j59466J49124l291
$$ 8750891 8762282 8778834 8575591 8567631 8656685 8597836 8699118 8689816 8530350 8679474 8676183
4251H676183J46539J07856K85555o6582J58991M8160O5475J28447l1994J05712
$$ 8676183 8822722 8930578 9216133 9149551 9308542 9356702 9422177 9550624 9518630 9624342
4241I624342J65454K63370J49006K77005M28813K07054K42790Q4209k15211O1602
$$ 9624342 9789796 10053166 10202172 10479177 10907990 11115044 11357834 11442043 11226832 11288434
4231A1288434J19856J43615J95975J14004K58965K39138N27929L95554K99498
$$ 11288434 11408290 11551905 11747880 11861884 12120849 12359987 12887916 13283470 13582968
4222A3582968N31901O26913N26739P18583R64019J124523J207556J474680K059719
$$ 13582968 14114869 14741782 15268521 15987104 16951123 18075646 19283202 20757882 22817601
4213B2817601J995363P11166o67737j067262r87383r56631q97012o00699l20743
$$ 22817601 24812964 25524130 24856393 23789131 22801748 21845117 20948105 20347406 20026663
4204B0026663n5240M3209J52150M01252L95026M43324R6248k2449k28668k56353
$$ 20026663 19971423 20014632 20166782 20568034 20963060 21406384 21502632 21480183 21251515 20995162
4194B0995162l09796j70127j13791r7547j0629K63590M71569M27015O82833Q74244
$$ 20995162 20685366 20515239 20401448 20303901 20293272 20556862 21028431 21455446 22138279 23012523
4184B3012523P87622R46182P02777N83898J06850l23629m28888o51984o55308
$$ 23012523 23800145 24746327 25449104 26033002 26139852 25816223 25387335 24735351 24080043
4175B4080043p54555n78189n21469j48057l06438k00228o8823K94009o075o6064
$$ 24080043 23325488 22747299 22225830 22077773 21771335 21571107 21502284 21796293 21790218 21724154
4165B1724154n5426P6002J38188L08731M05564L36127O37373Q28587R68930J268588
$$ 21724154 21668728 21744730 21882918 22191649 22597213 22933340 23570713 24399300 25368230 26636818
4155B6636818J253315J435785J362374J518035R90744K54629p40895j137963j217744
$$ 26636818 27890133 29325918 30688292 32206327 33197071 33451700 32710805 31572842 30355098
4146C0355098j183397j407720j441178q13370n99337o81431k78834j51428K2502
$$ 30355098 29171701 27763981 26322803 25509433 24910096 24228665 23949831 23798403 23820905
4137B3820905R0892N9029O8896K51562L32880N89055M08481M07329N14314M91134
$$ 23820905 23911797 23970826 24039722 24291284 24624164 25213219 25621700 26029029 26543343 27034477
4127B7034477O85218Q85686J095095J007742J247591J510155J509811J170782
$$ 27034477 27719695 28605381 29700476 30708218 31955809 33465964 34975775 36146557
4119C6146557J099217N27650R1700m01232q01583j175626j007280j159836r25393
$$ 36146557 37245774 37773424 37865124 37463892 36662309 35486683 34479403 33319567 32394174
4110C2394174r54748o05485m53479k17522k27742q7137Q115K84932K97671L01847
$$ 32394174 31439426 30833941 30380462 30162940 29935198 29848061 29856176 30141108 30438779 30740626
4100C0740626L57126O37296M56281M12970N92570O77822R04555J282333J175547
$$ 30740626 31097752 31735048 32191329 32604299 33196869 33874691 34779246 36061579 37237126
4091C7237126J222544J270561J073280P13597M52773N0824k40129k08721k25244
$$ 37237126 38459670 39730231 40803511 41517108 41969881 42020705 41780576 41571855 41346611
4082D1346611r8374J59992L06742M89819N18200O60744P95811J057969J254634
$$ 41346611 41248237 41408229 41714971 42204790 42722990 43383734 44179545 45237514 46492148
4073D6492148J106026J261568J058297Q51603P36904P74962L94487O67759N83487
$$ 46492148 47598174 48859742 49918039 50769642 51506546 52281508 52675995 53343754 53927241
4064E3927241Q29772R90154J104528J215414J396336J469151J500909J703986
$$ 53927241 54757013 55747167 56851695 58067109 59463445 60932596 62433505 64137491
4056F4137491J764467J885885K325366K969744L376647L535989M224983M868572
$$ 64137491 65901958 67787843 70113209 73082953 76459600 79995589 84220572 89089144
4048H9089144N676676O404106P078456Q754187J1242740J3806346J6929540J9066335
$$ 89089144 94765820 101169926 108248382 117002569 128245309 142051655 158981195 178047530
4040A78047530J4482244R69330j1319098j6003243j6123757j4858337j2791824
$$ 178047530 192529774 193499104 182180006 166176763 150053006 135194669 122402845
4033A22402845j0281869q169377o108898m539921l555862k652482j912506j188534
$$ 122402845 112120976 103951599 97842701 93302780 89746918 87094436 85181930 83993396
4025H3993396o37661l48231J62013K11395O38394N96003J052508J166263J518717
$$ 83993396 83355735 83007504 83169517 83380912 84019306 84615309 85667817 86834080 88352797
4016H8352797K022661K307985K602329K928634L433594L706374M081607M697254
$$ 88352797 90375458 92683443 95285772 98214406 101648000 105354374 109435981 114133235
4008A14133235N645210O741347Q441692R873973J1347454J2100272R957388L419896
$$ 114133235 119778445 126519792 134961484 144835457 156182911 168283183 178240571 181660467
4000A81660467l617513o913721p352428o825892n618764m216362k966126j585897
$$ 181660467 178042954 171129233 163776805 156950913 151332149 147115787 144149661 142563764
3992A42563764p86834J5918Q10332J355556J893266K280624K722540L251335L474676
$$ 142563764 141776930 141792848 142603180 143958736 145852002 148132626 150855166 154106501 157581177
3983A57581177L910328M216978M194917M128595M214961M235572L990450L982207
$$ 157581177 161491505 165708483 169903400 174031995 178246956 182482528 186472978 190455185
3975A90455185M002254L962661M126306M187385M175081M262757M168102M008210
$$ 190455185 194457439 198420100 202546406 206733791 210908872 215171629 219339731 223347941
3967B23347941L399661L505558L046702K608363K332525J583185J221116J321174
$$ 223347941 226747602 230253160 233299862 235908225 238240750 239823935 241045051 242366225
3959B42366225J082284J231800J535103J748444K023798K165005K402779K499124
$$ 242366225 243448509 244680309 246215412 247963856 249987654 252152659 254555438 257054562
3951B57054562K678144K687817K470578K283145K498211K644886K942252L538681
$$ 257054562 259732706 262420523 264891101 267174246 269672457 272317343 275259595 278798276
3943B78798276M454787N448937O445197P593522Q806505J0114992J1696425J3526934
$$ 278798276 283253063 288702000 295147197 302740719 311547224 321662216 333358641 346885575
3935C46885575J4880105J6723158J8096061J9219470J9589206J8025552J5338760
$$ 346885575 361765680 378488838 396584899 415804369 435393575 453419127 468757887
3928D68757887J1125017O012539N26059m322920q235916j1059435j2605023j2549076
$$ 468757887 479882904 485895443 486421502 482098582 473862666 462803231 450198208 437649132
3920D37649132j2284674j1171997r941066r593497r464654r875647j0650010j1653697
$$ 437649132 425364458 414192461 404251395 394657898 385193244 375317597 364667587 353013890
3912C53013890j2622058j3318655j3237762j2851723j2013892j0437203r110177
$$ 353013890 340391832 327073177 313835415 300983692 288969800 278532597 269422420
3905B69422420p551167n893477m193477k727724j268537K61212J341294K779087
$$ 269422420 261871253 255977776 251784299 249056575 247788038 248049250 249390544 252169631
3897B52169631L852820M182586M404383L837713K455359Q15628o90404k148198
$$ 252169631 256022451 260205037 264609420 268447133 270902492 271718120 271027716 268879518
3889B68879518l308277m275823m485434m519395m275374m011043l779082l438636
$$ 268879518 265571241 261295418 256809984 252290589 248015215 244004172 240225090 236786454
3881B36786454l353357l324529l729664m370001n181183o025498o775957p337577
$$ 236786454 233433097 230108568 226378904 222008903 216827720 210802222 204026265 196688688
3873A96688688p900070q228471q030980p560997o983586o111015n252008m682727
$$ 196688688 188788618 180560147 172529167 164968170 157984584 151873569 146621561 141938834
3865A41938834m055093l636020l169625k971197k874036k672298k670019k459227
$$ 141938834 137883741 134247721 131078096 128106899 125232863 122560565 119890546 117431319
3857A17431319k240044k356336k251079k025245j984141j776508j584016j392726
$$ 117431319 115191275 112834939 110583860 108558615 106574474 104797966 103213950 101821224
3849A01821224j343634j070997q61685q58472q50227o64933o77572m84526k74126
$$ 101821224 100477590 99406593 98544908 97686436 96836209 96171276 95493704 95009178 94735052
3840I4735052n4514N5577Q6208K16196L07955L00249J87776M8855L42794P83545
$$ 94735052 94680538 94736115 94822323 95038519 95346474 95646723 95834499 95883354 96226148 97009693
3830I7009693J045449J342326J595586K369156K896680L492286M092931M878093
$$ 97009693 98055142 99397468 100993054 103362210 106258890 109751176 113844107 118722200
3822A18722200N728668O678153P507642Q496431R844332J0860226J1870857J2737344
$$ 118722200 124450868 131129021 138636663 147133094 156977426 167837652 179708509 192445853
3814A92445853J2792115J1969885J0420010P753456N073069K202842l66866k140318
$$ 192445853 205237968 217207853 227627863 235381319 240454388 242657230 242290364 240150046
3806B40150046l180711l797576l883024l237767k879188k426609k023352k402565
$$ 240150046 236969335 233171759 229288735 226050968 223171780 220745171 218721819 216319254
3798B16319254k832291l988953n372272p014652q511482r717577j0656474j0566126
$$ 216319254 213486963 209498010 204125738 197111086 188599604 178882027 168225553 157659427
3790A57659427j0538221r765372q728831q129390p177476o365708n482085m964960
$$ 157659427 147121206 137355834 128627003 120497613 113320137 106954429 101472344 96507384
3782I6507384m224186l550634l119685k550954k000039j838546j582063j513016
$$ 96507384 92283198 88732564 85612879 83061925 81061886 79223340 77641277 76128261
3774G6128261j431152j312990j232701j185992j307396j426301j400798j518945
$$ 76128261 74697109 73384119 72151418 70965426 69658030 68231729 66830931 65311986
3766F5311986j718868j458346j690923j413069j087397j090501j167139j297470
$$ 65311986 63593118 62134772 60443849 59030780 57943383 56852882 55685743 54388273
3758E4388273j200960j119429j173488j152893p32206o91086o66278k03458k21706
$$ 54388273 53187313 52067884 50894396 49741503 49009297 48318211 47651933 47448475 47226769
3749D7226769j35549L68878M74017N03348O61446P18599Q73117O41354M63615
$$ 47226769 47091220 47460098 47934115 48437463 49098909 49817508 50690625 51331979 51795594
3740E1795594j4542k18162j11205n61194j175684j253725j515287j480867j250376
$$ 51795594 51781052 51562890 51451685 50890491 49714807 48461082 46945795 45464928 44214552
3731D4214552j314569j020558r04369n16713m09167n09715m33695n45922m07797
$$ 44214552 42899983 41879425 40975056 40458343 40049176 39539461 39105766 38559844 38152047
3722C8152047m48055m28015n25222l08247j28675J9263J76642L32197L71268N49582
$$ 38152047 37703992 37275977 36750755 36442508 36313833 36333096 36509738 36841935 37213203 37762785
3712C7762785O26523N81128N61474L96491N27513N28051L64943J43902m6238J37021
$$ 37762785 38389308 38970436 39531910 39928401 40455914 40983965 41348908 41492810 41446572 41583593
3702D1583593j30332o8314j64414n36039j53231l00352m72429m24464n99544m79222
$$ 41583593 41453261 41384947 41220533 40684494 40531263 40230911 39758482 39334018 38734474 38255252
3692C8255252j1428j7390J81337J23628J23409L89238M91084N38112N77516Q37392
$$ 38255252 38243824 38226434 38407771 38531399 38654808 39044046 39535130 40073242 40650758 41488150
3682D1488150O67543O96295O48460M31673M65752M11285J09475j5065L09701J6473
$$ 41488150 42155693 42851988 43500448 43932121 44397873 44809158 44918633 44903568 45213269 45229742
3672D5229742L07802O44070O12481O11472K42920L00086K29928L15651K99150
$$ 45229742 45537544 46181614 46794095 47405567 47648487 47948573 48178501 48494152 48793302
3663D8793302L32529N35980N28907N46885O58354N85845P64409Q62139O54105
$$ 48793302 49125831 49661811 50190718 50737603 51395957 51981802 52746211 53608350 54262455
3654E4262455R34826P42263R01411J262705J352247J456792J454184J501339J549302
$$ 54262455 55197281 55939544 56840955 58103660 59455907 60912699 62366883 63868222 65417524
3645F5417524J836157J939710J931418K087493K178860K493875K581628K898128
$$ 65417524 67253681 69193391 71124809 73212302 75391162 77885037 80466665 83364793
3637H3364793L093930L186020L338642L756846M044090M301347M925688N395957
$$ 83364793 86458723 89644743 92983385 96740231 100784321 105085668 110011356 115407313
3629A15407313O166992O797666P565170Q503279R810121J1055953J2287382J3716269
$$ 115407313 121574305 128371971 135937141 144440420 154250541 165306494 177593876 191310145
3621A91310145J4546984J4782524J4373600J3277975J1782875J1185754J0567940
$$ 191310145 205857129 220639653 235013253 248291228 260074103 271259857 281827797
3614B81827797J0812906J1621461J2662871J3808670J4886791J5150726J4970840
$$ 281827797 292640703 304262164 316925035 330733705 345620496 360771222 375742062
3607C75742062J3504437J1253987Q665158N460426K517832j6613j687961k751955
$$ 375742062 389246499 400500486 409165644 414626070 417143902 417127289 415439328 412687373
3599D12687373l204305k875709k659571k641461k518519l108547m130469n748960
$$ 412687373 409483068 406607359 403947788 401306327 398787808 395679261 391548792 385799832
3591C85799832p405559r203081j0519557j1322440j1097634j0352138r097811
$$ 385799832 378394273 369191192 358671635 347349195 336251561 325899423 316801612
3584C16801612p433618n768054m617271l576073l052053k875924k804918l140837
$$ 316801612 309367994 303599940 298982669 295406596 292354543 289478619 286673701 283532864
3576B83532864l871596m267779m576507m493994m201544l578641k802972j495432
$$ 283532864 279661268 275393489 270816982 266322988 262121444 258542803 255739831 254244399
3568B54244399n41023K61996O21843O20957P0020r96256k243034m127872n690561
$$ 254244399 253703376 253965372 254587215 255208172 255278192 254281936 252038902 247911030 242220469
3559B42220469o900680q157495q536096q397297q260282p782150p162230o583494
$$ 242220469 235319789 227162294 218626198 210228901 201968619 194186469 187024239 180440745
3551A80440745n935623n679524n780095n933015o569473o947056p696159p940530
$$ 180440745 174505122 168825598 163045503 157112488 150543015 143595959 135899800 127959270
3543A27959270p851681p636748p356188o694608o149367n315100m953524m522446
$$ 127959270 120107589 112470841 105114653 98420045 92270678 86955578 82002054 77479608
3535G7479608m084172l459712l208695k958887k654961k511277k259586k111460
$$ 77479608 73395436 69935724 66727029 63768142 61113181 58601904 56342318 54230858
3527E4230858j939299j773350j794016j610301j473193j287111j338251j277241
$$ 54230858 52291559 50518209 48724193 47113892 45640699 44353588 43015337 41738096
3519D1738096j177072j114744j218488j224917j060538r01044q80770r40764n60295
$$ 41738096 40561024 39446280 38227792 37002875 35942337 35041293 34160523 33219759 32659464
3510C2659464q89086p04177q36508n24887o62655o71262o33732p72941q05901
$$ 32659464 31770378 31066201 30229693 29704806 29042151 28370889 27737157 26964216 26158315
3501B6158315o10794n16421n52463n70514m61358n60375n14294n58905n49323
$$ 26158315 25547521 25031100 24478637 23908123 23446765 22886390 22372096 21813191 21263868
3492B1263868k98605l92908o22621n81871k65658l07738n67539m05977j95278
$$ 21263868 20965263 20572355 19949734 19367863 19102205 18794467 18226928 17820951 17625673
3483A7625673l81801l28724l76230l81452j66691k82074m48649j29644k83048
$$ 17625673 17243872 16915148 16538918 16157466 15990775 15708701 15260052 15130408 14847360
3474A4847360k71445l64913j36645k42146l964k71049j75556j73678k31043j45101
$$ 14847360 14575915 14211002 14074357 13832211 13828247 13557198 13381642 13207964 12976921 12831820
3464A2831820k34058r6125k85014j80380r1300j61114k27582n964j77822j92395
$$ 12831820 12597762 12501637 12216623 12036243 11944943 11783829 11556247 11550283 11372461 11180066
3454A1180066r9006J2489j06573n18j053k80903j55475k00491j78665j75184j97099
$$ 11180066 11081060 11093549 10986976 10986458 10985405 10704502 10549027 10348536 10169871 9994687 9797588
3443I797588m0332l3113j95423k21409j28725l3958p1491j37775m9113j21325
$$ 9797588 9757256 9724143 9528720 9307311 9178586 9144628 9073137 8935362 8886249 8764924
3433H764924n4731j17427j76880K7453J70956j12022k36198j34302l5439j17473
$$ 8764924 8710193 8592766 8415886 8443339 8614295 8502273 8266075 8131773 8096334 7978861
3423G978861j13563j06702k4850J60667m6918k02762j22580l08008j16919l8090
$$ 7978861 7865298 7758596 7733746 7894413 7847495 7644733 7522153 7214145 7097226 7059136
3413G059136J2237k47123j61307k13399l19484R1176O8455M5297o5137P5238j54265
$$ 7059136 7071373 6824250 6662943 6449544 6130060 6221236 6289691 6334988 6269851 6345089 6190824
3402F190824p7629k1261j97381j20775R5238J1738R9118j54581N3090j081J33184
$$ 6190824 6113195 6091934 5894553 5773778 5869016 5880754 5979872 5825291 5878381 5877300 6010484
3391F010484Q415q6892J290K3761j13981j52183J5584n0970j28417l19911J08501
$$ 6010484 6018899 5932007 5933297 5957058 5843077 5690894 5706478 5655508 5527091 5207180 5315681
3380E315681k62516j38066r4489n1580P1144J1308J00816j78556r6286l8445j32667
$$ 5315681 5053165 4915099 4820610 4769030 4840174 4851482 4952298 4773742 4677456 4639011 4506344
3369D506344P5237k4330j986n8575j25121m9090K58093j6701k16009K47091m788
$$ 4506344 4581581 4557251 4555265 4496690 4371569 4322479 4580572 4563871 4347862 4594953 4590165
3358D590165k2862j09351j69067P4276P893K6169j27448L2408K2899M3658k9899
$$ 4590165 4567303 4457952 4288885 4363161 4371054 4397223 4269775 4302183 4325082 4368740 4338841
3347D338841p23j9969j28738p1578J87937J7475j35966N1015J65925o8970P2388
$$ 4338841 4338118 4318149 4189411 4117833 4305770 4323245 4187279 4238294 4404219 4335249 4407637
3336D407637N6720L559j25832p6594J22686Q4032J65492j29211J20575m302K8600
$$ 4407637 4464357 4467916 4342084 4265490 4388176 4472208 4637700 4508489 4629064 4624762 4653362
3325D653362J00387J25043K4733k3292L2735J16211Q4720j4594l9518L25223O0786
$$ 4653362 4753749 4878792 4903525 4880233 4912968 5029179 5113899 5099305 5059787 5385010 5445796
3314E445796p6505n3404J10993O9982j05695j35579K2262J5008k4271q2256q1274
$$ 5445796 5369291 5315887 5426880 5496862 5391167 5255588 5277850 5292858 5268587 5186331 5105057
3303E105057K19380m2753j00491k6651M5278l2915j31216j88467l5608q597R3021
$$ 5105057 5324437 5281684 5181193 5154542 5199820 5166905 5035689 4847222 4811614 4803017 4896038
3292D896038j46577l7386M8032k4560m0231n9153o4673m2424R7250K9568o1239
$$ 4896038 4749461 4712075 4760107 4735547 4695316 4636163 4571490 4529066 4626316 4655884 4594645
3281D594645Q3872p19m4643j58126L1422P7971J97047O7581k03263j57381Q423
$$ 4594645 4678517 4677798 4633155 4475029 4506451 4584422 4781469 4849050 4645787 4488406 4496829
3270D496829K84594l7214j18106j1930j26549N9858j28029L8395J76517m8876
$$ 4496829 4781423 4744209 4626103 4614173 4487624 4547482 4419453 4457848 4634365 4585489
3260D585489Q2334p7658J50852o9523J53681j81877r5020J37690N9607J36495
$$ 4585489 4667823 4590165 4741017 4671494 4825175 4643298 4548278 4685968 4745575 4882070
3250D882070J56739k3144k30035J34410J56188j85254k00668J32237R0423j5016
$$ 4882070 5038809 5015665 4785630 4920040 5076228 4890974 4690306 4822543 4912966 4897950
3240D897950J21430R7419j6619O9844L6613Q1934K36540O6392J37871J26404J98289
$$ 4897950 5019380 5116799 5100180 5170024 5206637 5288571 5525111 5591503 5729374 5855778 6054067
3229F054067K51724K61574M16690L44517J13286Q8003Q1525L19380N72404L43728
$$ 6054067 6305791 6567365 6984055 7328572 7441858 7529861 7611386 7930766 8503170 8846898
3219H846898K22559L20050J43149J45435k2423k10075l08172l37464k57335k32277
$$ 8846898 9069457 9389507 9532656 9678091 9655668 9445593 9137421 8799957 8542622 8310345
3209H310345p7456j83563k14827n14163m67124k26029l51206k33926k46505k50067
$$ 8310345 8232889 8049326 7834499 7320336 6853212 6627183 6275977 6042051 5795546 5545479
3199E545479j09773M5019J31672Q816J52777j03747r0689k00178k70231j21667
$$ 5545479 5435706 5480725 5612397 5621213 5773990 5670243 5579554 5379376 5109145 4987478
3189D987478j07604J3767n1312n1572q1814R0390J58124j26239J49305J36313
$$ 4987478 4879874 4893641 4842329 4790757 4708943 4799333 4957457 4831218 4980523 5116836
3179E116836K10091L78911N20025L52059j39985m14130l36389k52553m74744k92304
$$ 5116836 5326927 5705838 6225863 6577922 6437937 6023807 5687418 5434865 4960121 4667817
3169D667817l39433l01623j64627j45783M6045j99042K30840J15765q0461j08363
$$ 4667817 4328384 4026761 3862134 3716351 3762396 3563354 3794194 3909959 3829498 3721135
3159C721135k45778k04175k0046p2244p9397L6522j6749M714L655k5315N6183
$$ 3721135 3475357 3271182 3251136 3178892 3099495 3136017 3119268 3123982 3127637 3102322 3158505
3148C158505L8055J10997J33643K48032K32908j52669j11335j98170j25081l26806
$$ 3158505 3196560 3307557 3441200 3689232 3922140 3769471 3658136 3459966 3334885 3008079
3138C008079j96719k85286O263j20198o7449J62244j55134Q41j96674m9376O0813
$$ 3008079 2811360 2526074 2532337 2412139 2344690 2506934 2351800 2352641 2155967 2106591 2167404
3127B167404M0446N071J1583j46519j60929O4777J3129k6569j61585K3170Q690
$$ 2167404 2207850 2212921 2224504 2077985 1917056 1981833 1994962 1968393 1806808 1829978 1838668
3116A838668O7882o0069j48547J17629r9473j82181P3996M8353J46322O6610P1785
$$ 1838668 1906550 1846481 1697934 1815563 1716090 1533909 1607905 1656258 1802580 1869190 1940975
3105A940975k27967j49743J5993O0228p6428J33113m2205j19857k2519M5417P5249
$$ 1940975 1713008 1563265 1579258 1639486 1563058 1696171 1653966 1534109 1511590 1557007 1632256
3094A632256n0536j62784L1403N0658N2916L0121j44762j27046J30165K7025j21034
$$ 1632256 1581720 1418936 1450339 1500997 1553913 1584034 1439272 1312226 1442391 1469416 1348382
3083A348382r535J14493m0428j84437O6646l3896J35743p6532O7241r8661J20291
$$ 1348382 1338847 1453340 1412912 1228475 1295121 1261225 1396968 1320436 1387677 1289016 1409307
3072A409307Q2794J70859R6392j05056j38015k53324j37888N1604J8486J33135
$$ 1409307 1492101 1662960 1759352 1654296 1516281 1262957 1125069 1176673 1195159 1328294
3062A328294P0212j21280j13159R9609r4601j91633R1783M4641K0750J56769L6142
$$ 1328294 1398506 1277226 1164067 1263676 1169075 977442 1069225 1113866 1134616 1291385 1327527
3051A327527N7028p9134r5683o4013q7391j8247N4984J33770O585O2835J6143
$$ 1327527 1384555 1305421 1209738 1145725 1058334 1040087 1095071 1228841 1235426 1298261 1314404
3040A314404n9381j38239o3668J85657l2763k6186m757J05286j54130m6505q1370
$$ 1314404 1255023 1116784 1053116 1238773 1206010 1179824 1175067 1280353 1126223 1079718 998348
3029I98348M3987j37980O9738p4422o0334J30233o8786P7821j51969Q9522N8260
$$ 998348 1042335 904355 974093 899671 839337 969570 900784 978605 826636 916158 974418
3018I74418o2461j56610K47865M3134p60r2014Q7413p5359r3346k3014j4227J59441
$$ 974418 911957 755347 1003212 1046346 1045586 953572 1040985 965626 872280 849266 835039 994480
3006I94480l7549n5867K5355Q8409j08141J5302o0490p4539O5937K505J11998
$$ 994480 956931 901064 926419 1014828 906687 921989 861499 786960 852897 855402 967400
2995I67400j33124m8126r787J28082J7487P7899r2266K4011L8587o6192L2016
$$ 967400 834276 786150 776363 904445 921932 999831 907565 931576 970163 903971 935987
2984I35987J39400j85453o3719K01797l270j54099n2443J99369J6991r4138K09043
$$ 935987 1075387 889934 826215 1028012 1024742 870643 818200 1017569 1034560 940422 1149465
2973A149465q1553j95313N4859p59J68018J39941k55293m2288Q9511l2409r6976
$$ 1149465 1067912 872599 927458 926699 1094717 1234658 979365 937077 1026588 994179 897203
2962H97203J4460L2675j2410K24321j20347l3031m7815J35978R0455O9093k2279
$$ 897203 911663 944338 931928 1156249 1035902 1002871 955056 1091034 1181489 1250582 1228303
2951A228303r6086O2006k6042J25301l9065J93732n682k8566P2901j18772Q191
$$ 1228303 1132217 1194223 1168181 1293482 1254417 1448149 1442467 1413901 1486802 1368030 1376221
2940A376221m5260n3485K6515K25309n6469m8600J68037N2463J33683J02032k8254
$$ 1376221 1330961 1277476 1303991 1529300 1472831 1424231 1592268 1644731 1778414 1880446 1852192
2929A852192J46904J19726J37606M6080J58643J93234L45064L43891R3931M06746
$$ 1852192 1999096 2118822 2256428 2302508 2461151 2654385 2999449 3343340 3437271 3844017
2919C844017M12262L88521k25968m61812l58438m54336k57054k56819j75119j7152
$$ 3844017 4256279 4644800 4418832 3957020 3598582 3144246 2887192 2630373 2455254 2438102
2909B438102j66582Q9481J24891j67523q0204j10350J01594L8138K21985J26503
$$ 2438102 2271520 2361001 2485892 2318369 2238165 2127815 2229409 2267547 2489532 2616035
2899B616035L2002m0014M9638k5062L48502Q3315j8190K27424L52464K87787L92653
$$ 2616035 2648037 2608023 2657661 2632599 2981101 3064416 3046226 3273650 3626114 3913901 4306554
2888D306554N772j64287r1147j84601l96771l51677j50371k60959j81775J01210
$$ 4306554 4312326 4148039 4056892 3872291 3475520 3123843 2973472 2712513 2530738 2631948
2878B631948J73154j14158m6768j36784r6768k6032j27343j09600j38092n3527
$$ 2631948 2805102 2690944 2644176 2507392 2410624 2384592 2257249 2147649 2009557 1956030
2868A956030R9412l6845j07759L9335j40410k30613J7561R2749q8566k7371J54509
$$ 1956030 2055442 2018597 1910838 1950173 1809763 1579150 1596711 1689460 1600894 1573523 1728032
2857A728032O8640j25044K2100j4454o8763j8731j36436J30974J31448J45529
$$ 1728032 1796672 1671628 1693728 1679274 1610511 1591780 1455344 1586318 1717766 1863295
2847A863295j67288j07438p2274Q1733k32j94013N2021N0538j63326Q3130k12619
$$ 1863295 1696007 1588569 1516295 1598028 1597796 1403783 1455804 1506342 1343016 1426146 1213527
2836A213527j24833j672J26743J35666J58363o4894j42416j08096o9118J2646
$$ 1213527 1088694 1087022 1213765 1349431 1507794 1442900 1300484 1192388 1123270 1135916
2826A135916M163P1985k0817l7150n6579J1200p9078M2747n7727P0749k17133
$$ 1135916 1140079 1212064 1191247 1154097 1097518 1108718 1029640 1072387 1014660 1085409 868276
2815H68276O058K9066j15629J7070L8075J21799k04758J373l1041L7463M9114
$$ 868276 874334 903400 787771 804841 842916 964715 759957 761330 730289 767752 816866
2804H16866j02880n1148K6671O7733L1996j68968j4037q0190p3646J37180q390
$$ 816866 713986 662838 689509 757242 789238 620270 606233 526043 452397 589577 581187
2793E81187M5640M6177j74744j00549N7989o886J96084m1426j73544N1072m5802
$$ 581187 626827 673004 498260 397711 455700 448814 644898 603472 429928 481000 435198
2782D35198j15695N0877J37977K1070J69727j45934k10488k6348K17776j61872
$$ 435198 319503 370380 508357 529427 699154 553220 342732 316384 534160 372288
2772C72288k2367K2396r1383n5419J15982K83785j85n5520m8012l1492J04072
$$ 372288 349921 372317 280934 225515 341497 625282 625097 569577 521565 490073 594145
2761E94145j80228o5961J67023o2531j76976N349J28908l9195q4080j21200O554
$$ 594145 413917 347956 514979 452448 275472 280821 409729 370534 286454 165254 171808
2750A71808n1617J18168o7565N0357o1416J98922j17532R9940j04129o9822J81415
$$ 171808 120191 238359 170794 221151 159735 358657 241125 341065 236936 167114 348529
2739C48529P6284M3451j28735l2756J6098q1709J11864j62451M119J28674k6871
$$ 348529 424813 468264 339529 306773 322871 241162 353026 190575 194694 323368 296497
2728B96497M2894R261o1498k40423m2604K87507p8125k6340J10560k6004K6421
$$ 296497 339391 348652 287154 46731 4127 291634 213509 187169 297729 271725 298146
2717B98146j32066Q6178J34764n4600k04650J07659j32265J16206N1895m1660
$$ 298146 166080 252258 387022 332422 127772 235431 103166 219372 271267 229607
2707B29607r6820m9327Q5527n1175J4755K15209p9588O2264m9354k13726q2277
$$ 229607 132787 83460 168987 117812 132567 347776 268188 330452 281098 67372 -14905
2696a4905J07504J19656K9882j17775l6923K7427N2443J28506J04360j30843J9194
$$ -14905 92599 212255 242137 124362 87439 114866 167309 295815 400175 269332 288526
2685B88526R4810j75364n6237l4957J09039n3760r1656J74695R918k8123q2737
$$ 288526 383336 207972 151735 116778 225817 172057 80401 255096 265014 236891 154154
2674A54154m679J69393j82142K4155k1661J2372m1173J10551O7967p5399p558
$$ 154154 149475 318868 136726 160881 139220 151592 110419 220970 288937 213538 205980
2663B05980O5371m3765J0519j6347K9919q1182m4103r1626K32558l79k19312l437
$$ 205980 271351 227586 238105 221758 251677 170495 126392 34766 267324 266945 47633 44196
2651D4196o1751J25264J13828J2203k0471l0445m2326j7511l6909N3155K3857
$$ 44196 -17555 107709 221537 233740 213269 182824 140498 122987 86078 139233 163090
2640A63090K5695l4681j49045n4220K49027m6794o1261M9009j90946J01706J65549
$$ 163090 188785 154104 5059 -49161 199866 153072 91811 140820 -50126 51580 217129
2629B17129m5043R6264n2536j30997L6079k9138p7459R4732o5814p9497J10068
$$ 217129 172086 268350 215814 84817 120896 91758 14299 109031 43217 -36280 73788
2618G3788p1451o3619J07026Q5703o378J3789N1257M9212j02287j5370P2589j8801
$$ 73788 2337 -61282 45744 131447 125069 138858 190115 239327 137040 121670 194259 175458
2606A75458m6205J9956P712n1139L3526q6810o4675J23727q2877j9616L0427R0293
$$ 175458 129253 149209 156921 105782 139308 52498 -12177 111550 28673 9057 39484 129777
2594A29777M1073j02516j7743J86920J40187q3473j33385q5300K1860j0678n8460
$$ 129777 170850 68334 50591 237511 377698 294225 160840 75540 97400 86722 28262
2583B8262k6331R0854j2504P3276N3210p6552j21873J44535o1045J0029K2385
$$ 28262 1931 92785 80281 153557 206767 130215 8342 152877 91832 101861 124246
2572A24246p3692k01075J07654R5540N5618r5775j14247m8959J46427J32964L4727
$$ 124246 50554 -150521 -42867 52673 108291 12516 -101731 -150690 -4263 128701 163428
2561A63428K3993j23088p0175k409o9981N0155K99863k04731j91082P9394M4193
$$ 163428 187421 64333 -5842 -8251 -78232 -28077 271786 67055 -124027 -44633 -440
2550d40J17411L2738j59196l9964R8070k2332K19928O4386k19157n1045K8728
$$ -440 116971 149709 -9487 -49451 48619 26287 246215 310601 91444 40399 69127
2539F9127L17L591j48812q8064J22062j2399J99124L1841j42856M3462k5957j02387
$$ 69127 69444 73035 -75777 -163841 -41779 -54178 144946 176787 33931 77393 51436 -50951
2527e0951l3201J09523n5958o9220J37914P8654m1878p8025j48859j0513J47030
$$ -50951 -84152 25371 -30587 -99807 38107 116761 74883 -3142 -152001 -162514 -15484
2516a5484o0614N4228l9532p8057l862J14588j8932J92574q66j40110J16743j15777
$$ -15484 -76098 -21870 -61402 -139459 -143321 -28733 -47665 144909 144043 3933 120676 4899
2504D899o871l0647j03161N8834j6994P0696J0182P3474m4699O5659j4834j00444
$$ 4899 -1972 -32619 -135780 -76946 -93940 -23244 -13062 60412 15713 81372 66538 -33906
2492c3906j21030Q2751J05955O0954K5022k13507p734M0687K4460K2128J35108
$$ -33906 -154936 -72185 33770 94724 119746 -93761 -101495 -60808 -36348 -14220 120888
2481A20888m4938j09859K1668q5574P6178j1196m3108o7899K18311J82597K4781
$$ 120888 75950 -33909 -12241 -97815 -21637 -32833 -75941 -143840 74471 257068 281849
2470B81849r9106p5085r0886R7168L057j45312M0254O1754K19748j33737j48337
$$ 281849 182743 107658 16772 113940 116997 -28315 11939 73693 293441 159704 11367
2459A1367O0354l0136j21354Q0312K387L4542j10507p12J36282N0088J395k168
$$ 11367 71721 41585 -79769 543 2930 37472 -73035 -73747 62535 112623 114018 111850
2447A11850k14551r182O9851K8941M228k7811Q0053J50056n9238p974j7602k5969
$$ 111850 -102701 -111883 -42032 -13091 -8863 -36674 43379 193435 134197 126223 108621 82652
2435H2652P1264r8460L5457J79238n6392q5457j13876J675L267P997m970o910
$$ 82652 153916 55456 90913 270151 213759 128302 14426 16101 19368 27365 22395 15485
2423A5485M3884P25K7953r2739P8206j9969O400L9942K12o1175M721Q2261j19518
$$ 15485 59369 60094 88047 -4692 73514 53545 59945 99887 100099 38924 43645 125906 6388
2410F388O255J00655j64321L584m3379K8844J14981N093o7804j4159Q3323J5733
$$ 6388 12643 113298 -51023 -47439 -90818 -61974 53007 58100 -9704 -23863 59460 75193
2398G5193j47811n7493J20704O3210j53232N2567J78984j17520j20212J29314
$$ 75193 -72618 -130111 -9407 53803 -99429 -46862 132122 14602 -105610 23704
2388B3704O9628l3678M9161R315j1204l953q4870j05581l3615R9753Q8323J26106
$$ 23704 93332 59654 108815 118130 106926 102973 18103 -87478 -121093 -21340 66983 193089
2376A93089P9846O8817k04324m4085r7878R6987J14851l0282P7754j40569K2583
$$ 193089 272935 341752 137428 93343 -4535 92452 207303 177021 254775 114206 136789
2365A36789J17950k074j96172K24194j8324j52549P1627k2740j4643m9929Q8141
$$ 136789 254739 252665 56493 280687 262363 109814 181441 158701 144058 94129 182270
2354A82270J30100p8193L475L5734l0109m981J45798N7718k4202P06L9642M8906
$$ 182270 312370 234177 237652 273386 243277 238296 384094 441812 417610 418316 457958 506864
2342E06864p6571k66404K4112L6805R0810j49837q1597m710M7731J5105L4490
$$ 506864 430293 163889 188001 224806 315616 165779 84182 79472 127203 142308 176798
2331A76798k8976j25992K7585k8161M8875j00049Q8426J42261j2102j61193j8473
$$ 176798 147822 21830 49415 21254 70129 -29920 58506 200767 188665 27472 8999
2320H999O8444p464K5308K00927q7179j14687O7226m8885l4121k11642O8930L6953
$$ 8999 77443 69979 95287 296214 209035 94348 161574 112689 78568 -133074 -64144 -27191
2308b7191Q3942K820R0056J13445l2219j33685J45028j53331L98j92159j50577
$$ -27191 56751 59571 149627 263072 230853 97168 242196 88865 89263 -102896 -253473
2297b53473J83006P1222P8759J17475Q54j40820O0542j2780J49785k0616j20140
$$ -253473 -70467 755 79514 196989 197843 57023 117565 104785 254570 233954 113814
2286A13814Q5215J05777j52991J06355p8104j23179M8316O7498k6685k3483R924
$$ 113814 199029 304806 151815 258170 180066 56887 105203 172701 146016 122533 132457
2275A32457L6167o763L5293o0840o8500J18147O3625n7754J22707r2761p5889
$$ 132457 168624 161861 197154 136314 67814 185961 249586 191832 314539 221778 145889
2264A45889j5566J32450m8800K5124J6138J4675m335Q8560J1084o0873J9942j75672
$$ 145889 130323 262773 213973 239097 255235 269910 265575 354135 365219 304346 324288 148616
2252A48616L1072k5969j24810P3209J71079J6986j81884N421n2617n5401J56950
$$ 148616 179688 153719 28909 102118 273197 290183 108299 113720 61103 5702 162652
2241A62652n7967l152J67468m3521p0178J21948K4614j1777j29639o6235Q6057
$$ 162652 104685 101533 269001 225480 155302 277250 301864 290087 160448 94213 180270
2230A80270K0241J9559N1866m910p9074o301k8721J30468o4929j07472M8125N5660
$$ 180270 200511 220070 271936 267026 187952 181651 152930 283398 218469 110997 159122 214782
2218B14782M203o9034L7115O5245R2823l8557P1131O1655p7359R456J01151n0611
$$ 214782 218985 149951 187066 252311 345134 306577 377708 439363 362004 371460 472611 422000
2206D22000j17676Q6914J18204r1828j2602q9704M4855k2063j39772J22980J5975
$$ 422000 304324 391238 509442 417614 405012 315308 360163 338100 198328 321308 337283
2195C37283n1708O7961L9892l4131N1740O9113m5928P485J61364k944j02682O0171
$$ 337283 285575 353536 393428 359297 411037 480150 434222 441707 603071 600127 497445 557616
2183E57616M6475m8819K7855J06673J0174j6165r8403R6563j05103J09905K11012
$$ 557616 604091 555272 583127 689800 699974 683809 585406 681969 576866 686771 897783
2172H97783R9302P1761o5185J79189n1790j42054j23290n4410J58818Q3673k2906
$$ 897783 997085 1068846 1003661 1182850 1131060 989006 865716 811306 970124 1053797 1030891
2161A030891J96506J26935m3947k05136j9430N3775J05418J72485r2767l2447
$$ 1030891 1227397 1354332 1310385 1105249 1085819 1139594 1245012 1417497 1324730 1292283
2151A292283M9716M5414J28379J36571M0846m3919m3968j34527J23517m651p7766
$$ 1292283 1341999 1387413 1515792 1652363 1693209 1649290 1605322 1470795 1594312 1589661 1511895
2140A511895J1757P537N8235k4278J44784P0002j29260J56186O9954J2646Q7826
$$ 1511895 1523652 1531189 1589424 1565146 1709930 1779932 1650672 1806858 1876812 1889458 1977284
2129A977284q1589J01944K02495J87118m6115m6696K8302M9109J42244K41955
$$ 1977284 1895695 1997639 2200134 2387252 2341137 2294441 2322743 2371852 2514096 2756051
2119B756051p9879J17244J18742J90781J19155J63058K15447J64096K44186J55316
$$ 2756051 2676172 2793416 2912158 3102939 3222094 3385152 3600599 3764695 4008881 4164197
2109D164197J18916K19759K14471L60687K15719J09031R0272L17041L35849N35424
$$ 4164197 4283113 4502872 4717343 5078030 5293749 5402780 5493052 5810093 6145942 6681366
2099F681366K72890K03100M39827Q43782P87298Q07439J051120Q83136Q35741
$$ 6681366 6954256 7157356 7597183 8440965 9228263 10035702 11086822 11969958 12805699
2090A2805699J126233J144056J182607J694989J815641K238022K701530L687503
$$ 12805699 13931932 15075988 16258595 17953584 19769225 22007247 24708777 28396280
2082B8396280N115792O194999Q295158J1434444J4792581Q081277o406885j1670008
$$ 28396280 33512072 39707071 48002229 59436673 74229254 82310531 75903646 64233638
2074F4233638j0869431r189915p878664o251464n138149l802719k680377k003389
$$ 64233638 53364207 44174292 36295628 30044164 24906015 21103296 18422919 16419530
2066A6419530j525633j231470p81492m61300o90846r54015p15553p26313o73661
$$ 16419530 14893897 13662427 12880935 12419635 11728789 10774774 10059221 9332908 8659247
2057H659247o50224m96201n26358k43409m06992m34385k56897k62298k33996l14783
$$ 8659247 8009023 7512822 6986464 6743055 6336063 5901678 5644781 5382483 5148487 4833704
2047D833704j25368k19049j78829m52770r4392m5102r7625q9768j71418k14263
$$ 4833704 4708336 4489287 4310458 3857688 3763296 3718194 3620569 3530801 3359383 3145120
2037C145120j84764q9922k06335K968l5624j80722K8816q8401N203j41069l1513
$$ 3145120 2960356 2870434 2664099 2667067 2631443 2450721 2479537 2391136 2396339 2255270 2223757
2026B223757J8127m6150j85008j28063J00285j41250o5492P091L5332l9326k09060
$$ 2223757 2241884 2195734 2010726 1882663 1982948 1841698 1776206 1783297 1818629 1779303 1570243
2015A570243M3656m4506m3393j48312K5466J18763k09290J2984N1323M4765j80740
$$ 1570243 1613899 1569393 1526000 1377688 1403154 1521917 1312627 1325611 1376934 1421699 1240959
2004A240959M14J5509J57501o8008j23504j57140q1308j50579p5663k5672Q4705
$$ 1240959 1241373 1256882 1414383 1346375 1222871 1065731 984423 833844 758181 732509 817214
1993H17214O3135P8194j2256k11345N2855J71676K8704j14647n8554j54785r1753
$$ 817214 880349 958543 946287 734942 787797 959473 988177 873530 814976 660191 568438
1982E68438m5876L4304J11903J04711J08690r1978k38338J05533R4369j02048
$$ 568438 522562 556866 668769 773480 882170 790192 551854 657387 751756 649708
1972F49708p4548o849L6765K34j2133N5599j12092q9227J32447j9576R6503m7321
$$ 649708 575160 568311 605076 605310 593177 648776 536684 447457 579904 560328 656831 609510
1960F09510J22456o1975j60296R530k18456O9157J60837o2796j6458L646Q9335
$$ 609510 731966 669991 509695 519225 300769 369926 530763 467967 451509 455155 544490
1949E44490o3293j34521j2201n8907n885K4432l3772O8741J76592N1432j44833
$$ 544490 481197 346676 334475 275568 269683 294115 260343 329084 505676 557108 412275
1938D12275j37389p7780Q3534j0352J59236J7648j51105j14136m2274P7562J33305
$$ 412275 274886 197106 280640 270288 429524 447172 296067 181931 139657 217219 350524
1927C50524O1449r4950r0646J24220P4311p4052L7407k5501n2032j68401J68690
$$ 350524 411973 317023 226377 350597 424908 350856 388263 362762 310730 142329 311019
1916C11019k2762J21282p0332k3258R9955k6359o5347l7889m4646N9345J04499
$$ 311019 288257 409539 339207 315949 415904 389545 324198 286309 241663 301008 405507
1905D05507M8193L0862p7072l4603j10591N7450R8170q7706n5413p456O799q4491
$$ 405507 453700 484562 407490 372887 262296 319746 417916 330210 274797 267341 274140 189649
1893A89649j0696O5266r8472M1057K64012J2111p4320p2658l336p6452J8976p9142
$$ 189649 178953 244219 145747 186804 450816 462927 388607 315949 312613 236161 255137 175995
1881A75995k3507K77409k00272j28279R5687R0957n3037q0960M8237M5607j47769
$$ 175995 152488 429897 229625 101346 197033 287990 234953 153993 202230 247837 100068
1870A00068O3244p2763m1763J15059P7027N7805m3517k3671j14970m0594J28285
$$ 100068 163312 90549 48786 163845 240872 298677 255160 231489 116519 75925 204210
1859B04210m4475n0455j12379Q1810J14803n9639j34879M1780J02554n6378l7865
$$ 204210 159735 109280 -3099 78711 193514 133875 -1004 40776 143330 86952 49087
1848D9087J02844N8916O6410M8819j58122j35047L4423j56679K08307R8657K2955
$$ 49087 151931 210847 277257 326076 167954 32907 67330 -89349 118958 217615 240570
1837B40570M6386p089J82217j4457p0821j04137K5214r4005k4671L2506J57433
$$ 240570 286956 279867 462084 447627 376806 272669 297883 203878 179207 211713 369146
1826C69146J8269k56898L8508J31965k15617R2195m297k02689K8654J54023N4412
$$ 369146 387415 130517 169025 300990 85373 177568 173271 -29418 -764 153259 207671
1815B07671p6581P7825m3295M213J21912R5404N252p1256l0959n9225P3121l6130
$$ 207671 131090 208915 165620 169833 291745 387149 392401 321145 290186 230961 304082 267952
1803B67952j37999j7536M4689J26176L0200j67803Q23j7273Q4742o7255j00713
$$ 267952 129953 112417 157106 283282 313482 145679 146502 129229 213971 146716 46003
1792D6003m9300O0907K6772Q152J3954R7471J8170p0123n8914L8376N8345J03296
$$ 46003 -3297 57610 84382 92534 106488 203959 222129 152006 93092 131468 189813 293109
1780B93109k39548p2008Q8232J671R911q5486J9133o1876j02003R9912l1120J20072
$$ 293109 53561 -18447 69785 71456 81367 -4119 15014 -46862 -148865 -48953 -80073 39999
1768C9999r376m46O8414r4042M0499j64887J94422j11138l0911Q4494R8997l3437
$$ 39999 30623 30177 98591 4549 45048 -119839 74583 -36555 -67466 17028 116025 82588
1756H2588N6029j7107j80920J05203N5787l9718j4641R7013m2834J4273J7170
$$ 82588 138617 121510 -59410 45793 101580 61862 47221 144234 101400 115673 132843
1745A32843k20r5046j3916P9009r5673p3522M3384m8366J00684O2087j66879m5562
$$ 132843 132623 37577 23661 102670 6997 -66525 -23141 -71507 29177 91264 -75615 -121177
1733a21177J98492k6518l9110j4346m8882O1686L0376J4278r9096r8386n2679
$$ -121177 77315 50797 11687 -2659 -51541 10145 40521 54799 -44297 -142683 -195362
1722a95362K06599j08224q7748m8309K6958J99542J74404j37457N0271j00772
$$ -195362 11237 -96987 -184735 -233044 -206086 -6544 167860 30403 80674 -20098
1712b0098j67959R8521N0105N049M2981n2615Q4836J523j7793K03229j09754M7096
$$ -20098 -188057 -89536 -39431 -34382 8599 -44016 40820 42343 24550 227779 118025 165121
1700A65121N6747k22421j65151L8195J21778K9641L0519Q501l317L6428j2518
$$ 165121 221868 -553 -165704 -127509 -5731 23910 54429 62930 59613 96041 83523
1689H3523j02467J0796P9225n7466K3105p5503j60849J32114M6959k6071J43261
$$ 83523 -18944 -8148 71077 13611 36716 -38787 -199636 -67522 -20563 -46634 96627
1678I6627n2204n9089N2157j29278r556J5363N7601p290j12334J31012j07493
$$ 96627 44423 -14666 37491 -91787 -101343 -85980 -28379 -35669 -148003 -16991 -124484
1667a24484j33052J12305J09619J07631N9057J115O5089j8266o6682l5891o0869
$$ -124484 -257536 -145231 -35612 72019 131076 132191 197280 179014 112332 76441 15572
1656A5572n9115O5537l7873o287M5886j05483J03434N8518o7768j59951L5549
$$ 15572 -43543 21994 -15879 -22166 23720 -81763 21671 80189 12421 -147530 -111981
1645a11981J39829J4116j5956n2732l5187j80773N2817K00086K10016J47341j85218
$$ -111981 27848 41964 26008 -26724 -61911 -242684 -189867 10219 220235 367576 182358
1634A82358j60710q6265J33596O4906j6121j81392j4448J05532L1870m4309j18492
$$ 182358 21648 -64617 68979 133885 117764 -63628 -78076 27456 59326 15017 -103475
1623a03475J95418m7945J07110j10306q0697j8714L9707M7916q576j24967K7055
$$ -103475 91943 43998 151108 40802 -39895 -58609 -18902 29014 20438 -104529 -77474
1612g7474K35045k77760n9877J55052k6064J23685m7055Q9679k22205J96799J09801
$$ -77474 157571 -120189 -180066 -25014 -51078 72607 25552 115231 -106974 89825 199626
1601A99626p3004O828K6294K912k23142N3098m5474J38819q6830k9367K7827l8769
$$ 199626 126622 133450 159744 162656 -60486 -7388 -52862 85957 -873 -30240 -2413 -41182
1589d1182M4313m9409l1518O915l5611n8520J20842Q0723k3246P7986m8512l121
$$ -41182 3131 -46278 -77796 -70881 -106492 -165012 -44170 36553 13307 91293 42781 39660
1577C9660j9531J46149P4r0156o1924j32494J59166J35929j23325p4192J42370
$$ 39660 20129 166278 166352 76196 14272 -118222 40944 176873 53548 -20644 121726
1566A21726j32079o3839P5607m8808M801K0474j3844P1790K45940j62268k03527
$$ 121726 -10353 -74192 1415 -47393 -42592 -22118 -35962 35828 281768 119500 -84027
1555h4027m6607Q5797J28274J09573j55594o9604K4073j21870L7144J01944q0870
$$ -84027 -130634 -44837 83437 193010 37416 -32188 -8115 -129985 -92841 9103 -71767
1544g1767J52001j07692L7877l6046j57434J98105k1892R0393K8227q5957l8400
$$ -71767 80234 -27458 10419 -25627 -183061 15044 -6848 83545 111772 25815 -12585
1533a2585k5741O2955L4842R3371j16567j7133m5216j98380K6494M4131J02880
$$ -12585 -38326 24629 59471 152842 36275 19142 -26074 -224454 -197960 -153829 -50949
1522e0949P7276k0728L4154j3199j08431m8263k1328Q5453j9127R7182j33112
$$ -50949 26327 5599 39753 26554 -81877 -130140 -151468 -66015 -85142 12040 -121072
1511a21072P4232K2021j1061N1492R4944q5105j35131K5797O0020K1495m6772
$$ -121072 -46840 -24819 -35880 15612 110556 25451 -109680 -83883 -23863 -2368 -49140
1500d9140L3002l3243k2410k3821K217k4220J13368J24656j04885J414j54535
$$ -49140 -16138 -49381 -71791 -95612 -93395 -117615 -4247 120409 15524 16938 -137597
1489a37597K3475J10897j3641j4678m9646p2134O509J31187l8704r8485J5782
$$ -137597 -114122 -3225 -16866 -31544 -81190 -153324 -146815 -15628 -54332 -152817 -137035
1478a37035J1498L8400O8249o5580O4159P9359j9421l6512o5728Q7875j06108
$$ -137035 -125537 -87137 -18888 -84468 -20309 59050 39629 3117 -62611 25264 -80844
1467h0844P9754q8623l1846Q4830M14J05687k8333Q7077o5737p9201j34856L5474
$$ -80844 -1090 -89713 -121559 -36729 -36315 69372 41039 128116 62379 -16822 -151678 -116204
1455a16204J8809O8491m0701o5731K1844N8440M9856j2231n5L5810m1467n1683
$$ -116204 -97395 -28904 -69605 -135336 -113492 -55052 -5196 -17427 -17482 18328 -23139 -74822
1443g4822J22046n6051q5039k8842m8222N0787M0165J48897K7346P3354j47203
$$ -74822 47224 -8827 -93866 -122708 -170930 -120143 -79978 68919 96265 169619 22416
1432B2416K6746m0738j09939M6126p600j2811M3997K65103k29075p0360j09037
$$ 22416 49162 8424 -101515 -55389 -62989 -75800 -31803 233300 4225 -66135 -175172
1421a75172P2922J82862m2555j02441n4548O3864J12793n3863r3930R7801L4716
$$ -175172 -102250 80612 38057 -64384 -118932 -55068 57725 3862 -90068 7733 42449
1410D2449J67121r5223P5328j49937J19666j30696q0865P0506k6116k7396J25388
$$ 42449 209570 114347 189675 39738 159404 28708 -52157 18349 -7767 -35163 90225
1399I0225Q3774j69395P3313L6775j806j43736n773r5204j7855N5489M5459O1162
$$ 90225 173999 4604 77917 114692 112886 -30850 -36623 -131827 -149682 -94193 -48734 12428
1387A2428n2227j02979p2679J23501o5613N7231P2786j99700J91379O2139j98768
$$ 12428 -39799 -142778 -215457 -91956 -157569 -100338 -27552 -227252 -35873 26266 -172502
1376a72502r8025P3891J50700N4616o5732j59418N8960R7062k39131K01054j28198
$$ -172502 -270527 -196636 -45936 8680 -57052 -216470 -157510 -60448 -299579 -98525 -226723
1365b26723l1735k9771P6452J33952M6540k5071J04196l2807j8690J14478j17900
$$ -226723 -258458 -288229 -211777 -77825 -31285 -56356 47840 15033 -3657 110821 -7079
1354g079R5681p9469L1963j48301P1904L6835N7345j8116K3734R9007j16155j03642
$$ -7079 88602 9133 41096 -107205 -35301 1534 58879 40763 64497 163504 47349 -56293
1342e6293R7394n5261o3504J29217R520j3038N3656N1959o2117j25831J26197
$$ -56293 41101 -14160 -77664 51553 61073 48035 101691 153650 91533 -34298 91899
1331I1899l0379j69411J5363M5796Q1313l201m8687N1p0670J33904J39154m5060
$$ 91899 61520 -107891 -92528 -46732 34581 31380 -17307 -17256 -87926 45978 185132 140072
1319A40072j24551l3543R2288p1950L265N7983J3683p6432q938j33678R1136K09735
$$ 140072 15521 -18022 74266 2316 5581 63564 77247 815 -8123 -141801 -50665 159070
1307A59070r2924j00327j45695M6207K25970M7217q3287j68156J60559N0277k03982
$$ 159070 66146 -34181 -179876 -133669 92301 139518 56231 -111925 48634 98911 -105071
1296a05071Q6416J5135m1163J00029j77264q194N7048R5368p131J5206K0757m2689
$$ -105071 -18655 -3520 -44683 55346 -121918 -130112 -73064 22304 15173 30379 51136 8447
1284H447q5139j19148J67113J14800n1290N1465N6482j06816j91888O1874n3851
$$ 8447 -76692 -195840 -28727 86073 34783 86248 142730 35914 -155974 -94100 -147951
1273a47951L4337j25648L7637K18614o3945R9662J41512j62349r8356R568q8131
$$ -147951 -113614 -239262 -201625 16989 -46956 52706 194218 31869 -66487 -56919 -145050
1262a45050r2791J29617j59502k4440J38212j4060k6249n2118J23466J44374Q2272
$$ -145050 -237841 -108224 -267726 -292166 -153954 -168014 -194263 -246381 -122915 21459 103731
1251A03731J7119r7123p4504N8903j3301q087j27071R6066K9403j3465m3873R3128
$$ 103731 120850 23727 -50777 8126 -5175 -13262 -140333 -44267 -14864 -28329 -72202 20926
1239B0926j10709n5190M1938L5602j38165Q5888J23662j1310k1207j3871L3802
$$ 20926 -89783 -144973 -103035 -67433 -205598 -119710 3952 -7358 -28565 -42436 -8634
1228h634K407p1244k0099J5247J21358k1074j5976q2630L6393P2368p3926k6706
$$ -8634 -6227 -77471 -97570 -82323 39035 17961 1985 -80645 -44252 28116 -45810 -72516
1216g2516O0094L8734Q694P3477j32036m561m1R2218J43931q2260j17690q1823
$$ -72516 -12422 26312 35006 108483 -23553 -28114 -28155 64063 207994 125734 8044 -73779
1204g3779j46043M6430K05026j5433q2370L5896p7889J27861m2371K0154k6637
$$ -73779 -219822 -173392 31634 16201 -66169 -30273 -108162 19699 -22672 -2518 -29155
1193b9155j96890J67409k3865k7371J30014o501n4600l5462R5368j885o7476M2166
$$ -29155 -226045 -58636 -82501 -109872 20142 13641 -40959 -76421 18947 17062 -50414 -8248
1181h248m3515k8543j0288L4098r7640J7278J14951P8860o952j39139J4434J32119
$$ -8248 -51763 -80306 -90594 -56496 -154136 -136858 -21907 56953 50001 -89138 -74704 57415
1169E7415j17109m0155L0460n2727M97p6509R5807J04136j15874l6650P1649J30649
$$ 57415 -59694 -99849 -69389 -122116 -121619 -198128 -102321 1815 -114059 -150709 -79060 51589
1157E1589N237j31131O7579M9490n8937j06040j9364m1926K0125N5722m2993L248
$$ 51589 56826 -74305 -6726 42764 -16173 -122213 -141577 -183503 -163378 -107656 -150649 -147401
1145a47401r6273M8892L2544K5282n6753N2645M6659Q0414j8140p0291M0034O0743
$$ -147401 -243674 -194782 -162238 -136956 -193709 -141064 -94405 -13991 -32131 -102422 -62388 -1645
1133a645J36152k24902k20533R486M7339K09907J18598j19178p6192J38300Q2154
$$ -1645 134507 -90395 -310928 -301442 -254103 -44196 74402 -44776 -120968 17332 99486
1122I9486O2614O5229j07039j87176j707k5880K97600k1216o9692K2211n3386
$$ 99486 162100 227329 120290 -66886 -68593 -94473 203127 181911 112219 134430 81044
1111H1044m3087k54616J94132l0488o423p3878L1010n4956J14122n0704K4511
$$ 81044 37957 -216659 -22527 -53015 -59438 -133316 -102306 -157262 -43140 -93844 -69333
1100f9333M9551L7913p036N7050O4665p0355j6211J49176j38797p9299m8915l0876
$$ -69333 -19782 18131 11095 68145 132810 62455 46244 195420 56623 -22676 -71591 -102467
1088a02467M257N8105j3543j6092P6323N0066k4653k8721K6796k4081k1324m7749
$$ -102467 -98210 -40105 -53648 -69740 6583 56649 31996 3275 30071 5990 -15334 -63083
1076f3083L2393J69288p0750k09429j4879J62080L2384j77691J91070J2250m5808
$$ -63083 -30690 138598 67848 -141581 -156460 5620 38004 -139687 51383 63633 17825
1065A7825j25158j24247M6078K51671p1268j62561M5969j0585J42373M8854j80191
$$ 17825 -107333 -231580 -185502 66169 -5099 -167660 -121691 -132276 10097 58951 -121240
1054a21240O0171K01640J60465j4535r8426n7252j01576L3178L933k5631k447
$$ -121240 -61069 140571 301036 286501 188075 130823 29247 62425 66358 40727 38280
1043C8280j1812q1025l2428o6214m9221j2729Q3018J31750J9675P3499j75025
$$ 38280 26468 -54557 -86985 -153199 -202420 -215149 -132131 -381 19294 92793 -82232
1032h2232l3641Q7446l5195j4132n14J80920r0347o2230j19298J676O7416q4854
$$ -82232 -115873 -28427 -63622 -77754 -78268 102652 12305 -49925 -169223 -167547 -100131 -184985
1020a84985n1532Q1231M4510O8379Q7956j25749J7720O2480j35113o6177J84260
$$ -184985 -236517 -155286 -110776 -42397 45559 -80190 -62470 10 -135103 -201280 -17020
1009a7020M8644n4533q1722M0968N7520n7702N2522J88011j26579K0228L32p5367
$$ -17020 31624 -22909 -104631 -63663 -6143 -63845 -11323 176688 50109 70337 70669 -4698
997d698r5481n7767l2967J49388j61629o4921J31040J23728N2273k5910J9074
$$ -4698 -100179 -157946 -190913 -41525 -203154 -268075 -137035 -13307 38966 13056 32130
986C2130M2632j69624o1088P2239J33843q858K00795l01073l8647Q4018l4512
$$ 32130 74762 -94862 -155950 -83711 50132 41274 242069 -59004 -97651 -13633 -48145
975d8145O0380j07197J37149p8142K7304p7493p9871m8513j0173J08332N6207
$$ -48145 12235 -94962 42187 -35955 -8651 -86144 -166015 -214528 -224701 -116369 -60162
964f0162Q183J08996J5016N728q6851j301K7161j4085j18013q8816o3374Q4030
$$ -60162 -51979 57017 72033 77761 -9090 -10391 16770 2685 -115328 -204144 -267518 -183488
952a83488p2N7806K7093Q8447l6711P0765L3002m2888O8435K7955q7214j19709
$$ -183488 -183560 -125754 -98661 -10214 -46925 23840 56842 13954 82389 110344 23130 -96579
940i6579J01260R194n929o2770N5023p5462r9430j31348M8220O9563P4550P9972
$$ -96579 4681 13875 7946 -54824 199 -75263 -174693 -306041 -257821 -188258 -113708 -33736
928c3736O0831l2207J01073P7803q4147o6848p3290j05162p9475J742J67113q4587
$$ -33736 27095 -5112 95961 173764 89617 22769 -50521 -155683 -235158 -233416 -66303 -150890
916a50890k18395K70747L1339R6889q5729j23139R5576P9907N2235P0233k7103
$$ -150890 -369285 -98538 -67199 29690 -56039 -179178 -83602 -3695 48540 118773 91670
905I1670j59996j41390J48626r3211O626O9894O9898R376j41651m1048L951K0075
$$ 91670 -68326 -209716 -61090 -154301 -147675 -77781 -7883 1493 -140158 -181206 -177255 -157180
893a57180P5972j8928L4550L9903l007r3430J62725J34062p5047K0933j2927q0552
$$ -157180 -81208 -100136 -65586 -25683 -28690 -122120 40605 174667 99620 120553 107626 27074
881B7074M2110o8459L6463r069j93022M6011O2656J03839Q5470j24302k4670n1270
$$ 27074 69184 725 37188 28119 -164903 -118892 -56236 47603 133073 8771 -15899 -67169
869f7169R9246R0005j56073M0559j67440p2103r820p3259J07479L8165k9621P465
$$ -67169 32077 122082 -33991 6568 -160872 -232975 -242795 -316054 -208575 -170410 -200031 -192566
$$ [...]
##END NTUPLES=NMR SPECTRUM
##END=
