##TITLE=1H_EC-3286(2)
 CDCl3
 8 sc, 
 15.11.2022
##JCAMPDX= 6.0         $$ Bruker NMR JCAMP-DX V2.0
##DATA TYPE= NMR SPECTRUM
##DATA CLASS= NTUPLES
##ORIGIN= UXNMR, Bruker Analytische Messtechnik GmbH
##OWNER= root
$$ XWIN-NMR		Version 3.5
$$ Tue Nov 15 15:20:03 2022 Russian Standard Time (UT+4h)  she@DPX200
##.OBSERVE FREQUENCY= 200.1313499994
##.OBSERVE NUCLEUS= ^1H
##.ACQUISITION MODE= SIMULTANEOUS
##.ACQUISITION SCHEME= undefined
##.AVERAGES= 8
##.DIGITISER RES= 18
##SPECTROMETER/DATA SYSTEM= spect
##.PULSE SEQUENCE= zg30
##.SOLVENT NAME= Acetone
##.SHIFT REFERENCE= (INTERNAL, Acetone, 0, 15.7645)
##AUDIT TRAIL= $$ (NUMBER, WHEN, WHO, WHERE, WHAT)
$$ ##TITLE= Audit trail, XWIN-NMR		Version 3.5
$$ ##JCAMPDX= 5.01
$$ ##ORIGIN= Bruker BioSpin GmbH
$$ ##OWNER= she
$$ F:/spectra/data/she/nmr/H-F/1/pdata/1/auditp.txt
$$ ##AUDIT TRAIL=  $$ (NUMBER, WHEN, WHO, WHERE, WHAT)
(   1,<2022-11-15 15:18:38.54 +0400>,<she>,<DPX200>,
      <created by zg, POWCHK disabled, PULCHK disabled
       configuration hash MD5:
       00 E9 B6 7A A2 85 ED C7 34 08 36 98 17 FE 4E 26
       data hash MD5: 16K
       E4 24 78 3A 1D 11 5B FF 9F 3C 8F F8 B0 35 44 CE>)
(   2,<2022-11-15 15:18:46.43 +0400>,<she>,<DPX200>,
      <Start of raw data processing
       efp BC_mod = 2 LB = 0.24 FT_mod = 6 PKNL = 1 PHC0 = -17939.89 PHC1 = 9.200696 SI = 16K 
       data hash MD5: 16K
       72 DE 8C 05 E7 F0 6D 32 CC E7 3F 6C 4E 16 90 E9>)
(   3,<2022-11-15 15:19:06.65 +0400>,<she>,<DPX200>,
      <pk PHC0 = -8.639441 PHC1 = 11 
       data hash MD5: 16K
       DD F5 F4 ED 3C 13 6E 5F 7C AE BB DF C4 35 1A 42>)
(   4,<2022-11-15 15:19:09.95 +0400>,<she>,<DPX200>,
      <abs ABSG = 5 
       data hash MD5: 16K
       58 78 48 B2 BB 3B FF AA 64 4F 32 6E DE 66 67 FD>)
$$ ##END=
$$ 
$$ hash MD5
$$ 0B 26 CA 46 9D 09 D9 92 FF 1C A8 2F D0 2C 1E 1F
##$RELAX= 
##$RELAX= 
##$RELAX= 
##$RELAX= 
##$RELAX= 
##$RELAX= 
$$ Bruker specific parameters
$$ --------------------------
##$DU= <F:/spectra>
##$EXPNO= 1
##$NAME= <H-F>
##$PROCNO= 1
##$TYPE= <nmr>
##$USER= <she>
##$AMP= (0..31)
100 100 100 100 100 100 100 100 100 100 100 100 100 100 100 100 100 100 
100 100 100 100 100 100 100 100 100 100 100 100 100 100 
##$AQSEQ= 0
##$AQ_mod= 1
##$AUNM= <au_zg>
##$AUTOPOS= <>
##$BF1= 200.13
##$BF2= 200.13
##$BF3= 200.13
##$BF4= 200.13
##$BF5= 200.13
##$BF6= 200.13
##$BF7= 200.13
##$BF8= 200.13
##$BYTORDA= 1
##$CFDGTYP= 0
##$CFRGTYP= 5
##$CHEMSTR= <none>
##$CNST= (0..31)
1 1 145 1 1 1 1 1 1 1 1 1 1 1 1 1 1 1 1 1 1 1 1 1 1 1 1 1 1 1 1 1 
##$CPDPRG= <>
##$CPDPRG1= <>
##$CPDPRG2= <>
##$CPDPRG3= <>
##$CPDPRG4= <mlev>
##$CPDPRG5= <mlev>
##$CPDPRG6= <mlev>
##$CPDPRG7= <mlev>
##$CPDPRG8= <mlev>
##$CPDPRGB= <>
##$CPDPRGT= <>
##$D= (0..31)
0 1.2 0 0 0 0 0 0 0 0.06 0 0.03 0 0 0 0 0.0002 0 0 0 0 0 0 0 0 0 0 0 0 
0 0 0 
##$DATE= 1668511118
##$DBL= (0..7)
120 120 120 120 120 120 120 120 
##$DBP= (0..7)
150 150 150 150 150 150 150 150 
##$DBP07= 0
##$DBPNAM0= <>
##$DBPNAM1= <>
##$DBPNAM2= <>
##$DBPNAM3= <>
##$DBPNAM4= <>
$$ [...]
##$SUBNAM3= <"">
##$SUBNAM4= <"">
##$SUBNAM5= <"">
##$SUBNAM6= <"">
##$SUBNAM7= <"">
##$SUBNAM8= <"">
##$SUBNAM9= <"">
##$SW= 18.0517283424941
##$SWIBOX= (0..15)
0 0 2 0 0 0 0 0 0 0 0 0 0 0 0 0 
##$SW_h= 3612.71676300578
##$TD= 16384
##$TD0= 1
##$TE= 0
##$TE2= 300
##$TE3= 300
##$TEG= 300
##$TL= (0..7)
0 120 120 120 120 120 120 120 
##$TP= (0..7)
150 150 150 150 150 150 150 150 
##$TP07= 0
##$TPNAME0= <>
##$TPNAME1= <>
##$TPNAME2= <>
##$TPNAME3= <>
##$TPNAME4= <>
##$TPNAME5= <>
##$TPNAME6= <>
##$TPNAME7= <>
##$TPOAL= (0..7)
0.5 0.5 0.5 0.5 0.5 0.5 0.5 0.5 
##$TPOFFS= (0..7)
0 0 0 0 0 0 0 0 
##$TUNHIN= 0
##$TUNHOUT= 0
##$TUNXOUT= 0
##$USERA1= <user>
##$USERA2= <user>
##$USERA3= <user>
##$USERA4= <user>
##$USERA5= <user>
##$V9= 5
##$VALIST= <valist>
##$VCLIST= <CCCCCCCCCCCCCCC>
##$VD= 0
##$VDLIST= <DDDDDDDDDDDDDDD>
##$VPLIST= <PPPPPPPPPPPPPPP>
##$VTLIST= <TTTTTTTTTTTTTTT>
##$WBST= 1024
##$WBSW= 4
##$XGAIN= (0..3)
0 0 0 0 
##$XL= 0
##$YL= 0
##$YMAX_a= 43085
##$YMIN_a= -35986
##$ZGOPTNS= <>
##$ZL1= 120
##$ZL2= 120
##$ZL3= 120
##$ZL4= 120
##$ABSF1= 15.72596
##$ABSF2= -2.32589
##$ABSG= 5
##$ABSL= 3
##$ALPHA= 0
##$AQORDER= 0
##$ASSFAC= 0
##$ASSFACI= 0
##$ASSFACX= 0
##$ASSWID= 0
##$AUNMP= <proc_1d>
##$AZFE= 0.1
##$AZFW= 0.1
##$BCFW= 0
##$BC_mod= 2
##$BYTORDP= 0
##$COROFFS= 0
##$CY= -3
##$DATMOD= 1
##$DC= 0
##$DFILT= <>
##$DTYPP= 0
##$F1P= 0
##$F2P= 0
##$FCOR= 1
##$FTSIZE= 16384
##$FT_mod= 6
##$GAMMA= 0
##$GB= 0
##$INTBC= 1
##$INTSCL= 3.70164e-10
##$ISEN= 128
##$LB= 0.24
##$LEV0= 0
##$LPBIN= 0
##$MAXI= 10000
##$MC2= 0
##$MEAN= 0
##$ME_mod= 0
##$MI= 1.114404
##$NCOEF= 0
##$NC_proc= -8
##$NLEV= 6
##$NOISF1= 3.799351
##$NOISF2= 2.8
##$NSP= 0
##$NTH_PI= 0
##$NZP= 0
##$OFFSET= 15.76452
##$PC= 1
##$PHC0= -17948.53
##$PHC1= 20.2007
##$PH_mod= 1
##$PKNL= yes
##$PPARMOD= 0
##$PSCAL= 0
##$PSIGN= 0
##$REVERSE= no
##$SF= 200.13000140467
##$SI= 16384
##$SIGF1= 3
##$SIGF2= 2
##$SINO= 5.538805
##$SIOLD= 16384
##$SREGLST= <1H.CDCl3>
##$SSB= 0
##$STSI= 16384
##$STSR= 0
##$SW_p= 3612.71676300578
##$SYMM= 0
##$S_DEV= 0
##$TDeff= 16384
##$TDoff= 0
##$TI= <>
##$TILT= no
##$TM1= 0
##$TM2= 0
##$TOPLEV= 0
##$USERP1= <user>
##$USERP2= <user>
##$USERP3= <user>
##$USERP4= <user>
##$USERP5= <user>
##$WDW= 1
##$XDIM= 16384
##$YMAX_p= 277838640
##$YMIN_p= -2008112
$$ End of Bruker specific parameters
$$ ---------------------------------
##NTUPLES= NMR SPECTRUM
##VAR_NAME=  FREQUENCY,     SPECTRUM/REAL,   SPECTRUM/IMAG
##SYMBOL=    X,             R,               I
##VAR_TYPE=  INDEPENDENT,   DEPENDENT,       DEPENDENT
##VAR_FORM=  AFFN,          ASDF,            ASDF
##VAR_DIM=   16384,         16384,           16384
##UNITS=     HZ,            ARBITRARY UNITS, ARBITRARY UNITS
##FACTOR=    0.220516191357247, 1,           1
##FIRST=     3154.9533479973, 0,             0
##LAST=      -457.763415008485, 0,           0
##MIN=       -457.763415008485, -2008112,    0
##MAX=       3154.9533479973, 277838640,     0
$$ Real data points
##PAGE= N=1
##DATA TABLE= (X++(R..R)), XYDATA
$$ [...]
8156B4292L0190j03855L551p1531M7123N9445q3262m5536J5007N4930M1628J922
8144b6096m3034J0422m4128R075O9959j12774M9122P3951Q954n9624k4573L0076
8132e8670R6358j7181k6123k2518R513J3012m6721J05714m1510k1655K969o9198
8120g6010N1406Q8826l5247J4928J5238j18283N9856n000m0982L3627m1752p8884
8108a32277N4366P7972K3966j3482o2642K4736K4751J0433L0038Q8746q3141k8904
8096A4562m7934r6089J13966p211j8737K3872M6180m4874M1608r0809m8066M8196
8084f5336J5197N572N8142k510l2841n8424R8222l19m4652K1823l2631M3685o9413
8071f3485N1586R2987p3304j20020O8881P9549p979p0234p0855K8719k612J496
$$ plain form
8156 24292 54482 -49373 -45822 -117353 -70230 -10785 -94047 -139583 -124576 -69646 -28018 -26096
8144 -26096 -69130 -58708 -102836 -93761 -23802 -136576 -87454 -13503 -4549 -64173 -88746 -58670
8132 -58670 37688 20507 -5616 -28134 -18621 -5609 -52330 53384 11874 -9781 -6812 -76010
8120 -76010 -24604 64222 28975 43903 59141 -59142 714 -4286 -45268 -11641 -53393 -132277
8108 -132277 -77911 61 24027 10545 -52097 -27361 -2610 7823 37861 126607 43466 14562
8096 14562 -33372 -129461 -15495 -22706 -41443 -17571 28609 -16265 25343 -65466 -113532 -65336
8084 -65336 -50139 -44567 13575 11065 -21776 -80200 18022 17703 -26949 -5126 -37757 5928 -63485
8071 -63485 -11899 81088 7784 -112236 -43355 36194 28215 -42019 -112874 -84155 -86767 -85271
8059h5271M8398k0683l0818J5459L6588m369n060k180l0108J9415q2481k2519
8047a63629O3364J0037j2664O4180n9094L9219k1411n2505R800L9370q996m5476
8035a37805K2362M4626K8687o576n8390o1366J1457K3551o5332N34M8529K5566
8023a24157P6230m0402l3457M462L0373K7679J6789o5892L2957l1744P9184p1354
8011i9332j5778N6851J4084m5119J3247K9673Q468p8608n0474N5101j33K1955
7999i0065Q2990n4463o4408j6571k3317O8907K6007N3517o1932o4022r101q493
7987a60951M891m708k524O6937K3334j3362L3424m2104N7860K0520j5125K3520
7975h288K696o0403M850j8879P2697N9609r4357l2103l4678L429j2320n4884J10035
$$ plain form
8059 -85271 -36873 -57556 -88374 -72915 -36327 -40696 -45756 -47936 -78044 -58629 -141110 -163629
8047 -163629 -100265 -90228 -102892 -38712 -97806 -58587 -79998 -132503 -122703 -83333 -92329 -137805
8035 -137805 -115443 -70817 -42130 -48706 -107096 -168462 -157005 -133454 -198786 -198252 -149723 -124157
8023 -124157 -47927 -88329 -121786 -117324 -86951 -59272 -42483 -108375 -75418 -107162 -27978 -99332
8011 -99332 -115110 -58259 -44175 -89294 -76047 -46374 -37906 -116514 -166988 -111887 -112020 -90065
7999 -90065 -7075 -61538 -125946 -142517 -165834 -96927 -70920 -17403 -79335 -143357 -152458 -160951
7987 -160951 -156060 -160768 -163292 -96355 -73021 -86383 -52959 -95063 -37203 -16683 -31808 -8288
7975 -8288 -5592 -65995 -61145 -80024 -7327 52282 -42075 -74178 -108856 -105427 -117747 -172631 -62596
7962f2596l7416n4621M2565Q420O7949O099J1277l3023J6402K1237M1946q2987
7950e4748l2694M5376l9787J6889O9792j7116j8337k3662l9301P228L2199k520
7938e6681K3465j344q8703O9664N0808k4890K6574J5793j0795l3519J9781n6022
7926f5869p454N9758n1538M1786k2321K6o6022O2300l53p5855O8611j2890l0666
7913a00487L5191n1061K7493J2747L9165J6973l8384M0039q0398J2314J7351q0468
7901a49525M9338Q852j5928Q6727k9770L1603r4924Q064L9836q184J25916n5450
7889c445n4887J2419m352L7692J6891j6533k0639Q730j0903m1112k8978L2434
7877g2683k0008K4570m8236m989M3198M356K1647k7008m4348O4530l4500n7700
$$ plain form
7962 -62596 -100012 -154633 -112068 -103648 -35699 -29600 -18323 -51346 -34944 -13707 28239 -54748
7950 -54748 -87442 -42066 -81853 -64964 4828 -12288 -30625 -54287 -93588 -86360 -54161 -56681
7938 -56681 -33216 -34560 -123263 -53599 -2791 -27681 -1107 14686 3891 -29628 -9847 -65869
7926 -65869 -73323 -13565 -65103 -23317 -45638 -45612 -111634 -49334 -49687 -125542 -56931 -69821 -100487
7913 -100487 -65296 -116357 -88864 -76117 -36952 -19979 -58363 -18324 -98722 -86408 -69057 -149525
7901 -149525 -100187 -91335 -107263 -20536 -50306 -18703 -113627 -105563 -65727 -73911 52005 -3445
7889 -3445 -58332 -45913 -50265 -12573 4318 -12215 -32854 -24124 -35027 -76139 -105117 -72683
7877 -72683 -92691 -68121 -116357 -121346 -78148 -73792 -52145 -79153 -123501 -58971 -93471 -151171
7865a51171J8564J00990O6909L904o5698m7452p1173K5299K6344K7666j1461R0152
7853A2873J7910l2594k9721N1700o003j6532l8752K6829q800J4955K730O4827
7841E9422J858k8268j6607O0817l7595N9730o0317K1740N960J9002j9324K0287
7829H6705N210L6428p3721P039M5462k3574L204P3846j08671l836n2770k8032
7817c2710l0598L4114p0502L6130n24796j419750J557456N09285p3238k4753m2108
7806h1470O7701l5670L0484m1524Q8659M0279k9007L6185q036n0856j865J6766
7794C1646j7066l937J0365j1596j5716J8732J1615n712N4372P983R9351l0849
7782A49188m1918J9752M9981o7438j7439m5381M3194j1785j8839J2666J9026J071
$$ plain form
7865 -151171 -132607 -31617 35292 39196 -26502 -73954 -145127 -119828 -93484 -65818 -77279 12873
7853 12873 30783 -1811 -31532 20168 14165 -2367 -41119 -14290 -23090 -8135 -5405 59422
7841 59422 61280 33012 16405 77222 39627 99357 39040 60780 66740 85742 66418 86705
7829 86705 91915 128343 54622 61661 107123 83549 86753 160599 51928 48092 -4678 -32710
7817 -32710 -63308 -29194 -99696 -63566 -588362 -2008112 -450656 58629 -14609 -39362 -81470
7806 -81470 -13769 -49439 -18955 -60479 28180 68459 39452 75637 67601 16745 14880 31646
7794 31646 14580 10643 21008 9412 -6304 12428 24043 18331 72703 80686 180037 149188
7782 149188 107270 127022 177003 109565 92126 46745 89939 78154 59315 71981 91007 92078
7770I2078m2225L5339K0393K7496J8577o5083L5940M8403m4660l1685o6809l6376
7758h612P4176L3627l563J1807J6531j6465K8175n1607p9124K2391M2095m4134
7746B5297j2298k1717j6497Q92J7080J5544K6915k6039J1484k0672L5890l4927
7734I52N0249K9405j4740l6059n463J1164P748p2345P1848l9688l3531K7668j1429
7721a4221k4822q5450J9045J6585P7335l3924R664L9535p822l6055m161K1025
7709b3266m629N70o3849J5640J9166J0117j404K5375M504k8786J0047L8488J3941
7696A5914L8450k7030J9014r047p977L8443J7832L3094P5216m5438J3920q951
7684A53440L0580N2824n1982J5242O5574l563n1744l6015o799Q845o2754L6012
$$ plain form
7770 92078 49853 85192 105585 133081 151658 86575 122515 170918 126258 94573 27764 -8612
7758 -8612 65564 99191 95628 107435 123966 107501 135676 84069 4945 27336 69431 25297
7746 25297 12999 -8718 -25215 -24323 -7243 8301 35216 9177 20661 -11 35879 952
7734 952 51201 80606 65866 29807 24344 35508 43256 -29089 42759 3071 -30460 -2792 -14221
7721 -14221 -39043 -124493 -105448 -88863 -11528 -45452 -35788 3747 -4075 -40130 -44291 -23266
7709 -23266 -27895 -27325 -91174 -75534 -56368 -46251 -47655 -22280 -17776 -46562 -36515 1973 15914
7696 15914 54364 27334 46348 37301 29324 67767 85599 118693 193909 148471 162391 153440
7684 153440 184020 236844 184862 200104 265678 262115 210371 174356 167557 176402 113648 149660
7672A49660k7194j6287O057J0551m8813p0690J6244n5504K8606k1561J9812N9781
7660E0662j9449m0692j3457L5264j0118n1270M1782p262K6529K91J304M070p1334
7647e3680N3936P7082j3945r4781J1149l0287L1500M4489p475J9515l6158l7721
7635c6376j8699P0567J8080o190l9497l3123P1751P0614k7142k7457j0810J6505
7623D8223L7366K1501K0354j0262R801P689O2994k2820n3852n863J6472l3740
7611I7863N096n7617K6109k1285j4441L9184N8464m4617q763k307o0003l2270
7599a4587L0347j2735j1962L5128L6322l8592l4932n921M1981M7330J6695q1281
7587G793j557k4224M0512J8934j4941M2327j1096k7226l6593K4852O9208l147
$$ plain form
7672 149660 122466 106179 112236 122787 73974 3284 19528 -35976 -7370 -28931 -9119 50662
7660 50662 31213 -9479 -22936 12328 2210 -49060 -7278 -14540 11989 12280 13584 17654 -53680
7647 -53680 256 77338 63393 -31388 -20239 -50526 -19026 25463 17988 37503 1345 -36376
7635 -36376 -55075 15492 33572 27382 -12115 -45238 26513 97127 69985 42528 31718 48223
7623 48223 85589 107090 127444 117182 126983 134672 197666 174846 120994 115131 131603 97863
7611 97863 102959 45342 71451 50166 35725 74909 133373 88756 79993 77686 17683 -14587
7599 -14587 15760 3025 -8937 26191 62513 23921 -11011 -16932 25049 72379 89074 7793
7587 7793 6236 -17988 22524 41458 26517 68844 57748 30522 -6071 18781 87989 84842
7575H4842m330J7964R657p806r98J5261K0127n2080Q5336J4838Q399N8470M132
7562B53812r0512m3403p9140o748J5453k4888P5262K3207K0478m6309o526m3174
7550D7512L494Q992j8540k6062J5846Q762K3148m5826K0216o7638O6522O3598
7538A00024p8759L9456P4082K3567O906o6284m1130M3122L4527l6246m7707j3226
7526C8332N8675l3004L283j26L4961R523n5689N4421n5778J7793r344k3994O8616
7513A07669j1501j6545J0317K9540o3605k9487M7162L1094L314J7047j5703j1238
7501I8064r3333N1315L7017k1578k5937j7703L4176M1382k3314R0469M9803r8505
7489A21856P2143k4411o067J5619k0896k9858o5006N5339J3462j82j5676M3414
$$ plain form
7575 84842 80512 98476 108133 100327 99329 114590 134717 82637 167973 182811 191210 249680 253812
7562 253812 163300 119897 40757 34009 49462 24574 99836 123043 143521 97212 90686 47512
7550 47512 51006 59998 41458 15396 31242 40004 63152 17326 37542 -30096 36426 100024
7538 100024 21265 60721 134803 158370 165276 98992 57862 100984 135511 99265 51558 38332
7526 38332 97007 64003 67286 67160 102121 111644 55955 110376 54598 72391 63047 39053 107669
7513 107669 96168 79623 89940 119480 55875 26388 73550 104644 107958 125005 109302 98064
7501 98064 4731 56046 93063 71485 45548 27845 62021 103403 80089 170558 220361 121856
7489 121856 193999 169588 163521 179140 158244 128386 63380 118719 132181 131999 116323 159737
7477A59737J9485q6135M884m7837M061L6178l966K7876o256K746K0333M6230m5983
7464A31353k3832j0391O0551j5392m4351L0514q312j504P7817m2785n5407K2382
7452A20643Q924k937J8612o9727N9607N7502m5102p364L5165m0026M3227p512
7440A71012q4060L9141J9919M6061l0404N2923J8452o4331j8220M5597k279L1678
7428B25489K4039Q45m2251k735M9774l4237l7227O0343l080n0790k9572L9933
7416B00531j9433N2919m2683K955J8692K6774M9989k8428l5058L8605j2037r415
7404B43411M8093J1988P5994q699K4105L22m1800O5727l6506K2794L3578j4779
7392D24228P151K4277J04331j0780l0723O144m3422m17L858n6893j890j0441j8455
$$ plain form
7477 159737 179222 93087 97971 50134 54195 90373 86407 114283 108027 110773 131106 177336 131353
7464 131353 107521 97130 157681 142289 97938 128452 120140 118636 196453 153668 98261 120643
7452 120643 129567 126630 145242 75515 135122 192624 147522 140158 175323 135297 178524 171012
7440 171012 86952 126093 146012 192073 161669 214592 233044 168713 150493 196090 193811 225489
7428 225489 249528 250373 208122 205387 255161 220924 183697 244040 240960 190170 160598 200531
7416 200531 181098 234017 191334 194289 212981 239755 289744 261316 226258 264863 252826 243411
7404 243411 291504 303492 379486 370787 394892 395214 353414 419141 382635 405429 439007 424228
7392 424228 431379 455656 559987 549207 518484 524628 481206 480789 484647 427754 425864 415423 396968
7379C96968Q2201m2385P3912J2612O6652J9938J4453M4864q67n6045M733K8761
7367F45797j2975N8731J22611O885r088N0010L3471j9660O9708M8941k8008L70
7355I66793Q70L3242Q1748J1586O7960O2008k278O6960R1176Q4275m3309O046
7343A427077R9696J36990l75N5040P9191N3571R6424J11783L4581k576K8933J42754
7331B263089J39247R6454P3267J00053M2433J03458J46342J41793J7904J17121
7321C241161R3072M8549R6403j603R218O1583M4303o2028j02435j11332o1466
7310C255425j13190j00290q2784j7308r6250j53149j06256j04553m3459j01946
7300B336240l4832j23420j32445r7321p0732r8532r3533l2672j6562m9141n7515
$$ plain form
7379 396968 479169 436784 510696 523308 589960 609898 624351 669215 668348 612303 617036 645797
7367 645797 632822 691553 814164 821049 811961 861971 895442 875782 945490 994431 966423 966793
7355 966793 967663 1000905 1082653 1094239 1162199 1224207 1221929 1288889 1380065 1464340 1421031 1427077
7343 1427077 1526773 1663763 1663388 1718428 1797619 1851190 1947614 2059397 2093978 2091402 2120335 2263089
7331 2263089 2402336 2498790 2572057 2672110 2714543 2818001 2964343 3106136 3124040 3241161
7321 3241161 3334233 3382782 3479185 3477582 3486800 3548383 3592686 3530658 3428223 3316891 3255425
7310 3255425 3142235 3041945 2959161 2941853 2845603 2692454 2586198 2481645 2438186 2336240
7300 2336240 2301408 2177988 2045543 1948222 1877490 1778958 1685425 1652753 1636191 1587050 1529535
7289A529535n1139k6394k3740j0346m4950L1554m2825o4177j7990Q1327J7149
7278A378004k3790k8292j6332j7185l4149n2849J4445K9621K0435k2626j7596
7267A229686l1050J5441O4619q6777l9440J3783K3243j4615k7825j3620o9995
7256A063450l7266J5980k9803L2897m5015J3226N7970j1060l066n7105N778J8884
7244A024870l630K7784N01J9604K5545M3760o1715J1778M154k297j5589K8582
7232A103347K7935m5284p679K340j8876N0804l071j850l35k1423m0824n8043J4668
7219A001709q9724K1909L5846K459K0546o7192m1265L916M859l8600O95l7954
7207H17204L913q8282l205l4572k9171l4991j4680m1950L2156m337k892m7446
$$ plain form
7289 1529535 1478396 1452002 1428262 1417916 1372966 1404520 1361695 1297518 1279528 1360855 1378004
7278 1378004 1354214 1325922 1309590 1292405 1258256 1205407 1219852 1249473 1269908 1247282 1229686
7267 1229686 1198636 1214077 1278696 1191919 1152479 1166262 1189505 1174890 1147065 1133445 1063450
7256 1063450 1026184 1042164 1012361 1045258 1000243 1013469 1071439 1060379 1057313 1000208 1005986 1024870
7244 1024870 1021240 1049024 1049525 1069129 1094674 1138434 1076719 1088497 1092651 1090354 1074765 1103347
7232 1103347 1131282 1085998 1078319 1080659 1061783 1112587 1109516 1107666 1107331 1085908 1045084 987041 1001709
7219 1001709 911985 933894 969740 972199 992745 925553 884288 888204 893063 854463 855158 817204
7207 817204 821117 732835 729630 695058 665887 630896 616216 574266 606422 602085 599193 551747
7195E51747j1880K3024m394o2496l9163O1507k5608P376p6691q223K8676K915
7183D46790o7145L5042l8227L4251M2332k2994K188M200l4533j1133m2482n6830
7171B91459O2312p285l0962n2034m2270M7397P3752O71o0222J0106n5130K2112
7159B59906l1274r083N9808N1582k057n9592J2807K5280j566m3772M3411J3129
7147C18579L1475l7597m7518P0984M3009K1118m3221j048j5968n9933N1917J730
7135C33527l0810j7351R7679L2297p5913l3964q500l0565m7566J00618o5766p318
7123B46368l1955k8181M6189J2904K8201k4979l6556j859j854K7462J6799n4556
7111A97983M6802l6509L1957O518n0928J9488M5299n2434O6075L0122q3292J5568
$$ plain form
7195 551747 539867 562891 558497 496001 456838 518345 492737 500113 423422 415199 443875 446790
7183 446790 379645 414687 376460 410711 453043 430049 432237 436437 401904 390771 348289 291459
7171 291459 353771 346486 315524 263490 221220 268617 342369 343040 282818 292924 237794 259906
7159 259906 228632 219549 279357 330939 328882 269290 282097 307377 305811 262039 305450 318579
7147 318579 350054 312457 264939 335923 378932 400050 356829 355781 339813 279880 331797 333527
7135 333527 302717 285366 383045 415342 339429 305465 296965 266400 218834 319452 253686 246368
7123 246368 214413 186232 232421 245325 273526 248547 211991 210132 208278 235740 252539 197983
7111 197983 244785 208276 240233 246751 195823 215311 260610 208176 274251 304373 221081 236649
7099B36649O4576K5754j41J2836n7698k661K2112m9584P2716M9307j5213k7991
7087C30662N3313m8204k7438q7116J4741m2336j5553K4224o5495L547M966M9232
7075A94543j1640n994J2101j8354k8083N7021n548m6510l7820O0888j7851K1523
7063A74276j0562k479L4829n7160o899P5818n1723k9042J0202L6017J1147J8317
7051B02741p838L47L5358j0628m7555m3903J4634P3971k0554j546o8448J6965
7039A43544L5458L4635n215n136L230K7323k9232J4449J4348L1526R482l8555
7027B35857j4993K8050n5824j3421L0462l2884L4370K632m0682j4397q38p5386
7015H2946Q0530P900l3810r433m2368l4252L9376O2733l6126J8465R192q1231
$$ plain form
7099 236649 301225 326979 326838 339674 281976 279315 301427 251843 324559 373866 358653 330662
7087 330662 383975 335771 308333 221217 235958 193622 178069 202293 136798 140345 145311 194543
7075 194543 182903 176909 189010 170656 142573 199594 194046 147536 109716 170604 152753 174276
7063 174276 163714 161235 196064 138904 132005 207823 156100 127058 137260 173277 184424 202741
7051 202741 194903 195250 230608 219980 172425 128522 143156 217127 196573 195027 126579 143544
7039 143544 179002 213637 208422 203286 206516 233839 204607 219056 233404 264930 274412 235857
7027 235857 220864 248914 193090 179669 210131 177247 211617 214249 173567 159170 158332 82946
7015 82946 163476 171376 137566 128133 85765 51513 90889 153622 117496 135961 145153 63922
7003F3922n6008O6961M3796k4114j1988j2687K3116m9179K716L6681l0413m00
6991E2403M6218l3705k2686J4411l3298L4374k156k7369K8983J3408J2373l2288
6979E0668K9613J880J1903l0093K3284j0401K7360k0619J4767k613j2549r521
6967G3679k0823n5033j7287R9287J7307p326K8702o1741L3816l8476mj6949P9492
6954A14644K9719k2432j6605o4151j5973O718L3337P649n4938K5782N0750J0364
6942A04864m2636k6310J7515q490J2093M4798j0687N8002L1130n3930j1295k8449
6930H6605N111m1681N9935q731K7766k1792p7297j2229L3614m3813O9542m6143
6918C0887m3267K7515N8935j3705n1644N1987k6866M0014L4645m1142k2915M4158
$$ plain form
7003 63922 7914 74875 118671 94557 82569 69882 92998 43819 46535 83216 52803 52403
6991 52403 98621 64916 42230 56641 23343 57717 55561 28192 57175 70583 82956 50668
6979 50668 80281 82161 94064 63971 87255 76854 104214 83595 98362 95749 83200 73679
6967 73679 52856 -2177 -19464 79823 97130 89804 118506 56765 90581 52105 52101 35152 114644
6954 114644 144363 121931 105326 41175 25202 31920 65257 72906 17968 43750 94500 104864
6942 104864 62228 35918 53433 44943 57036 101834 91147 149149 180279 126349 115054 86605
6930 86605 91716 50035 109970 101239 129005 107213 29916 17687 51301 7488 77030 30887
6918 30887 -12380 15135 74070 60365 8721 60708 33842 73856 108501 67359 44444 88602
6906H8602M0854M0803K9991o6624l3214L4887K1073m5051L2775P4209N0150o4570
6894B03885k7047n0247J3577K606k8577L456m3859j3912l9289j544M3235J0603
6882G2887P008n7067l3581O122N043j2338N5954j317m1020L1064L9476L7210j1270
6869I8171J8049j5031k5279j9100k0643j1982p061j3216l6091M5866J1523l1198
6857e992K0160N7059J2734k6662j06464J5394N128o229O6846N678J709k5978j8953
6844e570k1459J5645o18K0339l2181m910P276K725k7563J5485O0707K5061p4431
6831a9494K6873m068K328k1021K0477q698m8104Q043L7290l2383j4754o323M3680
6818a6154k118o3753P6181k152k7255l6851J1575K0344l0971p440j2353Q126l7649
$$ plain form
6906 88602 129456 170259 200250 133626 100412 135299 156372 111321 144096 218305 268455 203885
6894 203885 176838 126591 140168 142774 114197 117653 73794 59882 20593 19049 62284 72887
6882 72887 79895 22828 -10753 -4631 412 -11926 44028 42711 1691 32755 72231 109441 98171
6869 98171 116220 101189 75910 56810 36167 24185 17124 3908 -32183 13683 25206 -5992
6857 -5992 14168 71227 83961 57299 -49165 -33771 -28643 -34872 31974 37652 39361 13383 -5570
6844 -5570 -27029 -11384 -12002 8337 -23844 -28754 -21478 -18753 -46316 -30831 29876 54937 -19494
6831 -19494 7379 3311 5639 -15382 5095 -3603 -51707 -43664 -6374 -38757 -53511 -59834 -16154
6818 -16154 -18272 -82025 -5844 -7996 -35251 -72102 -60527 -40183 -71154 -78594 -90947 -82821 -120470
6805a20470K2168L1067k0832R258K7944K5572l9625j0963J0637N4115j318Q231
6793d216k1036o168o3380Q4925m5748k9134M2369l0460L0358K0690j8372L4665
6781e507K1487l9467O986n5736k9168q563M2265L1592l3595J8167M3462N47P753
6768B23j9710J527L1286o1280l0397N4661l3437q6376M614M4185j3428j2804O1146
6755e9790o083L0268l1887K6525L8455l7671J1014p1675K5751L5195J9869l9486
6743e9515K7147l0974J0146N6437l6894l6928O5918k2089o1458J1124O5777l0114
6731d1423k0244k2369K1826k7557O658M1468j6638J1245J3570l965K039J0152
6719b5238n777K6256j4551J4854k5113k4099N939K3118m068k8311K3262K7085
$$ plain form
6805 -120470 -98302 -67235 -88067 -78809 -50865 -25293 -64918 -75881 -65244 -11129 -12447 -4216
6793 -4216 -25252 -31420 -94800 -9875 -55623 -84757 -42388 -72848 -42490 -21800 -40172 -5507
6781 -5507 15980 -23487 -16501 -72237 -101405 -109968 -67703 -36111 -69706 -51539 -8077 -7530 223
6768 223 -19487 -17960 13326 -47954 -78351 -23690 -57127 -143503 -138889 -94704 -108132 -120936 -59790
6755 -59790 -65873 -35605 -67492 -40967 -2512 -40183 -29169 -100844 -75093 -39898 -20029 -59515
6743 -59515 -32368 -63342 -53196 3241 -33653 -70581 -4663 -26752 -88210 -77086 -11309 -41423
6731 -41423 -61667 -84036 -62210 -89767 -83109 -41641 -58279 -47034 -33464 -37429 -35390 -25238
6719 -25238 -31015 -4759 -19310 -4456 -29569 -53668 -47729 -24611 -28679 -56990 -33728 -6643
6707f643m878l5173j021O8940J0208r7040k1937M4414k1833l302M8445l6615n4562
6694a10997k2128L8182M7278l3049k590j073k7230K0944L173m4501R0723J3186
6682b8082q8582K922N9105k2167L7863M5981k5446K75J3314n8633m7441L9707
6670g1184q212L3188J4586j5914Q30K3650J7160M661l4595o3298N8274j8171o759
6657f5784m8748K0308N9803Q5154J5798q7294l6932M8531n552l5245n9214Q6281
6645b2894N5426k1149r4766N4023n2909q3054J6879P1966P3653l1457k1784k3118
6633g9184K3356K6861J6706J3263K8073m5712j2956n0793J6376o3425K419J3874
6621a11142j1955k1901J23268M7550o9478m0202J7699L9633p413j4667J825l4234
$$ plain form
6707 -6643 -11521 -46694 -47715 21225 31433 -65607 -87544 -43130 -64963 -68265 -19820 -56435 -110997
6694 -110997 -133125 -94943 -47665 -80714 -83304 -84377 -111607 -90663 -87490 -131991 -41268 -28082
6682 -28082 -116664 -113742 -54637 -76804 -38941 7040 -18406 -18131 -4817 -63450 -110891 -71184
6670 -71184 -79396 -46208 -31622 -47536 -46706 -23056 -5896 -1235 -35830 -99128 -40854 -59025 -65784
6657 -65784 -114532 -94224 -34421 50733 66531 -20763 -57695 -9164 -14716 -49961 -109175 -22894
6645 -22894 32532 11383 -83383 -29360 -82269 -165323 -148444 -76478 -2825 -34282 -56066 -79184
6633 -79184 -55828 -28967 -12261 1002 29075 -16637 -29593 -80386 -64010 -127435 -125016 -111142
6621 -111142 -123097 -144998 -21730 25820 -43658 -83860 -66161 -26528 -33941 -48608 -46783 -81017
6609h1017j8165J5783K9064n2240l6225N563J7999L0248j2836J9526j7501K1357
6597g8444j1656K4477K7918k8718j404P1204n0442j1681J9496m1933M9998J475
6585b9710n484k3725J4823l2010l9791L2941M3363L9755j5206m7691M1160m7131
6573f8706j6298O0365P4939r9314j7655J7461k5387J7986m2067K8272n670l162
6561g9236N3049n289L157J2120j281m0246m3089O0497k7243M508J9090L8739q2524
6548h7748m7164J18710L3977m3862l4962J5782L8813l274j449k4855k1503l671
6536f1206K7914O1618q4582l7660K7044O9133m4891m762n044j3044N4043j8332
6524b9769O4877q0629q54j6884O375J9824q9624q377Q0652P0206k1325J3106R576
$$ plain form
6609 -81017 -99182 -83399 -54335 -106575 -142800 -137237 -119238 -88990 -101826 -82300 -99801 -78444
6597 -78444 -90100 -65623 -37705 -66423 -67827 3377 -47065 -58746 -39250 -81183 -31185 -29710
6585 -29710 -35194 -58919 -44096 -76106 -115897 -82956 -39593 162 -15044 -62735 -21575 -68706
6573 -68706 -85004 -24639 50300 -49014 -66669 -49208 -74595 -56609 -98676 -70404 -76074 -79236
6561 -79236 -26187 -31476 -28319 -16199 -17480 -57726 -100815 -40318 -67561 -63053 -43963 -5224 -87748
6548 -87748 -134912 -16202 17775 -26087 -61049 -45267 -6454 -9728 -11177 -36032 -57535 -61206
6536 -61206 -33292 28326 -56256 -93916 -66872 2261 -42630 -47392 -52436 -65480 -11437 -29769
6524 -29769 35108 -45521 -46375 -63259 -56884 -37060 -126684 -135061 -54409 15797 -5528 7578 17154
6511A7154j6840J0800O736l6821J3888k6351L2706N9469j9691k9884M1575q0910
6499b8169K4505k6232M4049J0584p0028R7779j2414K9232r0329O4910l0716J4615
6487B7786k2063o8717j7385M5839P784M0562m8556n6760N5451N8578j2420l1146
6475b1047l0612J5741l8572o5774K6321N0757J6456l2598J8340m5921K2575l1732
6463a16066J29639k6619n1634j6406k2373M3466K9291k5938Q6912J1793r2458
6452e0393K4958K5001o28n7833K8919O8056k0503m0205M4105q916L95m8424N3554
6439A8086j3840p5920j1638N1525j21o3206J9874r637O7438L4837j5026l9166
6427c6794l2203J8831K9401p4708N1967M8567n4773j853J6850J519m2788K5362
$$ plain form
6511 17154 314 11114 17850 -18971 -5083 -31434 1272 60741 41050 11166 52741 -28169
6499 -28169 -3664 -29896 14153 24737 -45291 52488 40074 69306 -21023 43887 13171 27786
6487 27786 5723 -62994 -80379 -34540 -26756 13806 -34750 -91510 -36059 22519 10099 -21047
6475 -21047 -51659 -35918 -74490 -140264 -113943 -63186 -46730 -79328 -60988 -106909 -84334 -116066
6463 -116066 13573 -13046 -64680 -81086 -103459 -59993 -30702 -56640 30272 42065 -50393
6452 -50393 -25435 -434 -1062 -58895 -29976 38080 17577 -22628 21477 12561 12956 -35468 18086
6439 18086 4246 -71674 -83312 -31787 -31908 -95114 -75240 -84877 -17439 17398 2372 -36794
6427 -36794 -68997 -50166 -20765 -95473 -43506 5061 -49712 -51565 -34715 -33196 -75984 -50622
6415e0622J7983q3580J1987P0600N2373l4273J2594K3468n1183l5586J8068k5898
6403g4069j1286P5496K4784l0399l2735j0489K5871j2620j8091L4579J6240n8797
6391g1516M0447N2467Q449L5866o924k4851j7966p3289k5558O8150J8492N5352
6379E9119m3524K6227q840k9992m2978k5990k5502K9412L0877M1903n7699k1707
6367f8694K8268k2196O794K9383J9474k5297M5697o208j3424q339m494L7924j8584
6354C04q0642M5786J4746n5575L7282L3222l870q056j687L6708l0023n304J6720
6341c89q609m4892J9775j9549J7571J18732j4767j02789j7950K0168J5348R537
6329g814M249m5718K7436N5527L5082k0130m9087m350O4534n2254l5714O0850
$$ plain form
6415 -50622 -32639 -116219 -104232 -33632 18741 -15532 -2938 20530 -30653 -66239 -48171 -74069
6403 -74069 -85355 -9859 14925 -15474 -48209 -58698 -32827 -45447 -63538 -28959 -12719 -71516
6391 -71516 -31069 21398 29847 65713 58789 33938 15972 -57317 -82875 -14725 3767 59119
6379 59119 15595 41822 32982 2990 -39988 -65978 -91480 -62068 -31191 10712 -46987 -68694
6367 -68694 -40426 -62622 -55828 -26445 -6971 -32268 13429 7221 -6203 -14542 -19036 18888 304
6354 304 -80338 -34552 -19806 -75381 -38099 -4877 -8747 -16803 -18490 18218 -11805 -17109 -389
6341 -389 -8998 -53890 -34115 -53664 -36093 82639 67872 -34917 -52867 -32699 -17351 -7814
6329 -7814 -3565 -49283 -21847 33680 68762 48632 -455 -4805 59729 7475 -28239 32611
6317C2611m524L3224l6335j8130o72n450M328L9465K097l5640K5013K6136m2607
6304A9516p385j7019p751Q327J9270N98P513l1081K4469R905K5893o808p698k8314
6290I435K7472m7934J1162K7342O434K7488k4978J1785N0563l1736q1542J9821
6278E312J6762M2549J8214M1785k227K7998p5076p023O457j7972J9443O5648p192
6265A34678N8145l983N5438N5617M9827J0153P0818M491k4543L0835p4937j18235
6253B48304n3974n31p256K8337l68j7392m5508J8533k7680L9420l6469o1715N1431
6240A35132m0814q440m0657o0831K8651j0132p777n2699M1279K3218P665K77O4898
6227G9770J1878l2007l6520m84o7340k514L5656K1498L184l3878K9545k2768j7982
$$ plain form
6317 32611 28087 61311 24976 6846 6174 724 5052 44517 46614 10974 35987 62123 19516
6304 19516 12131 -4888 -12639 -4312 14958 15556 23069 -8012 16457 26362 52255 45447 37749 9435
6290 9435 36907 -11027 135 27477 33911 61399 36421 48206 98769 67033 -14509 5312
6278 5312 22074 64623 82837 124622 122395 150393 75317 68294 74751 56779 76222 141870 134678
6265 134678 192823 188840 244278 299895 349722 359875 430693 435184 410641 441476 366539 248304
6253 248304 194330 193799 186543 214880 214512 197120 151612 170145 142465 181885 145416 83701 135132
6240 135132 94318 85878 45221 -15610 13041 2909 -4868 -57567 -16288 6930 14595 14872 79770
6227 79770 91648 59641 23121 22637 -44703 -47217 -11561 9937 13121 -20757 8788 -13980 -31962
6214c1962P8398O2339p6374n083l6066l993Q226k4251M1095k3967m2268L4011
6202a9895j4091J3284n4510J388O0348K9211j8262k9811k348K169L7989o6515
6190f1043J6767k7835M7336j815K3656N8382O9545o4716J1863m8544O3931q105
6178G9422r3323j1938k616K1299k0839L3873m4547r676L4145j4022J338K719n4782
6165g8947J04758M7061m2490j4019N8853p8305N733K0031J0615j0148J2212K0544
6153E5898n3252n0975N8538o0151K9476L7458R773k632J441Q993M26m4110m28
6140i545j1518j7079R547L6718J6882l1988k1908L4964P0655K4242n1810K5686
6128G4846K2164o6031j2103J1681O0535k3331K31j4262n8167K9445Q0509n2160
$$ plain form
6214 -31962 46436 108775 32401 27318 -8748 -12741 -4515 -28766 12329 -11638 -53906 -19895
6202 -19895 -33986 -20702 -75212 -73824 -13476 15735 -2527 -32338 -34686 -32517 5472 -61043
6190 -61043 -44276 -72111 -24775 -26590 -2934 55448 124993 60277 72140 23596 87527 79422
6178 79422 -13901 -25839 -28455 -7156 -27995 5878 -38669 -48345 -14200 -28222 -26884 -24165 -78947
6165 -78947 25811 72872 30382 16363 75216 -3089 2644 22675 33290 23142 35354 55898
6153 55898 2646 -48329 10209 -49942 -20466 16992 26765 24133 25574 34567 34993 -9117 -9545
6140 -9545 -21063 -38142 -28595 8123 25005 -6983 -28891 6073 76728 100970 49160 74846
6128 74846 97010 30979 18876 30557 91092 67761 67992 53730 -4437 25008 105517 53357
6116E3357J7761Q232K58k2624o9371K7097M5173n2639m9963N4135N8066j0961
6104E8521n6178l0487L6068J3905k9599q9182K773M8898R9848m9091m3993l6906
6092g5423O4797L513R834o880n6140L8222N512M1405L8689m662m654l5662K9888
6079D8439K9447J0898n8861n8805N7679J2127N8329o8317j7650k4050o4752R072
6067f6444K8677K4292P7391m4572m9392K2112q380K1471L2021p8667K1130J9955
6055d06P7017o4321J5549M790m4965R158K1981L3511k6941K4861r4362L6360P0732
6042F2964l9815O9419n486l3740J0385J7580M0666l7549j9984m1925l0194K9150
6030B1471M5321o944N9596j1965o024n6507k4722n3827M7338K5477K1016K4162
$$ plain form
6116 53357 71118 79350 79608 56984 -12387 14710 59883 7244 -42719 11416 69482 58521
6104 58521 2343 -28144 7924 21829 -7770 -96952 -94179 -45281 54567 5476 -38517 -75423
6092 -75423 -10626 -7113 2721 -4159 -60299 -22077 -16565 24840 63529 58867 54213 18551 48439
6079 48439 77886 88784 29923 -28882 28797 40924 99253 30936 13286 -10764 -75516 -66444
6067 -66444 -37767 -13475 63916 19344 -30048 -7936 -16316 5155 37176 -41491 -20361 -406
6055 -406 76611 12290 27839 32629 -12336 -3178 18803 52314 25373 50234 -44128 -7768 62964
6042 62964 23149 92568 87082 53342 63727 81307 121973 84424 64440 22515 -7679 21471
6030 21471 66792 59848 119444 107479 101455 44948 20226 -33601 13737 39214 60230 84392
6018H4392m4302M215j5326J8150M8425k5121r665K9034k9564J5136j6361k7449
6006C1564k9315J5256l102L2622J7587n91j3746k7268j8314j911P891r125j1437
5993i889L5907J22130J2598o9709J7744N5692m4157l6722N8619j0345o2777o0787
5981H304M4353k452j3668M5738N8423o6540J9679Q283p5874K3924R166r906j5100
5968C4330m5775j1884R6973m237N4908K692p94k055J3203M1619R465o365j8574
5955A63506m2784l4204j7230O1055M5692L1122r2289j2128M0103q667l612J4731
5943A45295m3121m3915N1373L7838O866l898o488m2784n6205N5078P6119L133
5931A79291m1853k0166j6760J5121J2051O2685J8283o3883k960q6187P8969K3295
$$ plain form
6018 84392 40090 44305 28979 47129 95554 70433 60768 89802 60238 75374 59013 31564
6006 31564 2249 17505 14403 47025 64612 64021 50275 23007 4693 2782 10673 1548 -9889
5993 -9889 26018 148148 160746 91037 108781 164473 120316 83594 142213 131868 69091 8304
5981 8304 52657 50205 36537 82275 140698 74158 93837 102120 26246 50170 59336 49430 34330
5968 34330 -11445 -23329 73644 69407 124315 127007 126213 124158 137361 178980 188445 182080 163506
5955 163506 120722 86518 69288 130343 176035 207157 114868 102740 142843 134176 130564 145295
5943 145295 102174 58259 109632 147470 154336 150438 143950 101166 44961 100039 176158 179291
5931 179291 137438 117272 100512 115633 127684 190369 208652 144769 141809 55622 134591 157886
5919A57886n6367M2896N9014j837k3342l8055M9239P0421n714p3186L4337m3865
5907A71427o8203J08129K4704m2109k5174l0756P0202L1645k541n1353L6646k8930
5895A93687K7083J3348j9711N721J3477k4074k769L5537M1498m360k8061r385
5883B41991m6310j5730k7153n5963J2953R678P5649P4998j1308K6636K2194K1071
5871C28706J1153O876j0380k9928N3621N551r5098l9870K8788J6481J8346J7299
5859C11545l4684j8502o7801N9352O9330M8732n8376o1440l6141M033r804R0412
5847B96656K5345p4535N6097J05213o2110j0378L9157K5634j6267J0846L7969
5836D33627n1284o5505o3154J422l2408Q7640M5250Q264N8707l953o84K1869k307
$$ plain form
5919 157886 101519 144415 203429 201592 178250 140195 189434 259855 254141 180955 215292 171427
5907 171427 103224 211353 236057 193948 168774 138018 208220 239865 237324 185971 222617 193687
5895 193687 220770 234118 214407 220128 233605 209531 206762 242299 283797 279437 251376 241991
5883 241991 195681 179951 152798 96835 109788 119466 195115 270113 258805 285441 307635 328706
5871 328706 339859 346735 336355 306427 360048 365599 270501 230631 259419 275900 294246 311545
5859 311545 276861 258359 190558 249910 319240 367972 309596 248156 212015 216048 206244 296656
5847 296656 322001 247466 303563 408776 346666 336288 375445 401079 384812 395658 433627
5836 433627 382343 316838 253684 255106 222698 310338 355588 363852 422559 418606 417922 439791 437484
5823D37484K4774M6361J3771n86J2348J3837K4450K4798O5567R28j3850Q4657
5811G34539p8854L0636r914N0932Q7203P3707P6964m7952N7953R4618M9608J8722
5799A138162J34433J68028O8955P0124R8131K25274K81128K51235L50077M56857
5789C242404N96331Q22665R03851O03400J27160n69264q92813r14614p01558n94930
5779B622632m33605k56333k03898j40891j06039j74144j53093J5435p6026m7424
5769A046614l5752K2894N4436n7878k8532n6262k6533J4101J804R142J3427J68802
5757A126263O0921J6628K5928j22708j71515q6338j1370j11075j10921o6098J7151
5746E66866M4521l1758m0808j299n580R240K9905q2529k7985k0063j4206n507
$$ plain form
5823 437484 462258 508619 522390 521804 534152 547989 572439 597237 662804 663732 649882 734539
5811 734539 655685 686321 676407 727339 814542 888249 965213 917261 975214 1069832 1119440 1138162
5799 1138162 1272595 1440623 1509578 1579702 1677833 1903107 2184235 2435470 2785547 3242404
5789 3242404 3838735 4661400 5565251 6168651 6295811 5726547 4833734 3919120 3217562 2622632
5779 2622632 2189027 1932694 1728796 1587905 1481866 1307722 1154629 1170064 1094038 1046614
5769 1046614 1010862 1033756 1088192 1030314 1001782 945520 918987 933088 934892 944034 957461 1126263
5757 1126263 1187184 1203812 1229740 1107032 935517 849179 837809 726734 615813 549715 566866
5746 566866 611387 579629 538821 537522 531942 541182 571087 488558 460573 440510 426304 420797
5734D20797O4591J58j7805n3746l1339J2926R681m2820m8249k7220p092L4344
5722C14226N1185l394J6558k4140j8830k2348o3838J6774M2679K6543p5491l5181
5710B24743L1601J9210L33J9058N2600j0266j4625m2479j5706k8986M6658j53245
5698A28896J1029J10632n3064P2069m1532l479n1262J22580K7056n2305p5777
5687A94843P9977l048l5224N7123N7706O4510j4773p2212J1113K8483K4220n6998
5675C35720l0245l0790J5000L3641K5441n8583M9536n5542K556K7928k5981M4553
5663C33234J6958j9919j0045l0382m1954N1983L9096J4483O0042K0675p7014m8849
5651C08308Q6537K4816r7364M1251N4657L064K8833l0223M1134j1247o4793K5107
$$ plain form
5734 420797 485388 485546 467741 413995 382656 395582 405263 362443 314194 286974 279882 314226
5722 314226 365411 362017 378575 354435 335605 313257 249419 266193 308872 335415 259924 224743
5710 224743 256344 275554 275887 294945 347545 337279 322654 280175 264469 235483 282141 128896
5698 128896 139925 250557 197493 269562 228030 224551 173289 295869 322925 270620 194843
5687 194843 274820 271772 236548 293671 351377 415887 401114 328902 340015 368498 392718 335720
5675 335720 305475 274685 289685 323326 348767 290184 339720 284178 286734 314662 288681 333234
5663 333234 350192 330273 320228 289846 247892 299875 338971 353454 413496 434171 357157 308308
5651 308308 394845 419661 322297 363548 418205 421269 450102 419879 461013 449766 384973 410080
5639D10080m3635N5753R94j6763L225J3041J3284N6244k4320J2870Q946J5037
5627E04756k8635O2682k4192N871L3184N5778O879K5653L5642L6051l0691l8678
5615F44300K1663K1408K8467K8283M8121o1018k2325M9839K1587K0695j9142k0118
5603G61760L8970j3505J8117Q1796P4653J3795k174O6170N6275J850N1115O7084
5591A215906K6272L8368l8320L478L6053J00073M7362R6379J33201P5970N7195
5580A791937J78139J37415R6133P7413K9933K8982J1186j0862n9374p9158J2804
5569B214548R558o4897M6070p78L3487M1688N8117J19161J23967N1412J26360
5558B758693J47284K34568J82396K11768K15832J44244J01699N0909O0111k2947
$$ plain form
5639 410080 366445 422198 423192 406429 409654 422695 435979 492223 467903 480773 489719 504756
5627 504756 476121 538803 514611 520482 553666 609444 616323 641976 677618 713669 682978 644300
5615 644300 665963 687371 715838 744121 792242 731224 708899 758738 780325 801020 781878 761760
5603 761760 800730 787225 805342 887138 961791 975586 973412 1039582 1095857 1097707 1148822 1215906
5591 1215906 1242178 1280546 1242226 1245704 1281757 1381830 1429192 1525571 1658772 1734742 1791937
5580 1791937 1970076 2107491 2203624 2281037 2310970 2339952 2351138 2340276 2280902 2201744 2214548
5569 2214548 2224106 2159209 2205279 2204501 2237988 2279676 2337793 2456954 2580921 2632333 2758693
5558 2758693 2905977 3140545 3322941 3534709 3750541 3894785 3996484 4047393 4107504 4084557
5548D084557l9440q4294r8748O4627J0245K8637J62018J72767J79421L43197L98084
5537E221071N85710P91860J123786J375556J283155O74358k99687j148531j334993
5528H272285j142718r43423p06435n92919l99660m21276m04378l21178k45272
5519C095026k20122j80122k54888j74195j03185q0239j37875r6682k7019k595
5509A818104r441J5215r4586L809O3395J13396J56413P9953K5000m3700j46152
5498A981406k19306j59765j01421q3276j42956k8897p4490o8610p4331n2853J1072
5487I86573n8189M4994K0180q6989m2156o6718J5799M8761j5453p8633j1264o1567
5475F95338k4987k7058R5038L4402n5968m2069j0425J7643K7256m9663l7389l79
$$ plain form
5548 4084557 4045117 3960823 3862075 3926702 3936947 3965584 4127602 4300369 4479790 4822987 5221071
5537 5221071 5806781 6598641 7722427 9097983 10381138 11055496 10755809 9607278 8272285
5528 8272285 7129567 6186144 5479709 4886790 4487130 4065854 3661476 3340298 3095026
5519 3095026 2874904 2694782 2439894 2265699 2162514 2082275 1944400 1847718 1820699 1818104
5509 1818104 1808663 1823878 1729292 1733101 1796496 1909892 2066305 2146258 2171258 2127558 1981406
5498 1981406 1762100 1602335 1500914 1417638 1274682 1245785 1171295 1102685 1028354 975501 986573
5487 986573 928384 973378 993558 906569 864413 797695 813494 862255 846802 768169 756905 695338
5475 695338 670351 643293 738331 772733 716765 674696 664271 681914 709170 659507 622118 621739
5463F21739J05125Q074j7979j8042k193N8667j2985M847j6978N683l0643J0819
5451G16134J1266q941O450Q1175N1752L7091j0477J0948r2851j2431Q0801J1615
5439H82532K2499j03978r8865L8426K9711K6374j00798k7195Q7807K3499N4857
5428H34869K5905k9223m7155N7985L0459J6226J1877k2513P2402M8914Q9386J6336
5416A105468p4493o9185l5761J1175j56219j0137k9528q8059k9269K7154N4246
5405G05392n1976R090K8502k87p776L0191l89L4018M1539j7920L2965J0419R46
5392H14714P3337m0657J720j4509J4345n8111j3354O38q6839p0177k5263L3718
5380F29562m3884p930p1799l6689P0377K4975l3671L5185m7641j21498J25613
$$ plain form
5463 621739 726864 734938 716959 698917 696724 755391 742406 747253 730275 735958 705315 716134
5451 716134 727400 718459 724909 806084 857836 894927 884450 895398 802547 790116 870917 882532
5439 882532 905031 801053 702188 740614 770325 796699 695901 668706 756513 780012 834869
5428 834869 860774 831551 784396 842381 872840 889066 900943 878430 950832 999746 1089132 1105468
5416 1105468 1030975 961790 926029 937204 780985 770848 741320 653261 623992 651146 705392
5405 705392 653416 662506 691008 690721 682945 713136 712747 746765 788304 770384 803349 813768 814714
5392 814714 888051 847394 849114 834605 848950 790839 777485 778123 691284 621107 595844 629562
5380 629562 585678 577748 505949 469260 539637 564612 530941 566126 518485 396987 522600
5369E22600K8938l4148J0230K9980j6374p4260k5899l655M8732Q4583M2641j4015
5357E99353m7266Q7401j0880n1318O407K4382L2647m6423K0194k2896l7861L5209
5345E88949K8939j4378k6451q92M6108R700j413k9674J0904Q9909o8343j9969
5333F13389K0579J186o893q7873K4563K1838K0185p15L514L0373m7836M5760Q606
5320F46676m4108r1149P075l9849M5076N2878o3479N5344j5755L4278j1333Q636
5308E84290q622N9453j2013m755o5488j2615Q169m64J2178p479q187L3832M4327
5295F22626L3220m1490l7901J6795l9827j5205p1977k0046K8689m0064O9675n379
5283D99116l966j631L7731K5722M447L8726j0086j6525l6428r7732M5054q127
$$ plain form
5369 522600 551538 517390 527620 557600 541226 466966 441067 437412 486144 570727 613368 599353
5357 599353 552087 639488 628608 577290 583697 608079 640726 594303 614497 591601 553740 588949
5345 588949 617888 603510 577059 576167 622275 631975 630562 600888 611792 701701 633358 613389
5333 613389 633968 635154 628261 540388 564951 586789 606974 606259 609773 640146 592310 638070 646676
5320 646676 602568 511419 518494 478645 523721 576599 513120 568464 552709 586987 575654 584290
5308 584290 575668 635121 623108 618353 552865 540250 548419 547955 560133 552654 544467 578299 622626
5295 622626 655846 614356 576455 593250 553423 538218 466241 446195 474884 434820 504495 499116
5283 499116 495150 493519 531250 556972 561419 600145 590059 573534 537106 439374 484428 476301
5271D76301N9218k918j06749N1956m510j959M2877j0703m4158k8476O8855K2802
5259E22536k8382J01920j46450K069k3827l048L5875J8997P228l0102L3678J7679
5247E08173l2745N4230m5695J6008m361J1923k6955k0254K5566O620K5250O3253
5235E81013m717n0280J2905M5641P9707n72k5437K9330Q7065N2816J9482O2134
5223H89087O6084p749l7252l0796P1980J1082K1922O3894Q8812J16038J51732
5212A404834J54610K4572j25360j23571j97568j91315q8725q8769o3621p2286
5202F32801k201o72j6202m5000J0604K4482p3116N1833L042k5612o4790l6566
5190D58603m141K7363K925k6997l8183K9830Q585j5901L9088k2809n1205K22L5601
$$ plain form
5271 476301 535519 532601 425852 477808 473298 471339 514216 503513 459355 430879 499734 522536
5259 522536 494154 596074 449624 451693 427866 424818 460693 479690 486918 456816 490494 508173
5247 508173 475428 529658 483963 499971 495610 507533 480578 460324 485890 492510 517760 581013
5235 581013 576296 526016 538921 584562 664269 663697 638260 667590 754655 807471 826953 889087
5223 889087 955171 947422 910170 879374 951354 962436 984358 1048252 1137064 1253102 1404834
5212 1404834 1559444 1584016 1458656 1335085 1137517 946202 857477 768708 705087 632801
5202 632801 630600 629928 613726 568726 579330 603812 530696 582529 585571 559959 495169 458603
5190 458603 454462 481825 484750 457753 419570 449400 457985 442084 481172 458363 407158 407380 442981
5177D42981P0917n0658j4626N2081J1084m7606m059k0267r5271N3793k4197k8780
5165C45392M0086k3664N120L939Q838Q4014l4197k6353L7943j1461J7177L635
5153D50469n1092K2779K7440J7837k4289m6857K1444P1566J7881m9870J1948R810
5141D79066p724J2147M8421L235l055J1734o565l1768j6670K9041K3289N3717
5129E94868K9165q0687N9490L0556J7578J2124J9320O9559p662j1027J7963j2532
5117G38715o2351L4311n8735n155N0730j3753j7989J4713P3121K2574j9352l4887
5105G21942N9856O6529J1820L5762n0437M4656o373m9530j06988O631N1164L9625
5093H24657k8735R408K8061P1437O3592K5119j9250K5658P8730N3512J33402J16525
$$ plain form
5177 442981 513898 463240 448614 500695 511779 464173 460114 439847 344576 398369 374172 345392
5165 345392 385478 361814 366934 370873 379711 463725 429528 403175 441118 429657 446834 450469
5153 450469 399377 422156 449596 467433 443144 396287 417731 489297 507178 457308 469256 479066
5141 479066 471342 483489 531910 535145 532090 543824 537259 505491 488821 517862 541151 594868
5129 594868 624033 543346 602836 633392 650970 663094 682414 751973 744311 733284 751247 738715
5117 738715 676364 710675 651940 646785 697515 683762 665773 680486 753607 776181 756829 721942
5105 721942 781798 848327 860147 895909 845472 890128 883755 834225 727237 733868 785032 824657
5093 824657 795922 805330 833391 904828 968420 993539 974289 999947 1078677 1132189 1265591 1382116
5081A382116L6164J55936J17206J00014K06448J67775J10558j2422q2940k21593
5071A959262k27661j00553j53771r3867j03428q7530R492k6344r2066L215K9932
5060A116681m0908j3629k0535K4560k1973j5547j7835L0065o6141o232r3279k2138
5048H53089J0657m7844j0852j5446l4408n364N2715L8994o887k6185k3134O7131
5036H52466n9959J5286J9464q917M1429j5971q520k2974N9198J5987k0463o592
5024H60434J6816K8774P6797O9247k6335K7211O6733K282N0421L1081K8495L8396
5012A270352L2072N4233R0918J10438R0090J63410J91713J58682k4511q9776p5827
5001A971794k20134j85765j85997q9976j40476l4669O2849m9644l5958j4837J0655
$$ plain form
5081 1382116 1418280 1574216 1691422 1791436 1997884 2165659 2276217 2263795 2180855 1959262
5071 1959262 1731601 1631048 1477277 1383410 1279982 1192452 1201944 1175600 1083534 1086749 1116681
5060 1116681 1075773 1062144 1041609 1066169 1044196 1028649 1010814 1040879 974738 968506 875227 853089
5048 853089 863746 815902 805050 789604 755196 749832 802547 841541 834654 808469 785335 852466
5036 852466 792507 807793 827257 818340 859769 843798 835278 812304 871502 887489 867026 860434
5024 860434 877250 906024 982821 1052068 1025733 1052944 1119677 1121959 1172380 1203461 1231956 1270352
5012 1270352 1302424 1356657 1447575 1558013 1648103 1811513 2003226 2161908 2137397 2047621 1971794
5001 1971794 1751660 1565895 1379898 1289922 1149446 1114777 1177626 1127982 1092024 1077187 1087842
4990A087842K5681r221n7889K306K4794J6053m5098k9322l0977L6692N702M7436
4978A073999M2062n3365l3788N0282N7871n2735p6862Q0257J05899l4180K1626
4967A181066k6965L419P2472R069j5801N85l982k0078j1781N8751M6738K793R5884
4954A392170J1592m2117L7635J8238k2572Q541l3597n6475J3222k970q2352L9086
4942A280401M0787q1572K3905Q1735K0997J01434J6585L0844O2765M3368N0870
4931A672119q8139p1436L1873J8036k9038r490q290Q465O6775P2137J15635K8305
4919A806952N926N7165O0030L3048J0207N2379P8116R4665M8277N2767j6872M1355
4907B324015m6540n661K3626M7738k0769o2876K5092J617L4449L9916K7370j7451
$$ plain form
4990 1087842 1113523 1104302 1046413 1048719 1073513 1089566 1044468 1015146 984169 1020861 1026563 1073999
4978 1073999 1116061 1062696 1028908 1079190 1137061 1084326 1007464 1087721 1193620 1159440 1181066
4967 1181066 1154101 1157520 1229992 1239061 1223260 1223845 1219863 1199785 1188004 1246755 1293493 1296286 1392170
4954 1392170 1403762 1361645 1399280 1417518 1394946 1403487 1369890 1313415 1326637 1323667 1241315 1280401
4942 1280401 1321188 1239616 1263521 1345256 1366253 1467687 1484272 1515116 1577881 1621249 1672119
4931 1672119 1583980 1512544 1544417 1562453 1533415 1523925 1515635 1524100 1590875 1663012 1778647 1806952
4919 1806952 1812878 1870043 1930073 1963121 1973328 2025707 2103823 2198488 2246765 2299532 2282660 2324015
4907 2324015 2277475 2271814 2295440 2343178 2322409 2259533 2284625 2286242 2320691 2360607 2387977 2370526
4895B370526M7694O1165K1011R2532P0459N2843M280R6392N3605m0588Q7946J8549
4883B936414K73N2232P0502Q1089K6772r030L6878l227l2262J6907j0248M1652
4871C207952Q9091J5695M3997J9059N3519J85584J29697J79431J69427P1595J47072
4860D312119J73856Q1549J40488J45387J36962J37976K06206J50077J61234J26073
4850E771927R8223R5429J89774J78630J15516J06344J16404J32068Q2612P5100
4840F962027J39801J66700K20882Q5625K22276J80587J93480K24402K16409K70263
4830H882452J59529J77869J45708J33694R4031J85811J13337J23975R8852L3353
4820A0148611J55075K13664J72776K15079K08950J77645K64314K79019K42535
$$ plain form
4895 2370526 2418220 2479385 2500396 2592928 2663387 2716230 2720510 2816902 2870507 2829919 2917865 2936414
4883 2936414 2936687 2988919 3059421 3140510 3167282 3158252 3195130 3191903 3159641 3176548 3166300 3207952
4871 3207952 3297043 3312738 3356735 3375794 3429313 3614897 3744594 3924025 4093452 4165047 4312119
4860 4312119 4485975 4567524 4708012 4853399 4990361 5128337 5334543 5484620 5645854 5771927
4850 5771927 5870150 5965579 6155353 6333983 6449499 6555843 6672247 6804315 6886927 6962027
4840 6962027 7101828 7268528 7489410 7575035 7797311 7977898 8171378 8395780 8612189 8882452
4830 8882452 9041981 9219850 9365558 9499252 9593283 9779094 9892431 10016406 10115258 10148611
4820 10148611 10303686 10517350 10690126 10905205 11114155 11291800 11556114 11835133 12077668
4811A2077668L41689L48588M01334L88021L79724N13504M82090N50545O12145
4802A6095308O43611O49114O99500P60155P67307Q08009R92175J031026J032784
4793B3478989J041239J016627J144515J256698J237856J278991J372466J429235
4785C3256616J749065J843404K100384K439894K724927L220548L598092L990443
4777E4923373M651099N389600O418513P559915Q924520J0854938J3564767J7236732
4769A29523457K2846469K9927184L5985784L4417388K3051577K086781j9273903
4762B58564737l3963926l8383448l3584455k6492046j9786993j4780662j1138215
4755H0434992q639710o928010n779828m931495m240450l564312l148056k550442
$$ plain form
4811 12077668 12419357 12767945 13169279 13557300 13937024 14450528 14932618 15483163 16095308
4802 16095308 16738919 17388033 18087533 18847688 19614995 20423004 21415179 22446205 23478989
4793 23478989 24520228 25536855 26681370 27938068 29175924 30454915 31827381 33256616
4785 33256616 35005681 36849085 38949469 41389363 44114290 47334838 50932930 54923373
4777 54923373 59574472 64964072 71382585 78942500 87867020 98721958 112286725 129523457
4769 129523457 152369926 182297110 218282894 252700282 275751859 277838640 258564737
4762 258564737 224600811 186217363 152632908 126140862 106353869 91573207 80434992
4755 80434992 71795282 64867272 59087444 54155949 49915499 46351187 43203131 40652689
4747D0652689k246685j849540j612784j448004j273670j018038q76341p65791
4739B9561836o73141n25820m11032l86996k17896j35941j84579r8988r2596L390
4729B6838237J15220P4685J86757K63693K92003N09021N66584O65228O92688O82652
4719C0886768Q22797P84593P81676Q58425R49424J105295J219265J462421J664869
4710D0535533K022371K354541K645050L082727L551919M103349M840594N795492
4702F8931576P036189Q434571J0403830J3082015J6577171K1519255K8314293
4695A74298900L3073261K9868496J9537071N173608r968178k3937236l3653715
4688A94392207l4109386k8635306k2102002j6859935j2733182r894378p875448
$$ plain form
4747 40652689 38406004 36556464 34943680 33495676 32222006 31203968 30327627 29561836
4739 29561836 28888695 28362875 27951843 27564847 27346951 27211010 27026431 26927443 26834847 26838237
4729 26838237 26953457 27028142 27214899 27478592 27770595 28279616 28846200 29511428 30204116 30886768
4719 30886768 31709565 32494158 33275834 34134259 35083683 36188978 37408243 38870664 40535533
4710 40535533 42557904 44912445 47557495 50640222 54192141 58295490 63136084 68931576
4702 68931576 75967765 84402336 94806166 107888181 124465352 145984607 174298900
4695 174298900 207372161 237240657 256777728 261951336 251983158 228045922 194392207
4688 194392207 160282821 131647515 109545513 92685578 79952396 70058018 62182570
4681F2182570o351973n283801m499642l764393l203337k778643k430764k222476
4673C1647541j904611j757637j532119j407377j305240j146704j037602q24281
4665B0731970q46433p00963o78813o38784n67028o36465p20949o45803n81951
4656A4714781n50616n27670n18981m71903l64340l32110m10160m18157l08531
4647A0812313l01997j90231j83408k95543k39015k37105j86856k03279k14905
4638H759974k44627k01713k56960j02359j85580j50757k23314k37116j44016j81821
4628F831711k34268j95243j87202j18512j23848k09123j71055j35179p8679j80355
4618E198247o6796j074j00157n0363r4520k9474l7947K4507j05238n9606n5343
$$ plain form
4681 62182570 55830597 50546796 46047154 42282761 39079424 36300781 33870017 31647541
4673 31647541 29742930 27985293 26453174 25045797 23740557 22593853 21556251 20731970
4665 20731970 19885537 19184574 18505761 17866977 17299949 16663484 15942535 15296732 14714781
4656 14714781 14164165 13636495 13117514 12645611 12281271 11949161 11539001 11120844 10812313
4647 10812313 10510316 10320085 10136677 9841134 9602119 9365014 9178158 8974879 8759974
4638 8759974 8515347 8313634 8056674 7954315 7768735 7617978 7394664 7157548 7013532 6831711
4628 6831711 6597443 6402200 6214998 6096486 5972638 5763515 5592460 5457281 5378602 5198247
4618 5198247 5131451 5130377 5030220 4979857 4885337 4855863 4817916 4842423 4737185 4677579 4622236
4607D622236m9772p8608q0272j47948j73465r0462r8781j18615q6731j28368o3554
4596C505660k7735q2540J0722K0723M9632m1445L8954P7543j01657o2364N1230
4585C438723m7413j53053j07353j12521r1637r2739j32087j55232m151q380j7451
4574B516706l5693r3571q9782L5658m2100o2245k1547o6080q2804m2024K2609
4563B039127R2774N0775m9381o2619j5402k5597N1680n4968p1228J3383O919k3284
4551A952179N4217j6736o7318m3487n3054n0733L3424J2087q1872J8297k0237
4540A736767k4205M155O0622J1840j36444m5868K5334k669k3231m9894K6314n9624
4528A523097k354k8591n0100m0421l7331q782K8225Q9116Q9288M151N3849J16461
$$ plain form
4607 4622236 4572464 4493856 4413584 4265636 4092171 4001709 3902928 3784313 3697582 3569214 3505660
4596 3505660 3477925 3395385 3406107 3426830 3476462 3435017 3473971 3551514 3449857 3387493 3438723
4585 3438723 3391310 3238257 3130904 3018383 2926746 2834007 2701920 2546688 2542537 2534157 2516706
4574 2516706 2481013 2387442 2297660 2333318 2291218 2228973 2207426 2141346 2058542 2016518 2039127
4563 2039127 2131901 2182676 2133295 2070676 2055274 2029677 2081357 2026389 1955161 1968544 1975463 1952179
4551 1952179 2006396 1989660 1922342 1878855 1825801 1775068 1808492 1820579 1738707 1757004 1736767
4540 1736767 1712562 1716717 1777339 1789179 1652735 1606867 1632201 1629532 1606301 1556407 1582721 1523097
4528 1523097 1520743 1492152 1442052 1401631 1364300 1355518 1383743 1472859 1562147 1566298 1620147 1736608
4516A736608R04M2219p415o6321j2703m9391j8217j1840l7442j06761N5218j2622
4504A512237j9900m446L1241J662m0263p8234K3912M9714j9636k3327N2588N6757
4492A542305m5589j7693J00472n5789m8097J6491N6274J312k6563L608k7527J4420
4480A513624R0694K1694K3180L6547M4927m0867J7837M5614P1595M8333R56O5638
4468A939772O8030J4723J34085J03816k9460O5999J06373N4876Q6682K00348R2742
4457B837986J03595K14049K15610K94541L72698L02221J06524p0825q8067j41267
4447D147065j67744r0612m5072K8216O0709J27632Q7506J18497O4587O0855k1957
4436D369682O8583M8635K008K8486j7172K6678P828R6819L8210J24298P6093J96090
$$ plain form
4516 1736608 1737512 1779731 1772316 1705995 1693292 1643901 1625684 1613844 1576402 1469641 1524859 1512237
4504 1512237 1492337 1487891 1519132 1520794 1480531 1402297 1426209 1475923 1456287 1432960 1485548 1542305
4492 1542305 1496716 1479023 1579495 1523706 1475609 1492100 1548374 1549686 1523123 1526731 1499204 1513624
4480 1513624 1604318 1626012 1649192 1685739 1730666 1689799 1707636 1753250 1824845 1873178 1874134 1939772
4468 1939772 2007802 2022525 2156610 2260426 2230966 2296965 2403338 2458214 2544896 2745244 2837986
4457 2837986 2941581 3155630 3371240 3665781 4038479 4340700 4447224 4376399 4288332 4147065
4447 4147065 3979321 3888709 3843637 3871853 3932562 4060194 4147700 4266197 4330784 4391639 4369682
4436 4369682 4438265 4486900 4488908 4517394 4500222 4526900 4534728 4631547 4669757 4794055 4870148 5066238
4424E066238J72027O0143J3665R5319j1109O3726J0108p4904l7610n9477n0051
4413E248075O2683Q3249L7173k004p3507m0967L1790j5034l8552J6846J9704R4596
4401E424052J97556K39455J95371J65814J95885J84204J12608J10965J31577J46363
4391G103850J26548J12821J68018J22156J2545j5195L5086r7757j05464j23743
4381G338865j16421k43422j97790k45845l15929l06930l34840m16931l84356l96016
4371D380385k68136j90021k01832j72877j35647q0889n8094j17989k4013K5394
4361C156281j04844l6183n7089n7660N6654L9874M7049q4045O552N7147o3995
4350B959741J5330n65J8510M2455M0745O1877L7305M6825L6851J08345K09309
$$ plain form
4424 5066238 5238265 5298408 5312073 5407392 5396283 5460009 5470117 5395213 5357603 5298126 5248075
4413 5248075 5310758 5394007 5431180 5429176 5355669 5314702 5346492 5331458 5292906 5309752 5329456 5424052
4401 5424052 5621608 5861063 6056434 6222248 6418133 6602337 6714945 6825910 6957487 7103850
4391 7103850 7230398 7343219 7511237 7633393 7645938 7630743 7665829 7568072 7462608 7338865
4381 7338865 7222444 6979022 6781232 6535387 6219458 5912528 5577688 5160757 4776401 4380385
4371 4380385 4112249 3922228 3720396 3547519 3411872 3330983 3272889 3154900 3130887 3156281
4361 3156281 3051437 3015254 2958165 2900505 2957159 2997033 3044082 2960037 2966589 3023736 2959741
4350 2959741 2975071 2974506 2993016 3035471 3076216 3138093 3175398 3222223 3259074 3367419 3576728
4339C576728J15458Q9115J56515J53315K12564K35682K11212K72452K93696L52352
4329E669089L09002L01145L08205K99179K05499J72183R6910J28203L4055l4599
4319G488871R750j63932j26125n2642j48054j44591j90155j87704j50796j57936
4309F176686j13856j31650j93006j12796j23759M848p1631L7656K4286J18553
4299E615331m822N32r08k4388L4093J9637n6404J8425J03199K0520p367M1821
4287E759669j6295m1739j05319l7667k3249q7164j37272j32283k1999r0077j35122
4276D931483l4481M784o8845j5770J7750n9538p2804o3990j00512j73656j40245
4265D224176j70329k23770j15091j15043j14710j13133j15280n2268k2972k7757
$$ plain form
4339 3576728 3692186 3781301 3937816 4091131 4303695 4539377 4750589 5023041 5316737 5669089
4329 5669089 5978091 6279236 6587441 6886620 7092119 7264302 7361212 7489415 7523470 7488871
4319 7488871 7498621 7334689 7208564 7155922 7007868 6863277 6673122 6485418 6334622 6176686
4309 6176686 6062830 5931180 5738174 5625378 5501619 5506467 5434836 5472492 5496778 5615331
4299 5615331 5610509 5611041 5610133 5585745 5619838 5639475 5583071 5601496 5704695 5725215 5717848 5759669
4287 5759669 5743374 5701635 5596316 5558649 5535400 5448236 5310964 5178681 5156682 5066605 4931483
4276 4931483 4897002 4901786 4832941 4817171 4834921 4775383 4702579 4638589 4538077 4364421 4224176
4265 4224176 4053847 3830077 3714986 3599943 3485233 3372100 3256820 3204552 3181580 3153823
4255C153823J1133J3250n0318j4446k9886K6274P6425K4093Q5424L5719P8372
4244C409863n3076O7533Q8856P9408P8352N9782O1538J89425J07322J12549R6017
4233D297569N8836p1178l9082j56344j63170j15044o3732p261J3803K4429O0483
4222C839309J44219N1374J12267O2035O4207J07434J31724J56226J89600J23626
4212D982021R3256J14160R80j6992p7014p1003j58923j76273k38614j98449j92824
4201D060325j42043p7138j21487o9046k1965J6096J0536Q8688M1502J01411Q7387
4190C974266J1436K5001J15675L9703o3L4212n3103j23129p9303j71194j01166
4179C672335j66795j04057r0848q7693l5847l9253k4151q7422m0053J0483M4647
$$ plain form
4255 3153823 3164956 3178206 3127888 3113442 3083556 3109830 3186255 3210348 3295772 3331491 3409863
4244 3409863 3356787 3424320 3513176 3592584 3670936 3730718 3792256 3981681 4089003 4201552 4297569
4233 4297569 4356405 4285227 4246145 4089801 3926631 3811587 3747855 3740594 3754397 3778826 3839309
4222 3839309 3983528 4034902 4147169 4209204 4273411 4380845 4512569 4668795 4858395 4982021
4212 4982021 5075277 5189437 5190417 5173425 5096411 5025408 4866485 4690212 4451598 4253149 4060325
4201 4060325 3918282 3841144 3719657 3650611 3628646 3644742 3655278 3743966 3785468 3886879 3974266
4190 3974266 3985702 4010703 4126378 4166081 4166018 4200230 4147127 4023998 3944695 3773501 3672335
4179 3672335 3505540 3401483 3310635 3222942 3187095 3147842 3123691 3036269 2996216 3006699 3051346
4168C051346q2091m5244M634p847l8476p813J27145n357p1362P4885L0376J2208
4156C042404L3031L3462O611P8551R2286J68628J44019Q4529J15191O7294M2503
4145C908509m0419j2297j05388j62464q7662P975j00477j3956j7746J8587O082
4134C400744J6463O7812o654K543j0450n6409m161l6559m2690l1560j14242p5412
4122C109425P692p3625J0961J2630L1955L0461o0320k7187O0204J4285n5785R2383
4110C153079L0827J939J20013N6231J9991O6039L6173M4695L7623P5107M8214
4099C689931N0892m8700J8452q188K2034J66O7974O0717L3883O5273N05O1842
4087D014781P9286Q4227J31135N9213L5267O2672J02540J23332R3140Q5096J22684
$$ plain form
4168 3051346 2969255 2924011 2928645 2920798 2882322 2874509 3001654 2996297 2924935 2999820 3030196 3042404
4156 3042404 3075435 3108897 3115508 3194059 3286345 3454973 3598992 3683521 3798712 3866006 3908509
4145 3908509 3868090 3855793 3750405 3587941 3500279 3508254 3407777 3393821 3376075 3394662 3400744
4134 3400744 3417207 3485019 3478365 3480908 3470458 3414049 3409888 3373329 3330639 3299079 3184837 3109425
4122 3109425 3117117 3043492 3054453 3067083 3099038 3129499 3069179 3041992 3102196 3116481 3060696 3153079
4110 3153079 3183906 3185845 3305858 3362089 3382080 3448119 3484292 3528987 3566610 3641717 3689931
4099 3689931 3740823 3692123 3710575 3702387 3724421 3724587 3792561 3853278 3887161 3952434 3952939 4014781
4087 4014781 4094067 4178294 4309429 4368642 4403909 4466581 4569121 4692453 4785593 4870689 4993373
4076D993373J48489Q3262L008J71369J41532O7481J28944K09626J89253K06270
4066F342607J81663J75234K25485J95002L13168L34324L58213M25642N09853O40840
4056I702031O74084O71055R28072J118341J347480J472542J618316J769961J942632
4047B1244514K254200K612600K894363K611511J385869q16052k646510l497729
4039B6042766l343431k766408k266786j815729j453983j141684j017654r55766
4031A1281325p61905o03244n90331m01774l79886l86476k85271l26509k06749
4022G339180j83648j94107j54599j37518j56443j40524o4997l2469L1814l7893
4012F268796K6720q9899o784N9042m6928O5582l73J696J05048J06587j5087L797
$$ plain form
4076 4993373 5141862 5225124 5228132 5399501 5541033 5608514 5737458 5947084 6136337 6342607
4066 6342607 6524270 6699504 6924989 7119991 7433159 7767483 8125696 8551338 9061191 9702031
4056 9702031 10376115 11047170 11975242 13093583 14441063 15913605 17531921 19301882 21244514
4047 21244514 23498714 26111314 29005677 31617188 33003057 32187005 29540495 26042766
4039 26042766 22699335 19932927 17666141 15850412 14396429 13254745 12237091 11281325
4031 11281325 10519420 9916176 9325845 8924071 8544185 8157709 7872438 7545929 7339180
4022 7339180 7155532 6961425 6806826 6669308 6512865 6372341 6307344 6274875 6306689 6268796
4012 6268796 6295516 6205617 6198833 6257875 6210947 6276529 6276156 6277852 6382900 6489487 6474400 6478197
4000F478197Q58L3617J23921J09756Q3778R5042O7907N8917K14744J36788J88957
3989G592482J75972K12715J53401K12613J91630K06664K62665K67413K34582L07946
3979I818083L42532K56553K69077L72290L65396L54987K95497L67499L98550K88062
3969A3128526L83221L70604M24128M18969M43570M40538L84220L70666L53375
3960A6717817M02941L74092K88017L50221L45597K86789K37862J81088K70435
3951A9454859J94685J66957K50806K19959J82390J64015K05486J76385J53710
3942B1169252M4320Q2335Q9064R3842N7823K8580m1053n4241j57495j72439l06338
3931B0833650k57740k77762l17447k34690l63179l46471k80683j62677l42161
$$ plain form
4000 6478197 6479055 6512672 6636593 6746349 6830127 6925169 6993076 7051993 7266737 7403525 7592482
3989 7592482 7768454 7981169 8134570 8347183 8538813 8745477 9008142 9275555 9510137 9818083
3979 9818083 10160615 10417168 10686245 11058535 11423931 11778918 12074415 12441914 12840464 13128526
3969 13128526 13511747 13882351 14306479 14725448 15169018 15609556 15993776 16364442 16717817
3960 16717817 17120758 17494850 17782867 18133088 18478685 18765474 19003336 19184424 19454859
3951 19454859 19649544 19816501 20067307 20287266 20469656 20633671 20839157 21015542 21169252
3942 21169252 21213572 21295907 21384971 21478813 21536636 21565216 21524163 21469922 21312427 21139988 20833650
3931 20833650 20575910 20298148 19980701 19746011 19382832 19036361 18755678 18593001 18250840
3922A8250840l50533k16120l47383k10108k03986k53806k08340j48586j55207
3913A6156771j23418O803r1778P041O7893J53853K11576K11896L60016M52588
3903A7413241N30785O92535P72216Q86855R88321R97415R00704O58104N01318
3894B4341494L51456J87550m7861j32023j85571j48835q4484k9623O2728J05632
3884B4420463J88998J75780J77330J83044J38164k4195p7701j03497j85649k26782
3874B4665955j81800r4995O4815J61484L01145L49976M70520O38189Q09483R66658
3864B8151430J051424J159552J129732J159121R51087P72649M92644J71344n3640
3855C4985343k81284m64898n95651o41393o05869o27647n97944n51824n00168
$$ plain form
3922 18250840 17900307 17684187 17336804 17126696 16922710 16668904 16460564 16311978 16156771
3913 16156771 16033353 16040156 15948378 15955419 16023312 16177165 16388741 16600637 16960653 17413241
3903 17413241 17944026 18636561 19408777 20295632 21283953 22281368 23182072 23840176 24341494
3894 24341494 24692950 24880500 24832639 24700616 24515045 24366210 24281726 24252103 24314831 24420463
3884 24420463 24609461 24785241 24962571 25145615 25283779 25259584 25181883 25078386 24892737 24665955
3874 24665955 24484155 24389160 24453975 24615459 24916604 25266580 25737100 26375289 27184772 28151430
3864 28151430 29202854 30362406 31492138 32651259 33602346 34374995 34867639 35038983 34985343
3855 34985343 34704059 34239161 33643510 33002117 32396248 31768601 31170657 30618833 30118665
3846C0118665n66880o74987q13666r36243j054181j182922j366523j416428j346673
3837B0760162j392319j275374j084208j058986r95927q29427p84442p07944n67629
3828A2063906n46873m93556n01077l34683k94825l36879k83282k84320j93112
3819H795299k62646k93317j69098j90358k23889k58876k21269k49190j01879m9776
3809F775001k26135j88433j11244q5960j96646j63564j03258q4148j52294j63221
3799E300098j05431j01340j27038j05682r3653p2641j01595n5616m8696r6301
3789D392105q8147j00931j27470m7662o9412l1765k0921k0054n9290j20731q0898
3778C624824m0794j0996p7602p8447O6055o5521p8919k7415k8391K9823p0013
$$ plain form
3846 30118665 29551785 28876798 28063132 27126889 26072708 24889786 23523263 22106835 20760162
3837 20760162 19367843 18092469 17008261 15949275 14953348 14123921 13339479 12631535 12063906
3828 12063906 11517033 11023477 10522400 10187717 9892892 9556013 9272731 8988411 8795299
3819 8795299 8532653 8239336 8070238 7879880 7655991 7397115 7175846 6926656 6824777 6775001
3809 6775001 6548866 6360433 6249189 6163229 5966583 5803019 5699761 5615613 5463319 5300098
3799 5300098 5194667 5093327 4966289 4860607 4766954 4694313 4592718 4537102 4488406 4392105
3789 4392105 4303958 4203027 4075557 4027895 3958483 3926718 3905797 3885743 3826453 3705722 3624824
3778 3624824 3584030 3573034 3495432 3416985 3483040 3417519 3338600 3311185 3282794 3312617 3242604
3767C242604j23364l2678k0800o6990p1286M8689J1272n7593n4387P2636L1235
3756B979338o6408R43j5400r4920L7646K7930n0520p4906l3294k794j7647p9631
3744B610337l6330M961p415l2187j2198L137L144k6348k1401l9621m6215L3041
3732B432905l9930l3951K5949l5801k956Q784K5268O894n2940l4524L0086j62
3720B329622l7990j5960m4883J6594K7087J0809j1229p201P7722K6257m2547P3790
3708B402071j8722k1708m6949K5765q279j264K6247K7398K677N6537o2073M3039
3696B424739J02153L2716Q7688L9379M572n553o096J21023m672k498L5438R1356
3684B920245J01522K5208O7487Q3688O2364L7394R3978J37934M7634M6538P7499
$$ plain form
3767 3242604 3119240 3086562 3065762 2998772 2927486 2976175 2987447 2929854 2875467 2948103 2979338
3756 2979338 2912930 2913873 2898473 2803553 2841199 2869129 2818609 2743703 2710409 2707615 2689968 2610337
3744 2610337 2574007 2578968 2571553 2539366 2527168 2530305 2533449 2507101 2485700 2446079 2399864 2432905
3732 2432905 2392975 2359024 2384973 2349172 2346216 2355000 2380268 2387162 2334222 2299698 2329784 2329622
3720 2329622 2291632 2275672 2230789 2247383 2274470 2285279 2274050 2266849 2344571 2370828 2328281 2402071
3708 2402071 2383349 2361641 2314692 2340457 2332178 2330914 2357161 2384559 2387236 2443773 2381700 2424739
3696 2424739 2526892 2559608 2647296 2686675 2691247 2685694 2679598 2800621 2795949 2793451 2828889 2920245
3684 2920245 3021767 3046975 3114462 3198150 3260514 3297908 3391886 3529820 3577454 3623992 3701491
3673C701491O3022N8630O6555K2572L7222P6839k8772N4645J32414P4516Q1088
3662D340222L1425Q1119L0661j5688O1262O4720j4982L1974Q0329n474j3538P0277
3650D742307K6387Q9260J05895N2744J09929J14360P5272J81012P2998P0737J05657
3639E746558J83948K01482J22915J39934J07419K19610K12848K35516J42405K48674
3629G561309K74818K50790L17555L34257L50887M14886M17112L90218M23190N56113
3619A1291135N57774O48403O92236P65012Q78100R47260R75521R71679Q91502
3610A8618622Q56574P86856Q01466P43147Q09527R04190Q94544J000994J173403
3601B6589323J245951J363569J413432J345528J291721J174131J129266Q61281
$$ plain form
3673 3701491 3764513 3823143 3889698 3912270 3949492 4026331 3997559 4052204 4184618 4259134 4340222
3662 4340222 4371647 4452766 4483427 4467739 4529001 4593721 4578739 4610713 4691042 4685568 4672030 4742307
3650 4742307 4768694 4857954 4963849 5016593 5126522 5240882 5316154 5497166 5570164 5640901 5746558
3639 5746558 5930506 6131988 6254903 6394837 6502256 6721866 6934714 7170230 7312635 7561309
3629 7561309 7836127 8086917 8404472 8738729 9089616 9504502 9921614 10311832 10735022 11291135
3619 11291135 11848909 12497312 13189548 13954560 14832660 15779920 16755441 17727120 18618622
3610 18618622 19475196 20262052 21063518 21806665 22616192 23520382 24414926 25415920 26589323
3601 26589323 27835274 29198843 30612275 31957803 33249524 34423655 35552921 36414202
3593C6414202O86801M68531L44711J53771O3223K4121J83248L34110K94078L82735
3583C9349531L61858L07314J23442q9051l62973n72674r11394j036584j296137
3574C5873332j273686j302733j298279j277873j274135j067759r59517r75078
3566B6444272q65580j013771j023686j030294j087626j197418j203095j216286
3558A7806516j163645j070002j023757q17598p45691o61976o44736n39204n84825
3549A0555082m38404m89575l86885l56418l70214k98965k86856k79131k59365
3540G389269j81938k07308k60282j31172j45657j37916k26621k27872q7316k28168
3530E555019j16429o8004j32984j01191j20470q2524j21841o0549o4671j23606
$$ plain form
3593 36414202 37101003 37569534 37914245 38068016 38131239 38155360 38338608 38672718 38966796 39349531
3583 39349531 39711389 40018703 40142145 40053094 39690121 39117447 38206053 37169469 35873332
3574 35873332 34599646 33296913 31998634 30720761 29446626 28378867 27419350 26444272
3566 26444272 25578692 24564921 23541235 22510941 21423315 20225897 19022802 17806516
3558 17806516 16642871 15572869 14549112 13731514 12985823 12323847 11679111 11139907 10555082
3549 10555082 10116678 9627103 9240218 8883800 8513586 8214621 7927765 7648634 7389269
3540 7389269 7207331 7000023 6739741 6608569 6462912 6324996 6098375 5870503 5783187 5555019
3530 5555019 5438590 5370586 5237602 5136411 5015941 4933417 4811576 4751027 4686356 4562750
3520D562750q7041j22651n1639r3641q1331k5983j1540j12991p7961n3924o9713
3509C774335n8338l6749l2523o6327K7833j28084j3001m4104j7919m3824m0219
3498C321080o2102j9554o2305r5452N2523K3615j52185n9732k1306r9036k0790
3487B804756l3122m1061n3474m5231k1625m3041p6229j0912o4401o1244M6408
3476B400824o1122m6387q5778m8498K2719l0704o622q0864k7282p9505j6655k6933
3464A913193j12744m8599j7580m6097P0926m2459p9866k344m1315k7054k4365
3453A541696l2541K5020r699m6401J5824K6519k0577p3512j674j6572l0742j3183
3441A364158j7989J9738L790n8397l9775j1491l5529j7402J2856k4339K0869M064
$$ plain form
3520 4562750 4475709 4353058 4301419 4207778 4126447 4100464 4088924 3975933 3897972 3844048 3774335
3509 3774335 3715997 3679248 3646725 3580398 3608231 3480147 3467146 3423042 3405123 3361299 3321080
3498 3321080 3258978 3239424 3177119 3081667 3134190 3157805 3005620 2945888 2924582 2825546 2804756
3487 2804756 2771634 2730573 2677099 2631868 2610243 2567202 2490973 2480061 2415660 2354416 2400824
3476 2400824 2339702 2293315 2207537 2159039 2181758 2151054 2144432 2063568 2036286 1956781 1940126 1913193
3464 1913193 1800449 1751850 1734270 1688173 1759099 1716640 1636774 1634430 1593115 1566061 1541696
3453 1541696 1509155 1534175 1524476 1478075 1493899 1520418 1499841 1426329 1424655 1408083 1377341 1364158
3441 1364158 1346169 1365907 1369697 1311300 1271525 1260034 1224505 1207103 1219959 1195620 1216489 1220553
3429A220553n0067P986R383l7217J5971r7323L7750N6124r1997m084J1919K4762
3417A103760L8736J6839o0167q5082l6214k4486J5715Q361k8509l8553J3693Q159
3405I32252N8841j3978n2066R0562m6622j2571n281J6640M6060r806j8219n6976
3393I28836r850K282l4519l716o4693J0384K6021j3757k0299M4948M6803j9622
3381H92818l8864k4568M897J5257N302j5019l6936M3861L3187l9491j561j7166
3369H21717q767k5390j6571n017n746K7807j5430L6616m3188K0036Q9102r5012
3357G80157k853k1516K1551L3300j916l4677k4988J0234m2308R617K6931K8445
3345G81977K1201j5570J6991l7608J0999J4400l995o8373J5989K5040p6517J0776
$$ plain form
3429 1220553 1170486 1178472 1187855 1150638 1166609 1069286 1107036 1163160 1071163 1067079 1078998 1103760
3417 1103760 1142496 1159335 1099168 1014086 977872 953386 969101 977462 948953 910400 924093 932252
3405 932252 991093 977115 925049 1015611 968989 956418 951137 967777 1013837 1004031 985812 928836
3393 928836 918986 921268 886749 883033 818340 828724 854745 840988 820689 865637 912440 892818
3381 892818 853954 829386 834283 849540 854842 839823 802887 846748 879935 840444 838883 821717
3369 821717 812950 787560 770989 765972 760226 788033 772603 809219 766031 786067 875169 780157
3357 780157 777304 755788 777339 810639 808723 774046 749058 759292 716984 726601 753532 781977
3345 781977 803178 787608 804599 766991 777990 792390 788395 720022 736011 761051 684534 695310
3333F95310L1396O1718k0065j3316P1804k7632p5045J9433N7238R1025o941m7137
3321H37788K502L4674J8700l9015k1130k1151L7520L0534j1099j1896M2636P6147
3309I76210l7619L9380l1150r188N5932N2906n0320l2722M4574P3597k0916p825
3297A052859o568o798Q3142N212l1121m8021N889M4743j2197l1480K9575K3616
3285A108851k6406p602M3657L2299K252M0482k6610j9717M2556n9127M014k7491
3273A107158L2271R1059L0036J9733K7940o655L7724k7085p1797J9845k3571Q2016
3261A318674N561K229J1598k0521R343Q5560j1367P996N9993L3040K2449N571
3249A530126J557p8963R1050R4563j286M2420N0586K044L9975J9214N9360R6051
$$ plain form
3333 695310 726706 788424 768359 755043 826847 799215 724170 743603 800841 891866 884925 837788
3321 837788 840290 874964 893664 854649 833519 812368 849888 880422 869323 857427 900063 976210
3309 976210 938591 977971 946821 937633 993565 1046471 996151 963429 1008003 1081600 1060684 1052859
3297 1052859 1046291 1039493 1122635 1127847 1096726 1048705 1054594 1099337 1087140 1055660 1085235 1108851
3285 1108851 1082445 1074843 1118500 1150799 1153051 1193533 1166923 1147206 1189762 1130635 1134649 1107158
3273 1107158 1139429 1230488 1260524 1280257 1308197 1301542 1339266 1312181 1240384 1260229 1236658 1318674
3261 1318674 1324235 1326464 1338062 1317541 1326884 1412444 1401077 1409073 1469066 1502106 1524555 1530126
3249 1530126 1531683 1452720 1543770 1638333 1637047 1679467 1730053 1732097 1772072 1791286 1850646 1946697
3237A946697Q3349j2147N0153R3075P0622N341J18546O7427J32866Q9009J27018
3226B771956J41629Q3476J52317J03617J29797K10995K07606J29099K51208J42694
3216D324394K7632K6882l2464r9521j54422j81402k70703l05099k49432k20593
3206B865272k46554j59674j64425o7966j69686n1396p1815m4051O9074k1605q0666
3195A856508j01011o5010q0843j9389j21371m4811l1067o5964m2541j3700o3806
3184A206995j9300J1086n714n9756k2759p8722m6784M246K5016J2010m5060L8370
3172A019628k5923n1871m0352l167j5594L2285R5042o7058n8838j5386J7014p7623
3160H08157K0178P808k6024m9726m0513J7589o854k0625n9400j1595L9745O368
$$ plain form
3237 1946697 2030046 2017899 2068052 2161127 2231749 2237090 2355636 2423063 2555929 2644938 2771956
3226 2771956 2913585 2997061 3149378 3252995 3382792 3593787 3801393 3930492 4181700 4324394
3216 4324394 4352026 4378908 4346444 4246923 4092501 3911099 3640396 3335297 3085865 2865272
3206 2865272 2618718 2459044 2294619 2226653 2056967 2005571 1933756 1889705 1958779 1937174 1856508
3195 1856508 1755497 1690487 1609644 1590255 1468884 1424073 1393006 1327042 1284501 1270801 1206995
3184 1206995 1187695 1198781 1193067 1133311 1110552 1031830 985046 989292 1014308 1026318 981258 1019628
3172 1019628 993705 941834 901482 898315 882721 915006 1010048 942990 884152 868766 885780 808157
3160 808157 828335 836143 810119 760393 719880 737469 730615 709990 650590 638995 678740 685108
3148F85108P898o4835L267K4358K10r966n2130j3604k908j524J8202p4345j8418
3135E01313M9877J8446J8992q6836m6088K0124L6100l6444n5251M6424L0221l2490
3123D64388K859O053o046O013J2100o735j0995m3686m0036R103J7338l4400K6037
3110D01993N8676k4578j08467M6503O9405L6011n8682o1407k3756M5848k2225
3099C59321j2461j896k9925l5385M4943M1162m7893Q458J0416o276q846O588O60
3086C28866J380J0142l8796k215N7024l7834M2042j0361k9906n3627O7993p1919
3074B62789j2634M245m3579P4557k0154j359K7151N3180k6153j5808n6549l7417
3062B08269O0603l8054J2506K8541k4668k4327N0587j7652l7726j0194N4452K4064
$$ plain form
3148 685108 693006 628171 631438 655796 656006 646040 593910 580306 577398 575874 594076 519731 501313
3135 501313 551190 569636 588628 501792 455704 475828 511928 475484 420233 466657 496878 464388
3123 464388 467247 473300 467254 473267 485367 478632 467637 423951 383915 393018 410356 375956 401993
3110 401993 460669 436091 327624 374127 443532 479543 420861 359454 335698 381546 359321
3099 359321 346860 344964 315039 279654 324597 365759 317866 326324 336740 330464 321618 328206 328866
3086 328866 330246 340388 301592 299377 356401 318567 360609 350248 320342 266715 334708 262789
3074 262789 250155 254400 210821 285378 265224 263865 291016 344196 318043 302235 245686 208269
3062 208269 268872 230818 243324 271865 247197 222870 273457 255805 218079 207885 262337 286401
3050B86401N3555m8832r2129P4748n891m0571R559L6325K8297k5396J276n5420
3038B21922k9496K7296p281L4697K7487K2317J4689k4679J1485k14k2707K7853
3026C03369n6244l5317n1028R0699J4682P30p2948l1140N9928k9883J4590l4103
3014A73335O3887N9311l4182l411M992J769j9023R355k5842J9881R846q0838m5058
3001A34022N3018K6016J7704k4090J6885N428r205J8397p6923P0401j2214m6491
2989A72948k5825L2383L2897n7018P4503l4816n669n4573J2648M8233J9712o9328
2977A46095M3647J2102j5364J7114j5060q500J0396O9225l9265L2168N4363m8516
2965B58405j849l094m732L474K4658k0411n6911L5400k0648P6133K8464O837l884
$$ plain form
3050 286401 339956 291124 198995 273743 267852 227281 236840 273165 301462 276066 277342 221922
3038 221922 192426 219722 212441 247138 274625 296942 311631 286952 298437 298223 275516 303369
3026 303369 247125 211808 160780 251479 266161 266891 193943 162803 222731 192848 207438 173335
3014 173335 237222 296533 262351 258940 263932 265701 246678 256033 230191 250072 259918 179080 134022
3001 134022 187040 213056 230760 206670 223555 228983 219778 238175 161252 231653 219439 172948
2989 172948 147123 179506 212403 155385 229888 195072 189403 134830 147478 195711 215423 146095
2977 146095 189742 201844 186480 203594 188534 180034 190430 259655 220390 252558 306921 258405
2965 258405 256556 253462 248730 252204 276862 256451 199540 234940 214292 290425 318889 325726 321842
2952C21842K0304k8989l3758m1122j9373J4573j164J2468M8374J1568J4341j7044
2940C02020j3089j06008M1995J8451L7688Q6495j4439m6152L7071o508j5173K7634
2928C49985j0841N5294K5716l4884j7104r568M7639J2976k1552l2489n1525P1230
2916C84877n613J4517M5958q5007m3822M3435P1093j5819k0209L0968l7101O9789
2904D53066r046N2734l8422M533j0969L5244N9622j3967n2722M6181M5785J1166
2892E83205R922k4777k4200m7260P3616l5481L3466J6502K0508M8344m4059L5151
2880F44937j6512K1510r99j2845N4443Q0946M4208j7660q0947m8688R969K6092
2868G04454q0801r7988L1380J1036n2430N608K2l6595P6582K1385l542P4001j1799
$$ plain form
2952 321842 342146 313157 279399 238277 218904 233477 232313 244781 293155 304723 319064 302020
2940 302020 288931 182923 224918 243369 281057 367552 353113 306961 344032 337524 322351 349985
2928 349985 339144 394438 420154 385270 368166 358598 406237 419213 397661 365172 313647 384877
2916 384877 379264 393781 439739 354732 310910 354345 425438 409619 389410 420378 383277 453066
2904 453066 444020 496754 458332 462865 451896 487140 546762 532795 480073 526254 572039 583205
2892 583205 593127 568350 544150 496890 570506 535025 568491 584993 605501 653845 609786 644937
2880 644937 628425 649935 648936 636091 690534 771480 815688 798028 717081 668393 678362 704454
2868 704454 623653 525665 557045 568081 515651 521259 521281 484686 561268 582653 579111 653112 641313
2855F41313n7794J0020K0404l1363M4746k8642j0452J9852J2512N4231J415L7365
2843G13607j12537m4502M5629K894m8943K936m300l6703o2933K5233k2326n631
2831D52424J2049k7127k4734J8043M921o331k5735k5560M498J3182p412j8863
2819C69355K7470K9136r5256l1599M4868k1287n3343L4789J3817k6652n2784J07794
2807C46308K1092o0833m4931m4365M6040M2163l6369M138Q4446n0587k0938o239
2795B79925k9932o1275M7182L0307L875k3890m2844L9433j9201L6144J9467o4410
2783B14781j5542n6258O0006k3230k1742m0413L7983q369l127L8242n8508J6986
2771A40809J9836Q780o5886m1682M0521N6258l6782J9818L6722L8488o7350l7737
$$ plain form
2855 641313 583519 593539 613943 582580 627326 598684 588232 608084 620596 674827 676242 713607
2843 713607 601070 556568 602197 605091 556148 559084 554784 518081 455148 480381 458055 452424
2831 452424 464473 437346 412612 430655 435576 429245 403510 377950 382448 395630 388218 369355
2819 369355 396825 425961 330705 299106 343974 322687 269344 304133 317950 291298 238514 346308
2807 346308 367400 306567 261636 217271 263311 305474 269105 273243 357689 307102 286164 279925
2795 279925 249993 188718 235900 266207 270082 246192 203348 242781 223580 259724 279191 214781
2783 214781 199239 142981 202987 179757 158015 117602 155585 147216 144089 182331 123823 140809
2771 140809 160645 169425 103539 61857 102378 158636 121854 141672 178394 216882 149532 111795
2759A11795M3343n609q706p2344R504N8106J7851n1374k303k4350O8172N8235
2747B02320j3725l0895l9048j8113j3168k5559R345J3615L1041m5056K5270J7697
2735A13724J6697l0814l765m88l8421J8127j2881J6533R9583n5223k9214j3397
2723H0461J1756O265l4595m9640K3856J2870J9315P3335N2758m7636n1623j7725
2711G9397k6586M339n2871L5270O3028L3443m8682L2965O311L661l0404M4337
2699A44208j9502r235N216o2645l1287Q3776o63k9738l8068P474J404K6050J18158
2686A95148j107m4285k2864k2454m7990k1367n875R0402k9003p7515j0611m803
2674b324L3159k7195j6914j2136M057J1987J2861k0950r014L4721J3798P851n4287
$$ plain form
2759 111795 155138 149529 140823 68479 77983 136089 153940 102566 100263 75913 144085 202320
2747 202320 188595 157700 118652 100539 87371 61812 71157 84772 115813 70757 96027 113724
2735 113724 130421 99607 95842 95354 56933 75060 62179 78712 178295 123072 93858 80461
2723 80461 92217 98482 63887 14247 38103 50973 70288 143623 196381 148745 97122 79397
2711 79397 52811 57150 4279 39549 102577 136020 87338 120303 126614 130275 99871 144208
2699 144208 124706 115471 120687 58042 26755 110531 109868 80130 42062 49536 50940 76990 195148
2686 195148 194041 149756 126892 104438 56448 35081 29206 119608 90605 13090 2479 -2324
2674 -2324 30835 3640 -13274 -25410 -21353 -9366 3495 -17455 -26469 8252 22050 29901 -24386
2661b4386n390N4740J4122R72m4553J8281J2513K2624k1175o0626K5515J9782
2649A2419K1870m842n0497J5644l5412M1991J5185M0433J5046l6731M2674L7177
2637A14957l0675j2571o705r293K1907n9280l5378N0950L2158L1495n2224l6593
2625H748J4680N655m5403j0963K952J3426j5044l1134o4874R5983L9089j3954
2613h39l173J7475P5999q9744J3935k324j7594q032n30N722L9980l405k3592J2636
2599A6514J5901k4674K0137L2056j6373o9488K95K8524q7981L0412L5131L8015
2587A8469n911k566J2942j3418k6134o2567Q3840J1507J9254k3618l9815N2622
2575B4605m231k2159l0597n6824L9052L2454P296n3242l5466O8936J6753R299
$$ plain form
2661 -24386 -29776 24964 39086 40058 -4495 13786 26299 48923 27748 -32878 -7363 12419
2649 12419 34289 29447 -21050 -5406 -40818 1173 16358 56791 71837 35106 77780 114957
2637 114957 84282 71711 65006 55713 77620 18340 -17038 33912 66070 97565 45341 8748
2625 8748 23428 29083 -16320 -27283 -24331 -10905 -25949 -57083 -121957 -25974 13115 -839
2613 -839 -4012 13463 89462 -282 13653 11329 -6265 -14297 -14827 -9105 30875 27470 3878 16514
2599 16514 32415 7741 27878 59934 43561 -25927 -25632 2892 -85089 -54677 -19546 18469
2587 18469 12558 9992 22934 9516 -16618 -79185 4655 16162 35416 11798 -28017 24605
2575 24605 20374 -1785 -32382 -89206 -50154 -17700 -10404 -63646 -99112 -30176 -13423 -4124
2563d124J2682o799P87J3154J4837j3111J4066r214j5592Q5038j1164l8058K5770
2550F8272m5939Q4094O652j09037p2928J5648L3685P2676q5067K3782k0290J5489
2538a2963j6784M8663J4506q5924L1206n6659J4147K9925j6209k2676M3622K8304
2526h42l3138L4686k253n458K8066l8696O950p592l7667P4265n1527K7457K3227
2513A7478m9573P7416j2114n0710J9501k4046J8176j0214N377j9408n578M3173
2501I478n7290O35M323j9630O370M6099j476N3655r346K505n90O603q3458K2532
2487a9590M8374J292k2057N2098k4139k1417k0288j8035l4699R341M4758j2525
2475a6887n4000J6472O1990n0294j8908M6268L0045o575o7865m0901L2614L6431
$$ plain form
2563 -4124 8558 1759 2546 15700 30537 17426 31492 22278 6686 91724 80560 42502 68272
2550 68272 22333 106427 113079 4042 -68886 -53238 -19553 53123 -31944 -8162 -28452 -12963
2538 -12963 -29747 18916 33422 -52502 -21296 -77955 -63808 -33883 -50092 -72768 -29146 -842
2526 -842 -33980 706 -1547 -7005 21061 -17635 -10685 -18277 -55944 18321 -33206 -5749 17478
2513 17478 -32095 45321 33207 -17503 1998 -22048 -3872 -14086 -8709 -28117 -33695 9478
2501 9478 -47812 -47177 -42854 -62484 -56114 -10015 -11491 42164 32818 35323 34733 41336 -42122 -19590
2487 -19590 28784 30076 8019 60117 35978 14561 -5727 -23762 -58461 -49120 -4362 -16887
2475 -16887 -70887 -54415 7575 -42719 -61627 -15359 14686 8111 -59754 -100655 -68041 -31610
2463c1610M4053j2970j2413L5497O3491m2057n0369M4441k9630O0982m0095k4413
2451D907J9974N7728l1781k0912L1951k2537L93k9821J7485k4848l4826J2501
2439a9786k2961O8958r589k5827N727k9149L2653K9382r6m2800k5016J9429Q4084
2426F5009l7153r422j2964K3747j3011o0550L8545M3118m7594K758N301L5292
2414C3076n5286j9868l3286K2652M487q796q826l8933k194M6091L8032l0154L0416
2401b2589M5490M3183p4855k698N1662J7045p8634l0049J3135R2203L609n4363
2389C139J8723k6545L8626J537M0941k8396j9739j2854k2168L2897m6684j5723
2377c6246R3676L9290n5285m9727N249L7590m4761k5231L4506L3320L3492m2751
$$ plain form
2463 -31610 12443 -527 -12940 22557 86048 43991 -6378 38063 8433 69415 29320 4907
2451 4907 24881 82609 50828 29916 61867 39330 39723 9902 27387 2539 -32287 -19786
2439 -19786 -42747 26211 16622 -9205 -3478 -32627 26 29408 29312 -13488 -38504 -19075 65009
2426 65009 27856 18434 5470 29217 16206 -44344 -5799 37319 -10275 -7517 -2216 33076
2414 33076 -22210 -42078 -75364 -52712 -48225 -57021 -65847 -104780 -106974 -60883 -22851 -53005 -22589
2401 -22589 22901 66084 -8771 -11469 40193 57238 -21396 -51445 -38310 53893 57502 3139
2389 3139 21862 -4683 33943 35480 76421 48025 28286 15432 -6736 26161 -20523 -36246
2377 -36246 57430 96720 41435 -8292 -3043 34547 -10214 -35445 -939 32381 65873 23122
2365B3122M334O4352L024m0984K099k1398l810O6934P1970o1358n3452j4077L1387
2352G2143M5120K0163q081K6735L1946m7671l5125O9370O1442n3936J6205K6521
2340B24832r4724P372J8569l8827K657L025l4216r3066l0821n9488Q9056J8721
2328A3090J8376N6438m6350n6681K4879K9084L3886J2172N4450k0344l4947l0300
2316E3753J2706l5093l1602j9679K0597R3462m4002k4269k3466M2929l8163M9968
2304E7141M8024Q396j11103n7533N5004l034M2037j8816K3090l572l2531M2168
2292D9271k5605P313J2435k1749k716n095L1087J5560m3311m2467N4752O4067
2280I3542l5447N3718J0756k0606m2050J712L7050k8989m2728p284K6181M9088
$$ plain form
2365 23122 27456 91808 94832 53848 55947 34549 30739 97673 169643 108285 54833 40756 72143
2352 72143 117263 137426 129345 156080 188026 140355 105230 174600 236042 182106 198311 224832
2340 224832 130108 137480 156049 117222 119879 122904 88688 -4378 -35199 -94687 -5631 13090
2328 13090 31466 87904 41554 -15127 9752 38836 72722 84894 139344 119000 84053 53753
2316 53753 66459 31366 -236 -19915 682 94144 50142 25873 2407 45336 7173 57141
2304 57141 105165 113561 2458 -55075 -71 -3105 38932 20116 43206 39634 7103 49271
2292 49271 23666 30979 43414 21665 18949 13854 44941 60501 17190 -25277 29475 93542
2280 93542 58095 111813 122569 101963 59913 61625 98675 69686 26958 19674 45855 94943
2268I4943j9608m4070L309J7503J9454N542L1416k5370q9866P2241N6628l5117
2256H7005L5242l1428k9536m4981m3005O0562L3552j0935M511J611L1258P633
2244A01489L7774m2879k9256k2403j8777M820o3294K8802M8229n562N4086L2587
2232A25616k3890m0097j1501O040L7J02646k4211l8610O7646j9966J1105n4154
2220A00661M0173L5189j1575l2349Q8177m5292m4134r5165J4969O0801n89J494
2208A12360j4897q958k4486L1343J6263K7008K2591l3276l0881J7412Q8868O6376
2196B69723q3279j6265n1129N7340L5551j0144J553M4492m9940J616K643k548
2184A99613N2327L4311j5689o6466N271m801L5578N9358k7919L1129n720n3653
$$ plain form
2268 94943 75335 31265 34574 52077 71531 77073 108489 83119 -6747 65494 122122 87005
2256 87005 122247 90819 61283 16302 -26703 33859 67411 56476 60987 62598 93856 101489
2244 101489 139263 96384 67128 44725 25948 30768 -32526 -3724 44505 38943 93029 125616
2232 125616 101726 61629 50128 56168 56205 158851 134640 96030 163676 143710 154815 100661
2220 100661 140834 176023 164448 132099 220276 174984 130850 35685 50654 111455 110866 112360
2208 112360 97463 88505 64019 95362 111625 138633 161224 127948 97067 114479 203347 269723
2196 269723 186444 170179 119050 176390 211941 201797 203350 247842 197902 199518 202161 199613
2184 199613 251940 286251 270562 204096 209367 204566 240144 299502 271583 302712 296992 243339
2172B43339l4958P6915K3882r994O7995N6867K686N0612J1734L9542J6233q777
2160E36076j950K4459J0025k203k0194O691J2937k0097R287K3312j6591P7836
2148F39588J5279k8469N1716L3286J9394q012R0310N2890m0785N671L3168J069
2136H65105O0271j4148M8245R309j1485j1470M721K6505N0101L3214N246K4858
2124A090472J3483K2467K2205K0554O9492j6255M6487J12281Q9121M3257R0186
2113A603750O9984P8144P4141O6307J10383J55399O4759J38725J02127J41310
2103B605029J39198J23483J69487J45311K15805K05212J71287K44420K85118M06541
2093D710891L76849M97129M93295L69421L00253M09713N62682O90505R08673J249673
$$ plain form
2172 243339 208381 285296 309178 299184 367179 424046 426732 477344 489078 528620 544853 536076
2160 536076 534126 558585 568610 566407 546213 552904 565841 545744 555031 578343 561752 639588
2148 639588 654867 626398 678114 711400 730794 722782 813092 865982 825197 830868 864036 865105
2136 865105 925376 911228 959473 968782 957297 945827 950548 977053 1027154 1060368 1065614 1090472
2124 1090472 1103955 1126422 1148627 1169181 1238673 1222418 1268905 1381186 1470307 1513564 1603750
2113 1603750 1673734 1751878 1826019 1892326 2002709 2158108 2222867 2361592 2463719 2605029
2103 2605029 2744227 2867710 3037197 3182508 3398313 3603525 3774812 4019232 4304350 4710891
2093 4710891 5087740 5584869 6078164 6447585 6747838 7157551 7720233 8410738 9319411 10569084
2083A0569084J392114J896731K402371L215065M273600N942305N838681K644207
2075C8174158k130120n900143n793219m725030l456209k750799j992185j584076
2067I842377j048544q79185o86731n37399m02603l47880l14621m03817m74517
2058D747080m03779l64695k80557k98542k62407j45740j43578j14510j30220p4988
2048B528064r8499p2026l7135j80059j26867m68j00444j15391o6106k8773l8376
2037A663920r4169k8336l4758q2434r0048J2510n6389k2730q9777o1742j5897
2026A100150K2748l1860J0542J0085K0847k2408k1032n1698m5037q7261j4554
2015H90522j4972m7856k7900q85k9151m7722L1395o3274m6306N321j3794p0412
$$ plain form
2083 10569084 11961198 13857929 16260300 19475365 23748965 29691270 35529951 38174158
2075 38174158 36044038 30143895 24350676 19625646 16169437 13418638 11426453 9842377
2067 9842377 8793833 7914648 7227917 6690518 6287915 5940035 5625414 5221597 4747080
2058 4747080 4343301 3978606 3698049 3399507 3137100 2991360 2847782 2733272 2603052 2528064
2048 2528064 2429565 2357539 2320404 2140345 2013478 2013010 1912566 1797175 1731069 1702296 1663920
2037 1663920 1569751 1541415 1506657 1424223 1334175 1346685 1290296 1267566 1177789 1116047 1100150
2026 1100150 1122898 1091038 1101580 1111665 1132512 1110104 1089072 1037374 992337 905076 890522
2015 890522 875550 827694 799794 798909 769758 722036 753431 690157 643851 649172 635378 564966
2003E64966J5910l204q8184j5530J5589K6084k4137k1044O9208J3750m4807N880
1991E14481l8443J0132k0032j9740R476l7006J0762J724k6923J2384o9184N6714
1979D04345l1689o214O7333m0899j03285L8167j3935J0239P04q680j183l4827
1967B80076m0499L5586N5350R607n0415q1968M0225l8447R635j1640K0727O8634
1955B96871j8543J9058l6774l6556k6720j5283M1184k458k9085P2352m3529j06914
1943A13603l4817M2771P3069Q981j8713l9344M8426m934N1827m0831m6510K830
1931A56358l4969J0787j8573m5059L8674N0652L3539j5576n5972l948k2241p2655
1919B1017l6167R0060P3869k8662k9381K5121L6974j1155k5907m9994N6432K9205
$$ plain form
2003 564966 580876 577672 489488 473958 489547 515631 491494 470450 539658 553408 508601 514481
1991 514481 476038 486170 466138 446398 455874 418868 429630 431354 404431 416815 347631 404345
1979 404345 372656 366442 433775 392876 289591 327758 313823 324062 324766 316086 314903 280076
1967 280076 239577 275163 330513 340120 289705 207737 247962 209515 219150 207510 228237 296871
1955 296871 278328 297386 260612 224056 197336 182053 223237 220779 191694 264046 220517 113603
1943 113603 78786 121557 194626 203607 184894 145550 193976 189042 240869 200038 153528 156358
1931 156358 121389 132176 113603 68544 107218 157870 191409 175833 119861 115913 93672 21017
1919 21017 -15150 74910 148779 120117 90736 115857 152831 141676 115769 65775 122207 151412
1907A51412l3488r497L4849q2165j893M043J9846O5470O6392m9309M3799K4324
1895B33783q562k6150p9314J1872J1217J5232j8614K7331o961l8333o8454m5205
1883G842M1282P8655J586n8851K8089j3376K4788J9524K8438o5874m8836K7923
1871G1190R785Q19N354l8205J2420L2303p7153J6653l7473J6220K0134J175J6583
1858D9805Q4142m6364N8909m7477n4347Q286Q372K9028n0914J4287K6880R08k8805
1845E2710k4339L5912N680j7833K7892n2107J9271J7953P705K8144n1407L5551
1833H5132M0573l9928j4615N3567R0382j7217j5181L037m6566o1737J9478l308
1821I3617k8845J5192o4020K4508J12576n4625M0355N5223p2669m603M1056J5204
$$ plain form
1907 151412 117924 108427 143276 61111 59218 63261 83107 148577 214969 165660 209459 233783
1895 233783 225221 199071 119757 131629 142846 158078 139464 166795 159834 121501 53047 7842
1883 7842 49124 127779 129365 70514 98603 85227 110015 129539 157977 92103 43267 71190
1871 71190 80975 81794 87148 48943 61363 93666 16513 33166 -4307 11913 32047 33222 49805
1858 49805 133947 87583 146492 99015 44668 52954 61326 90354 39440 53727 80607 81515 52710
1845 52710 28371 64283 69963 52130 80022 27915 47186 65139 72844 100988 49581 85132
1833 85132 125705 85777 71162 124729 215111 197894 182713 185750 139184 77447 96925 93617
1821 93617 64772 79964 15944 40452 153028 98403 138758 193981 121312 116709 157765 172969
1809A72969J2645q579K0107Q628k4438n2534J2568m3830p5054K1899l4508K2359
1797C2232L6120L0355m6781q445o916M374O5786O146l7495m487m5834M9426j9886
1784E4595j4970N5878O014o145m2721n0811J002P841r2710L4391J08099J2364
1772G2827m6746O681N2613o118R519p033k2328l5125j0892m8570M7184k8558K4261
1759G715n2876N515M3024m9048R658m3327L2302N5482P8586k3931j9409j08300
1747f4609j4809J7427P4852k2640k1576O902j9682P5588k4411n4872N8666P0444
1735H1280o161m7842R40m4110K825M721j4504n1730N6964j7237m3912Q9711K3137
1722C4082L863q1258L2435P9801l9405J460R478L0828j6643n0994m4816O1394
$$ plain form
1809 172969 185614 177035 197142 205770 181332 128798 141366 97536 22482 44381 9873 32232
1797 32232 68352 98707 51926 43481 36565 40939 106725 112871 75376 70889 25055 74481 54595
1784 54595 39625 95503 101517 95372 52651 1840 2842 10683 -82027 -47636 60463 72827
1772 72827 26081 32762 85375 79257 88776 81743 59415 24290 13398 -35172 12012 -16546 7715
1759 7715 -45161 -39646 3378 -45670 -36012 -79339 -47037 8445 87031 63100 43691 -64609
1747 -64609 -79418 -61991 12861 -9779 -31355 -24453 -44135 31453 7042 -47830 10836 81280
1735 81280 75119 27277 28217 -15893 -13068 -8347 -22851 -74581 -17617 -34854 -78766 10945 34082
1722 34082 37945 -43313 -10878 68923 29518 30978 40456 71284 54641 3647 -41169 20225
1710B0225P0310k8394n3887J3063K3534R47j9029p2500P5461K5801m8035n645
1698A851j3923l5556k3354R378M7376L96l3050O8475L4360n4721K5792m5174l723
1685b1873N5600O380m1947J8385J2262m4927K8528n3805l8688J08423K8054l9193
1673A7199j0416O103k5971K5553K9159K6216r8391M4303L4799J716k2984K0402
1661D7688m3326J700L6443j149L5193l0907J4076o4957k9665j5417P9754J3951
1649D3384k8006K2249J099k3812k3266L756M7416J9494m0348M1006k1746r105
1637C2121p8824K2171L5879k7740L7394k703p873m4472Q8086N203r6051k7294
1625f4103M2378M9249K4502m9522N038m265j8178R348r458k5698L280M8334O1347
$$ plain form
1710 20225 90535 62141 8254 21317 44851 45798 26769 -45731 29730 55531 7496 1851
1698 1851 -12072 -47628 -70982 -61604 -14228 -13832 -46882 21593 55953 1232 27024 -18150 -21873
1685 -21873 33727 40107 -1840 16545 28807 -16120 12408 -41397 -80085 28338 56392 17199
1673 17199 6783 12886 -13085 12468 41627 67843 -30548 13755 48554 50270 27286 47688
1661 47688 4362 6062 42505 41356 76549 45642 59718 -5239 -34904 -50321 29433 43384
1649 43384 15378 37627 38726 14914 -8352 -4596 42820 62314 21966 62972 41226 32121
1637 32121 -46703 -24532 11347 -16393 21001 18298 10425 -34047 54039 59242 -36809 -64103
1625 -64103 -21725 27524 52026 2504 7542 3277 -14901 -5553 -15011 -40709 -37429 10905 72252
1612G2252k5157P767K2640k7556k0584J9641K8437n491J0046l1354K0353l4515
1600C6479q9948L2877J7942l2009Q100L5336N153p3435K2706O7585j8512n1251
1588c8977n9208L7605K5896O927j5342M6331j2030J974N1199o956L508j0577P392
1575C7742L5181m2137o737M1500K7556p0203J7975n4925K1300n2280k947k7918
1563g5893J0600J16943m2728p2104K4295J5800J3393n911m3366P1722j8265p655
$$ plain form
1612 72252 47095 54862 77502 49946 29362 49003 77440 71949 81995 50641 70994 36479
1600 36479 -53469 -20592 -2650 -34659 -26559 8777 13930 -59505 -36799 30786 12274 -38977
1588 -38977 -98185 -60580 -34684 -27757 -43099 3232 -8798 -6824 44375 37419 40927 30350 37742
1575 37742 72923 30786 24049 65549 93105 22902 40877 -14048 7252 -45028 -47975 -75893
1563 -75893 -65293 51650 8922 -63182 -38887 -23087 -9694 -15605 -58971 12751 -5514 -13169
$$ [...]
##END NTUPLES=NMR SPECTRUM
##END=
