##TITLE=1H_EC-3286(1)
 CDCl3
 8 sc, 
 15.11.2022
##JCAMPDX= 6.0         $$ Bruker NMR JCAMP-DX V2.0
##DATA TYPE= NMR SPECTRUM
##DATA CLASS= NTUPLES
##ORIGIN= UXNMR, Bruker Analytische Messtechnik GmbH
##OWNER= root
$$ XWIN-NMR		Version 3.5
$$ Tue Nov 15 15:39:46 2022 Russian Standard Time (UT+4h)  she@DPX200
##.OBSERVE FREQUENCY= 200.1313499994
##.OBSERVE NUCLEUS= ^1H
##.ACQUISITION MODE= SIMULTANEOUS
##.ACQUISITION SCHEME= undefined
##.AVERAGES= 8
##.DIGITISER RES= 18
##SPECTROMETER/DATA SYSTEM= spect
##.PULSE SEQUENCE= zg30
##.SOLVENT NAME= Acetone
##.SHIFT REFERENCE= (INTERNAL, Acetone, 0, 15.7755)
##AUDIT TRAIL= $$ (NUMBER, WHEN, WHO, WHERE, WHAT)
$$ ##TITLE= Audit trail, XWIN-NMR		Version 3.5
$$ ##JCAMPDX= 5.01
$$ ##ORIGIN= Bruker BioSpin GmbH
$$ ##OWNER= she
$$ F:/spectra/data/she/nmr/H-F/1/pdata/1/auditp.txt
$$ ##AUDIT TRAIL=  $$ (NUMBER, WHEN, WHO, WHERE, WHAT)
(   1,<2022-11-15 15:38:34.68 +0400>,<she>,<DPX200>,
      <created by zg, POWCHK disabled, PULCHK disabled
       configuration hash MD5:
       00 E9 B6 7A A2 85 ED C7 34 08 36 98 17 FE 4E 26
       data hash MD5: 16K
       80 45 FA B7 F1 5F 85 CF 0F C6 73 7A 1A C8 80 D5>)
(   2,<2022-11-15 15:38:37.07 +0400>,<she>,<DPX200>,
      <Start of raw data processing
       efp BC_mod = 2 LB = 0.24 FT_mod = 6 PKNL = 1 PHC0 = -17948.53 PHC1 = 20.2007 SI = 16K 
       data hash MD5: 16K
       33 8C AF 21 AC 45 EC 43 2D 51 70 9C 08 AC D7 AB>)
(   3,<2022-11-15 15:38:41.59 +0400>,<she>,<DPX200>,
      <abs ABSG = 5 
       data hash MD5: 16K
       8F FE 4F 24 D3 84 8B E9 EA 2A F1 37 70 8B F6 7E>)
(   4,<2022-11-15 15:38:58.28 +0400>,<she>,<DPX200>,
      <pk PHC0 = -87.89455 PHC1 = 0.1999999 
       data hash MD5: 16K
       62 1E 21 E4 14 27 BB F7 FB 60 C3 5E F1 77 2D EA>)
(   5,<2022-11-15 15:39:01.32 +0400>,<she>,<DPX200>,
      <abs ABSG = 5 
       data hash MD5: 16K
       63 B0 47 96 62 AA C8 97 EF 2D 95 96 43 56 3A D5>)
$$ ##END=
$$ 
$$ hash MD5
$$ FA 62 3F BC A8 94 69 9B E1 83 82 DE 24 EE C4 9F
##$RELAX= 
##$RELAX= 
##$RELAX= 
##$RELAX= 
##$RELAX= 
##$RELAX= 
$$ Bruker specific parameters
$$ --------------------------
##$DU= <F:/spectra>
##$EXPNO= 1
##$NAME= <H-F>
##$PROCNO= 1
##$TYPE= <nmr>
##$USER= <she>
##$AMP= (0..31)
100 100 100 100 100 100 100 100 100 100 100 100 100 100 100 100 100 100 
100 100 100 100 100 100 100 100 100 100 100 100 100 100 
##$AQSEQ= 0
##$AQ_mod= 1
##$AUNM= <au_zg>
##$AUTOPOS= <>
##$BF1= 200.13
##$BF2= 200.13
##$BF3= 200.13
##$BF4= 200.13
##$BF5= 200.13
##$BF6= 200.13
##$BF7= 200.13
##$BF8= 200.13
##$BYTORDA= 1
##$CFDGTYP= 0
##$CFRGTYP= 5
##$CHEMSTR= <none>
##$CNST= (0..31)
1 1 145 1 1 1 1 1 1 1 1 1 1 1 1 1 1 1 1 1 1 1 1 1 1 1 1 1 1 1 1 1 
##$CPDPRG= <>
##$CPDPRG1= <>
##$CPDPRG2= <>
##$CPDPRG3= <>
##$CPDPRG4= <mlev>
##$CPDPRG5= <mlev>
##$CPDPRG6= <mlev>
##$CPDPRG7= <mlev>
##$CPDPRG8= <mlev>
##$CPDPRGB= <>
##$CPDPRGT= <>
##$D= (0..31)
0 1.2 0 0 0 0 0 0 0 0.06 0 0.03 0 0 0 0 0.0002 0 0 0 0 0 0 0 0 0 0 0 0 
0 0 0 
##$DATE= 1668512314
##$DBL= (0..7)
$$ [...]
##$SUBNAM3= <"">
##$SUBNAM4= <"">
##$SUBNAM5= <"">
##$SUBNAM6= <"">
##$SUBNAM7= <"">
##$SUBNAM8= <"">
##$SUBNAM9= <"">
##$SW= 18.0517283424941
##$SWIBOX= (0..15)
0 0 2 0 0 0 0 0 0 0 0 0 0 0 0 0 
##$SW_h= 3612.71676300578
##$TD= 16384
##$TD0= 1
##$TE= 0
##$TE2= 300
##$TE3= 300
##$TEG= 300
##$TL= (0..7)
0 120 120 120 120 120 120 120 
##$TP= (0..7)
150 150 150 150 150 150 150 150 
##$TP07= 0
##$TPNAME0= <>
##$TPNAME1= <>
##$TPNAME2= <>
##$TPNAME3= <>
##$TPNAME4= <>
##$TPNAME5= <>
##$TPNAME6= <>
##$TPNAME7= <>
##$TPOAL= (0..7)
0.5 0.5 0.5 0.5 0.5 0.5 0.5 0.5 
##$TPOFFS= (0..7)
0 0 0 0 0 0 0 0 
##$TUNHIN= 0
##$TUNHOUT= 0
##$TUNXOUT= 0
##$USERA1= <user>
##$USERA2= <user>
##$USERA3= <user>
##$USERA4= <user>
##$USERA5= <user>
##$V9= 5
##$VALIST= <valist>
##$VCLIST= <CCCCCCCCCCCCCCC>
##$VD= 0
##$VDLIST= <DDDDDDDDDDDDDDD>
##$VPLIST= <PPPPPPPPPPPPPPP>
##$VTLIST= <TTTTTTTTTTTTTTT>
##$WBST= 1024
##$WBSW= 4
##$XGAIN= (0..3)
0 0 0 0 
##$XL= 0
##$YL= 0
##$YMAX_a= 468890
##$YMIN_a= -730149
##$ZGOPTNS= <>
##$ZL1= 120
##$ZL2= 120
##$ZL3= 120
##$ZL4= 120
##$ABSF1= 15.76452
##$ABSF2= -2.28733
##$ABSG= 5
##$ABSL= 3
##$ALPHA= 0
##$AQORDER= 0
##$ASSFAC= 0
##$ASSFACI= 0
##$ASSFACX= 0
##$ASSWID= 0
##$AUNMP= <proc_1d>
##$AZFE= 0.1
##$AZFW= 0.1
##$BCFW= 0
##$BC_mod= 2
##$BYTORDP= 0
##$COROFFS= 0
##$CY= -3
##$DATMOD= 1
##$DC= 0
##$DFILT= <>
##$DTYPP= 0
##$F1P= 0
##$F2P= 0
##$FCOR= 1
##$FTSIZE= 16384
##$FT_mod= 6
##$GAMMA= 0
##$GB= 0
##$INTBC= 1
##$INTSCL= 3.70164e-10
##$ISEN= 128
##$LB= 0.24
##$LEV0= 0
##$LPBIN= 0
##$MAXI= 10000
##$MC2= 0
##$MEAN= 0
##$ME_mod= 0
##$MI= 1.114404
##$NCOEF= 0
##$NC_proc= -5
##$NLEV= 6
##$NOISF1= 3.799351
##$NOISF2= 2.8
##$NSP= 0
##$NTH_PI= 0
##$NZP= 0
##$OFFSET= 15.77554
##$PC= 1
##$PHC0= -18036.42
##$PHC1= 20.4007
##$PH_mod= 1
##$PKNL= yes
##$PPARMOD= 0
##$PSCAL= 0
##$PSIGN= 0
##$REVERSE= no
##$SF= 200.1299991999
##$SI= 16384
##$SIGF1= 3
##$SIGF2= 2
##$SINO= 5.538805
##$SIOLD= 16384
##$SREGLST= <1H.CDCl3>
##$SSB= 0
##$STSI= 16384
##$STSR= 0
##$SW_p= 3612.71676300578
##$SYMM= 0
##$S_DEV= 0
##$TDeff= 16384
##$TDoff= 0
##$TI= <>
##$TILT= no
##$TM1= 0
##$TM2= 0
##$TOPLEV= 0
##$USERP1= <user>
##$USERP2= <user>
##$USERP3= <user>
##$USERP4= <user>
##$USERP5= <user>
##$WDW= 1
##$XDIM= 16384
##$YMAX_p= 372066385
##$YMIN_p= -148370
$$ End of Bruker specific parameters
$$ ---------------------------------
##NTUPLES= NMR SPECTRUM
##VAR_NAME=  FREQUENCY,     SPECTRUM/REAL,   SPECTRUM/IMAG
##SYMBOL=    X,             R,               I
##VAR_TYPE=  INDEPENDENT,   DEPENDENT,       DEPENDENT
##VAR_FORM=  AFFN,          ASDF,            ASDF
##VAR_DIM=   16384,         16384,           16384
##UNITS=     HZ,            ARBITRARY UNITS, ARBITRARY UNITS
##FACTOR=    0.220516191357247, 1,           1
##FIRST=     3157.15887799727, 0,            0
##LAST=      -455.557885008512, 0,           0
##MIN=       -455.557885008512, -148370,     0
##MAX=       3157.15887799727, 372066385,    0
$$ Real data points
##PAGE= N=1
##DATA TABLE= (X++(R..R)), XYDATA
$$ [...]
9462 478678 455468 496076 483314 506292 527830 552107 509244 503723 522537 509291 531781 580388
9450 580388 577805 570553 520435 531593 573849 496179 514629 560011 574838 614456 652940 684579
9438 684579 674823 652168 628322 642314 710897 723843 706407 722768 702659 746950 793838 819579
9426 819579 832969 864201 881244 892983 949039 954605 985710 998020 893625 846658 849878 873994
9414 873994 899643 922533 923421 927026 916390 928939 993781 1017414 1014064 1038804 1083318 1083416 1117671
9401 1117671 1133156 1141853 1157964 1170158 1158992 1210997 1249954 1290948 1359342 1373711 1338040 1396955
9389 1396955 1419177 1438329 1466190 1492053 1614086 1637443 1608396 1650197 1702499 1758404 1792332
9378 1792332 1824308 1833281 1928183 2014830 2057441 2135579 2194134 2242517 2332848 2446024 2544094
9367 2544094 2624079 2753649 2876230 2959121 3121239 3200016 3301192 3418463 3571099 3709671
9357 3709671 3869382 4046666 4197236 4387345 4672469 4912694 5125002 5382714 5747713 6098388
9347 6098388 6489498 6966833 7492057 8078326 8722975 9466066 10286342 11260506 12347251
9338 12347251 13532023 14771660 16046150 17421696 18807377 19992720 20972716 21648968
9330 21648968 21952777 21887540 21432524 20554706 19347587 17988607 16516729 14984714 13530731
9321 13530731 12160510 10899956 9822873 8865095 8097470 7348352 6704735 6168989 5714453
9312 5714453 5327496 4997375 4736407 4414535 4164572 3966151 3764437 3619012 3476103 3349894
9302 3349894 3242443 3102303 2960540 2883479 2868449 2802107 2684992 2638642 2586372 2527580 2574961
9291 2574961 2534327 2610824 2683667 2676650 2691639 2684161 2619240 2499710 2455973 2422484 2369971 2313735
9279 2313735 2224774 2199550 2148803 2158922 2147886 2122581 2087772 2126218 2157135 2145930 2178497
9268 2178497 2250645 2396428 2447934 2469306 2549584 2466544 2369070 2305798 2275739 2307655 2315495
9257 2315495 2351256 2373453 2425999 2460907 2453949 2403874 2354690 2350148 2382453 2449129 2557142 2603524
9245 2603524 2655660 2695323 2568158 2492744 2422381 2340954 2303441 2284921 2355073 2424554 2508600
9234 2508600 2597283 2726838 2821445 2957090 3023751 3077742 3134493 3161147 3205699 3265522 3374387
9223 3374387 3425835 3427687 3444594 3394193 3343291 3410703 3467867 3600462 3823129 4072457 4405577
9212 4405577 4858554 5272975 5474016 5316021 5009895 4693202 4481022 4260108 4053485 3936066
9202 3936066 3883327 3901510 3894269 3862352 3767710 3807596 3835144 3854306 3929703 4155771 4351076
9191 4351076 4716938 5216413 5598252 5672351 5504260 5272280 4950414 4653185 4403943 4295624
9181 4295624 4330832 4475654 4605477 4664951 4682983 4618104 4576104 4626893 4759938 4964004 5182305
9170 5182305 5478082 5676127 5638864 5342046 4899131 4485493 4119545 3829070 3610575 3423405
9160 3423405 3350706 3357545 3402863 3472687 3525793 3481124 3527631 3583881 3634646 3695392 3886932
9149 3886932 4164511 4374370 4666844 4663926 4368624 3958166 3549502 3172998 2804906 2502065
9139 2502065 2284435 2150033 2071729 2048354 2053620 1972657 1949520 1904684 1920228 1875484 1860713
9128 1860713 1849666 1837650 1828919 1770798 1750965 1743080 1741602 1760544 1794619 1854155 1921365 2006301
9116 2006301 2069322 2240249 2453148 2527725 2633917 2602766 2559379 2481170 2372447 2249317
9106 2249317 2215434 2175920 2167320 2162114 2088831 2112211 2124975 2096247 2089714 2102354 2116000 2181771
9094 2181771 2250400 2350961 2518268 2660282 2792380 2844878 2835339 2784955 2688159 2631524 2614765
9083 2614765 2591509 2542664 2552054 2564154 2607585 2610317 2580254 2635501 2645342 2682992 2699410 2788401
9071 2788401 2849923 2829565 2763353 2626828 2491175 2356898 2215753 2127403 2024211 2047791
9061 2047791 2043619 2074906 2155786 2149936 2113202 2140486 2140867 2184982 2335682 2409168 2456268 2550752
9049 2550752 2661106 2695988 2695166 2558494 2353027 2249846 2078614 1962233 1890506 1762728
9039 1762728 1667371 1584779 1491515 1411953 1342010 1312183 1296762 1276021 1217078 1186076 1182124 1113440
9027 1113440 1029069 1046872 1032073 1022154 1004919 998769 951938 918086 1008098 1034699 1021450 954302
9015 954302 998613 982169 962886 924477 896590 886801 900140 896625 907258 909416 912714 926249
9003 926249 916846 927845 876438 849962 895874 966404 981717 937161 891469 912949 842832 754204
8991 754204 774141 775145 796251 843041 889340 884291 832357 773922 757960 814245 875994 864543
8979 864543 912029 920973 975763 996751 988496 925322 942127 914559 902797 864313 816279 801167
8967 801167 724003 764101 824889 844604 837967 821041 835670 815739 828139 838422 799077 855915
8955 855915 919053 930377 973077 990452 982002 1029046 1049917 1036772 1062034 1066375 1025526 1086109
8943 1086109 1153465 1155871 1171601 1209286 1291424 1338708 1350690 1357343 1387177 1446782 1504190 1597519
8931 1597519 1677583 1703256 1830951 1876390 1894410 1980490 2065497 2143941 2235596 2303849 2391539
8920 2391539 2504305 2551838 2619594 2705162 2851824 2890052 2926275 2917089 2922878 2964749 2954436
8909 2954436 2876096 2830214 2740114 2688998 2622174 2532721 2461137 2404882 2298445 2184208 2141836
8898 2141836 2108681 1975632 1905485 1834968 1774825 1763410 1711845 1650005 1601098 1543842 1515885
8887 1515885 1417201 1324996 1358819 1352552 1301634 1255120 1236740 1195802 1183065 1150723 1163232 1147293
8875 1147293 1074954 1099050 1080748 1103027 1135778 1129794 1091727 1068435 1036021 982038 918121 973311
8863 973311 968170 954514 962260 949239 965261 959702 956049 919248 869021 887444 903698 883166
8851 883166 907668 907138 894928 857806 855772 831590 850148 861246 877182 813291 779910 807500
8839 807500 783422 788653 793041 806212 819201 828086 811017 818210 818850 756108 777338 798984 794964
8826 794964 811328 850309 786680 762233 785198 820734 845425 877155 831652 830188 792193 784090
8814 784090 791896 793250 877849 918393 870897 860601 920850 946945 925194 940253 946044 860211
8802 860211 897648 875917 884001 938775 1011243 1022239 1002245 981344 965999 970868 961627 990417
8790 990417 996588 1048518 1033420 1044165 1036122 1075425 1135479 1191881 1168145 1201383 1244245 1302319
8778 1302319 1333897 1379129 1358397 1320818 1330403 1365763 1448823 1475613 1509316 1525174 1554004 1585815
8766 1585815 1596422 1614963 1685075 1732259 1812088 1804592 1801148 1838613 1874707 1887405 1927193 1921415
8754 1921415 1879575 1916452 1949508 1967644 1971204 1986669 2045544 2098485 2186980 2284698 2319398 2380132
8742 2380132 2456911 2577129 2669582 2748138 2820239 2897254 2945203 3075439 3207693 3293654 3388657
8731 3388657 3500914 3641301 3789542 3953276 4136847 4387168 4549756 4777042 4951976 5159182
8721 5159182 5347423 5658964 5928037 6228639 6513686 6887622 7410332 8064215 8791816 9688658
8711 9688658 10702280 11837615 13089651 14720774 16670207 19161142 22409886 26607654
8703 26607654 32006087 40083567 49672797 56774241 53399360 42969236 34475741 27190404
8695 27190404 21650668 17393936 14325239 12086377 10521677 9320173 8400834 7492921
8687 7492921 6807557 6248861 5831772 5484186 5112871 4800053 4559474 4373174 4240712 4158162
8677 4158162 3983345 3802615 3665429 3498373 3351396 3225129 3077246 2951981 2777331 2602571
8667 2602571 2459934 2278808 2198206 2110779 2048311 1992610 1961997 1933126 1847701 1814321 1769947
8656 1769947 1761124 1768490 1798565 1798064 1771442 1750722 1678029 1612339 1585830 1571702 1506549 1510101
8644 1510101 1503112 1482868 1413140 1390987 1400456 1365359 1329446 1355154 1413787 1375806 1426747 1435830
8632 1435830 1428446 1407888 1360110 1339212 1323270 1308219 1246443 1156516 1157355 1189638 1161019 1147324
8620 1147324 1186091 1144404 1100391 1088871 1120283 1099895 1087005 1108761 1137470 1121021 1154820
8609 1154820 1169795 1146479 1129768 1087842 1042809 1080776 1130610 1126170 1105458 1110976 1122740 1123557
8597 1123557 1146202 1163298 1182768 1169125 1175899 1225572 1221564 1227129 1309270 1271556 1288982 1332294
8585 1332294 1367594 1417459 1377611 1421055 1453350 1441638 1531133 1588974 1614495 1628151 1606721
8574 1606721 1620814 1606211 1642987 1679801 1699624 1702930 1713014 1751543 1788768 1770511 1821552 1840274
8562 1840274 1928661 1989628 2075410 2163265 2233852 2338941 2302805 2336747 2380418 2439266 2476659
8551 2476659 2481156 2572953 2640804 2727504 2733105 2831583 2953154 3060642 3169222 3361675 3527010
8540 3527010 3716998 3856982 3947989 4027051 4032448 4034286 4062350 4173813 4286600 4423608 4588570
8529 4588570 4722375 4787359 4891723 4932784 4974005 5090239 5165157 5344833 5591119 5732202
8519 5732202 5936443 6219260 6531576 6983765 7395544 7720494 7937318 8130074 8360827 8364381
8509 8364381 8120655 7741095 7350231 7008972 6796517 6656979 6605417 6615353 6676661 6702445
8499 6702445 6646839 6504941 6391344 6223741 6060203 5963904 5948146 5871437 5826658 5784317 5767172
8488 5767172 5710675 5738317 5722318 5801250 5955268 6164989 6440898 6778735 7150477 7603920
8478 7603920 8015548 8529567 8991384 9424297 9933068 10287887 10335045 10163344 9871368 9519014
8468 9519014 9044512 8387100 7745916 7170661 6714541 6327169 6030424 5806830 5499502 5207059
8458 5207059 5046944 4785632 4571793 4389625 4270463 4194297 4173298 4084864 3983821 3887071
8448 3887071 3823255 3821860 3898896 3961519 4016909 4054119 4159607 4327171 4380138 4418052 4519495
8437 4519495 4667322 4894431 5098017 5247281 5357691 5465449 5460000 5284488 4877722 4292189
8427 4292189 3826628 3471079 3175664 2881718 2706262 2562599 2474190 2411767 2341294 2276137
8417 2276137 2179609 2068584 1974934 1905470 1817266 1798204 1701868 1664366 1587887 1528113 1510549
8406 1510549 1482348 1474599 1475352 1450375 1437874 1420758 1426092 1387770 1344272 1235941 1215352 1144087
8394 1144087 1113503 1106798 1125061 1159348 1111928 1126695 1138707 1106267 1096429 1058358 1016761 1003130
8382 1003130 979867 987061 981783 1005660 971048 976495 948105 942708 930408 904225 885009 905278
8370 905278 917756 965155 1032499 1032965 1052279 1052093 1057684 1096334 1203882 1250082 1153639 1089445
8358 1089445 1001515 951121 961366 914985 881720 851780 840440 829267 765951 714989 719441 722782
8346 722782 722784 744507 764515 725891 685215 716792 750226 749194 742738 761773 791167 781116 840622
8333 840622 881231 895011 878106 857512 863080 806121 764829 747903 754290 716749 721195 742671
8321 742671 696606 716650 786146 786612 792277 824869 885189 885233 883637 868965 881527 902662 868096
8308 868096 799723 752428 726851 679612 639619 600966 569440 587087 573048 485788 487239 510284
8296 510284 535398 513887 492711 525787 479169 485332 532457 548295 583609 600591 573592 588185
8284 588185 576717 543130 573825 630958 688388 754742 804871 867229 880795 941450 941402 924559
8272 924559 871114 798811 751325 704181 626348 606011 593423 548586 554935 592025 617771 717021
8260 717021 742513 716520 725300 758942 759429 715496 659817 614088 590983 578385 549730 584078
8248 584078 637254 610202 628600 610237 634425 638212 611701 616102 667368 704705 713097 794690
8236 794690 820685 824145 784004 713580 701787 599604 595604 548026 608257 598264 596418 585228
8224 585228 633707 669020 726996 671464 628450 623431 611368 570669 488848 477963 465749 429900
8212 429900 446531 490063 423784 342069 294193 331820 331997 366544 399797 343696 302149 298295
8200 298295 319996 304888 318653 368348 393614 398160 397015 277689 -69150 77857 192112
8189 192112 238317 281008 249619 235878 240097 309222 276277 235658 243298 233534 215689 234335
8177 234335 208362 168211 166245 173843 176467 192254 217469 196431 172920 210251 231857 260223
8165 260223 209923 235950 219711 197982 153001 182382 215039 226632 253193 242613 269231 263742
8153 263742 272940 279727 308622 275740 253259 256920 234711 245335 236352 243770 213948 185080 237132
8140 237132 265361 244238 238771 257826 248194 292731 267174 234407 248156 263658 256334 228046
8128 228046 191851 228103 253555 251591 271213 225930 268590 320021 321339 322669 302366 286242
8116 286242 310516 309845 301973 323861 328486 300263 325106 324096 347853 415784 410149 424145 450735
8103 450735 404493 404136 393054 442060 455926 453265 442405 400880 362683 336827 329299 354866
8091 354866 411940 459165 494399 452205 415670 366216 414087 362538 319226 341827 345439 407316
8079 407316 347350 315308 306713 315090 296127 261047 279173 286069 290278 252331 302027 334710
8067 334710 319700 294332 362051 331659 290809 270635 297532 307834 280842 341165 330979 312995
8055 312995 320887 298004 293336 330935 369072 348574 313365 336126 327930 339433 355216 326026
8043 326026 308471 357384 330630 373834 405357 362370 337979 370346 345380 274289 358725 316840
8031 316840 324360 353800 360267 361373 377210 354331 345264 385418 401784 383595 396251 388617 413960
8018 413960 416411 449543 475017 454536 433035 403697 385008 381304 373938 361878 373334 353282
8006 353282 359540 362647 370991 361874 371413 317191 342783 333067 327810 331248 363469 331659 346782
7993 346782 384443 350607 329251 342326 344236 390010 354558 291288 305201 303166 248433 303620
7981 303620 329106 308120 335423 344102 306221 275846 272493 290810 335915 328479 285165 299363
7969 299363 342171 327367 334192 301908 316957 380037 421815 375353 362946 381459 377889 358720
7957 358720 363028 382178 403897 388408 403895 432220 455192 458734 447106 444867 414752 413687
7945 413687 376722 355561 338080 370571 313996 330977 412198 407144 388077 366964 368551 415364
7933 415364 457362 440525 454901 404236 434999 435352 454057 424690 409945 463043 509346 546388
7921 546388 608191 573249 609281 566007 504886 497507 550674 536004 474434 532285 530398 542514
7909 542514 565419 584072 545373 526223 495131 510141 465247 505941 551698 577240 504956 464286
7897 464286 463594 468813 493731 528041 487950 467072 490050 462101 529822 526078 525950 535119 537072
7884 537072 555967 607794 559838 549316 602795 640497 647454 657051 681113 716295 740912 770221
7872 770221 761491 750276 726176 654102 675356 685751 732643 679204 698150 697261 687000 619487
7860 619487 645838 641132 620425 651410 661408 710258 675628 667990 706021 708913 660972 748098
7848 748098 762015 788074 797203 762924 784836 767583 755345 741178 817029 871702 926691 895033
7836 895033 920510 980358 901292 883837 913604 981628 981480 965123 1036243 1035159 1017434 1032982
7824 1032982 1047090 1111531 1098782 1054516 1075135 1115559 1084280 1105907 1177658 1236221 1350447
7813 1350447 1406700 1226058 1238168 1202972 1290995 1315042 1313504 1338845 1347479 1404287 1380553 1445079
7801 1445079 1510995 1514416 1554408 1598297 1627642 1709760 1736837 1742604 1759356 1788307 1767443 1818940
7789 1818940 1870282 1840665 1861314 1966550 2010091 2049040 2126177 2224644 2283409 2333366 2386218
7778 2386218 2489257 2540796 2674713 2809931 2870100 2975610 3100076 3251707 3342912 3480606
7768 3480606 3621150 3707896 3865562 4021969 4296656 4559086 4793575 5131806 5496965 5898909
7758 5898909 6396377 7023688 7777582 8738622 9924239 11393042 13072142 14404469 14767712
7749 14767712 14243069 13448077 12758164 12413433 12472057 13043861 14046905 15382555 16397722
7740 16397722 16292123 15014374 13277705 11579918 10110018 8897635 7915035 7164063 6629701
7731 6629701 6209244 5894686 5640516 5398077 5258780 5184441 5133355 5045717 4982112 4958642
7721 4958642 4933069 4905174 4938104 4948198 4868404 4903683 4992563 5050160 5106044 5121040 5201272
7710 5201272 5311416 5439982 5521681 5581953 5702324 5849747 5958074 6123428 6268932 6491039
7700 6491039 6720944 7023008 7244278 7525896 7811413 8131258 8435927 8720270 9147273 9594691
7690 9594691 10158569 10730781 11347087 12159241 13067845 14051518 15188372 16497385 17976428
7681 17976428 19856832 22191141 25215575 28853543 33501616 39139110 44702852 47649362
7673 47649362 46580356 43338208 39977028 37397162 36090614 36232645 37857357 40955059
7665 40955059 44293467 45511510 43029775 38217574 33052508 28328504 24180665 20906788
7657 20906788 18356001 16439502 15026255 13870483 12927720 12236388 11664027 11240220 10938246
7648 10938246 10676548 10441754 10280276 10111925 9958558 9826608 9767508 9800489 9910379 10030442
7638 10030442 10191884 10461486 10795171 11202522 11687348 12264477 12976921 13819575 14837759
7629 14837759 16099776 17796915 19966624 22674630 26144303 30459904 35079857 38057794
7621 38057794 37114054 32966296 28264520 23986682 20358174 17526114 15369590 13698834
7613 13698834 12470673 11543285 10833310 10287666 9813662 9388410 9099684 8888324 8681980
7604 8681980 8518920 8431253 8394512 8359969 8336564 8346581 8461151 8626751 8815548 9027779
7594 9027779 9284969 9565236 9980011 10484057 11073193 11823969 12677982 13659734 14887747
7585 14887747 16466773 18407453 20946257 24130396 28225985 33380315 38204770 40265168
7577 40265168 37711251 32464799 27256721 22743611 19079383 16242910 14091637 12391715
7569 12391715 11187840 10272538 9586559 8962271 8415919 8016401 7631005 7343328 7131702
7560 7131702 6985064 6898871 6794977 6756020 6750205 6779394 6857604 7027461 7280183 7659903 8178360
7549 8178360 8823889 9704478 10713425 11642834 11819364 11021591 9830313 8668236 7643250
7540 7643250 6815196 6227856 5745094 5346002 5132244 4953894 4823812 4717693 4589221 4544457
7530 4544457 4512960 4520215 4473703 4462744 4430773 4441883 4470441 4487163 4552039 4612295 4672847 4712444
7518 4712444 4782836 4978851 5159263 5360114 5587664 5851456 6177517 6547625 6939484 7434645
7508 7434645 8008664 8831649 9884672 11201168 12855583 14664917 15981751 15822131 14189446
7499 14189446 12227952 10460271 8970343 7768655 6766217 6079724 5559607 5098414 4756069
7490 4756069 4475958 4243359 4070300 3920519 3817290 3697305 3624504 3534136 3485296 3432901
7480 3432901 3378595 3331658 3291969 3234845 3212654 3261732 3319530 3376817 3360656 3358800 3412319 3338779
7468 3338779 3349943 3444351 3533140 3601050 3687558 3777284 3847959 3914652 3999311 4104131 4152969
7457 4152969 4152183 4205830 4169378 4107492 4041730 4003284 3935483 3787949 3672230 3597945 3509336
7446 3509336 3434932 3312856 3202820 3082129 2947000 2840148 2737363 2636225 2567783 2469219
7436 2469219 2387195 2346822 2186607 2098929 2080314 2014576 1965655 1904247 1838836 1807441 1716123
7425 1716123 1667928 1690760 1593761 1548444 1536972 1487339 1462385 1394704 1380607 1358131 1328042
7414 1328042 1346634 1359652 1297066 1303895 1268212 1249383 1268508 1248277 1274460 1219082 1203743 1185359
7402 1185359 1170918 1193081 1237382 1247192 1252004 1219488 1167439 1194422 1200405 1199826 1192172 1196565 1198419
7389 1198419 1172231 1177916 1178703 1211921 1213202 1252356 1272327 1262621 1238811 1238782 1209204 1235971 1264552
7376 1264552 1300610 1293098 1294113 1376205 1385994 1440751 1450301 1440737 1400514 1417690 1398628 1382734
7364 1382734 1413373 1455280 1444310 1461684 1462931 1417621 1366291 1338209 1361613 1428099 1373060 1299299
7352 1299299 1307565 1297079 1295745 1300965 1299497 1339711 1392070 1355860 1339420 1374411 1401027 1378455
7340 1378455 1332389 1310009 1307541 1385280 1335915 1332474 1249295 1296227 1316662 1303309 1295279 1328188
7328 1328188 1323702 1349196 1313067 1312865 1343631 1310608 1310531 1352969 1356309 1325406 1364063 1378002 1363119
7315 1363119 1383495 1425811 1392704 1411733 1408078 1430616 1450557 1446270 1444574 1503943 1530759 1548141
7303 1548141 1532914 1596980 1607993 1597021 1622838 1703330 1786311 1835248 1878654 1880431 1879615 1893170
7291 1893170 1971114 1962369 1865239 1882777 1873071 1945176 1970065 2004278 2032025 2076441 2112496 2104778
7279 2104778 2078146 2141602 2114705 2104424 2144214 2159061 2184602 2180059 2143779 2165341 2193989 2169624
7267 2169624 2227208 2233766 2253443 2337555 2355768 2347557 2362704 2427477 2431964 2474416 2542471 2618696
7255 2618696 2654062 2700634 2709824 2722733 2810408 2838713 2930797 2974177 3012135 3058332 3133631 3244845
7243 3244845 3299408 3364571 3406185 3466004 3553764 3565811 3579120 3658633 3706473 3762761 3816888
7232 3816888 3868294 4006095 4082933 4177665 4307907 4356214 4359258 4413780 4491670 4567718 4599487
7221 4599487 4667557 4756405 4870345 4911430 5010429 5061216 5179291 5302693 5366848 5480321 5651079
7210 5651079 5735697 5830798 5984382 6096269 6224941 6378909 6498310 6656699 6793017 6929986
7200 6929986 7138189 7370235 7555793 7740454 7914476 8059536 8254820 8482082 8684677 8906993
7190 8906993 9168417 9432601 9720451 9964865 10266064 10583687 10932220 11200925 11531821 11890179
7180 11890179 12211358 12551695 12919786 13316070 13713648 14122315 14605587 15094148 15462456
7171 15462456 15906726 16383816 16870745 17284625 17657594 18087465 18529431 18993121 19401595
7162 19401595 19851029 20278400 20723265 21116660 21461733 21790485 22138764 22409081 22659787
7153 22659787 22850452 23000228 23122248 23206159 23259292 23348824 23325198 23302645 23296681 23244406 23133558
7142 23133558 23082593 23024077 22926912 22921326 22993296 23072062 23172913 23425390 23728822 24186814 24744185
7131 24744185 25443794 26444720 27757490 29519409 31861646 34816199 38331421 41853495
7123 41853495 43826853 43337125 41257747 38777241 36706326 35340271 35018954 35683122 37360135
7114 37360135 39196553 39856206 38512557 35489937 31913755 28447643 25323248 22700151
7106 22700151 20588253 19002865 17810642 16905193 16125919 15489768 15019096 14698762 14377812
7097 14377812 14151891 14002729 13899705 13877930 13963608 14037986 14256018 14535838 14965830 15554298
7087 15554298 16283982 17231440 18469232 20119289 22270444 25024134 28082963 30682708
7079 30682708 31679326 30833968 29032106 27163500 25654864 24970116 25109163 26155176 27851270
7070 27851270 29284008 29197027 27289330 24308683 21137295 18241925 15751352 13832410
7062 13832410 12261752 10982705 10066857 9282309 8710644 8127805 7699757 7353038 7002958
7053 7002958 6665786 6396783 6130316 5924177 5692029 5523775 5289039 5108875 4971416 4839797
7043 4839797 4681292 4595239 4472111 4369925 4319667 4240476 4169243 4041278 4009197 3857069
7033 3857069 3648880 3522376 3402060 3258583 3094318 2985547 2939235 2831691 2719007 2636861
7023 2636861 2584715 2560723 2470235 2410827 2362801 2313152 2291308 2197829 2189803 2159435 2118051 2077009
7011 2077009 2094079 1998434 1919763 1881692 1859836 1799511 1862867 1839390 1788508 1751231 1688147
7000 1688147 1603612 1672679 1663324 1549596 1505240 1468969 1453932 1402256 1382343 1371401 1361137
6989 1361137 1335011 1284289 1221545 1189342 1219187 1225312 1218993 1212020 1188892 1190738 1176533 1124298
6977 1124298 1071493 1085096 1124674 1056837 1067311 1064995 1059982 1095462 1064465 1086834 1080472 1082221
6965 1082221 1125878 1147247 1113472 1097525 1089692 1081862 1102339 1087122 1126727 1146898 1101362 1120897
6953 1120897 1118332 1155588 1107304 1097276 1099071 1123263 1110461 1062872 1058595 1035008 1039525 1051544
6941 1051544 1025570 1034376 1069269 1051830 1016127 1089993 1128635 1120789 1183775 1214713 1208446 1269418
6929 1269418 1336121 1387940 1347679 1405266 1503695 1539191 1575127 1657464 1712984 1803767 1893946
6918 1893946 1951505 1966125 2009290 2080150 2105168 2140995 2100823 2041703 2059816 2072553 2042627
6907 2042627 2023016 1936210 1784745 1691873 1606102 1599847 1557421 1432113 1373557 1302537 1260148
6896 1260148 1206942 1167471 1111273 1115678 1114252 1064660 1046664 1022879 1015761 1041512 1105933 1114856
6884 1114856 1141279 1209904 1198553 1055547 935129 852220 785688 702101 660987 673899 616536
6873 616536 591796 533834 511624 524575 537594 505344 425164 458428 460620 425758 462427 406365
6861 406365 357198 355013 364283 283238 313537 302499 308580 314428 282475 256138 267762 272887 269473
6848 269473 274189 264426 228088 214679 267919 265994 231806 238902 228025 230374 208891 246010 228343
6835 228343 229696 233380 172212 200463 213591 168369 184367 186043 205980 209505 175611 193769
6823 193769 195699 166811 150268 179059 155535 181063 169005 136044 107241 153851 181040 144695
6811 144695 126469 166115 148863 155729 149370 97393 83428 102421 92470 120470 131870 147121
6799 147121 139052 74370 66253 35484 45963 57052 101945 121238 150930 145136 110927 67253
6787 67253 48703 89879 114957 125733 109228 133995 131162 157983 130291 70904 83660 117409
6775 117409 126979 119935 111632 126234 129131 123494 136510 107249 141504 132911 149147 193880 199332
6762 199332 213496 190964 229875 223780 199918 194417 216130 252280 275551 229043 237751 236581
6750 236581 218108 203859 218496 229371 228282 132444 114871 149093 137569 122373 84233 121845
6738 121845 127138 110241 76452 80429 90483 55421 93238 105437 104086 89557 72791 84475
6726 84475 96441 84438 94702 144640 131051 111662 84931 122115 113780 137383 162016 124040
6714 124040 139779 155787 172174 140689 143324 217384 185276 151906 184077 141698 158324 161633
6702 161633 115351 133289 119536 108287 78866 52850 59981 150505 142921 122385 110763 61681
6690 61681 62214 53006 44814 53556 45357 2311 29704 24227 6375 31637 10487 5339 25546
6677 25546 23248 -15471 45562 61655 23709 29436 8179 2788 23352 60694 10342 12418 -32059
6664 -32059 -28846 -45525 -62856 10271 24441 -13284 25943 43439 57899 56449 4642 30055
6652 30055 34110 46434 51051 7196 31901 53976 58030 59730 19371 -14316 -11054 34810 13089
6639 13089 49926 29885 71355 82940 104301 113828 112671 96313 76951 62991 51841 73093
6627 73093 78733 45734 54595 67459 46769 19450 6456 18816 38546 31193 28372 44654 49565
6614 49565 4118 -17967 22990 22795 17032 18959 9430 5462 21700 -33416 26461 37276 -15245
6601 -15245 -13733 -16124 7892 -18860 -16136 -21859 -21774 -6774 -6347 -38695 -30293 -32195 -28522 -45957
6587 -45957 -65473 -7847 -6413 -38046 -46480 -48694 -16839 -15166 14560 -17839 6862 13547 32248
6574 32248 58347 11840 -5927 18923 56416 57095 80289 43059 89424 95938 66501 73180 20636
6561 20636 69119 112369 125355 129108 111643 132441 68326 124454 156173 132408 107784 123342
6549 123342 130706 93894 72042 58163 33955 26162 25729 6508 -23318 38615 58134 58873 8287
6536 8287 8406 69698 37826 50548 38441 49178 33438 -19932 -21262 9111 -28292 -50061 24819
6523 24819 44921 39610 15693 25673 12381 48041 31450 7722 4676 38839 37488 26726 -7873
6510 -7873 -25718 -2916 32306 19249 43676 824 -2479 -5825 -9678 -6599 -11506 -11502 -37136 -14766
6496 -14766 -27823 -66545 -26813 -28984 -29193 -18071 -643 7515 -75430 -70538 -76526 -66060 -56744
6483 -56744 -78430 -77428 -88931 -57968 -4367 -38946 -79753 -73501 -65790 -65662 -52640 -81859 -30506
6470 -30506 -29663 -47860 -91283 -90637 -127281 -87534 -90778 -94647 -75182 -45364 -28375 -71149 -64585
6457 -64585 -64622 -92751 -78028 -33479 -69167 -72444 -56310 -16156 -80744 -90018 -51244 -55081 -107216
6444 -107216 -99769 -51391 -87063 -120658 -109801 -123423 -125102 -87402 -66989 -70588 -140200 -142237
6432 -142237 -115711 -86900 -94183 -107776 -73070 -38703 -95257 -54562 -83633 -43933 -111960 -46653
6420 -46653 -18211 -14615 -16242 -56384 -51834 -3592 -11106 -44874 -40269 -15461 -45086 -27915 -33656
6407 -33656 -34139 -34737 -39419 -42814 -16907 1193 -55409 -63462 -45524 -40043 -60064 -75996 -37937
6394 -37937 -40603 -66120 -65644 -89274 -47819 -27386 -20695 10486 20751 -21224 -26755 -75381 -49695
6381 -49695 -57353 -51836 -18638 38729 -2383 17629 -14381 -15656 7574 -8955 -15226 -44960 -41924
6368 -41924 -70994 -27476 -8136 -19487 9680 -45083 -45491 -92176 -62853 -49880 -34989 -51826
6356 -51826 -28313 -23629 -75198 -81817 -72631 -99929 -40454 -9158 37483 7564 -11441 -41728
6344 -41728 -37471 22844 1452 -35145 -40692 -39038 19833 47016 34655 60997 40525 59382
6332 59382 29236 37430 16756 -41195 -34119 -11099 1095 26960 68597 40003 70653 63808
6320 63808 77391 58511 22711 -40676 -17480 31506 2101 -2643 24682 41986 10085 41978
6308 41978 44464 20323 -27145 -3272 2295 -51925 -39805 -10478 -42408 -5514 28093 12856
6296 12856 14080 -9023 -26542 -41879 -34380 -64827 -58769 -29482 14818 -574 -45947 -93996
6284 -93996 -109781 -53065 -62772 13928 7852 -46681 -39946 -28719 -42321 8350 11050 14093 -233
6271 -233 -28807 -37849 -18140 -10296 19896 6056 23774 9917 -16656 -43665 30288 34578 23783
6258 23783 51259 108222 124004 123487 163348 192519 257052 289085 283833 270449 299257 300167 161190
6245 161190 118896 124265 108859 47617 31460 41316 33170 25560 24504 27570 -3180 -37459 -59492
6232 -59492 -51105 -19522 4896 23071 22147 65512 90145 24800 -17250 -29202 -7573 3058
6220 3058 -15658 1741 6912 -12564 -31496 -66037 -33079 -43713 -51329 -70472 -79641 -10097 2076
6207 2076 -33021 -37673 -62786 -48407 -49051 -17331 -27170 -73280 -39496 4667 -4573 968 -20493
6194 -20493 -26089 -20829 -38705 -47053 -43597 -82514 -48248 -77359 -53446 -20365 -29299 -30859 -76389
6181 -76389 -53536 -81822 -66201 -76096 -82720 -28856 -30934 -59851 -75175 -59983 -61022 -55727 -45864
6168 -45864 -22374 -28873 -23394 -16524 21157 -28679 -75867 -32322 21520 -32600 -43914 -113587
6156 -113587 -148370 -104120 -69759 -71056 -95122 -51127 -38893 -84981 -65051 -58074 -32567 -52350
6144 -52350 -109315 -64173 -42499 -19983 -45389 -62883 1949 36434 -72236 -57339 -41375 -85324
6132 -85324 -57328 -6801 -5889 -35320 -49934 -39129 -26858 -14223 -32917 -76855 -46489 -57735
6120 -57735 -82757 -59198 -44580 -14013 981 21415 34720 -4185 -57838 -13407 -14393 -45752
6108 -45752 -67911 -62241 -65279 -57762 -34305 -58360 -61291 -32903 -25376 -64101 -112882 -96773 -24462
6095 -24462 -5450 29955 58870 -38731 -40058 3199 -65851 -58868 -59419 -73017 411 20956 -30091
6082 -30091 19146 -4920 -37688 -45053 -42312 -7912 6508 -7566 -73879 -74837 -61371 -87692 -83527
6069 -83527 -53533 -37275 -43040 -62631 -59698 -29919 -9478 -57616 -71642 -110326 -46499 -36315
6057 -36315 -32256 -72739 -64846 -42805 -54030 -53055 -25110 -70223 -57887 -75434 -96257 -64554 -68352
6044 -68352 -62173 -81135 -95500 -86202 -46840 -60601 -38208 -53066 -19965 -25419 -28874 -10998 22842
6031 22842 31308 19696 -63450 -67775 -33827 -55782 -43349 -53583 -31439 30130 16267 -40630
6019 -40630 -53390 -33784 -26857 -59284 -62841 -3197 -24548 -38045 616 22381 -28441 4181
6007 4181 27875 27317 -6440 -39449 -31257 -43537 -21867 10 -38926 4398 25649 15046 -24134
5994 -24134 -55074 -54648 -27465 -49730 -45267 -7266 -19261 -51084 -59367 -42701 -40486 -16932 -32302
5981 -32302 -8806 3492 -866 -13675 -10750 -7233 891 3866 25044 63363 65155 23391 4013
5968 4013 3244 -1205 42017 91265 60360 58114 38327 99067 68568 27632 55163 86604 57470
5955 57470 17764 25342 7697 45093 24969 12566 60620 57217 89783 43566 46365 16703
5943 16703 23235 22952 -2498 1984 10200 37708 67778 39168 20235 -12290 1175 -21250 33321
5930 33321 71983 23076 -2967 -13528 35250 45297 4035 -7509 -29043 -44431 32701 93521
5918 93521 30063 19836 75660 41401 91107 71112 150211 124733 88459 78921 121218 113855
5906 113855 97514 79903 100171 70030 89542 68394 64257 47405 66443 41888 72683 105618
5894 105618 67213 140018 112043 140203 120092 110737 110559 98751 117435 93198 147802 149769
5882 149769 149242 165978 133665 156115 171927 114618 117567 163515 152034 161204 160841 194042 199586
5869 199586 244396 292213 293644 264049 256788 252256 247727 219052 221988 203565 190531 181639 187813
5856 187813 174158 209491 251707 185034 224482 266106 265009 278633 264800 236805 241627 287522
5844 287522 274104 304299 335741 403979 378515 423135 525015 550352 651102 709689 673878
5833 673878 610173 582459 480568 416929 366269 291080 328247 357109 290411 241871 282654
5822 282654 301666 282586 251720 217905 267361 268558 271080 307572 335565 388844 407658 386652
5810 386652 422117 484190 520440 550424 620034 724654 773257 776890 776875 745514 660233 622118
5798 622118 568044 527717 506700 498907 494270 450424 483777 547311 541028 572766 619172 695342
5786 695342 759654 797927 856930 937314 1073240 1225455 1386927 1579948 1876671 2209631
5776 2209631 2674887 3181508 3544004 3615448 3311247 2826136 2327384 1958775 1574524 1286326
5766 1286326 1124835 947275 852526 787749 726757 706908 662134 612252 610618 578619 514301
5755 514301 472300 474340 480300 485270 497237 498736 492848 501846 506355 588012 627648 622699 598385
5742 598385 567074 520205 430876 407057 401549 380648 327796 256816 257197 265825 301234 324277
5730 324277 280668 233222 250048 235339 206627 203084 169501 223784 257966 229067 188848 168795
5718 168795 184093 201207 191885 140743 115814 107220 68112 12435 24113 33055 44707 41274
5706 41274 32174 28854 16844 60716 55148 36459 86527 85629 37396 45200 73803 58285 22786
5693 22786 34088 70641 102027 52861 45623 36047 43064 46536 53290 36584 27754 59367 26382
5680 26382 24861 41952 35535 89609 56461 59741 70725 64848 54868 24112 48479 44433 50951
5667 50951 85301 85582 101692 93295 56972 80285 59966 48456 54537 112775 103714 20038 -31808
5654 -31808 35036 86211 34711 44868 56053 43072 113710 128686 95505 48653 83849 105475
5642 105475 50800 21050 27385 32978 27124 48700 85858 109761 106006 55642 54143 63604 36098
5629 36098 52154 68641 95794 28492 33989 66315 1529 -14729 18223 27897 53685 36397
5617 36397 19468 84829 66042 90410 136085 92727 96135 95244 99830 118081 111503 157650 148713
5604 148713 176233 173529 198256 117314 93918 148630 140700 114218 117601 139503 130257 125573 62318
5591 62318 104900 122852 179755 184230 168540 199754 247847 230186 239936 230435 219815 219037 249792
5578 249792 320903 250248 258658 306697 324543 347417 305077 298608 330534 386194 422941 408309
5566 408309 456143 484479 540137 584696 637275 760154 900633 1063900 1101236 1072544 972001
5555 972001 874854 756743 699747 623827 556056 523320 536778 535124 551472 534670 576102 631494
5543 631494 637931 656136 633415 613711 679794 687251 685795 763393 790064 831245 814244 916519
5531 916519 977882 1043990 1152412 1347237 1485622 1615026 1795593 2009558 2275531 2743341
5521 2743341 3382440 4086553 4867573 5337671 5188771 4552703 3795655 3180378 2568194 2125558
5511 2125558 1817227 1534952 1370477 1233209 1113035 1030821 983161 970247 907949 805292
5501 805292 773200 740222 712928 749323 701094 660394 616277 670020 707474 721741 780737 831962
5489 831962 918311 1011196 1075669 1008263 952514 873903 789722 728327 663425 629935 663717 690136
5477 690136 675029 652821 616208 591167 541109 510035 496301 417946 383854 338404 370137 373993
5465 373993 366147 410530 435139 419677 375706 313546 406364 418752 376173 375143 414001 426643
5453 426643 422375 495824 539669 549367 585803 669428 785987 897536 950962 882519 843763 769700
5441 769700 693065 659867 619998 604945 571523 613647 608787 581296 576742 597387 624708 636644
5429 636644 643123 614136 629626 673935 623268 602153 604875 567080 614282 670839 650115 669678
5417 669678 693036 878068 973310 1030244 1064472 1058934 1034418 991090 949108 948762 949569 1010982
5405 1010982 1063351 1043536 1007663 1011049 961505 905622 879725 771275 755905 709604 706025 662869
5393 662869 686096 708399 707298 701123 683010 679702 663963 651511 681069 769952 802932 811882
5381 811882 809698 792814 825754 786823 821934 803067 730053 657584 566641 575187 637362 600621
5369 600621 589863 624832 605425 642026 647783 666262 647238 635623 631588 584280 514509 442297
5357 442297 406993 398667 393930 382832 350529 348063 375968 379433 356929 357288 332476 286147 356263
5344 356263 370014 353061 378372 352560 411162 436221 460050 498051 492713 430866 357505 341678
5332 341678 295419 233065 280859 265151 289289 246755 199658 191895 216144 265739 212198 264643
5320 264643 280024 338131 344545 208463 245780 310618 280931 265000 266833 248753 244851 253933
5308 253933 283246 294247 292707 281888 282010 244524 271319 331934 313680 279509 265769 292076
5296 292076 270595 249328 225058 224324 194216 184014 215042 241919 217302 190437 153770 213113
5284 213113 234291 230823 249609 272273 213548 230636 284207 281907 319357 283068 270878 295613
5272 295613 346842 410264 454108 440485 420502 368991 341792 322829 296016 302450 318054 270283
5260 270283 257787 244667 275153 299986 255401 233085 247969 216186 237659 271498 209099 249417
5248 249417 260513 270136 279991 300627 331373 305725 339823 420429 456018 498812 521929 493173
5236 493173 488667 495751 457299 434830 400289 335533 324681 333021 305288 306231 359518 348446 338150
5223 338150 337030 386101 392627 370443 403401 419364 419771 454646 515363 634086 730439 785145
5211 785145 899090 980349 1130092 1267331 1403112 1473498 1478767 1392277 1352268 1276869 1215302
5200 1215302 1275925 1266056 1235755 1166396 1022068 911601 740132 633774 566799 531764 438554
5189 438554 407418 409506 347237 372615 363066 335183 286211 254604 242487 275783 289877 280508
5177 280508 261630 296207 263595 237835 234626 173082 170642 207678 250883 297277 261337 262780
5165 262780 264836 250745 227257 168875 117492 146944 185625 153057 144246 137163 154098 176247
5153 176247 214062 209689 143447 138588 140848 172965 147599 116696 100114 132897 131709 113301
5141 113301 135619 194512 172095 244009 218807 143156 145771 134162 186656 191201 200157 255493
5129 255493 315810 270645 299646 260759 256816 300720 317219 355604 442512 424912 410538 424421
5117 424421 432126 440104 447981 424739 415866 427937 433882 378428 341650 345609 308809 352081 291444
5104 291444 226397 224003 268799 298620 295404 312564 332539 296931 274620 283586 323340 259519
5092 259519 223412 277092 270507 298129 376235 339876 292075 278279 281995 241676 277248 281307
5080 281307 308892 332602 341841 348909 340683 393251 401703 410319 456736 505386 555906 587126 649584
5067 649584 671554 737971 809333 844333 879082 858151 833483 709244 593907 610315 560354
5056 560354 441473 462705 358036 349190 407394 387648 393116 390505 376630 384401 310640 353504
5044 353504 402587 378230 352843 360232 401219 420879 427122 453500 464711 419382 402582 376647
5032 376647 388796 346742 346408 334169 313441 340780 244201 280616 315100 357500 365399 322139
5020 322139 312211 275501 311726 386459 354394 361906 382236 361596 404233 462284 442791 419693
5008 419693 457036 502246 483676 507452 506413 492343 492308 519079 468323 472046 518343 596743 689527
4995 689527 695074 799492 884666 985356 1098178 1110303 1097348 1062383 971611 948730 933167
4984 933167 891230 814514 763402 752871 724886 732461 712784 674608 594059 636711 621577 549864
4972 549864 550416 538396 556220 542096 567757 587501 595178 585807 581754 538100 533053 610268 610284
4959 610284 615687 672639 740899 789081 790821 741759 679367 772784 763029 727069 711892 706838
4947 706838 692633 692303 729213 784265 759494 786393 796823 837355 880533 958013 1030668 1073109
4935 1073109 1107458 1050454 967031 963394 942667 877888 867631 872463 878542 881857 898396 870408
4923 870408 886788 910889 930217 1015957 1055771 1084243 1106056 1090280 1055213 1111242 1072163 1045408
4911 1045408 1034675 1025851 1020442 1003744 993568 1043756 1038786 1056494 1048738 1025861 1052812 1089306
4899 1089306 1099363 1074327 1064832 1102450 1106287 1106509 1184829 1171984 1217047 1247651 1344277 1378211
4887 1378211 1377341 1394405 1494719 1558058 1584673 1594722 1644487 1680773 1729275 1778491 1831097 1838045
4875 1838045 1822094 1855384 1860190 1775416 1785988 1775526 1802064 1787477 1770791 1765937 1722934 1714742
4863 1714742 1677864 1666275 1652276 1651194 1661072 1699524 1745060 1796367 1807884 1807533 1891551 2018959
4851 2018959 2042232 2077049 2170557 2233085 2271291 2318361 2371426 2437663 2508604 2571715 2589463
4840 2589463 2625238 2639065 2642060 2654467 2666407 2661792 2681128 2721088 2808340 2898676 2958558 3012281
4828 3012281 3057890 3191455 3280853 3305230 3430082 3508394 3539128 3631491 3680834 3691288 3755565
4817 3755565 3923429 4038555 4131837 4239489 4400146 4418979 4464466 4512139 4561343 4606196 4620264
4806 4620264 4621533 4670818 4700684 4700602 4778095 4828813 4989716 5096610 5214996 5396754 5547878
4795 5547878 5753182 6001657 6234469 6474468 6695243 6918750 7150833 7369022 7669103 7904717
4785 7904717 8139916 8327732 8592290 8891881 9209502 9638992 10067121 10551683 11059925 11581885
4775 11581885 12096727 12587167 13145210 13688950 14388722 15175470 16098849 17244338 18628752
4766 18628752 20324588 22307720 24545993 27136524 30282895 33856967 38171795 43706178
4758 43706178 50700196 59801620 72095220 86939417 101345988 110240210 111016192 103511596
4750 103511596 89792937 74888134 61904671 51152606 42880784 36568046 31818204
4743 31818204 28256751 25416108 23013425 21046436 19445859 18074787 16928397 15915921
4735 15915921 15064382 14251129 13576403 13047793 12588659 12110880 11702030 11380086 11074259
4726 11074259 10839277 10608776 10433237 10252496 10044609 9907750 9796402 9705704 9616435 9605227
4716 9605227 9585286 9668330 9705816 9803973 9998484 10145319 10259582 10420956 10580991 10803785
4706 10803785 11080702 11380609 11727044 12066510 12484858 12870494 13278071 13711359 14154640
4697 14154640 14765996 15474020 16300669 17329508 18627781 20216979 22072196 24349041 26948569
4688 26948569 29956815 33581971 38022785 43680934 50769721 60126957 72281831 85578086
4680 85578086 96282929 101644609 102360693 97643240 86671334 73144105 60685712 50122212
4672 50122212 41635958 35111548 30051108 26149771 23118575 20690586 18639867 16966851
4664 16966851 15645712 14515694 13600310 12730093 11968485 11316800 10782950 10400022 10002190
4655 10002190 9651496 9280724 8827394 8403353 7959556 7545814 7202741 6788385 6432298
4646 6432298 6101731 5814107 5530439 5309141 5069312 4867817 4723717 4632812 4512216 4383372
4636 4383372 4288879 4156774 4054389 3963869 3890623 3867364 3792682 3693354 3563329 3419536 3329152
4625 3329152 3232510 3093044 3054182 3011052 2936293 2873956 2793291 2709371 2684488 2660163 2664885
4614 2664885 2662005 2581375 2568743 2523271 2460279 2409174 2330163 2305758 2233315 2147605 2074775 1982923
4602 1982923 1913235 1892053 1820037 1775654 1707515 1698513 1680077 1620604 1555268 1448224 1389996
4591 1389996 1406512 1390265 1387706 1386271 1345133 1364747 1374846 1311236 1275540 1250635 1182577 1184247
4579 1184247 1166691 1147469 1189927 1236036 1253212 1261526 1289738 1326459 1318968 1394438 1429328 1437685
4567 1437685 1385711 1341527 1262185 1237429 1245080 1239494 1172868 1177972 1166324 1141787 1202280 1218580
4555 1218580 1183973 1200320 1260807 1345264 1355818 1365310 1357899 1295141 1232911 1209334 1112097 1053433
4543 1053433 1002736 988565 975289 967565 929921 913048 922107 956469 972413 942598 967624 972766
4531 972766 1030676 1012756 912125 842599 835627 794635 807687 759568 730705 691852 701388 655573
4519 655573 676489 716618 714118 719593 672854 643783 638841 608912 618148 615070 595969 570695 557209
4506 557209 545573 586424 626843 633020 669166 658940 659702 643848 667818 683109 676172 668746 666635
4493 666635 661032 648806 629628 668250 721183 724416 694802 691145 681887 746589 710583 675699
4481 675699 646874 602417 642570 685920 625504 607662 621163 672141 711274 704136 729827 681898
4469 681898 692898 739682 719274 759560 764762 711152 757888 790120 776341 778537 823873 855868
4457 855868 870643 889130 984001 1027911 1012656 996522 1004096 1065234 1173700 1149400 1157523 1226116
4445 1226116 1299634 1406364 1486451 1640355 1794767 1836011 1880609 1859733 1769943 1687233 1608493
4434 1608493 1479562 1506079 1529133 1511511 1531308 1491792 1489197 1585521 1626150 1599277 1671168
4423 1671168 1726912 1737319 1748834 1780326 1797377 1803711 1848871 1867336 1921513 1940649 1938267 1945239
4411 1945239 2032569 2098584 2146739 2198120 2299471 2373962 2372791 2354934 2338816 2368763 2370736 2337821
4399 2337821 2334419 2379573 2303673 2281039 2300948 2299580 2344959 2382345 2395005 2374334 2418424 2434707
4387 2434707 2442579 2533076 2576180 2714820 2802784 2882954 2957829 2995007 3106305 3189183 3226325
4376 3226325 3289867 3352081 3428414 3538774 3588363 3642564 3659635 3670333 3684154 3595188 3631347
4365 3631347 3694621 3659117 3462045 3363812 3307988 3173856 3106148 3026923 3004744 2944125 2859233
4354 2859233 2714854 2538027 2390419 2220821 2114417 2097680 2044351 1961363 1964632 1969346 1939735
4343 1939735 1902719 1919337 1935315 1987551 1975868 1997559 1996324 2047393 2079666 2142016 2167552 2280925
4331 2280925 2339797 2375716 2457183 2549542 2716878 2842139 2945989 3046858 3204451 3277642
4321 3277642 3364733 3386055 3425860 3550809 3609857 3650511 3611026 3596929 3588268 3544858 3481441
4310 3481441 3409946 3389258 3305540 3233576 3224237 3232027 3150217 3123457 3124555 3118161 3089711 3042766
4298 3042766 3089073 3113585 3132189 3214511 3241026 3327671 3359895 3423837 3507030 3606232 3664574
4287 3664574 3748942 3847010 3840006 3908150 3940697 3937409 3853330 3740874 3672369 3575300 3459253
4276 3459253 3408979 3370984 3314209 3289065 3260063 3265693 3214335 3194810 3245241 3269563 3248739 3251849
4264 3251849 3181562 3229029 3248027 3245392 3221029 3251486 3259449 3285125 3317950 3311795 3335798 3307505
4252 3307505 3270616 3277239 3274243 3289597 3314108 3360649 3359179 3373679 3353087 3445259 3541701 3557178
4240 3557178 3680616 3733702 3812205 3896931 3925393 4012883 4110037 4166473 4313432 4481059 4763083
4229 4763083 5063249 5310607 5489585 5614409 5582167 5412990 5278240 5157491 5073638 5039421
4219 5039421 5051978 5148941 5207590 5206670 5311269 5418953 5572765 5711816 5760372 5842197 5826836
4208 5826836 5899908 5947887 6005660 6049475 6052816 6080352 6082707 5963741 5889784 5779641 5664543
4197 5664543 5570377 5469035 5397797 5378741 5340467 5347011 5338161 5388344 5422131 5487629 5571612 5631882
4185 5631882 5748898 5851643 5862061 5828978 5795861 5724557 5683709 5663698 5623149 5509518 5491510
4174 5491510 5483291 5474730 5436533 5340156 5330859 5334162 5276833 5271013 5329149 5461127 5501842 5590605
4162 5590605 5708103 5753549 5848025 5895362 5938726 5960258 5990289 5994264 5962829 5929936 5853561
4151 5853561 5795174 5773209 5710106 5617764 5529247 5467546 5447100 5448654 5492454 5499638 5575406 5678710
4139 5678710 5766168 5879324 5984366 6153069 6218032 6224945 6263389 6299136 6303044 6351031 6410446
4128 6410446 6496266 6659106 6870475 7124190 7487487 7945138 8463933 9160412 10027785 10780857
4118 10780857 11226062 11345148 11336067 11355912 11177505 10960725 10491503 9954181 9550671 9133483
4108 9133483 8788890 8416006 8041773 7757660 7537260 7436737 7305936 7242387 7251319 7268359
4098 7268359 7301432 7350950 7413141 7507489 7474561 7429340 7415907 7395066 7395167 7394884 7432670 7482818
4086 7482818 7545637 7529054 7565195 7650391 7733197 7891149 7998029 8080584 8189452 8337048 8409009
4075 8409009 8520750 8581521 8685459 8850960 9002976 9125708 9238102 9317677 9361543 9367475
4065 9367475 9463818 9555983 9651958 9748200 9858786 10034360 10230777 10432335 10672241 10974306
4055 10974306 11212582 11476833 11733356 12041384 12400443 12722807 13054447 13387437 13672423
4046 13672423 14065897 14486449 15050894 15747981 16542025 17499832 18582104 19609330 20550422
4037 20550422 21473996 22443748 23580506 24980282 26606067 28600055 30877510 33309974
4029 33309974 35702188 38025241 40237650 42081289 42607505 41137342 38236925 35104456
4021 35104456 32184808 29713267 27740110 26213566 25159120 24426934 23889517 23657013 23538639
4012 23538639 23560353 23624121 23760861 24062269 24286940 24495578 24789929 25165837 25512436 25936687
4002 25936687 26404635 27017636 27720699 28430588 29164601 30057157 31085392 32136393 33317440
3993 33317440 34614268 36045890 37678711 39483776 41469851 43665990 46004101 48271233
3985 48271233 50327695 52046486 53516324 54976260 56442527 58118106 59919991 61789651
3977 61789651 63929230 66177803 68527507 71062562 73752288 76548059 79349459 82199407
3969 82199407 85169420 88084194 90929006 93717881 96446006 99110730 101758500 104462281
3961 104462281 107173747 109898960 112703217 115614485 118468410 121189918 123860010 126382372
3953 126382372 128792757 131004216 133098963 135106334 137132209 139157740 141294996 143586040
3945 143586040 146054556 148774884 151727097 154982877 158599098 162585452 166969006 171853431
3937 171853431 177469922 183997608 191515250 200382956 210716495 222838011 236965796 253183403
3929 253183403 271412253 291096085 311324116 330813334 347863411 361043089 369248363
3922 369248363 372066385 369697139 362739627 352529802 340358542 327282816 314087121
3915 314087121 301438219 289466539 277857134 266200983 254109994 241416439 228028656
3908 228028656 213978981 199829411 185707428 172115490 159341952 147615961 137059482
3901 137059482 127597668 119241500 111890818 105467152 99816596 94878844 90612794 86930587
3893 86930587 83772430 81152252 79015506 77318292 76035669 75171513 74578293 74201254 73892343
3884 73892343 73557985 73011010 72254134 71202414 70003554 68624392 67172381 65784772 64359915
3875 64359915 63072583 61967246 60904643 59896475 58919718 57959313 56920815 55786228
3867 55786228 54541652 53248867 51851416 50379415 48939594 47634949 46420360 45277482
3859 45277482 44236864 43272842 42466976 41703433 41040679 40448283 39834992 39253157 38661189
3850 38661189 38062417 37475385 36800055 36110559 35398983 34673453 33927419 33203396 32477590
3841 32477590 31759546 31022168 30278984 29570759 28877497 28141917 27362430 26567862 25859773
3832 25859773 25179956 24554569 23906880 23210629 22614077 22062281 21634584 21171722 20738141
3823 20738141 20449285 20145660 19937455 19791472 19713612 19677531 19739908 19884029 20109222 20415471
3813 20415471 20860334 21345300 21922698 22487510 22987068 23445121 23812981 23991320 24003716 23914894
3803 23914894 23673387 23369661 23046236 22677488 22265674 21928496 21537093 21198966 20885967
3794 20885967 20548870 20185803 19716223 19171450 18578902 17951638 17299748 16615223 16038352
3785 16038352 15421939 14810682 14251051 13884597 13519994 13202900 12942804 12701311 12497211
3776 12497211 12359850 12179003 11982553 11796932 11623562 11465821 11319641 11150938 11034090
3767 11034090 10929063 10809562 10692981 10521119 10338464 10119817 9900259 9734402 9659243 9509641
3757 9509641 9377961 9269148 9194871 9079196 8974512 8996526 8997393 9042291 9017739 9046809 9060517
3746 9060517 9021190 9039735 8993852 8904227 8855157 8821050 8823340 8841125 8784407 8805498 8836649 8930275
3734 8930275 8976891 9087946 9160848 9213566 9185164 9103166 8954572 8816515 8747913 8555926 8360312
3723 8360312 8293793 8252482 8163456 8078933 8049441 8035474 8025855 8075511 8048533 8101636 8138501 8196439
3711 8196439 8239642 8274707 8296872 8257781 8228488 8232518 8270275 8316141 8372058 8422412 8504916 8617765
3699 8617765 8684923 8733905 8856829 8986017 9145044 9244619 9354495 9492376 9567457 9643617
3689 9643617 9732136 9779531 9890598 10001188 10159050 10323317 10457066 10601733 10793953 11009147
3679 11009147 11218611 11310475 11432031 11646996 11855694 12073859 12306186 12555121 12839855 13114008
3669 13114008 13435191 13717367 14089679 14463773 14826057 15175868 15580597 15972920 16346182
3660 16346182 16732091 17174801 17639636 18054276 18506250 18979603 19447816 19944385 20486417
3651 20486417 20997091 21535072 22098089 22682190 23241822 23833738 24498760 25201335 25895648
3642 25895648 26676711 27538025 28389184 29275975 30270317 31356410 32495080 33667024 34925184
3633 34925184 36172769 37602613 39059310 40648745 42284701 44109037 46061362 48183668
3625 48183668 50604269 53287722 56228056 59554573 63276137 67469510 72146770 77283165
3617 77283165 83153948 89811581 97376113 105869511 115513814 126198531 137588137 149132327
3609 149132327 160154710 170071396 178604537 185954552 192406064 198525115 204863146 212010032
3601 212010032 220175530 229469272 239501519 249685355 259112402 266757901 271812289 273864619
3593 273864619 272827481 268962888 263037419 255830407 248110494 240608848 233836073 227915395
3585 227915395 222739168 218007210 213205214 207693789 201042541 192859827 183359519 172894675
3577 172894675 162023246 151367873 141320536 132082599 123721884 116445275 110094060 104540568
3569 104540568 99606094 95163355 91138144 87331326 83762076 80271852 77054559 73967983
3561 73967983 71065793 68323313 65821059 63564423 61497136 59523426 57692235 56037287
3553 56037287 54418234 52790393 51151852 49598868 47981238 46281997 44625867 42939982
3545 42939982 41296046 39774305 38340916 36983995 35709964 34548710 33473816 32371403
3537 32371403 31259622 30235990 29119929 28070721 27026936 26013662 25045240 24139049
3529 24139049 23222718 22416116 21694243 20970079 20348788 19701525 19041670 18446286 17912903
3520 17912903 17349169 16816011 16400947 15920518 15432971 14972315 14531285 14130303 13761401
3511 13761401 13351691 12939542 12588743 12279286 11977140 11640299 11363482 11133136 10913888
3502 10913888 10648819 10364304 10130901 9969890 9820396 9611196 9378123 9153972 8970017
3493 8970017 8774677 8624053 8460482 8235612 8111797 7988686 7886706 7720684 7536753 7413900
3483 7413900 7332500 7244173 7144413 6973846 6824649 6704266 6631786 6535365 6418346 6285882
3473 6285882 6206706 6171648 6095089 5958221 5882493 5802091 5717256 5686024 5578631 5489538 5383443
3462 5383443 5313000 5263380 5178758 5081001 5017588 4905779 4812256 4769594 4734496 4692952 4686520
3451 4686520 4601639 4551957 4532841 4472185 4367370 4297754 4331149 4279238 4283868 4218572 4133090
3440 4133090 4074449 4019068 3944579 3866613 3810679 3794204 3779794 3771248 3816119 3814942 3762533 3682113
3428 3682113 3618777 3583393 3544335 3516783 3479638 3450340 3442182 3401925 3417727 3411308 3414089 3388528
3416 3388528 3404240 3412110 3412509 3419104 3381153 3335608 3376703 3355013 3364272 3333680 3318950 3356989
3404 3356989 3364433 3414867 3469169 3519581 3529182 3547251 3527971 3421629 3288382 3252115 3199826
3393 3199826 3175565 3084608 3041890 3058628 3118015 3134698 3108557 3077835 2992196 2956128 2903933
3382 2903933 2867695 2850224 2824844 2830025 2856124 2889264 2916721 2937521 2932400 2975553 3078881 3153917
3370 3153917 3231676 3335299 3536850 3676392 3602167 3446047 3361791 3295351 3154049 3100740
3360 3100740 3106891 3010442 2899283 2849794 2856069 2811137 2836356 2765912 2701747 2651568 2638401 2639426
3348 2639426 2608456 2580478 2543561 2560833 2563784 2598817 2630098 2695644 2685893 2703797 2760485 2837435
3336 2837435 2919723 2992516 2961178 2909906 2941651 2894211 2838564 2819952 2761957 2773128 2848842
3325 2848842 2882703 2901552 2919876 3000510 3076192 3091805 3130051 3198223 3173855 3223338 3278424
3314 3278424 3353590 3424472 3422159 3485063 3521364 3561753 3609385 3634396 3663531 3662926 3656050 3646481
3302 3646481 3596531 3571066 3551627 3518422 3488724 3502191 3450331 3422871 3446993 3432200 3408843
3291 3408843 3405804 3441057 3402899 3346164 3360074 3401888 3399534 3386411 3435403 3458591 3460850 3481236
3279 3481236 3460353 3394394 3359733 3241459 3171789 3198178 3175093 3098115 3065497 3067150 3018358
3268 3018358 2997422 3033166 3086544 3083512 3122798 3104687 3076615 3090097 3093571 3197687 3217413 3206914
3256 3206914 3208514 3256494 3296632 3367630 3387458 3443184 3454244 3464636 3503475 3575130 3670948 3668113
3244 3668113 3725837 3865601 3956295 4079444 4148404 4220949 4390310 4492943 4666606 4870350
3234 4870350 5060714 5253424 5393558 5457486 5431083 5425317 5516228 5594445 5702547 5833456 6015779
3223 6015779 6191707 6421189 6663856 6977071 7357083 7832571 8305612 8806995 9253640 9654157
3213 9654157 10081823 10670552 11328278 11920621 12589637 13202404 13745131 14060722 14139221 13767914
3203 13767914 13037745 12153871 11223985 10310538 9504852 8802135 8233670 7663262 7138472
3194 7138472 6768050 6423728 6080657 5816184 5679855 5545510 5476681 5500041 5489006 5548633
3184 5548633 5537789 5344497 5141476 4887464 4622540 4379411 4216202 4037053 3927281 3817546
3174 3817546 3752459 3637589 3548096 3497958 3491910 3464978 3485295 3529446 3570153 3457458 3338551
3163 3338551 3246700 3142636 2983856 2886871 2842190 2798393 2743750 2737113 2765727 2797017 2839393
3152 2839393 2856467 2832287 2707261 2584864 2501611 2410387 2301284 2281278 2263361 2218357 2164112
3141 2164112 2143310 2039882 1987532 1983347 2030454 2042945 1992263 2005161 1970316 1902371 1900184 1832085
3129 1832085 1787532 1714394 1617117 1594059 1595986 1646186 1576339 1488405 1494018 1471517 1479985 1456168
3117 1456168 1399996 1401333 1442447 1444042 1403362 1392897 1373976 1342183 1348440 1312266 1314364 1245525
3105 1245525 1236147 1266526 1239406 1205338 1209448 1199608 1213768 1224968 1231043 1167758 1180683 1191948
3093 1191948 1187862 1165826 1147068 1135699 1174769 1141268 1097371 1129095 1140716 1125423 1084521 1073183
3081 1073183 1089732 1112456 1128037 1068276 1003089 1024836 1010333 996704 1015146 1025171 1010012
3070 1010012 988810 994956 986292 1016742 965961 999353 1018193 995579 1007473 1022229 1008225 951477
3058 951477 942850 883709 969401 976591 947932 915411 893929 855160 873146 868676 853089 858808
3046 858808 871945 880589 886713 925881 943197 926514 901007 844226 864820 871226 913562 848426
3034 848426 839449 856501 866024 908841 881281 836152 806173 802507 823418 849424 840952 805367
3022 805367 798760 844145 763591 721942 748762 762990 749758 749550 766913 769430 786632 796263 790941
3009 790941 812442 837042 811430 782862 821529 820163 763723 689212 692577 683314 714734 773518
2997 773518 802020 769852 752814 789403 732076 729127 752706 744722 717958 789570 776525 745930
2985 745930 756071 825901 859754 806170 767651 760413 780314 796343 778263 737851 759484 778156
2973 778156 762025 815519 785237 812516 870937 860726 805548 829340 832615 849172 846246 798591
2961 798591 863755 874265 875845 859519 894416 907095 879751 887001 915820 866452 827546 859991
2949 859991 929953 910675 879021 901359 947196 903753 880971 908986 955954 938951 915192 936763
2937 936763 996091 1031072 1032931 1046473 1084665 1105772 1079559 1067697 1132649 1161734 1173979 1156193
2925 1156193 1126107 1122570 1096419 1104550 1131245 1178017 1153504 1124523 1114453 1087764 1111805 1138673
2913 1138673 1205793 1233858 1211861 1162142 1153041 1204054 1264449 1253947 1226149 1299080 1312728 1250198
2901 1250198 1304463 1335419 1379822 1444323 1434533 1472175 1484771 1478888 1554209 1656725 1642140 1656430
2889 1656430 1648434 1650863 1635299 1656759 1681607 1699742 1689988 1658113 1696401 1736992 1749827 1778787
2877 1778787 1774943 1816882 1867806 1914481 1923605 1986456 2025739 2078500 2225776 2218640 2251784 2311923
2865 2311923 2417555 2467806 2459043 2347667 2235307 2172372 2121965 2062284 2012101 1985444 1926046
2854 1926046 1904999 1894404 1835840 1832376 1858993 1884059 1898531 1909359 1905366 1889949 1950766 2002098
2842 2002098 2030980 2029567 2066506 2140658 2126306 2145114 2172399 2154679 2110290 2078939 2032250 1903671
2830 1903671 1847366 1824579 1742718 1726683 1712366 1731390 1644647 1598029 1619853 1551155 1537779
2819 1537779 1537722 1548732 1534182 1492453 1475267 1440671 1441892 1334445 1300970 1298517 1171217 1135418
2807 1135418 1144622 1168981 1107394 1069036 1022796 1027037 972263 950043 976811 936895 880887 883927
2795 883927 877113 876174 827642 775755 731636 748604 737478 774184 720325 764694 753392 698149
2783 698149 729400 712632 735967 680894 650466 614038 576022 598469 590313 539366 548858 553053
2771 553053 519846 555116 577750 524460 514114 506126 489474 492282 491614 485163 485189 516258 571308
2758 571308 552772 523672 481814 443536 465423 451849 419170 404705 423978 419151 429742 405303
2746 405303 394150 362036 377548 405105 353347 346513 343738 378027 342343 326367 319586 353700
2734 353700 340013 316560 328252 330714 337528 370223 373121 385062 353481 314933 304360 262030
2722 262030 259266 281852 248281 221812 275117 306535 254330 253792 308887 315661 275104 230838
2710 230838 192138 215643 218292 219739 200954 215157 231646 237063 274763 247576 210201 204906
2698 204906 307931 267561 294744 298295 226466 230736 177097 256274 245611 225494 193941 186795
2686 186795 178699 162073 157146 221498 214264 184864 227937 223119 216781 150316 188995 259066 214884
2673 214884 204526 186914 191827 215991 219229 172500 171361 187339 152473 165072 132839 141974
2661 141974 170599 148664 154808 213536 258141 236812 166613 156928 178457 193742 208513 177014
2649 177014 153357 146418 177601 201503 163002 154309 145508 191710 195273 228318 238030 191396 183399
2636 183399 188360 182867 190027 153420 166720 191640 160810 154547 167409 168069 108949 106698 91034
2623 91034 138228 185157 120343 107626 138363 162318 153703 163792 199315 165123 140214 151639
2611 151639 174509 164597 195856 168750 111084 109009 146932 177622 132092 117192 123242 147064
2599 147064 185531 200790 161829 153140 132185 161284 171369 131381 155121 172008 141067 135227
2587 135227 125500 99689 155289 213444 136245 116153 144906 183072 207143 213200 196017 197523
2575 197523 203005 239382 201826 201973 223659 208301 236032 213868 163386 83033 117962 200568
2563 200568 200172 201094 179725 161837 201754 214592 180645 149126 174543 155820 179826 168976
2551 168976 151378 146548 160276 184138 116379 142427 137149 148622 164216 166764 178557 179383 173754
2538 173754 174828 184327 200676 143854 134156 136014 142262 153752 169355 151698 147980 164810 129664
2525 129664 147032 143973 123794 126295 142536 146023 185912 164953 155459 102382 129129 188417
2513 188417 158252 110873 117786 148469 73131 126512 136518 80749 104488 110204 131431 102989
2501 102989 136131 143953 192850 116070 57887 82351 78648 70311 64818 99038 47377 38076 65446
2488 65446 72101 53655 40865 83223 88174 81566 115772 107895 103994 141578 142878 105129 83484
2475 83484 92695 102773 72593 40379 62693 63162 73620 58627 83300 119768 106583 108536 105362
2462 105362 92590 125611 71277 63585 54614 46225 32975 36640 36731 26757 40923 45937 83252
2449 83252 34878 32043 39375 16319 58321 64120 60533 82862 93165 45008 77589 56456 29054
2436 29054 30562 84774 52826 33613 69540 43729 23335 -29242 23642 51246 29424 24385
2424 24385 38855 60174 60801 60972 50659 25628 453 -26559 -30715 14743 28182 1105 11927
2411 11927 -9681 9012 26188 93044 71260 12837 -41458 -41746 40810 71456 77638 31081
2399 31081 -27456 -26412 -17591 5120 12001 -26639 -41580 3292 22812 45263 79237 54511
2387 54511 2087 44041 26271 43732 27131 28627 -2202 12614 10612 28229 100074 82723
2375 82723 86645 77736 36472 -2453 -9627 45092 47429 19955 78555 98353 82558 79151 17526
2362 17526 25525 74647 77022 39048 48864 19386 50540 38765 15754 38163 66422 56746 26217
2349 26217 77823 80502 64976 67080 82083 77469 77998 44157 14148 31502 56875 52186 88417
2336 88417 105908 142840 113598 125033 153887 124978 127602 117400 86825 72563 81492 58337
2324 58337 29003 102308 96269 111244 108165 88986 119788 39640 78410 71649 55478 55589 44418
2311 44418 28893 -7348 4000 29386 3659 -3397 -3808 28414 66396 16804 88369 77880
2299 77880 49112 19986 3844 3945 40715 38816 37307 30666 18821 33147 14733 78420 72296
2286 72296 61031 52630 94896 108724 55732 76163 3707 -38160 -43930 -17733 7574 21714
2274 21714 25489 14352 18315 43543 2709 6054 16580 13733 45316 53320 37542 -25505 -17086
2261 -17086 40860 56707 7281 1530 10063 7333 6384 24937 41710 9554 31444 2718 -6159
2248 -6159 21618 -7463 24853 82583 44284 60985 77170 35536 5810 75595 105835 142222
2236 142222 70243 45741 52534 64559 47907 46947 75748 24113 16156 41227 51336 25577
2224 25577 20895 434 20292 64588 58561 60082 48825 24420 35349 32604 23045 67221 81026
2211 81026 46017 33752 65478 97572 109545 74575 74420 41538 27156 66255 122016 118346
2199 118346 75588 84074 46312 94089 73641 85168 67238 82761 62323 72515 69787 59038
2187 59038 56294 92947 109413 62829 53504 62530 53329 84203 114571 150734 57199 80757 147497
2174 147497 126215 49980 57658 77529 88084 79882 105215 127134 182160 168167 159552 152511
2162 152511 145774 153817 156958 180541 163130 192803 177752 175517 209016 226891 227143 235075 229841
2149 229841 226494 186565 201247 208786 222958 215331 260748 298887 305078 336760 315157 249058
2137 249058 238602 249505 286026 343386 350917 355442 377615 367042 435960 520781 502992 506854
2125 506854 537354 518466 521510 548121 569078 556417 541882 550215 512352 560469 592301 633564
2113 633564 630532 634308 677283 684131 729479 730945 773253 790798 870179 969021 989124 1008173
2101 1008173 1105328 1134137 1198465 1252000 1323225 1323237 1379525 1447293 1501519 1615250 1715011 1881495
2089 1881495 1977393 2131016 2187816 2311891 2500249 2633574 2875191 3188687 3500758 3797438
2079 3797438 4039765 4345437 4729233 5135348 5714734 6397559 7223965 8326143 9819671
2070 9819671 11709102 14158441 17618610 22034147 25428758 25000015 21531726 17958732
2062 17958732 14767545 12020586 9902753 8203392 6994154 6086970 5375800 4839135 4466492
2053 4466492 4185302 3931262 3767191 3523995 3249681 3019304 2765801 2529582 2389521 2239036
2043 2239036 2124884 2057675 1954296 1831514 1760383 1686002 1600309 1535845 1484290 1367536 1262962
2032 1262962 1179390 1162279 1130353 1075373 1012135 960070 901740 883494 884885 887686 878638 832455
2020 832455 841044 817829 782335 775001 759177 747822 640266 650452 666871 672865 653684 599321
2008 599321 560910 560912 606954 577163 567272 499592 495798 480562 506826 563623 590606 529543 516362
1995 516362 468610 464858 427088 417536 420641 417314 350244 343637 391429 381846 383839 281572 267957
1982 267957 320768 326227 340172 343602 361416 329035 289915 267638 274229 278147 279300 267509 263347
1969 263347 228822 162180 167239 188726 172462 145292 172379 222801 196252 213983 157056 159003
1957 159003 152246 206292 191509 183877 169100 157682 167482 131642 125488 157351 159180 142068 147397
1944 147397 162861 181221 118623 183993 199206 178848 169472 157544 125843 102962 96607 67075
1932 67075 57439 69507 69279 94292 98307 96768 79456 50020 70898 61190 -7402 -750 88643
1919 88643 62161 21799 33274 50340 72463 94129 50945 51494 20986 17719 78838 67989
1907 67989 79728 80762 131134 170005 136099 76706 93586 46096 48433 108861 118344 69137
1895 69137 58119 827 18399 17228 76186 72436 82740 58811 -4448 29474 86733 65979
1883 65979 62096 111360 111041 97219 77455 38029 42699 111423 64445 65237 55451 42227 89835
1870 89835 149056 68724 75319 81926 29498 45205 97898 124907 72298 71888 27946 43705 62387
1857 62387 45296 48922 44707 47547 23454 17847 17383 -3814 -8834 9422 2461 36692 50904
1844 50904 41284 33505 -43671 -45937 7217 57411 57252 25268 22651 -1236 7238 -6788 -50639
1831 -50639 -8500 44229 32363 26536 -10256 25115 90057 61491 36496 -15017 -45696 11115
1819 11115 18841 74346 60273 23361 55519 41536 61358 39277 -5549 -35052 -4180 6205
1807 6205 -11 28356 6589 2236 28600 87558 133751 120346 73839 52098 126804 150773
1795 150773 147195 97718 74455 81827 47891 40840 97212 106096 40963 19532 47177 41617 69579
1782 69579 86405 37234 -23110 10715 54434 36963 18560 -6653 24490 31103 1548 2285
1770 2285 -12137 5291 26778 -12455 -17204 17678 7134 -17447 13405 15099 61005 53753 45551
1757 45551 48622 55585 17018 4022 17909 65785 67917 33514 -35252 936 9227 -14043 6228
1744 6228 10567 3878 2348 -10162 -75930 -4966 -9042 5549 19177 8590 6399 18639 9386
1731 9386 22860 398 -1213 -59256 -51533 -6124 -44524 -96320 -87991 -45815 -47548 14086 1613
1718 1613 -13133 -5075 33159 -17741 -30738 -14414 30450 4253 -20988 -37487 -10923 9453
1706 9453 48477 43964 51230 36783 7809 -28146 -42578 -20830 -23225 -64162 -17718 -6757 -49095
1693 -49095 7454 -1611 -56784 -53415 -58905 -71194 -114907 -93021 -21570 -20254 -14021 -77753 -23859
1680 -23859 -55053 -24037 -38021 10671 13540 -42492 -72030 -58285 -6145 1084 -385 -47073
1668 -47073 6716 26774 -24482 -25751 -14574 23576 48180 9816 -38897 2090 -1079 -22765
1656 -22765 -18095 -85103 -78024 -46627 -32209 -69667 -70470 -9021 -65405 -56817 -40201 -32620 -36885
1643 -36885 -6769 38538 7162 -20143 -7366 -28133 -14317 -3011 -45489 -26273 7639 25979
1631 25979 3292 -29789 -43280 -18586 -26349 -12950 -17037 -16393 19805 17590 -21868 -37973 -11770
1618 -11770 -14491 -32409 10215 13648 19528 -34279 -36242 -21109 -42071 32122 -9581 -39088 -34574
1605 -34574 -101 -38267 -37313 12153 16300 8202 -15352 -17596 -72350 -70025 1454 2191 -2069 -19555
1591 -19555 -41210 -55260 3767 -1270 -9155 -50517 -84172 -59156 -70805 -83337 -53661 -19287
1579 -19287 47665 44132 -35852 -56185 -32809 -34391 -21356 -16861 -62353 -13552 -26002 -52597
1567 -52597 -54456 -16393 -12980 -66852 -50616 -26045 -25750 -46274 -54229 -8441 -6505 -21654 36316
1554 36316 20932 -33597 -74616 -67475 -55043 -45111 -25929 -111021 -101663 -95185 -50875 -24637 -30640
1541 -30640 -31391 23731 -43658 -61937 -12758 26001 -1868 -45740 -35256 -14402 -43572 -60720
1529 -60720 -72346 -12616 -29506 -1567 231 -54512 -60805 -104627 -86911 -63215 -22148 4698
1517 4698 -2053 12442 2821 -21701 15868 -23217 21474 39064 -2100 -43857 -53103 -32081 1922
1504 1922 -17214 -15420 -32826 -60047 -75630 -54755 -42543 -99958 -78937 -49078 -35216 -46471
1492 -46471 -29702 21602 19667 -19884 -42897 -2709 15136 -34188 -30052 -38791 -56688 -17271
1480 -17271 -5997 33480 18551 -48255 -46016 -18721 32637 -21335 -24061 -22389 -54975 -32490
1468 -32490 -41551 10690 34064 -15582 -53105 -83248 -71384 13431 27445 -1281 12820 -63550
1456 -63550 -75766 -108865 -85158 -72813 -48739 -973 -10179 -4933 -53450 -51098 -59061 -63560 -101125
1443 -101125 -96262 -81498 -38075 -32656 -44094 -73073 -64329 -66870 -69833 -48774 -41182 -41728 -23292
1430 -23292 24099 -2767 -47522 -48555 -45116 -18418 -31206 -43267 -83877 -108542 -137673 -99702
1418 -99702 -65469 -10467 2843 -40250 -47737 -47292 -69813 -22260 -67272 -107939 -128381 -74238
1406 -74238 -51890 -53490 -45484 -97623 -71694 2437 37668 32815 -19954 -18265 -39421 -5715 13485
1393 13485 -67531 -42985 -75210 -78208 -33868 -49838 -70591 -27155 -36228 -26291 -17153 -5629 -40869
1380 -40869 -35205 -37762 -36477 -39663 23175 30929 29379 16588 -21471 14773 54843 -4898 -12795
1367 -12795 -12015 -18948 -33352 -34758 -569 23039 19509 -53735 -23917 -24043 -7235 6400 14414
1354 14414 -81 -34507 11365 -15479 -73572 -50073 8251 -40517 -12317 -9359 -13427 -54323
1342 -54323 -62790 -32935 -50615 -48537 -14161 -26310 -56289 -85494 -45308 -42362 6100 35059
1330 35059 28003 23740 -14405 -44184 -29936 8759 8306 3491 -20819 152 -26180 -34472 -8118
1317 -8118 3202 -3705 -30082 -57139 -40163 -50680 -66348 -21072 -26589 21844 26040 6999 13831
1304 13831 -42107 -42458 -47070 -79953 -66501 -53657 -36520 -53902 -48860 -43827 -38475 326 -53008
1291 -53008 -25388 -322 -23782 10230 12973 -14458 24329 938 6827 26 -7696 26 -45448
1278 -45448 -24626 -24509 -52211 -32751 -4814 -52538 -40226 -39674 -55726 -60390 -73678 -76048 -110750
1265 -110750 -101183 -103832 -68190 -79838 -48311 -52041 -10622 -33236 -29147 -47333 -51717 -57128 -9032
1252 -9032 -39051 -30226 2893 -22237 -88271 -58119 -18868 -25186 -25491 -46631 -12612 19570 -25124
1239 -25124 -19948 -31356 -59999 -24412 -1699 -24890 -21579 -25196 -94643 -80173 -56285 -14997
1227 -14997 -41388 -68534 -82014 -66721 -84346 -97851 -59864 -9005 -74854 -102717 -64654 -6939
1215 -6939 34055 50390 23484 4048 -57218 -39546 -32962 -52684 -51612 -17590 -35152 -63349
1203 -63349 -41333 -47619 -45986 -88674 -41578 -8302 -9307 23383 27141 -49662 -57574 -17840 39148
1190 39148 69158 10977 66406 13756 -3545 -21540 -24905 -19705 -78038 -78495 -44306 -63620 -57542
1177 -57542 -11319 9922 8647 13544 -30540 -61437 -95973 -53463 -38428 -8676 -40766 -39839 -40662
1164 -40662 -49352 -18702 -34264 -35862 -23197 -23653 -14575 -27830 -43578 4181 -51748 -61260 -40293
1151 -40293 -49001 8853 3922 -18563 39551 -20007 1416 -13259 -17581 11153 -3262 3355 -34513
1138 -34513 -60216 -26326 868 -22145 -45537 -31008 -13123 -483 7275 -37427 -34391 4502
1126 4502 36825 35880 13751 76513 60623 88472 84567 57590 51996 35446 18224 35139 12808
1113 12808 -54367 -34476 4403 -19230 -60605 -57561 -46680 -62900 -21858 -4992 37971 26217
1101 26217 -12705 -7567 -52385 -73088 -25743 -10889 -43126 -56329 -59238 -75806 -34592 -24438
1089 -24438 -14829 -27168 -35734 615 5274 60713 44482 -25871 -11222 33771 -17811 -48631
1077 -48631 -33687 -31560 -26837 -76776 -79793 -79351 -79361 -56807 -8569 -50040 -113287 -56981 -12537
1064 -12537 -34160 -60414 -80562 -48948 -26820 -20030 -12552 -4242 -15785 -21181 3268 -21272 6250
1051 6250 -55074 -46739 -41743 -42581 -26818 -81847 -61247 -2946 -24191 -16226 -17920 -62437 -50481
1038 -50481 -48821 -73028 -79728 -29757 8133 23153 24063 -25484 -25528 -36177 -24971 -36676 -5185
1025 -5185 48231 -12904 -35773 -38954 -46700 825 -10614 -19644 -15835 -46087 -28150 -74970 -72103
1012 -72103 -58946 -37179 -51954 -41568 -34548 -69557 -38966 -66554 -36787 -29807 14645 25539
1000 25539 8434 -16230 -26331 -12507 -26973 18866 -3892 -49691 -19711 -17802 -30184 -17998
988 -17998 -14806 -15278 -14803 -57129 -38587 -46354 -41843 -100461 -121488 -42906 -41383 -56763 -37655 -57631
974 -57631 -53172 -9384 8958 16365 -3501 -42521 -21710 50626 11361 -15416 4349 -36270
962 -36270 -45295 -17742 -33050 -61383 -39642 51533 44971 -11240 19093 -32024 -38304 11075 -4541
949 -4541 -41266 -85163 -77815 -46619 -35124 -32901 12804 59788 63766 10420 -13597 -12287 -4940
936 -4940 -20617 -2403 -21840 -47782 -25245 -31696 -32035 -89021 -76395 -37397 -20586 -24717 -9435
923 -9435 14139 -19625 -50016 -66130 -5481 12729 1187 -23313 -1287 74932 25329 -21696
911 -21696 57206 -18551 -39359 -22094 -24926 8686 7918 13753 -24718 3769 18053 -23871 -32863
898 -32863 -12525 -13750 -42007 -19892 -19645 1976 -26055 19044 43136 11021 -54901 -38358 -4501
885 -4501 15443 -8068 -31085 -16294 -35583 -32828 -37121 -11524 39621 19869 -1433 -53357 -48719
872 -48719 -87573 -108504 -13795 -14218 -9839 -732 -10105 -3167 -72344 -28485 -35285 -71328 18695
859 18695 26341 57403 12652 -9898 -25905 -41274 -23261 34747 38560 325 -24007 25720
847 25720 16785 37210 7143 -5200 6567 5342 13078 14088 -7340 -26229 -3 -28483 -51932
834 -51932 -44070 -35292 -2134 -37633 -40104 21565 26399 -158 35156 43548 -7374 -30599 -53032
821 -53032 -37659 -30303 -28522 -11923 -5416 -40450 -66995 -41249 -5787 9097 -28610 -37589 -11599
808 -11599 -33017 -25703 -14102 3670 -12502 -40810 -1600 -12017 -50653 -20630 29736 -24426
796 -24426 1401 -29552 -2968 48781 55472 4685 -7127 -7187 22039 23300 2009 13429 14598
783 14598 18114 -4100 -17578 -46732 -22717 -5572 -79836 -75841 -46097 -18917 -4198 -13971 -8982
770 -8982 -7739 -11513 4840 5801 -61760 -34536 1215 24108 -29989 -2644 -6683 -60628 -64599
757 -64599 -7612 -5901 27095 71541 70002 56445 2008 9853 40622 -37897 -18438 -33300 -22364
744 -22364 9617 -51190 -43658 5032 8254 -17810 -3173 29895 49288 86438 61085 48373
732 48373 55768 -14224 -29805 23204 903 29183 19564 53057 19820 -64084 20176 58722
720 58722 19747 -9607 46566 116324 78998 26021 12440 -27324 -13531 858 18973 21240
708 21240 7086 22037 -36025 -50168 -49821 -7912 17382 56724 56726 78280 59806 -8161 -34723
695 -34723 -62846 -18728 3623 9261 685 46495 50281 51064 55375 64023 7707 -32576 -36090 -27049
681 -27049 -12076 41810 84872 7764 20262 57677 35333 19644 4789 16698 48380 19011
669 19011 28328 31380 26898 35992 25698 -3573 -4648 27288 46148 107907 60555 52046 6171
656 6171 -567 -34107 -3659 28553 11288 -7033 -76705 -88853 -9747 43064 11948 -38292
644 -38292 -56601 -37240 -28197 -41431 -4888 -11918 30396 72890 40529 11408 257 -4608 -820
631 -820 1424 -45168 15018 32840 25752 79499 58146 -13203 32215 35392 2892 -43438 -17115
618 -17115 20567 -1836 44727 21527 -1816 -15634 4646 -6106 20325 -6723 -9009 -30548
606 -30548 42576 71442 55031 38629 77905 110812 53575 43592 48484 54233 29501 79796 50364
593 50364 6393 -19580 -6731 13345 53883 13510 12943 -13689 -26282 -13404 -23468 8966
581 8966 51676 -11529 -17972 24132 24328 30087 48708 34657 50842 45971 73521 62453 35063
568 35063 -9023 -36841 -42166 -4952 12409 4514 33629 9507 -55156 -50659 -14862 -30219 -32384
555 -32384 13714 27281 64652 42228 -40442 -40528 -8246 30915 4939 -8525 -48870 -45806 21047
542 21047 50194 39344 17362 27461 66356 80348 51748 -13814 42198 81615 30865 -6566
530 -6566 -26609 -13016 21846 6256 -42394 -17568 -35979 -15043 -3297 -32923 -4681 22456
518 22456 52616 49569 31016 -1450 -6857 -3635 21696 9766 -7990 -21955 3577 50190 69915
505 69915 81 22018 73596 50060 -23043 -24141 34669 40996 14168 42626 -3836 -66462
493 -66462 -63580 -30250 -25698 34192 12793 17366 36651 6758 -18657 36415 1760 -48901 59510
480 59510 21160 31175 56355 115318 94808 66764 74673 62426 58618 47208 22603 77139
468 77139 60455 57241 103019 34218 -1550 1563 22439 3662 21683 35848 62110 39695
456 39695 16518 67211 -1291 42283 60964 26560 7937 6065 4506 25055 62529 38278
444 38278 30999 38502 73743 58408 73957 65146 40516 54651 55808 120172 97748 87649 44940
431 44940 68050 60914 83663 69821 20386 26533 32691 25709 52284 60931 7890 6087 10837
418 10837 -3047 29162 6958 2844 -2093 -28456 13984 35813 52499 79557 55838 68997
406 68997 94740 85554 77500 25076 46574 54109 74887 99331 100673 78285 110434 60293 88384
393 88384 97048 100770 62390 18064 63501 85981 92595 59427 56035 74125 64302 72225 48670
380 48670 35215 48035 104582 83142 75047 63710 79371 77447 56599 88643 63230 85028
368 85028 55228 64281 57804 40592 32017 88899 100116 65248 57152 76118 64561 50455 88198
355 88198 93037 90345 124994 137006 65508 37862 96258 96028 82564 49558 55353 87818 48227
342 48227 57947 24085 38232 94152 113093 86130 47697 34580 79452 73275 92349 69210
330 69210 32394 39298 74713 104039 91663 86067 92469 67954 66288 78790 106366 83644 68406
317 68406 120407 93257 103124 77798 63517 68251 61148 94133 91797 78208 75518 63961 76408
304 76408 46653 103450 119617 126493 125169 102758 99582 103739 91746 90104 61071 31478 17743
291 17743 23599 50466 25518 58397 72760 95933 86145 35298 26587 77495 87074 76127 97835
278 97835 63403 124555 154435 127854 85031 79819 83999 78203 27964 34367 60781 76296 122400
265 122400 97494 77152 87785 113670 88911 100186 101625 81906 83722 97249 87638 41544
253 41544 46548 53861 102367 130068 116381 121842 100200 87655 109909 135612 91353 92043 123151
240 123151 78759 64763 39673 24569 77168 105085 96110 95417 106360 100224 52051 -5420 54658
227 54658 42065 38479 112083 148346 142309 142138 72418 91031 123871 79045 107692 100805 102458
214 102458 99666 110100 106096 105333 84135 77736 26873 24916 36703 36313 77638 51116 69315
201 69315 114043 105759 100119 109634 126897 71445 47089 62625 110086 147518 113376 80648 49617
188 49617 88196 99787 104589 68009 85344 38538 31869 56598 50634 63058 113247 104011 73637
175 73637 70274 40153 80566 81859 93605 152571 164117 190220 155607 151393 148256 144149 153503
162 153503 133649 73898 118072 129987 60429 100458 83856 126709 67586 56334 112567 123116
150 123116 90612 79534 59433 59258 50046 102526 68779 85287 93693 75258 95875 76193 71122
137 71122 22402 50966 91806 97192 74473 38280 61781 107913 55524 94644 97735 127370
125 127370 66402 48539 85605 120432 84135 61087 53115 39541 122791 93672 89938 106891
113 106891 85978 60382 87475 101725 113496 117415 93310 89374 104862 104614 66415 75896 156101
100 156101 107636 113731 108966 73514 75432 82725 68792 87688 100198 79408 84372 80009 63452
87 63452 62299 117958 128031 89915 71072 102817 108058 137622 143064 149193 106635 89436 123326
74 123326 124591 113592 83086 92868 101514 106292 138536 148858 138821 120801 117375 101501 98516
61 98516 121263 104563 78793 104554 134679 115899 95506 116360 132582 114859 95585 128597
49 128597 141456 127995 125542 97856 98856 82073 90704 80747 92497 95822 103018 129157 109168
36 109168 90065 101234 99764 101212 75953 54293 108895 95665 112388 108405 73631 61721 81518
23 81518 93186 40347 50626 38377 52979 110120 91574 108360 113046 113967 106216 110782 125456
10 125456 113726 103357 127880 119678 122443 119271 74951 147101 106002 102703
0 102703
$$ Imaginary data points
##PAGE= N=2
##DATA TABLE= (X++(I..I)), XYDATA
16383 223817 217868 209042 210044 174990 194634 211859 237840 225360 207644 214195 231582 209538
16371 209538 204562 203629 225857 183337 208374 210646 196234 207398 199217 186216 186479 198023 204717
16358 204717 188352 196699 195904 186910 226700 231169 213667 197108 213863 182152 190514 182268 184369
16345 184369 207172 163763 161896 187253 207748 208699 215765 198199 172668 185650 155883 147741
16333 147741 192871 188415 212564 197580 192063 190922 218738 230413 228551 225130 219007 194442 205430
16320 205430 236299 226313 249091 204962 216769 235401 202450 194433 206744 179400 205531 213598
16308 213598 175297 203271 193643 178301 165608 139756 142033 204968 191544 194351 189601 185685
16296 185685 209248 204589 169947 147220 198889 181310 195167 227026 251777 207620 188701 181629
16284 181629 162902 179885 231640 231827 246999 224852 218021 214063 212529 240492 253974 239512
16272 239512 186640 203460 236399 211176 205986 193665 187661 164058 177922 193852 188120 175973
16260 175973 183820 183319 178372 193412 217468 224252 225556 207917 171938 185265 167906 185188 208690
16247 208690 185192 188497 192409 170057 218718 188028 163486 212886 227152 237846 218224 192954
16235 192954 207476 206436 211680 169654 154255 225886 246729 273690 208974 179751 147584 119815
16223 119815 165779 149126 194298 236441 205638 232423 172352 185658 234242 238480 245287 197214
16211 197214 136738 176080 181837 199002 228615 183418 239949 188464 182741 175318 216962 189822
16199 189822 212070 254450 211164 202615 221642 200376 180032 189683 177852 167360 208604 214983
16187 214983 177807 190535 208393 136367 140226 177366 150055 174978 225743 182488 124766 166032
16175 166032 202453 182402 186312 212074 204947 200952 191851 178774 146522 128025 183987 177740
16163 177740 226453 206520 187732 177114 89098 144882 173323 148066 156579 168793 154181 121850
16151 121850 130153 143106 168439 194141 132819 130656 148922 154326 194624 167382 140532 151984
16139 151984 202574 221842 189878 167634 191350 254776 221554 194041 170446 152438 144225 178328
16127 178328 206273 178680 161152 177269 172941 200649 204158 171014 191912 189181 140745 151081
16115 151081 175216 176669 186443 174510 192815 211455 190709 212961 188226 153647 127534 119945
16103 119945 135499 154466 170226 186443 186287 188677 190148 157300 155019 226831 236112 184343 174370
16090 174370 167230 118941 114412 135021 136568 131104 150054 212074 163618 152792 156052 162726 214306
16077 214306 240808 201756 165926 148815 150041 136188 126656 168806 142947 159775 168720 175416
16065 175416 150616 153570 150125 142606 144193 128595 97778 149088 175804 173216 128854 126505 218045
16052 218045 158975 120668 162985 162757 209349 176921 175533 192238 124677 94138 136844 154814
16040 154814 98310 171707 170689 207054 177649 176635 200169 167996 159170 114653 132881 148674
16028 148674 161681 156954 149493 121194 141437 137566 161418 160402 138076 117078 102423 107851
16016 107851 117906 159976 126495 141885 165799 201798 197609 184749 169892 165387 151909 91054
16004 91054 159060 184326 154011 166664 133984 149847 137478 158490 144922 128482 146687 196783
15992 196783 194367 198355 141943 97032 90669 128836 141881 171625 188524 118546 130785 85502
15980 85502 82635 128089 111540 135370 123013 79036 61982 32025 96845 99671 96893 115577
15968 115577 117349 65601 71153 62967 95427 172683 81865 49388 46409 104098 129307 127229
15956 127229 71500 77373 102362 105557 157567 162314 122043 49889 54102 70313 105320 68524
15944 68524 43684 87147 59660 70426 67481 55397 96196 94354 64287 51923 16405 22877
15932 22877 43554 177 5598 20544 30092 50233 71859 66406 46705 23325 29581 39901
15920 39901 37489 16317 -16307 20501 31691 56448 52804 54771 42405 44973 62825 59101 24787
15907 24787 -17076 49249 72722 86879 74052 47308 15635 22736 67371 89922 80272 88029
15895 88029 31889 22442 25788 88395 98848 113911 62578 13761 41301 -699 -31901 11625
15883 11625 49782 41510 64962 77938 82829 53559 42198 69580 68703 46026 24181 61420
15871 61420 46810 44459 60540 56125 20604 17815 22514 -2527 -9115 13308 39443 75868 91738
15858 91738 100978 25337 23339 66275 65034 57499 22650 42571 49600 105875 102987 123849 120151
15845 120151 94025 80678 34508 369 9191 38242 60996 38131 71672 45222 37032 28729
15833 28729 59900 44992 72810 63842 46846 -2635 42867 32256 21627 40843 -223 2880
15821 2880 47416 75391 46362 38485 8112 30295 38198 25337 51087 69843 56544 2272
15809 2272 -34614 1544 -11057 -11374 -19706 358 40374 53962 41371 58378 -35757 -8852
15797 -8852 33257 5095 6161 21196 908 14612 21861 -7893 -2087 1271 -33088 -26271 12785
15784 12785 48624 97241 73915 42739 51676 78679 78581 60608 -16386 17569 42380 17929
15772 17929 67249 73447 61956 50025 36270 34802 11971 -3494 -215 -17592 -24893 23241
15760 23241 33721 12557 41842 56901 58497 34229 33967 3004 -33301 14472 34890 37921
15748 37921 42779 22819 17947 55853 24464 2311 26436 39970 16205 -8617 36457 34722
15736 34722 91210 93634 23571 49947 34480 28219 54577 71641 18886 17299 36794 69837
15724 69837 50809 42681 44490 -3876 -26253 8532 -19936 8666 69331 40165 71066 57126
15712 57126 -1245 -10972 11546 -7972 -9986 43156 29860 36900 41124 -8822 16929 45849
15700 45849 54271 73040 77168 44289 17306 23965 37643 52196 25147 45740 11666 4901
15688 4901 8975 22511 10476 -45310 -43451 -53843 41894 26974 12933 36890 77231 63940
15676 63940 34955 27915 -8110 -34616 -32444 -6355 -22907 -46490 -69818 -127657 -103030 -101429
15664 -101429 -67731 -35795 8805 -7114 -50898 -46229 8112 32632 -2888 -50146 -18166 34370
15652 34370 49716 4860 -10793 -592 -2614 -33084 -38733 -2454 -55041 -75862 -95673 -75038
15640 -75038 -68477 -38815 2870 874 35844 42557 8200 26318 21286 32746 -22724 -76682
15628 -76682 -29746 -14737 -76715 -40003 -35183 -42689 -95138 -82867 -38945 -42942 2140 9139
15616 9139 17462 -29565 -2106 24874 -6303 -54276 -74135 -83876 -47518 -26139 12944 -397
15604 -397 -55279 -56929 -39349 9483 -35053 26028 10177 -11179 14196 26347 15206 -46678
15592 -46678 -32371 -28148 -7720 18929 428 -27864 -33367 -5069 -13072 -3888 34102 -20155
15580 -20155 -23879 -17417 9578 -12668 -87907 -69975 -59518 -24888 -16378 12682 27113 16259
15568 16259 10636 19354 3174 -16834 -18401 -5552 57587 8211 31827 939 5252 -6136
15556 -6136 -49337 -13753 -24425 -54323 -56416 -22476 -4318 23329 -27907 -24633 -4137 25503
15544 25503 -1290 3142 -13930 -37550 -41292 -21733 -3013 -45754 -24786 41909 21610 23019
15532 23019 27780 35942 -77678 -127443 -52461 -15165 12654 4604 -7425 -15016 40133 323
15520 323 11567 55946 -7827 -36417 -25168 -12305 -33793 -23030 8418 -30739 -42686 -48406
15508 -48406 -43895 -16703 -6403 -1110 -751 -37246 9200 -3416 -31049 -8129 720 16001 -12652
15495 -12652 -15874 -49582 -59349 -51730 -13919 8184 -48766 -59575 -53192 -57408 -72475 -89305 -69986
15482 -69986 -51993 -48076 -7743 -52531 -44211 -26117 -20742 -59078 -62554 2222 -21191 -25072 372
15469 372 -56911 -87052 -64218 -12546 -8608 -1284 -42109 -13362 -13542 -100529 -52635 -17504 39489
15456 39489 26124 18224 -22173 -69835 11486 -10918 -53652 -48305 15057 20587 21508 51454 -35724
15443 -35724 -80108 -90081 -32040 31417 38499 11145 22293 18381 -49338 -72761 -77121 -44291
15431 -44291 -16582 -24464 -86773 -64742 33707 -25338 -34546 -21492 -26837 -44547 -74519 -68010
15419 -68010 -20237 -33815 -58194 -46514 -59633 -68309 -53724 -79793 -97465 -90033 -87996 -48283
15407 -48283 -45492 -63809 -40000 -45708 -37825 -38993 -40917 -7720 -38339 -43097 -9295 -19784 -34956
15394 -34956 5244 6584 -34443 -45664 -3284 -28445 -6322 -26455 -8568 10125 -33064 -14766
15382 -14766 -24410 10819 11774 16443 -31701 -56896 -23212 -23077 -4774 -85931 -101904 -81859 -31987
15369 -31987 -39491 -45128 25222 -3227 -45161 -48883 -74865 -61787 -52431 -70957 -70632 -77310 -97155
15356 -97155 -67384 -43089 -29098 -11922 1640 -10124 -29260 -4415 -60926 -54041 -41478 -7019
15344 -7019 -18847 -85449 -89873 -79255 -60500 -74053 -103602 -70183 -71399 -63949 -12622 -41007
15332 -41007 -79425 -46552 -18486 -58381 -73744 -58116 -35733 2654 710 -35029 -65047 -62537
15320 -62537 -95515 -108202 -18398 3227 -17903 1510 -53857 -76211 -46940 -9713 994 11370
15308 11370 -49467 -46655 -66565 -17985 39982 8707 -8257 17949 33609 -31451 -48439 -45162
15296 -45162 -81414 -45882 -65756 -67047 -91515 -79985 -11308 -59628 -73887 -56695 -16926 -16542
15284 -16542 -26656 -35588 -3914 20949 35178 -26539 -13062 -17820 -69691 -105758 -107893 -57898
15272 -57898 -92589 -47412 -39786 -66573 -55694 -29567 -51088 -57887 -21261 -75427 -72854 -59282
15260 -59282 -45914 -53676 -70389 -47415 -46294 -87822 -65452 -25323 -19079 -20834 -29694 -28514 -2786
15247 -2786 18428 1561 -71709 -79456 -75902 -87802 -62467 -23178 -45170 -44529 -72442 -71280 -65730
15234 -65730 -86501 -65131 15441 17681 23541 29180 -29887 -20390 -62819 -40549 -51229 -18867
15222 -18867 11786 -24828 -61217 -75155 -71171 -94725 -93330 -95105 -122650 -95118 -54972 -58856
15210 -58856 -35642 -57400 -52592 -33053 8343 24550 3909 -28466 -5779 -37760 -14859 -27137
15198 -27137 -50141 -41471 -14346 6579 -26325 -15403 -29498 -34149 -39149 -71479 -82621 -61929
15186 -61929 -24870 -14004 -50681 -72018 -67322 -41742 -75919 -72825 -85657 -69817 -45985 -53378
15174 -53378 -74824 -61296 -31648 -73714 -115770 -18320 -38071 -52732 -17387 -13995 -24392 3661
15162 3661 -23862 -59550 -51083 -46517 -12031 -3858 -17380 -53660 -76338 -98722 -85473 -71687
15150 -71687 -71743 -29045 -46077 -75043 -32591 -57576 -42448 -45723 -53908 -25561 16205 -17761 -58590
15137 -58590 -76632 -61432 -47085 -52830 -40553 -13440 -35389 -49348 -49566 -69373 -50937 -32265
15125 -32265 -24585 -73245 -82875 -76009 -86586 -80818 -55958 -29837 -9739 -40306 -53796 -58244 -58304
15112 -58304 -31411 -28292 -30392 -75596 -89597 -83429 -63606 -64909 -81968 -29507 -62077 -56352 -52215
15099 -52215 -53314 -44306 -63352 -70459 -91893 -111734 -95852 -102189 -115734 -81414 -31620 -64118
15087 -64118 -15657 -10415 -63908 -70563 -48525 -106829 -87019 -55089 -46831 -72779 -78971 -66735
15075 -66735 -58663 -14531 -53810 -11989 7493 54472 20317 -13982 -55645 -20508 -52067 -71327
15063 -71327 -34793 -42582 -31290 -48871 -70154 -88813 -61021 -36560 -43863 -59651 16013 -11519
15051 -11519 -13805 -29427 -47136 -95327 -161119 -119830 -73863 -54583 -94430 -61118 -37654 -19111
15039 -19111 -42542 -66582 -70469 -38305 -79722 -65561 -44627 -54883 -74896 -80735 -86778 -67215
15027 -67215 -97657 -107688 -53292 -77161 -93827 -61526 -25723 -27505 -30586 -35318 -10541 25640
15015 25640 -38949 -27586 -14608 -51429 -3321 -19100 -45484 -14105 -24034 -6230 -5142 -43113
15003 -43113 -46201 -22729 -7535 -44356 -37353 -34068 -74709 -90414 -91071 -100657 -67600 -28931 -54262
14990 -54262 -81690 -91778 -103684 -88262 -53352 -26302 -50016 -55451 -26740 -25101 -62456 -49075
14978 -49075 27135 67387 33167 -21346 -836 -27750 -43178 15932 -45805 -52212 -34878 -77315
14966 -77315 -71139 -30477 -56545 -86207 -109286 -76230 -82341 -44327 -13560 -16322 -24847 -69255
14954 -69255 -79891 -56664 -60070 -27605 -28629 -26174 -50322 -8279 18452 -35846 -9081 -20909
14942 -20909 -46920 3056 12784 18541 61088 15180 -11140 -12951 -21233 -91020 -58168 -65342 -69012
14929 -69012 -59423 -46020 -42903 15325 -4597 -42401 -34660 -22122 -23289 -46349 -31920 -53439
14917 -53439 -46780 27700 5667 -28354 19706 -6656 -24727 -17341 -43757 -37544 -113037 -79392
14905 -79392 -6612 -37407 -47225 -59592 -74273 -75025 -44276 -93543 -90934 -48147 -41171 -47684 -23790
14892 -23790 -31529 -30963 -60603 -32282 -58086 -101655 -107728 -113382 -95449 -62047 -20432 -33770 -59902
14879 -59902 -110511 -96443 -85485 -69395 -72710 -63239 -67615 -117579 -69536 -42553 -52888 -87620
14867 -87620 -59582 -35633 -42780 -23686 -41325 -43215 -17989 21742 -14678 -61882 -22383 -414
14855 -414 -36122 -55044 -19936 -56519 -56724 -19710 -38966 -43889 -48716 -75840 -108307 -108387 -64422
14842 -64422 -61512 -112865 -80018 -35603 -26747 -22848 -22823 -2538 -2539 -5642 -15242 -21720 -52358 -19440
14828 -19440 -21451 -21827 -33882 -20399 -52643 -85594 -69059 -84634 -82698 -31418 9770 -19391
14816 -19391 -47317 -67358 -62354 -28261 -41178 -46836 -59796 -78872 -33499 -24285 -27859 -71476
14804 -71476 -101136 -86352 -69926 -44606 -24386 -3363 -30068 -79050 -82740 -87670 -32083 -77765
14792 -77765 -37019 -60372 -51839 -17497 -48087 -12247 10234 -146 -14083 2422 21610 -12183
14780 -12183 -20943 30936 -5784 -6823 22620 -3815 -2078 -14443 -58000 -107470 -76865 -71077
14768 -71077 -51577 -33186 -49602 -21244 -37408 -27611 -37904 3994 40406 -8212 -15887 3396
14756 3396 2130 -15925 6834 23806 50844 4466 20917 39115 14130 49966 26276 15505
14744 15505 6642 -9251 -28444 -51592 -821 -2396 2514 3821 -15899 -34165 -25057 -43480 20894
14731 20894 24938 -46911 -15362 -33934 -54625 -74301 -23980 -54183 -53739 -9978 -11965 -1776
14719 -1776 -3118 -24131 -31132 -91477 -103567 -105204 -87633 -99716 -79806 -65179 10338 40287
14707 40287 -9851 -44570 -56521 -68585 -23225 3247 -29608 -21788 -17761 -36381 -49927 -18616
14695 -18616 -27983 26161 -13253 -8323 -4107 33623 -626 -54685 -37525 -33440 -23394 -21611 -19085
14682 -19085 -24840 -9245 -71771 -64484 24395 25368 18895 4788 -45308 -64056 -47917 -49358 -56998
14669 -56998 -51626 -32153 12815 -29772 -49994 -80272 -53072 -101985 -107299 -85307 -81844 -20270
14657 -20270 -57041 -82455 -44050 -63126 -46070 -24158 -26099 18595 -10495 -21046 23475 10736
14645 10736 -47201 -22027 -23202 29238 9587 -18104 -34900 -37823 17868 -6258 -17855 -41854
14633 -41854 21175 -29627 -44383 -16689 -47923 -30189 -11916 -28615 -27666 -51094 -41558 -27415
14621 -27415 -20336 40619 -26350 -23697 -6728 -26588 -32946 -12254 38731 14260 23258 8095
14609 8095 -11737 -6904 192 -1643 -12196 -37523 -76566 -27146 40869 32978 -7895 -29478 -4943
14596 -4943 -44386 -66671 -36472 -13822 -22280 -5819 -34737 -28837 -29510 -54645 -10128 6484 -2304
14583 -2304 26900 45630 38809 8674 -62487 -58595 -108203 -71977 -16131 -875 -97 27092 31386
14570 31386 7089 36034 5504 -44997 -42993 -56777 5425 -33946 -50063 -26606 9801 -27787
14558 -27787 -3085 -33676 -96300 -52843 -19142 -48511 -52283 -24125 -56605 -75850 -32704 -3152
14546 -3152 13091 -13667 -53896 -64492 -72658 -53394 -45114 -67776 -24043 13417 10349 -28034
14534 -28034 -48179 -74968 -82236 -73002 -57789 2174 34152 51086 27901 41271 36823 24526
14522 24526 28460 54754 50341 7192 -20663 -7823 7102 38021 -7437 -153 -45317 -61068
14510 -61068 -28421 39715 318 -62 50949 77607 29674 73277 11598 -23320 15994 54814
14498 54814 55029 27296 40296 15534 31378 50595 40863 7585 -2987 -22235 20493 2323
14486 2323 -10733 -2961 -26922 -16926 10277 -10678 29467 9789 2032 2233 47845 33642 25227
$$ [...]
##END NTUPLES=NMR SPECTRUM
##END=
