##TITLE=1H_EC-3282(2)
 CDCl3
 8 sc, 
 25.10.2022
##JCAMPDX= 6.0         $$ Bruker NMR JCAMP-DX V2.0
##DATA TYPE= NMR SPECTRUM
##DATA CLASS= NTUPLES
##ORIGIN= UXNMR, Bruker Analytische Messtechnik GmbH
##OWNER= root
$$ XWIN-NMR		Version 3.5
$$ Tue Oct 25 14:26:41 2022 Russian Standard Time (UT+4h)  she@DPX200
##.OBSERVE FREQUENCY= 200.1313499994
##.OBSERVE NUCLEUS= ^1H
##.ACQUISITION MODE= SIMULTANEOUS
##.ACQUISITION SCHEME= undefined
##.AVERAGES= 8
##.DIGITISER RES= 18
##SPECTROMETER/DATA SYSTEM= spect
##.PULSE SEQUENCE= zg30
##.SOLVENT NAME= CDCl3
##.SHIFT REFERENCE= (INTERNAL, CDCl3, 0, 15.7392)
##AUDIT TRAIL= $$ (NUMBER, WHEN, WHO, WHERE, WHAT)
$$ ##TITLE= Audit trail, XWIN-NMR		Version 3.5
$$ ##JCAMPDX= 5.01
$$ ##ORIGIN= Bruker BioSpin GmbH
$$ ##OWNER= she
$$ F:/spectra/data/she/nmr/H-F/1/pdata/1/auditp.txt
$$ ##AUDIT TRAIL=  $$ (NUMBER, WHEN, WHO, WHERE, WHAT)
(   1,<2022-10-25 14:25:20.26 +0400>,<she>,<DPX200>,
      <created by zg, POWCHK disabled, PULCHK disabled
       configuration hash MD5:
       00 E9 B6 7A A2 85 ED C7 34 08 36 98 17 FE 4E 26
       data hash MD5: 16K
       15 D2 AC 26 98 A6 D2 0C 7E 4A A1 A2 B5 C5 C4 B8>)
(   2,<2022-10-25 14:25:25.00 +0400>,<she>,<DPX200>,
      <Start of raw data processing
       efp BC_mod = 2 LB = 0.24 FT_mod = 6 PKNL = 1 PHC0 = -18038.07 PHC1 = 15.2007 SI = 16K 
       data hash MD5: 16K
       E5 E5 01 A8 7C C7 77 47 54 C0 86 26 D6 AB 04 0F>)
(   3,<2022-10-25 14:25:48.39 +0400>,<she>,<DPX200>,
      <pk PHC0 = 4.234994 PHC1 = -5.2 
       data hash MD5: 16K
       75 85 37 2F 0C 7C F3 93 38 BF E3 79 3F DA 3A 52>)
(   4,<2022-10-25 14:25:51.82 +0400>,<she>,<DPX200>,
      <abs ABSG = 5 
       data hash MD5: 16K
       B6 36 8F 6E 34 F7 4B 86 DD 39 65 C0 2B 4C 73 1D>)
$$ ##END=
$$ 
$$ hash MD5
$$ 67 17 B6 86 4B E5 CA 7E EB 68 CB 8A 93 C6 3E B0
##$RELAX= 
##$RELAX= 
##$RELAX= 
##$RELAX= 
##$RELAX= 
##$RELAX= 
$$ Bruker specific parameters
$$ --------------------------
##$DU= <F:/spectra>
##$EXPNO= 1
##$NAME= <H-F>
##$PROCNO= 1
##$TYPE= <nmr>
##$USER= <she>
##$AMP= (0..31)
100 100 100 100 100 100 100 100 100 100 100 100 100 100 100 100 100 100 
100 100 100 100 100 100 100 100 100 100 100 100 100 100 
##$AQSEQ= 0
##$AQ_mod= 1
##$AUNM= <au_zg>
##$AUTOPOS= <>
##$BF1= 200.13
##$BF2= 200.13
##$BF3= 200.13
##$BF4= 200.13
##$BF5= 200.13
##$BF6= 200.13
##$BF7= 200.13
##$BF8= 200.13
##$BYTORDA= 1
##$CFDGTYP= 0
##$CFRGTYP= 5
##$CHEMSTR= <none>
##$CNST= (0..31)
1 1 145 1 1 1 1 1 1 1 1 1 1 1 1 1 1 1 1 1 1 1 1 1 1 1 1 1 1 1 1 1 
##$CPDPRG= <>
##$CPDPRG1= <>
##$CPDPRG2= <>
##$CPDPRG3= <>
##$CPDPRG4= <mlev>
##$CPDPRG5= <mlev>
##$CPDPRG6= <mlev>
##$CPDPRG7= <mlev>
##$CPDPRG8= <mlev>
##$CPDPRGB= <>
##$CPDPRGT= <>
##$D= (0..31)
0 1.2 0 0 0 0 0 0 0 0.06 0 0.03 0 0 0 0 0.0002 0 0 0 0 0 0 0 0 0 0 0 0 
0 0 0 
##$DATE= 1666693519
##$DBL= (0..7)
120 120 120 120 120 120 120 120 
##$DBP= (0..7)
150 150 150 150 150 150 150 150 
##$DBP07= 0
##$DBPNAM0= <>
##$DBPNAM1= <>
##$DBPNAM2= <>
##$DBPNAM3= <>
##$DBPNAM4= <>
$$ [...]
##$SUBNAM3= <"">
##$SUBNAM4= <"">
##$SUBNAM5= <"">
##$SUBNAM6= <"">
##$SUBNAM7= <"">
##$SUBNAM8= <"">
##$SUBNAM9= <"">
##$SW= 18.0517283424941
##$SWIBOX= (0..15)
0 0 2 0 0 0 0 0 0 0 0 0 0 0 0 0 
##$SW_h= 3612.71676300578
##$TD= 16384
##$TD0= 1
##$TE= 0
##$TE2= 300
##$TE3= 300
##$TEG= 300
##$TL= (0..7)
0 120 120 120 120 120 120 120 
##$TP= (0..7)
150 150 150 150 150 150 150 150 
##$TP07= 0
##$TPNAME0= <>
##$TPNAME1= <>
##$TPNAME2= <>
##$TPNAME3= <>
##$TPNAME4= <>
##$TPNAME5= <>
##$TPNAME6= <>
##$TPNAME7= <>
##$TPOAL= (0..7)
0.5 0.5 0.5 0.5 0.5 0.5 0.5 0.5 
##$TPOFFS= (0..7)
0 0 0 0 0 0 0 0 
##$TUNHIN= 0
##$TUNHOUT= 0
##$TUNXOUT= 0
##$USERA1= <user>
##$USERA2= <user>
##$USERA3= <user>
##$USERA4= <user>
##$USERA5= <user>
##$V9= 5
##$VALIST= <valist>
##$VCLIST= <CCCCCCCCCCCCCCC>
##$VD= 0
##$VDLIST= <DDDDDDDDDDDDDDD>
##$VPLIST= <PPPPPPPPPPPPPPP>
##$VTLIST= <TTTTTTTTTTTTTTT>
##$WBST= 1024
##$WBSW= 4
##$XGAIN= (0..3)
0 0 0 0 
##$XL= 0
##$YL= 0
##$YMAX_a= 233505
##$YMIN_a= -337324
##$ZGOPTNS= <>
##$ZL1= 120
##$ZL2= 120
##$ZL3= 120
##$ZL4= 120
##$ABSF1= 15.73257
##$ABSF2= -2.31928
##$ABSG= 5
##$ABSL= 3
##$ALPHA= 0
##$AQORDER= 0
##$ASSFAC= 0
##$ASSFACI= 0
##$ASSFACX= 0
##$ASSWID= 0
##$AUNMP= <proc_1d>
##$AZFE= 0.1
##$AZFW= 0.1
##$BCFW= 0
##$BC_mod= 2
##$BYTORDP= 0
##$COROFFS= 0
##$CY= -3
##$DATMOD= 1
##$DC= 0
##$DFILT= <>
##$DTYPP= 0
##$F1P= 0
##$F2P= 0
##$FCOR= 1
##$FTSIZE= 16384
##$FT_mod= 6
##$GAMMA= 0
##$GB= 0
##$INTBC= 1
##$INTSCL= 3.70164e-10
##$ISEN= 128
##$LB= 0.24
##$LEV0= 0
##$LPBIN= 0
##$MAXI= 10000
##$MC2= 0
##$MEAN= 0
##$ME_mod= 0
##$MI= 1.114404
##$NCOEF= 0
##$NC_proc= -6
##$NLEV= 6
##$NOISF1= 3.799351
##$NOISF2= 2.8
##$NSP= 0
##$NTH_PI= 0
##$NZP= 0
##$OFFSET= 15.73918
##$PC= 1
##$PHC0= -18033.84
##$PHC1= 10.0007
##$PH_mod= 1
##$PKNL= yes
##$PPARMOD= 0
##$PSCAL= 0
##$PSIGN= 0
##$REVERSE= no
##$SF= 200.130006476379
##$SI= 16384
##$SIGF1= 3
##$SIGF2= 2
##$SINO= 5.538805
##$SIOLD= 16384
##$SREGLST= <1H.CDCl3>
##$SSB= 0
##$STSI= 16384
##$STSR= 0
##$SW_p= 3612.71676300578
##$SYMM= 0
##$S_DEV= 0
##$TDeff= 16384
##$TDoff= 0
##$TI= <>
##$TILT= no
##$TM1= 0
##$TM2= 0
##$TOPLEV= 0
##$USERP1= <user>
##$USERP2= <user>
##$USERP3= <user>
##$USERP4= <user>
##$USERP5= <user>
##$WDW= 1
##$XDIM= 16384
##$YMAX_p= 480005698
##$YMIN_p= -386843
$$ End of Bruker specific parameters
$$ ---------------------------------
##NTUPLES= NMR SPECTRUM
##VAR_NAME=  FREQUENCY,     SPECTRUM/REAL,   SPECTRUM/IMAG
##SYMBOL=    X,             R,               I
##VAR_TYPE=  INDEPENDENT,   DEPENDENT,       DEPENDENT
##VAR_FORM=  AFFN,          ASDF,            ASDF
##VAR_DIM=   16384,         16384,           16384
##UNITS=     HZ,            ARBITRARY UNITS, ARBITRARY UNITS
##FACTOR=    0.220516191357247, 1,           1
##FIRST=     3149.88211752356, 0,            0
##LAST=      -462.83464548222, 0,            0
##MIN=       -462.83464548222, -386843,      0
##MAX=       3149.88211752356, 480005698,    0
$$ Real data points
##PAGE= N=1
##DATA TABLE= (X++(R..R)), XYDATA
$$ [...]
7175C151983m4267J20561J19708J04254P5142N601n1821M0166R4968K9876N5567
7164C701738J26160N5215o9734L18539N8813j13149m6627K40926K30768J02935
7154D605584n0811L8971K8094J07543K55554K45327J46100R0138K23124J98180
7144E887804M7419K31960J64787J49439K96165L59591L06026K62384L62757M65521
7134H533853M67214L92394N44934N31496N05902K81353N55525O43210L92511N97710
7124A3446102O68422P18310N79600R46525J142288J392003J651194J827509K163114
7115B4535067K428228K830143L201971M059174M951566O275049Q000572J0087737
7107F6369507J2954345J5737706J6692896J2715698M540819n102885j3793969
$$ plain form
7175 3151983 3107716 3228277 3347985 3452239 3527381 3532982 3481161 3521327 3616295 3646171 3701738
7164 3701738 3827898 3883113 3813379 4131918 4190731 4077582 4030955 4271881 4502649 4605584
7154 4605584 4554773 4593744 4621838 4729381 4984935 5230262 5376362 5466500 5689624 5887804
7144 5887804 5935223 6167183 6331970 6481409 6777574 7137165 7443191 7705575 8068332 8533853
7134 8533853 9001067 9393461 9938395 10469891 10975793 11257146 11812671 12455881 12848392 13446102
7124 13446102 14114524 14832834 15412434 16358959 17501247 18893250 20544444 22371953 24535067
7115 24535067 26963295 29793438 32995409 37054583 42006149 48281198 56281770 66369507
7107 66369507 79323852 95061558 111754454 124470152 129010971 123908086 110114117
7100A10114117j7551641j6608050j3630053j0266672p179931n279506l765535
7093C5832729l064581k792799k440423k262709k188735j778831j477030j436254
7085A8391367j252329r48551j216842r82548r01329j085494q72073o72716p10345
7076I749140l98325m29848n27873k87930l10251m62454l26413k16928j69457l97839
7066F221822n28161n6500k31443j03390j13068k67782j76398k44372M0944J8374
7056D560026j00788m2241j00740l6567j06742l7510J50129j16294j71153q2293
7046C915827J34729J59927p314L21156L30276M07394M51110L34360M86910R9538
7036F633913k42519o76282n75565n35130m99308m53159m25243k04492j89889j14564
$$ plain form
7100 110114117 92562476 75954426 62324373 52057701 44877770 39598264 35832729
7093 35832729 32768148 29975349 27534926 25272217 23083482 21304651 19827621 18391367
7085 18391367 17139038 16190487 14973645 13991097 13089768 12004274 11132201 10459485 9749140
7076 9749140 9350815 8920967 8393094 8105164 7794913 7332459 7006046 6789118 6619661 6221822
7066 6221822 5693661 5637161 5405718 5302328 5189260 4921478 4745080 4500708 4541652 4560026
7056 4560026 4459238 4416997 4316257 4279690 4172948 4135438 4285567 4169273 3998120 3915827
7046 3915827 4050556 4210483 4203169 4524325 4854601 5261995 5713105 6047465 6534375 6633913
7036 6633913 6391394 5715112 5139547 4604417 4105109 3651950 3226707 3022215 2832326 2717762
7026B717762k58511j9555m2982j21197j34171j30715O2290K9403j06006M1562
7016B037880k24481k7716l2962j9952O2596j38666k32681j1184m9788R239o2874
7005A309411N1704J5307k42661r4234l9699j06560J29445m7460N8690j54923J5825
6994H94845J7361q4978N075j3956R4382l0233p5876q9069q2321l8730K8658M2026
6982F67184J1536j7396K8482n2503P4464R2036j5399j52955J01526r6240j91539
6971D49196J08148J99264L4871j71439L5445p6781N9030K2161j46905k9647j04837
6960C78506l8952N6206m769r857N0114R1203j71463q1959l12Q2801K58953j18735
6948D91736r1787P4646p4271j91099j085J28839j20196j18552K27225q8002Q8252
$$ plain form
7026 2717762 2459251 2439696 2396714 2275517 2141346 2010631 2072921 2102324 1996318 2037880
7016 2037880 1813399 1785683 1752721 1732769 1795365 1656699 1424018 1412834 1363046 1372285 1309411
7005 1309411 1361115 1376422 1133761 1039527 999828 893268 1022713 975253 1033943 879020 894845
6994 894845 912206 827228 832303 818347 912729 882496 806620 717551 635230 596500 625158 667184
6982 667184 678720 661324 689806 637303 711767 803803 788404 635449 736975 640735 449196
6971 449196 557344 756608 791479 620040 655485 578704 637734 659895 512990 483343 378506
6960 378506 339554 395760 390991 381134 431248 522451 350988 269029 268717 351518 610471 491736
6948 491736 399949 474595 400324 209225 208140 336979 216783 98231 325456 237454 325706
6937C25706J52879j72841l4397j715J46797O6913r5266j10902j58885K7204O5818
6926B11311N3070L9172R6116M6263j82857k7059l9450k8629J70277j24394o1548
6915A52272l7641j5611P636R8943k12951m7410K74983J2929j09358j4709q3150
6904B5933Q3299Q5063M0233M7951p2397n0974L6710K25222r6234o2163p097J38833
6892C94379j3067r7159n7226j11397j19059L6201K51128j40139p4918q9920M6536
6881B5359J22701m4940J7500j2117K6536K0549p6041R5931j29503j26034L07817
6870B27758l893j09632k0619l9473J32690J6849l5487m6356J00924k6166R832
6859B06427J4076j222j80710p1509J48497R8678O4579j04381O4551j40251j22576
$$ plain form
6937 325706 478585 305744 271347 269632 416429 483342 388076 277174 118289 145493 211311
6926 211311 264381 303553 399669 445932 263075 236016 196566 167937 338214 213820 152272
6915 152272 114631 99020 106656 205599 -7352 -54762 220221 233150 123792 109083 25933
6904 25933 109232 194295 234528 282479 210082 159108 195818 421040 324806 262643 255546 394379
6892 394379 381312 284153 226927 115530 -3529 32672 283800 143661 68743 -21177 25359
6881 25359 148060 103120 120620 108503 135039 155588 79547 175478 45975 -80059 227758
6870 227758 223865 114233 93614 54141 186831 203680 168193 121837 222761 196595 206427
6859 206427 220503 219281 38571 -32938 115559 214237 278816 174435 238986 98735 -23841
6848b3841N5915L0741j04670J30008O1824r2081R4456J00228p0967L4910j35052
6837H1471j53294K02916k9047o280L5560J28309j36135j8687L9940K0698m3735
6826A21716j08876K03469L5573k13720o4987K22983j8462j12162j7564R0057j7019
6815A21008l9178J31551j29169j78541p8613L7583J14756N8837K7837p8876j55092
6804a67897J06879P2618N506J12635r0857q5661m9391k1864k786J82662N2592
6793A14436L3265M5536m4378r8270M6429n0373k0741j2844J18309O5320o8739
6782A27950R9393Q7200j88636n6033J4056m1014M4236J78318n8758j57876J6395
6771F5231k9594M7757Q6380q2239j12444M2228J45855L2989j49867p474L7626
$$ plain form
6848 -23841 32074 62815 -41855 88153 149977 57896 152352 252580 181613 216523 81471
6837 81471 -71823 131093 102046 95766 131326 259635 123500 104813 144753 165451 121716
6826 121716 12840 216309 251882 38162 -26825 196158 177696 65534 47970 138027 121008
6815 121008 81830 213381 84212 -94329 -172942 -135359 -20603 38234 66071 -12805 -167897
6804 -167897 -61018 11600 17106 129741 38884 -46777 -96168 -118032 -120818 61844 114436
6793 114436 147701 193237 148859 50589 97018 46645 25904 13060 131369 196689 127950
6782 127950 227343 314543 125907 69874 83930 42916 87152 265470 206712 48836 65231
6771 65231 35637 83394 169774 87535 -24909 17319 163174 196163 46296 38822 76448
6760G6448R1495j03925J6501N2171k3474j21025n5602J89845q6581L9815n0807
6749B4861n6637J32064j1133q4951J02793j5692q0434l846J01249k0417j9276
6738F8581K8129m6811P886J80814M5582j25758k9411O6226j68991j13847R6771
6727I171q023J42473J0203j77998P601o1973Q0967K4753j6670K74027K4152q4760
6715B23923J05122j04907q9813J72076J05111n5612q7975K0103n1285K94773J09488
6704F41004K1058l789L0195j42853m8556q0351k1257m0188j82164J4035P880M1942
6692B36956m379l8836J63557m5773j9551j03147L7570O6770j17601J8204J31664
6681C25434r0691j16490k2524r5232n5228j78303m8292K54929P1540m4099J28902
$$ plain form
6760 76448 167943 64018 80519 132690 109216 -11809 -67411 122434 35853 75668 24861
6749 24861 -31776 100288 89155 4204 106997 91305 10871 7025 108274 87857 68581
6738 68581 96710 49899 57785 238599 284181 158423 129012 195238 26247 -87600 9171
6727 9171 1148 143621 153824 -24174 -16573 -78546 2421 27174 10504 284531 308683 223923
6715 223923 329045 224138 134325 306401 411512 355900 267925 288028 236743 531516 641004
6704 641004 662062 658273 688468 545615 497059 416708 395451 355263 173099 187134 195014 236956
6692 236956 232577 193741 357298 311525 291974 188827 226397 293167 175566 193770 325434
6681 325434 234743 118253 95729 497 -54731 -233034 -281326 -26397 45143 1044 129946
6670A29946j3732J827k4098p6439R1298Q2305m0509P1720l3232l41750n9092K96012
6658H4256N1644j17654p333J71354q4716j5183K9036j67078m073o2411K11162
6647H9004o983q7811O794J01857l3942J2156R222m2075L6902J5198L4525l4987
6635I9860P8883r5463r039J39994l5880r7008j9829j16578m2481M1004R2336q4882
6623d9083j0585p7456l4317N6440J7745J03813M8956j88415r9374r305J88605
6612e2976P7370l9794L9294j13720m9379J38512R7115p1377J42385J8524j23520
6601F2434J56768j31613R0534J47226k60708k0346m8627k4327m256J7732l9444
6590e4627r1994Q5907J84788n3856q6233p7844P1088P1559J1029K3382m2466P5128
$$ plain form
6670 129946 116214 118041 93943 17504 108802 191107 150598 222318 189086 -152664 -211756 84256
6658 84256 135900 18246 10913 182267 97551 82368 111404 -55674 -59747 -122158 89004
6647 89004 82021 -5790 1004 102861 68919 81075 90297 48222 85124 100322 134847 99860
6635 99860 178743 83280 74241 214235 178355 81347 61518 -55060 -97541 -56537 35799 -49083
6623 -49083 -59668 -137124 -171441 -115001 -97256 6557 55513 -132902 -232276 -241581 -52976
6612 -52976 24394 -15400 23894 -89826 -139205 -693 96422 25045 167430 185954 62434
6601 62434 219202 87589 178123 325349 64641 44295 -4332 -28659 -32915 -15183 -54627
6590 -54627 -146621 -60714 124074 70218 -16015 -93859 -22771 48788 59817 83199 40733 115861
6578A15861j10052p5453N7087M9472L531L8270J06068k2006J3389M8211M0521
6567B64899k04252q3183J34553m7912j7750J03210l0957J1695p6040j35817K04990
6556A23436o5946o6098m7271J1346N5850P3609j0039p863J58303q7162j45867
6545g702P038J4578J18751l3147j6464j0728r5462q1096K1502m7913J15388Q3576
6533F8321m8263j569J42519N1885M3399q4659J01903j2771q1897p3572J12257
6522B17553n2729q833n6658j6015m3886R0532K4473K8651J05766j48546N124m5629
6510I9803j05244j51585K42755K0594j65827o950K5843l4930J77336O1139Q2373
6499B45307n9572K8224r5130j65684K700L0780O2155n0635Q8332Q3263j07232
$$ plain form
6578 115861 5809 -69644 -12557 36915 40446 78716 184784 162778 176167 224378 264899
6567 264899 60647 -22536 112017 64105 46355 149565 118608 130303 54263 -81554 123436
6556 123436 57490 -8608 -55879 -44533 11317 84926 74887 67024 225327 138165 -7702
6545 -7702 -664 13914 132665 99518 83054 72326 -23136 -104232 -82730 -130643 -15255 68321
6533 68321 20058 18489 161008 212893 256292 171633 273536 260765 178868 105296 217553
6522 217553 164824 155991 99333 83318 39432 129964 154437 183088 288854 140308 145432 99803
6510 99803 -5441 -157026 85729 106323 -59504 -66454 -40611 -75541 101795 162934 245307
6499 245307 185735 213959 118829 -46855 -44155 -13375 48780 -1855 86477 169740 62508
6488F2508J9218p0082O3993P3754j60939r4617J64769r872K25434j19898n8391
6477I5877j46237K19657R2635m3293J56977j41065J1385Q4053j72031L7672R6508
6466B92138j40573j1892P1672p7287j17050M9473J164O7402Q1889Q2227p5578
6455B23585j49990l2810Q7393m0768j38987K41741J59471L8096o111j00283m1645
6444B39692r211J6489K814q1550Q9510P404k1108N9747M4504J07587L3191J9093
6432E08162j82868J27395J3458l4845j23276j42616J02795N4419R5859L6380P8294
6421E33157J26585r1747m2305M0179m7761j2189n672l9641L9799L1767O2844j01586
6409D93430K8266M0390P7239k9285j25721k3413J28184j69604N433M9316P3968
$$ plain form
6488 62508 81726 11644 75637 149391 -11548 -106165 58604 48732 274166 154268 95877
6477 95877 -50360 169297 261932 218639 375616 234551 245936 329989 157958 195630 292138
6466 292138 151565 139673 211345 134058 17008 66481 67645 135047 216936 299163 223585
6455 223585 73595 40785 128178 87410 -51577 190164 349635 387731 381620 281337 239692
6444 239692 230481 246970 249784 168234 257744 265148 244040 303787 348291 455878 489069 508162
6432 508162 325294 452689 466147 431302 308026 165410 268205 322624 418483 454863 533157
6421 533157 659742 567995 525690 565869 518108 505919 500247 460606 500405 532172 595016 493430
6409 493430 521696 562086 639325 610040 484319 460906 589090 419486 424919 474235 548203
6398E48203K37599l5075L4681K61270m7574m4999Q7122r4196p6151j67624P8844
6387G82100k4273M6942R2148j50600j50990o3879j0218m6459j4533Q8909Q0685
6376F29832o4641N171J0164j3848n1090l2802O235J45686L5541j55901R3552J64422
6364G72321J5593J438j85394m4231O4536k2586k7698o3086k7917l6620R1008K43158
6352G80522r9050j22195M4417J07562o5704r622l9446k1451k8676Q1813K4700
6341F52870J6367o6418j8398O0302R3252k13275j24447P0404J3991L7780l4365
6330D88063J20932N8573J37894j54287n0343j22208K51194L2378n4084p1925k3623
6319F12564L848P2169J4894j72268J4007P7375J1288M4198P7068n4063p4118L7423
$$ plain form
6398 548203 785802 750727 785408 1046678 999104 954105 1041227 947031 870880 703256 782100
6387 782100 757827 804769 896917 746317 595327 531448 521230 474771 460238 549147 629832
6376 629832 565191 570362 580526 566678 515588 482786 489021 634707 670248 514347 607899 772321
6364 772321 787914 789352 603958 559727 624263 601677 573979 510893 482976 446356 537364 780522
6352 780522 681472 559277 603694 711256 645552 635930 596484 575033 546357 628170 652870
6341 652870 669237 602819 584421 644723 737975 524700 400253 470657 484648 522428 488063
6330 488063 608995 667568 805462 651175 600832 478624 729818 762196 708112 636187 612564
6319 612564 616412 688581 703475 531207 545214 622589 633877 678075 755143 701080 626962 664385
6307F64385O8012L2490l5670j178l0411J05173J56096n6959l9617j15700m2006
6296G04615R3903m7995J6039J7770K3785J0022Q7894R8118n6822p2624j5548J8010
6284H77167l9720J35546Q0907k6289J35587j7191J1463l7204r6850N3847R0644
6273A167907L9599R7528j43295j3351J16807m4688o5918J18960l4215M3929p0075
6262A213188o8912n7643j10627Q9282M2537N5593j3486n571L6558J71598J49866
6251A502383j93494J47621J26954j9115K00015J11570J24897k56807k11846m4579
6241A487599R1339q1735N4597m0437j20991r1202J04561P8695j30846m0337K05138
6230A516381J87714R900j52764l4747n881J17759J71201j33693k5684l7209n337
$$ plain form
6307 664385 732397 764887 729217 728039 697628 802801 958897 901938 862321 746621 704615
6296 704615 798518 750523 766562 784332 808117 818139 906033 1004151 947329 874705 859157 877167
6284 877167 837447 972993 1053900 1027611 1163198 1146007 1157470 1120266 1023416 1077263 1167907
6273 1167907 1207506 1305034 1161739 1148388 1265195 1220507 1154589 1273549 1239334 1283263 1213188
6262 1213188 1144276 1086633 976006 1065288 1107825 1163418 1149932 1144361 1180919 1352517 1502383
6251 1502383 1308889 1456510 1583464 1564349 1764364 1875934 2000831 1744024 1532178 1487599
6241 1487599 1578938 1497203 1551800 1511363 1390372 1299170 1403731 1482426 1351580 1311243 1516381
6230 1516381 1704095 1713995 1561231 1526484 1520603 1638362 1809563 1675870 1650186 1612977 1607640
6219A607640J86235R4K5355O021J8245L5896J22807N9849j44175q6415o2809N3839
6207A822582N4033j28843O3645J0262k360J697Q8992q9827m436J20207J02696
6196B038648J62377q2380j73478O4987K9577O9301q1177j28340K47282J26752
6186B273549j11648j0134N2427J62729J02604n3276J08585J6749n2936J00710
6176B589359O0551m5812O7896J18906J24856R6608J2517J66462j2613l4585j8632
6165C125513n9375J68132p0087N3237J34625K41916J08046J1382J07705J61447
6155C982541O7444o4334o853J24084k4986K40591j5147o0149J48741J38439J02162
6144D632533Q8169R1662J24618m3394K31845K39441O1891L513J29501K75739J7549
$$ plain form
6219 1607640 1793875 1793969 1819324 1825345 1843590 1879486 2002293 2062142 1917967 1831552 1768743 1822582
6207 1822582 1876615 1747772 1811417 1821679 1819319 1821016 1910008 1820181 1815745 1935952 2038648
6196 2038648 2201025 2118645 1945167 2010154 2039731 2109032 2027855 1899515 2146797 2273549
6186 2273549 2161901 2151767 2204194 2366923 2469527 2416251 2524836 2541585 2488649 2589359
6176 2589359 2649910 2604098 2671994 2790900 2915756 3012364 3024881 3191343 3178730 3144145 3125513
6165 3125513 3066138 3234270 3164183 3217420 3352045 3593961 3702007 3713389 3821094 3982541
6155 3982541 4049985 3985651 3978798 4102882 4077896 4318487 4303340 4243191 4391932 4530371 4632533
6144 4632533 4720702 4812364 4936982 4893588 5125433 5364874 5426765 5430278 5559779 5835518 5853067
6133E853067J23163K82429K85644J11432R5432J34237P3034L2457K22511K19620
6123G433026K07918J63366K02729N2246L43513K99469N7519J88170K06285L81352
6113I535593L31741L02249K85644L12473M11832M76251L32669K73027L00874N77414
6103A3139767M33049M98526N54287M72154M69097O94867Q93519Q54731R67583
6094A8977580J152691J346998J659622J733536J882807K359869K883936L444508
6086C5441547L991249M856251O081358P408523P822543O465899K598190k360924
6078G2304636n626021o783938o393611n173597l855286k851125j875818j396754
6070C8348486o04556L3719M63164Q78789J275194J868640K240596K968183L734929
$$ plain form
6133 5853067 5976230 6258659 6544303 6655735 6751167 6885404 6958438 6990895 7213406 7433026
6123 7433026 7640944 7804310 8007039 8059285 8402798 8702267 8759786 8947956 9154241 9535593
6113 9535593 9867334 10169583 10455227 10767700 11179532 11655783 11988452 12261479 12562353 13139767
6103 13139767 13572816 14071342 14625629 15097783 15566880 16261747 17155266 18009997 18977580
6094 18977580 20130271 21477269 23136891 24870427 26753234 29113103 31997039 35441547
6086 35441547 39432796 44289047 50370405 57778928 65601471 72067370 74665560 72304636
6078 72304636 66678615 59894677 53501066 48327469 44472183 41621058 39745240 38348486
6070 38348486 37743930 37777649 38240813 39119602 40394796 42263436 44504032 47472215 51207144
6061E1207144M623731N761870P118371Q793267J1216528J3161587J4451222J2209174
6053A28542894N172690m423589j1919924j5330225j4865884j2460634r884896
6046F4830432p188800n482598m129532l030927k139928j467758r67818m84225
6038C9938846l551M38658O57172J042009J373876K054425K665707L642582M775202
6029E6584926N616274O705419O012839K755699k321114o653945q503078q219731
6021E1977289o912019n540992m162769l495417k605662j968891j360478j349958
6013B4581103j018050o90340m52769k41389j18231m62741p39597q13848r32578
6004A9111560r18275q17000n25962m37432n78516l60985l41812l06896l44089
$$ plain form
6061 51207144 55830875 61592745 68711116 77504383 88720911 101882498 116333720 128542894
6053 128542894 133715584 129291995 117372071 102041846 87175962 74715328 64830432
6046 64830432 57641632 52159034 48029502 44998575 42858647 41390889 40423071 39938846
6038 39938846 39935295 40373953 41031125 42073134 43447010 45501435 48167142 51809724 56584926
6029 56584926 62201200 68906619 74919458 77675157 75354043 68700098 60197020 51977289
6021 51977289 45065270 39524278 35361509 31866092 29260430 27291539 25931061 24581103
6013 24581103 23563053 22872713 22419944 22178555 22060324 21597583 20857986 20044138 19111560
6004 19111560 18193285 17376285 16850323 16412891 15834375 15473390 15131578 14824682 14480593
5995A4480593l91585r6584L9301q0403l3452r7444n425K2343J6639K26783Q8003
5984A4168769K06855L20871J89607K60449J30234Q6648K02661k05827o9821K8532
5974A5318978p5285R2823K14907k3960J47656M1570M56374K62271K71204L99392
5964A7105930M37000M54057N77971L29038M90479N99777Q02597R97640J197685
5955B2992174J353201J361266J650594K044882K407800K730938L319694M069698
5947D1930247M748973N845833O889655P452124O425671K983552j551808n100793
5939F9623454o645436o177869m748735l928425k920294j818893j139108n67778
5931D1676916q2252O38721J170381J517994J784532K317677K670951L523854M649223
$$ plain form
5995 14480593 14089008 13992424 14031725 13951322 13917870 13820426 13815001 13837344 13853983 14080766 14168769
5984 14168769 14375624 14696495 14886102 15146551 15276785 15363433 15566094 15360267 15290446 15318978
5974 15318978 15243693 15336516 15551423 15527463 15675119 15716689 16173063 16435334 16706538 17105930
5964 17105930 17542930 17996987 18574958 18903996 19394475 19994252 20796849 21794489 22992174
5955 22992174 24345375 25706641 27357235 29402117 31809917 34540855 37860549 41930247
5947 41930247 46679220 52525053 59414708 66866832 73292503 76276055 74724247 69623454
5939 69623454 62978018 56800149 52051414 48122989 45202695 43383802 42244694 41676916
5931 41676916 41594664 42233385 43403766 44921760 46706292 49023969 51694920 55218774 59867997
5922E9867997N903067P286495Q961354J0866186J3249731J3934773J1159081M323662
5914A35552346n096043j1870167j4732380j4155117j1739776q791638o566807
5907F2600418n178812m152442l092244k194767j459225j089355m65446l37178
5899D4630949j60517L69356P31639J072195K114326K704335L464305M870409O078123
5890F5875120O550399M905099R79226l742593p059952p959385p520147o138054
5882D5889713m614933l597365k642263k368778k258019k088873j894945j645159
5874B4779378j462178j265269j095060j023366r55647p98389o93516o98958q36529
5865A5950466q79126p17832n95208p01979l37937l93993l99863k29821j56788
$$ plain form
5922 59867997 65771064 73057559 82018913 92885099 106134830 120069603 131228684 135552346
5914 135552346 130456303 118586136 103853756 89698639 77958863 69167225 62600418
5907 62600418 57421606 53269164 50176920 47982153 46522928 45433573 44968127 44630949
5899 44630949 44470432 44839788 45571427 46643622 48757948 51462283 54926588 59796997 65875120
5890 65875120 72425519 77330618 78309844 74567251 67507299 59547914 52027767 45889713
5882 45889713 41274780 37677415 35035152 32666374 30408355 28319482 26424537 24779378
5874 24779378 23317200 22051931 20956871 19933505 18977858 18179469 17485953 16786995 15950466
5865 15950466 15071340 14353508 13758300 13056321 12718384 12324391 11924528 11694707 11537919
5856A1537919n3372j25314p1198j66123j35622k05891k45736k08610l85827n07802
5846I432424l31411l11358m26546j52614r134j30768j92584m0921m7474j78140
5836G611474l15663k57450m28584j60041j91756j89990k74490j83783j29189n5774
5826E424754J4878j35060j48264j74366L499r7054j04690m9722r0675Q834j1699
5815D640435o1688j16824q065M6644M7994R7788J5449J38194K10201K19579Q9658
5804E319365K30847K97366P99324P21433N67519j37907o40748q51542q54303o62991
5794D788363l69076k87567m64170j35603k09849j34757k71701n784K7208N8248
5784B995312k1765j89168R4338k55466j73951M2420j666m2737K73707J54089j17953
$$ plain form
5856 11537919 11484547 11359233 11288035 11121912 10986290 10780399 10534663 10326053 9940226 9432424
5846 9432424 9101013 8789655 8363109 8210495 8201361 8070593 7878009 7837088 7789614 7611474
5836 7611474 7295811 7038361 6609777 6449736 6257980 6067990 5793500 5609717 5480528 5424754
5826 5424754 5439632 5304572 5156308 4981942 4985441 4888387 4783697 4733975 4643300 4652134 4640435
5815 4640435 4578747 4461923 4453858 4500502 4548496 4646284 4661733 4799927 5010128 5229707 5319365
5804 5319365 5550212 5847578 6646902 7368335 7935854 7797947 7157199 6305657 5451354 4788363
5794 4788363 4419287 4131720 3667550 3531947 3322098 3187341 2915640 2909856 2937064 2995312
5784 2995312 2973547 2784379 2878717 2623251 2449300 2491720 2490054 2447317 2721024 2875113 2757160
5773B757160j49714n6270r0077j70373j74342j87967K981o5935j9621J6714K3346
5762A885902j71735P747M1063r3575J38939p3160k61818J84584r5221K9225K4935
5751A616886j29467l0447N6687M8548k4234M1363J29218K5113n5422P9294k34117
5740A523422q6672P2523J96783j5977q3134Q3329K6694N4838R6728q0609l0429
5729A757496p6168Q8568m3883j47236J02766j31720j18932R5456o6603P314K66234
5718A733292J07950j69110m4475M4858O1309j492J79637J19244N8799L8521M4915
5707B173448J00105o0493j32765j0871K5937q7121j4047j30885l38645o8611n5536
5696A400516L8067M433m2470k38483j27843J0271N8255J65201K4613q0361j10309
$$ plain form
5773 2757160 2607446 2551176 2461099 2290726 2116384 1928417 1931398 1865463 1845842 1862556 1885902
5762 1885902 1714167 1721914 1762977 1669402 1808341 1735181 1473363 1657947 1562726 1591951 1616886
5751 1616886 1487419 1456972 1513659 1562207 1537973 1579336 1708554 1733667 1678245 1757539 1523422
5740 1523422 1436750 1509273 1706056 1690079 1606945 1690274 1716968 1771806 1868534 1787925 1757496
5729 1757496 1681328 1769896 1726013 1578777 1681543 1549823 1430891 1526347 1459744 1467058 1733292
5718 1733292 1841242 1672132 1627657 1672515 1733824 1732332 1911969 2031213 2090012 2128533 2173448
5707 2173448 2273553 2213060 2080295 2069424 2095361 2008240 1994193 1863308 1524663 1456052 1400516
5696 1400516 1438583 1443016 1400546 1162063 1034220 1044491 1102746 1267947 1292560 1212199 1101890
5685A101890J46304K08862M7649k3388r4447Q701K2320K3660k040j10851j37322
5674A191338J1688j35627p958r692q3373l3168J11997N2093K236j09470j12111
5663H77953N3574O6810J03573j30100L3168r2909j1298j19473Q8386j75031l3495
5652F61158j22206M6923L9439m547J1368K19428K0661q1675J8208k1184J54296
5641I41869J72554J3246j27116R3026q1832j96958O7261q683p8343j1653O464
5630G89835K7963p6360l6847M9305j08469Q4222k8580p5348J52563O5240p1827
5619G71697O629P2543R9268m4337J29L5656q4125j1294o6784J16377J25978Q0661
5607A102398n6045q3127Q094l3372R139o1800m5687m1446O066J21929j53814m9994
$$ plain form
5685 1101890 1248194 1457056 1504705 1481317 1386870 1395571 1417891 1441551 1439511 1328660 1191338
5674 1191338 1203026 1067399 1059441 1049749 966376 933208 1045205 1097298 1099534 990064 877953
5663 877953 931527 998337 1101910 971810 1004978 912069 900771 781298 869684 694653 661158
5652 661158 538952 585875 625314 620767 632135 851563 872224 790549 808757 787573 941869
5641 941869 1114423 1127669 1000553 1093579 1011747 814789 882050 873367 795024 783371 789835
5630 789835 817798 741438 704591 753896 645427 729649 701069 625721 778284 843524 771697
5619 771697 778326 850869 950137 905800 905929 941585 857460 846166 779382 895759 1021737 1102398
5607 1102398 1046353 963226 971320 937948 947087 885287 839600 798154 804220 926149 772335 722341
5595G22341J40889m2724O6701R4270n7450m9898K7598J81915J10993M9345P2285
5584A316265k80p0448N4465R3823l0178J76504K1017j00515j8215P633m8493j06077
5572A295501j8194q0116J45329P6608j1237J60547J1657M9200J5838r5383j161
5561A548589J01303L53449J99529K38683J20821M03914K47465K54365N88893P12262
5551D769273Q68724J070604J135745O51080k56157j140213j337915j097703q18387
5542C845051n02214m85625l52730j04954l44073K1000j27260k03222j0289p168
5532A728516j27464p6105N7617r4923O440N9629l2666M0003N9776l9056J326R3244
5520A676337J94103p7150O8872j15289j93607o2740k3153q5976j48106o4035K9651
$$ plain form
5595 722341 863230 820506 887207 981477 924027 874129 901727 1083642 1194635 1243980 1316265
5584 1316265 1315985 1245537 1300002 1393825 1363647 1540151 1561168 1460653 1442438 1450071 1401578 1295501
5572 1295501 1277307 1197191 1342520 1419128 1407891 1568438 1580095 1629295 1645133 1549750 1548589
5561 1548589 1649892 2003341 2202870 2441553 2562374 2966288 3213753 3468118 4057011 4769273
5551 4769273 5637997 6708601 7844346 8495426 8239269 7099056 5761141 4663438 3845051
5542 3845051 3342837 2857212 2504482 2399528 2055455 2076455 1949195 1745973 1735684 1728516
5532 1728516 1601052 1524947 1582564 1487641 1494081 1553710 1521044 1561047 1620823 1581767 1583093 1676337
5520 1676337 1870440 1793290 1862162 1746873 1553266 1490526 1467373 1381397 1233291 1169256 1198907
5509A198907j00987l9739p2604J7621k347O9697r578k9456q4798j72054n329M9565
5497H18898n4935l4510k0831j7668j13713J088M1958Q9381l8058j59941J21838
5486F33507L2306J1409L5906P4043l6908L6948k2402p0020n6786r2286M7632q4992
5474E08357o8168J59419O6806K404P888j33724j28538O0887K7595L6155p7498
5463D61583p0525N6801Q0361J75557j02556m0784M0752r0979k0165M4302J17290
5452F51637l0624j17002q2423J82380k2867r1482M3981O5661J3881k5711o2164
5441E25267N2369K1103l9626p8867l2686q0949J37737P0600J4036p9791p0457
5430D38736P2343J18969J3220k9002j4836K43973j08319J11723L7078j24497M482
$$ plain form
5509 1198907 1097920 1058181 985577 1003198 1000851 1070548 1060970 1031514 946716 774662 769333 818898
5497 818898 763963 729453 708622 690954 577241 578329 620287 709668 671610 511669 633507
5486 633507 665813 677222 713128 787171 750263 787211 764809 694789 638003 545717 593349 508357
5474 508357 440189 599608 666414 668818 676706 542982 414444 475331 502926 539081 461583
5463 461583 391058 447859 528220 703777 601221 560437 601189 510210 490045 534347 651637
5452 651637 621013 504011 421588 603968 581101 489619 533600 599261 613142 587431 525267
5441 525267 577636 598739 559113 480246 447560 366611 504348 574948 588984 509193 438736
5430 438736 511079 630048 643268 614266 599430 843403 735084 846807 883885 759388 763870
5419G63870k97j3404P2808J37044j79193j13492J82664j0584q6413o8658p2870
5408F11475q9261O1655R8976M0890L1993o0206J4261j83964M141O3487K4657K9646
5396F47750R1614r7470P0044k7357j14449R2020J65036j29596n2042K3652O061
5385F75263K9748J1061j14581P7932J6117K11022J12562p9673K4134J7142k8927
5374I51800J5916L2310m131M6318p9758k2307m0209K11R3172p525n6234Q1456
5362A011019O1534P7178j05029R2116J78833J28490q788K4692R9344Q9454K65909
5351A914752J64723J46225J54632J54669K18403K27454L2404O0207r7060m5581
5341B930828j49042k74184m8820l6222m473m2748N6516n8514k4383J01149O6456
$$ plain form
5419 763870 763573 750169 822977 960021 780828 667336 850000 839416 753003 684345 611475
5408 611475 522214 583869 682845 723735 755728 695522 709783 525819 529960 593447 618104 647750
5396 647750 739364 641894 711938 684581 570132 662152 827188 697592 645550 669202 675263
5385 675263 705011 716072 601491 679423 695540 906562 1019124 939451 963585 980727 951800
5374 951800 967716 1000026 995895 1042213 962455 940148 899939 900150 993322 985797 929563 1011019
5362 1011019 1072553 1149731 1044702 1136818 1315651 1444141 1435353 1460045 1559389 1648843 1914752
5351 1914752 2079475 2225700 2380332 2535001 2753404 2980858 3013262 3073469 2976409 2930828
5341 2930828 2781786 2507602 2458782 2422560 2418087 2375339 2431855 2373341 2348958 2450107 2516563
5330B516563J90175J89969J15319J39561K85454K42101K38570L65066L25178N73349
5320E181305P79679M30221M91793K75351k15177l66809n30286n41288n04322m07322
5310D593145k39457k73875j50769j07573q8824m1374q1393m2302O6501j20514
5300C513565J82403J13283J99889K50415L17144M47903K59957M13950O15269M25176
5290F738954N03793L82438l60449n82437o36615m23753n36263n68898l91676k65417
5280C859677k52052r601k64651k42092k71683Q8786j27183j38347J09131j85097
5270B566888j17459O5388M9601K39678K94464J44314R9185L3946K76734j31007
5260C521732k63030j67871k88471r3177j35183j30359L1114j50303m0238o3532
$$ plain form
5330 2516563 2706738 2896707 3012026 3151587 3437041 3679142 3917712 4282778 4607956 5181305
5320 5181305 5960984 6391205 6882998 7158349 6943172 6576363 6046077 5504789 5000467 4593145
5310 4593145 4353688 4079813 3929044 3821471 3732647 3691273 3609880 3567578 3634079 3513565
5300 3513565 3695968 3809251 4009140 4259555 4576699 5024602 5284559 5698509 6313778 6738954
5290 6738954 7242747 7625185 7264736 6682299 6045684 5621931 5085668 4516770 4125094 3859677
5280 3859677 3607625 3598024 3333373 3091281 2819598 2908384 2781201 2642854 2751985 2566888
5270 2566888 2449429 2514817 2564418 2804096 3098560 3242874 3342059 3376005 3652739 3521732
5260 3521732 3258702 3090831 2802360 2709183 2574000 2443641 2474755 2324452 2284214 2220682
5250B220682o9927l14370p3773k04563j40948j07837p2507K53732j19786l7883
5240A332820Q5456o8862k8852J00404N7156l1484L0939L04029M4243L5693J39977
5229B001519j33494j13573j96070j50881p687l8874j04656j08809M1196J3312
5219A201983k69625O520J34411q8816J27894j95678l4333J3515j63628P3473O46
5208H06362N6017R862K1980Q6512p1677l8061o4007K5042q7071j6522o2791J7225
5196F82871N463P5329p1152q4746N4333j12649P0942M1010N2489j10283k657J9709
5184F20659J00481k2431p5183p5168N8579L2716L8785l3116k37178Q8028Q1657
5173E77829L1185J4764J1523m6078p6223j1106m5316K8608j36644R858L9855O5827
$$ plain form
5250 2220682 2150755 1836385 1762612 1558049 1417101 1309264 1236757 1490489 1370703 1332820
5240 1332820 1418276 1349414 1320562 1420966 1478122 1446638 1477577 1781606 1825849 1861542 2001519
5229 2001519 1868025 1754452 1558382 1407501 1399814 1360940 1256284 1147475 1188671 1201983
5219 1201983 932358 938878 1073289 984473 1112367 916689 882356 895871 732243 805716 806362
5208 806362 862379 872241 894221 980733 909056 870995 806988 832030 744959 728437 665646 682871
5196 682871 688334 763663 692511 607765 662098 549449 620391 661401 713890 603607 600950 620659
5184 620659 721140 698709 623526 548358 606937 639653 678438 645322 408144 496172 577829
5173 577829 609014 623778 635301 589223 513000 501894 456578 485186 348542 358400 398255 464082
5161D64082J12175L261j65722j2656J29185Q607m6669k16189J17222O2012l8147
5150D17161K5041L2026J01224n7117J770j00655O1607J59437Q223j3375m5693
5139E89649j32705O1857J07093j31395O1834o4751J5933O4752q166l3464R2995
5128F23632j57633K723J73172j72402K4199J55597o33J09329Q1357J30562j7668
5117I52235j89005j04731Q5538M545l5254R6937J45889j37586p6932J79377P9638
5106A000651J05757k7633l4994K76824J83293J10258J03228K26194L85425L81423
5096B710426J09406k48841l58708m74249k40742j01159k257j23357l36804j3477
5086I20238N2220j93655N327K1588l615l5743q9968o3533J41184j12368k1585
$$ plain form
5161 464082 576257 579518 413796 401140 530325 538932 492263 276074 393296 455308 417161
5150 417161 442202 474228 575452 518335 520105 419450 481057 640494 648717 635342 589649
5139 589649 456944 518801 625894 494499 556333 491582 507515 572267 564101 530637 623632
5128 623632 465999 468722 641894 469492 493691 649288 648655 757984 839341 969903 952235
5117 952235 763230 658499 744037 748582 713328 810265 956154 818568 741636 921013 1000651
5106 1000651 1106408 1078775 1043781 1320605 1503898 1614156 1717384 1943578 2329003 2710426
5096 2710426 2819832 2570991 2212283 1738034 1497292 1396133 1393876 1270519 933715 920238
5086 920238 972458 778803 784130 805718 802103 766360 676392 612859 754043 641675 620090
5075F20090k7824k2364p8781O2872R1261p500J45279j24412n0816p5212m3247
5064D89346m522R3470J31819J11750j00005j32269n0625M4752P0116M8874J8146
5053G20852J6730P0074O2607J7326N1343j69557l0953J90117j82382N5223j24651
5042F76729J75361J10497P9499j43650j75061J10844N7152l4825m7031j27237
5032F82278K1474N0207k1614K65860M1970j77583J1938Q6312L4385r4922N6206
5021I56511p6098j05333M2002J46787l8278M8128j03531l7144j35789p5828Q6015
5010G07442O2430J88322m6645O5115O3537J2455M8118j4353L1601O3438j80045
4999A001415l1061j6258O9394j13313K73012J84753j15981l0935j4155J37381
$$ plain form
5075 620090 592266 569902 491121 553993 645254 637754 783033 658621 607805 532593 489346
5064 489346 484824 578294 710113 821863 721858 589589 538964 583716 653832 702706 720852
5053 720852 737582 807656 870263 887589 938932 769375 738422 928539 746157 801380 676729
5042 676729 852090 962587 1042086 898436 723375 834219 891371 856546 809515 682278
5032 682278 703752 753959 732345 998205 1040175 862592 874530 960842 995227 900305 956511
5021 956511 880413 775080 817082 963869 925591 973719 870188 833044 697255 621427 707442
5010 707442 769872 958194 911549 976664 1040201 1052656 1100774 1086421 1118022 1181460 1001415
4999 1001415 970354 954096 1023490 910177 1183189 1367942 1251961 1221026 1206871 1344252
4989A344252m0361m8970N2764n0541J50727p994J7568M0352J42572k36523r3709
4978A270137O090L5616L6480P5497L5408Q9947J03436p1135O4168M4987Q375n6326
4966A642680N5173j48500J00103m5186J2106M787L5939N3100j1900J24442o2995
4955A759749K6405m3357P9383J6890J67707k1880j98220Q6908J52371p6639R8430
4944B047747J18468j57017m3423J68185j1485Q1343L3680j24319O610j8258l34
4933B101197N1108m2569k1577O6098O6607m6414J09575p8252j39195L7241R8438
4922B202257K8905P6428J1243N9845J53830q0997n5430J22430P8722K31969K6514
4911B855716j03068P8452j36154N3264J57687R1625J29408J82223Q6077L282q2584
$$ plain form
4989 1344252 1303891 1254921 1307685 1257144 1407871 1399877 1417445 1457797 1600369 1363846 1270137
4978 1270137 1276227 1311843 1348323 1423820 1459228 1549175 1652611 1581476 1645644 1690631 1699006 1642680
4966 1642680 1697853 1549353 1649456 1604270 1616376 1621163 1657102 1710202 1698302 1822744 1759749
4955 1759749 1786154 1742797 1822180 1839070 2006777 1984897 1786677 1873585 2025956 1949317 2047747
4944 2047747 2166215 2009198 1965775 2133960 2122475 2203818 2237498 2113179 2119789 2101531 2101197
4933 2101197 2152305 2109736 2088159 2154257 2220864 2174450 2284025 2205773 2066578 2103819 2202257
4922 2202257 2231162 2307590 2318833 2378678 2532508 2451511 2396081 2518511 2597233 2829202 2855716
4911 2855716 2752648 2831100 2694946 2748210 2905897 2997522 3126930 3309153 3395230 3398512 3315928
4900C315928J00616k4172P8727O4318P671j02706J67478J39415L3807M7743J35415
4889C964240O6858Q3753O9327J60280p457q2944m050K30299K14867L0613L4349
4878D760135K64814J85437J23232o929J64752L00889O3490K13095M24678J84239
4868F677832K14852J65608K74650L03856J68074K44517L24494L20166J75149J73028
4858I042226K39905L21039L29612K15328L62925K22835Q6499K65199K20854j2757
4848A1293665K77326J93599r4577K31882J77141L41369K02459L53513P5007R6961
4838A3148345L16817L15288M55081L67381L29849K20254L39240N15083L59903
4829A6367241M38714L48759N49525M93544P81605P80617O61588N12730Q48876
$$ plain form
4900 3315928 3416544 3392372 3471099 3535417 3543088 3440382 3607860 3747275 3781082 3828825 3964240
4889 3964240 4031098 4114851 4184178 4344458 4337001 4254057 4250007 4480306 4695173 4725786 4760135
4878 4760135 5024949 5210386 5333618 5326689 5491441 5792330 5855820 6068915 6493593 6677832
4868 6677832 6892684 7058292 7332942 7636798 7804872 8049389 8373883 8694049 8869198 9042226
4858 9042226 9282131 9603170 9932782 10148110 10511035 10733870 10820369 11085568 11306422 11293665
4848 11293665 11570991 11764590 11670013 11901895 12079036 12420405 12622864 12976377 13051384 13148345
4838 13148345 13465162 13780450 14235531 14602912 14932761 15153015 15492255 16007338 16367241
4829 16367241 16805955 17154714 17704239 18197783 18979388 19760005 20421593 20934323 21783199
4820B1783199R64755P40220J150675J300917J235128J378817J509940J689368
4812C1753019J823342J818293J696805J315774J149572J145818J279092J554847
4804D3536562J567259K161311K711838L169901L873052M976430O334871P744981
4796G6076205Q141162O820709N906708P087060R799586J3467985J6744304K1660946
4788A65704665K6624070L4076660M7288386O6421119P4850256L8183304k9592143
4781D23556317p0454158p2800972o0936340m3549241l0272159k2565469j7004305
4774A05973673j3199151j0824957q666903p207719n660945m677950l826921l226669
4766D8682458l083455k982495k561944k363817k189594k042146k072749k030024
$$ plain form
4820 21783199 22747954 23488174 24638849 25939766 27174894 28553711 30063651 31753019
4812 31753019 33576361 35394654 37091459 38407233 39556805 40702623 41981715 43536562
4804 43536562 45103821 47265132 49976970 53146871 57019923 61996353 68331224 76076205
4796 76076205 84217367 91038076 96944784 104031844 113831430 127299415 144043719 165704665
4788 165704665 192328735 226405395 273693781 340114900 414965156 453148460 423556317
4781 423556317 353102159 280301187 219364847 175815606 145543447 122977978 105973673
4774 105973673 92774522 81949565 73282662 66074943 60413998 55736048 51909127 48682458
4766 48682458 45599003 42616508 40054564 37690747 35501153 33459007 31386258 29356234
4758B9356234j756287j362339j200014j038162j047645r53655j067880q63004
4750B0067248o34182q79249p29560o84569p06332o11987o28751o75163n21489
4741A3995966m81525o17392l49129k84328m08920m60655l02818k80546l93952
4732A0416701j98499k59226m53649j63913k80290l68183k50785j78992k61185
4723H001979k51458k58723J5495q5445l36578j31632q6248m0874k47313k59662
4713F319541k20688j50671k1727k43748k94450o2842j47932l27691k4811j18914
4703D706067p2755j54970p4733Q9812k33475r1661R4060j6818j25079k6545J69567
4692D263470j06651j91159j47500j09792r8040J04716P0866j15412k154q001j06426
$$ plain form
4758 29356234 27599947 26237608 25037594 23999432 22951787 21998132 20930252 20067248
4750 20067248 19433066 18553817 17824257 17139688 16433356 15821369 15192618 14517455 13995966
4741 13995966 13514441 12897049 12547920 12263592 11854672 11394017 11091199 10810653 10416701
4732 10416701 10218202 9958976 9505327 9341414 9061124 8692941 8442156 8263164 8001979
4723 8001979 7750521 7491798 7507293 7421848 7085270 6953638 6867390 6826516 6579203 6319541
4713 6319541 6098853 5948182 5926455 5682707 5388257 5325415 5177483 4849792 4824981 4706067
4703 4706067 4633312 4478342 4403609 4493421 4259946 4168285 4262345 4245527 4120448 4093903 4263470
4692 4263470 4156819 3965660 3818160 3708368 3610328 3715044 3785910 3670498 3668344 3660343 3553917
4681C553917r0190k65806L6030k16763j61108N701N0379n7610k86594q1102J13651
4670B600505K9309j86820k08424N8927M707j18447Q475p7489q4035M4969L1292
4659B102969J21288K5472q3898n9087r7593o6620m5082J72683L7347m3997j47310
4648A916172J47791P3819N2869J81199K3440j159R5561j2542k04833P8278M29726
4637B780321J58111j41428k20488l39706k45086k12183k17939j48478N4366K4658
4627A492148k6907q221p3217j71389j34981J17133M978R1427m3151l0994N1181
4616A268007n201K7136k4853q99J00838j49795q6590Q9504j23528m5857K00729
4605A249491M5486M8845n8072l1572n7962J1680j08539j3541n6399J8032j329
$$ plain form
4681 3553917 3463727 3197921 3233951 3017188 2856080 2861781 2912160 2854550 2567956 2486854 2600505
4670 2600505 2629814 2442994 2234570 2293497 2298204 2179757 2188232 2110743 2026708 2071677 2102969
4659 2102969 2224257 2249729 2165831 2106744 2009151 1942531 1897449 2070132 2107479 2063482 1916172
4648 1916172 2063963 2137782 2190651 2371850 2395290 2394131 2489692 2477150 2272317 2350595 2780321
4637 2780321 2938432 2797004 2576516 2236810 1991724 1779541 1561602 1413124 1467490 1492148
4627 1492148 1465241 1457020 1383803 1212414 1077433 1194566 1199544 1290971 1247820 1216826 1268007
4616 1268007 1262806 1289942 1265089 1264190 1365028 1215233 1128643 1218147 1094619 1048762 1249491
4605 1249491 1294977 1343822 1285750 1254178 1196216 1207896 1099357 1085816 1029417 1047449 1046120
4594A046120l6756p3353l3520n3748O6420P0453k16786L0643r668j474J01502
4583H89833K7457m8830j85017J7093K38822Q5871o8514k68362K8988N8757J02066
4572H78164J2030r7457j30604R3393J49556j19458q9439q7519J31678m1444M8958
4561G47858P4494Q4257l4226N0986p861p8140K7623N2907Q7465p8062k6710J604
4549I02195j646M7519N4607j26197j44922l0073J38518O1717K1797O380J50606
4538A080501k130N8302l0937p1028r9614M0378n3694M4170j9860N3610k8253J3264
4526I84709J9900j37237L2189l1897j09278P3523J1937j5439n3008M0297j9002
4515G96694q435J21494J08288p4092l6162J42252m2226q8671K5184K29038N2215
$$ plain form
4594 1046120 1009364 936011 902491 848743 915163 985616 768830 799473 789805 788331 889833
4583 889833 917290 868460 683443 700536 939358 1025229 956715 688353 717341 776098 878164
4572 878164 890194 792737 662133 755526 905082 785624 696185 608666 740344 698900 747858
4561 747858 822352 906609 872383 923369 915508 837368 864991 917898 1005363 927301 900591 902195
4549 902195 900549 948068 1002675 876478 731556 701483 840001 901718 923515 929895 1080501
4538 1080501 1078371 1136673 1105736 1034708 935094 975472 921778 965948 946088 999698 971445 984709
4526 984709 1004609 867372 899561 867664 758386 831909 843846 828407 775399 815696 796694
4515 796694 788259 909753 1018041 943949 907787 1050039 1007813 919142 944326 1173364 1225579
4504A225579N4552k94020n2050J27996L5659J37500M854j02522o7191J49399J06676
4493A326432O6147r2379j8560P5263k8250p642k1798R7820J81982P127j05443
4482A480699J11328L9359J2216J9837j59264L903Q8213J83739M0923j0783J30891
4471A941061Q1985K97995L46247K44139K62594K47925j65734n58174k52869j82465
4461B262704k33245p7259j53435j75790P8417J04406r9511L5052J0493K3989Q4860
4450A860681K09523j59277J05538J51805k9225O4314L45740K28783J75435M01894
4440C355211J11078J14103p3892l26102j45640k47195j41630j99524j82751j43230
4430B120428j50365K4543J6255q844Q4932m9885j70800j3369l1819L3306M987
$$ plain form
4504 1225579 1280131 986111 934061 1062057 1097716 1235216 1240070 1137548 1070357 1219756 1326432
4493 1326432 1392579 1300200 1281640 1356903 1328653 1321011 1299213 1397033 1579015 1586142 1480699
4482 1480699 1592027 1631386 1643602 1663439 1504175 1508078 1596291 1780030 1820953 1810170 1941061
4471 1941061 2023046 2321041 2667288 2911427 3174021 3421946 3256212 2698038 2445169 2262704
4461 2262704 2029459 1952200 1798765 1622975 1701392 1805798 1706287 1741339 1751832 1775821 1860681
4450 1860681 2070204 1910927 2016465 2168270 2139045 2203359 2549099 2777882 2953317 3355211
4440 3355211 3466289 3580392 3506500 3180398 3034758 2787563 2645933 2446409 2263658 2120428
4430 2120428 1970063 1994606 2010861 2002017 2086949 2037064 1866264 1852895 1821076 1854382 1859369
4419A859369Q3783J202K43801j9995j44049n7398O617l0378R3993K8795o2464
4408B003276p1969k7433l1399K47867j3198q0428Q8883p1216n1863l319K9939
4397B019140O5164o5971K34953J26942j12755K07939Q5957J00309O0342J33512
4387B855532J34875J45432L3269p4351R6481J26669k06234j41071k8416m2276
4377B899910j68919Q3220j15728J391l7160j16062J3166m6582o5649j16354J65125
4366B496358o585q0939m7238N7302O3555P7550n7312r5041J17512n6075Q4815
4355B553902J26926L7744j26034L1551P7685j32087N6230K3960j5892j5894R246
4344B627337J42837Q8274N8601J9775Q2098q7202j5740j5542N8362J02499Q1996
$$ plain form
4419 1859369 1943152 1944354 2188155 2168160 2024111 1966713 1973330 1942952 2036945 2065740 2003276
4408 2003276 1931307 1903874 1872475 2120342 2107144 2026716 2115599 2044383 1992520 1989201 2019140
4397 2019140 2084304 2018333 2253286 2380228 2267473 2475412 2561369 2661678 2722020 2855532
4387 2855532 2990407 3135839 3169108 3094757 3191238 3317907 3111673 2970602 2942186 2899910
4377 2899910 2730991 2814211 2698483 2699874 2662714 2546652 2559818 2513236 2447587 2331233 2496358
4366 2496358 2489773 2408834 2361596 2418898 2482453 2560003 2502691 2407650 2525162 2469087 2553902
4355 2553902 2680828 2718572 2592538 2624089 2701774 2569687 2625917 2649877 2633985 2618091 2627337
4344 2627337 2770174 2858448 2917049 2936824 3018922 2931720 2915980 2900438 2958800 3061299 3143295
4333C143295n896J25702P4118j77211j32157m7082L939Q6933O7387K355P308j11992
4321C036699K8604M1455l842J12195K34912K8266Q1672O2525q762Q6177P4044
4310C773945K6831J04900M3488M5061q2906n38K72727l5180j11663r4858m5144
4299C896663Q2757J73303L9233j5630J0333J0864J04405Q0678l9120l3529n5941
4288D254016r028R8761j24628j0255M956L3479K09951N3645L4943O5793J33696
4277D745329J5323K08267P9872J26946M9346j44343K60026J08899J0862J01740
4267E562267K25388J32801L2250Q7113J7212O2293K31250J28331J05534p0256
4257F514183K00439N4529L50719K53330L970Q9434K17687O1536J08548K90981
$$ plain form
4333 3143295 3137399 3263101 3337219 3160008 3027851 2980769 2984708 3071641 3139028 3141383 3148691 3036699
4321 3036699 3065303 3106758 3102916 3215111 3450023 3478289 3559961 3622486 3613724 3699901 3773945
4310 3773945 3800776 3905676 3949164 3994225 3911319 3910781 4183508 4148328 4036665 3941807 3896663
4299 3896663 3979420 4152723 4191956 4176326 4186659 4197523 4301928 4382606 4343486 4309957 4254016
4288 4254016 4244988 4343749 4219121 4208866 4213822 4247301 4457252 4510897 4545840 4611633 4745329
4277 4745329 4760652 4968919 5048791 5175737 5225083 5080740 5340766 5449665 5460527 5562267
4267 5562267 5787655 5920456 5952706 6039819 6057031 6119324 6350574 6478905 6584439 6514183
4257 6514183 6714622 6769151 7119870 7373200 7377170 7466604 7684291 7745827 7854375 8145356
4247H145356k9577N9868L27017J01687J08959L00911K04446L15582K87454K95750
4237A0117453L46658L63643L08690J97385L65502L28501L85664L54201K82639
4228A3050336K27780M47203L33121L83116K48293M72759L05284J86056L51358
4219A6005306K91792L66251L10653M34153L17910L17240M81885M18306M57674
4210A9401170N62462O19992O40006J45154K89170L95204L84460M40659M89841
4201B3368118N43268O94040P78020P44709P00045R38597Q71400J049061J130749
4192C0818007J225780J318139J556104J643972J846962K117846K439218K927387
4184D5893415L303779L286109L116645K419942J487090N16938J78892K14868N48601
$$ plain form
4247 8145356 8115779 8175647 8502664 8604351 8713310 9014221 9218667 9534249 9821703 10117453
4237 10117453 10464111 10827754 11136444 11333829 11699331 12027832 12413496 12767697 13050336
4228 13050336 13278116 13725319 14058440 14441556 14689849 15162608 15467892 15653948 16005306
4219 16005306 16297098 16663349 16974002 17408155 17726065 18043305 18525190 18943496 19401170
4210 19401170 19963632 20583624 21223630 21368784 21657954 22053158 22437618 22878277 23368118
4201 23368118 23911386 24605426 25383446 26128155 26828200 27766797 28638197 29687258 30818007
4192 30818007 32043787 33361926 34918030 36562002 38408964 40526810 42966028 45893415
4184 45893415 49197194 52483303 55599948 58019890 59506980 60023918 60202810 60417678 60966279
4175F0966279Q42452J138700J525741J913590K486125L003140L749056M744210
4167H0369293N562021O587293P448081Q516089R818312J1804538J4502517J7733481
4159A62341625K1498933K6153792L1520960L8512150M7099462N5870253N6837169
4152D39834344L8332981J838373l6961196o0558164o2890298n2891661m0129923
4145B26574456k8857702k0962576j6116057j3428396j1554044j0097140q220327
4138A17338214n969515l764805k355175j126900q5151J386545K969258M680154
4130A13072625N891909N874168L904565N01243l817114p869212j0334055j0479285
4122I6744844r320464p799590o475411n219407m116005l306951k712669k056535
$$ plain form
4175 60966279 61808731 62947431 64473172 66386762 68872887 71876027 75625083 80369293
4167 80369293 85931314 92518607 99966688 108482777 118301089 130105627 144608144 162341625
4159 162341625 183840558 209994350 241515310 280027460 327126922 382997175 439834344
4152 439834344 478167325 480005698 443044502 382486338 319596040 266704379 226574456
4145 226574456 197716754 176754178 160638121 147209725 135655681 125558541 117338214
4138 117338214 111368699 107603894 105248719 104121819 104036668 105423213 108392471 113072625
4130 113072625 118964534 124838702 128743267 129244510 125427396 117558184 107224129 96744844
4122 96744844 87424380 79624790 73149379 67929972 63813967 60507016 57794347 55737812
4114E5737812j697890j739472j100835o22358k27104L53845R34754J609986K312983
4105E5561721L072624L727898M622841M998296L915697J078980k316049n365257
4097F9296751o920859p056848o303393m968165m046904l082171k672476k201441
4089C2044494j743412j318757j241624j015232r51104n66860n47080m21265l3526
4080B4205634J35514K76422L24473O36816Q23537R30691M75760j17757p52624
4071B6938466j470780k073457j832515j713576j510075j014820r26637o92694
4063A5703912l49134n13164l52516n48487m64973n32216m11491n94130o02888
4054A1334913m52903k96219n15939m98945l25787l93011j99642j88481j24041
$$ plain form
4114 55737812 54039922 52300450 51199615 50577257 50350153 50703998 51638752 53248738 55561721
4105 55561721 58634345 62362243 66985084 71983380 75899077 76978057 74662008 69296751
4097 69296751 62375892 55319044 49015651 44047486 40000582 36918411 34245935 32044494
4089 32044494 30301082 28982325 27740701 26725469 25774365 25207505 24660425 24239160 24205634
4080 24205634 24341148 24617570 24942043 25578859 26402396 27333087 27808847 27691090 26938466
4071 26938466 25467686 23394229 21561714 19848138 18338063 17323243 16396606 15703912
4063 15703912 15354778 14841614 14489098 13940611 13475638 12943422 12531931 11937801 11334913
4054 11334913 10882010 10585791 10069852 9570907 9245120 8852109 8652467 8463986 8339945
4045H339945k06385k84515k02503l0975m1695j25780j83688j14540j9654m7913
4035G082297j31126J45667j6706K8881j39723q9606o3727j98969j32729l5565
4025F448694j88056j32754q6499O4986P1286o2034j05011N0884R8485k945M0401
4014F197437j33824k2182P3413P3802J08138Q2938K5460j45341J68731K09538
4004F638110k21854p7434j14567m258j54896j71923l0349j81377Q0889m705j8647
3993E738989j41980P1490J21898J95273K79312O1878K05375K68669M21650K28604
3983G451158J18258K26671L65819K75465k24094l82296m33144n00179l67895k05284
3973F324479q7363o6573l382n3317k02098k6139N067J38344K05631M8441K66430
$$ plain form
4045 8339945 8133560 7849045 7646542 7615567 7573872 7448092 7264404 7149864 7130210 7082297
4035 7082297 6951171 7096838 7080132 7109013 6969290 6879684 6815957 6616988 6484259 6448694
4025 6448694 6260638 6127884 6041385 6106371 6177657 6115623 6010612 6061496 6159981 6157036 6197437
4014 6197437 6063613 6041431 6114844 6188646 6296784 6379722 6405182 6259841 6428572 6638110
4004 6638110 6416256 6338822 6224255 6219997 6065101 5893178 5862829 5681452 5762341 5757636 5738989
3993 5738989 5597009 5668499 5790397 5985670 6264982 6326860 6532235 6800904 7222554 7451158
3983 7451158 7569416 7796087 8161906 8437371 8213277 7830981 7397837 6897658 6529763 6324479
3973 6324479 6237116 6170543 6167161 6113844 5911746 5885607 5890674 6029018 6234649 6283090 6549520
3962F549520L04465J76427M39332M95083M73225M64722M10600K84487J43810L68562
3952A0110233N48006O96499P75687N80739j04769l06246o96106p83723p44988
3943A0075332q53739j017140o25712m20145l39553k48781k65764p7852k36192
3934E990454m0496J72461J18361j2471M13434o9923o4025K3650J832k7482j04753
3923F401042p8401J26731r8314k61915k82002j45807j36060k42311r4060j2011
3913E176892J51998j67801r2600k06254j60458j58475j04757N2529k4389R4896
3903D561581k2481Q5439J02771N7097L5206K17755J98303J91187L83463J13721
3893E924042j70779m53675k24789l21675k24938k83178k06540n9111j55830j84892
$$ plain form
3962 6549520 6853985 7030412 7469744 7964827 8438052 8902774 9313374 9597861 9741671 10110233
3952 10110233 10658239 11354738 12130425 12711164 12606395 12300149 11604043 10820320 10075332
3943 10075332 9221593 8204453 7578741 7158596 6819043 6570262 6304498 6226646 5990454
3934 5990454 5949958 6122419 6240780 6228309 6641743 6571820 6507795 6531445 6533277 6505795 6401042
3923 6401042 6322641 6449372 6351058 6089143 5807141 5661334 5525274 5282963 5188903 5176892
3913 5176892 5328890 5161089 5068489 4862235 4701777 4543302 4438545 4491074 4466685 4561581
3903 4561581 4539100 4624539 4727310 4784407 4819613 5037368 5235671 5426858 5810321 5924042
3893 5924042 5753263 5299588 5074799 4753124 4528186 4245008 4038468 3979357 3823527 3638635
3883C638635r139n5436j14510O7240L403J47344n3246j2339J95946P6591J11998
3872C996487J39569K65826J64251L18858J70348K43072J6957L0183K04490M8053
3862E598094K21387j41257j18800l39226m10147m56043l39147k55724q5561j90656
3852C482920j25352j30349o6244P9490m4432j4264j15347M1685P135K7843j1553
3841C131532m7394Q2204K44833j18968j30356k5238K0701P9570Q8430j29163j31720
3830C064431r2988o7488l8595p9389n6277j47595r6532q0232n4827m1079K36361
3819B545790p4948j62838P7787k3336k4722R7977L6852J53968p0560n8666K89358
3808B786662L1311M8309J65291j3204n1083J54167P555p1146j40673j36712l6324
$$ plain form
3883 3638635 3629496 3574060 3459550 3526790 3530193 3677537 3624291 3611952 3807898 3884489 3996487
3872 3996487 4136056 4401882 4566133 4884991 5055339 5298411 5315368 5345551 5550041 5598094
3862 5598094 5819481 5678224 5559424 5220198 4810051 4354008 4014861 3759137 3673576 3482920
3852 3482920 3357568 3227219 3160975 3240465 3196033 3181769 3066422 3108107 3115242 3143085 3131532
3841 3131532 3084138 3166342 3411175 3292207 3161851 3136613 3157314 3236884 3325314 3196151 3064431
3830 3064431 2971443 2903955 2865360 2785971 2729694 2582099 2485567 2405335 2350508 2309429 2545790
3819 2545790 2470842 2308004 2385791 2362455 2337733 2435710 2472562 2626530 2555970 2497304 2786662
3808 2786662 2817973 2866282 3031573 3018369 2967286 3121453 3129008 3057862 2917189 2780477 2744153
3797B744153m39j02041J1850k3544L42032M5792p4632K21838q5830j6969N1171
3786C113381M7886J13488j41805k6135K62320r91J39197J51544J79680J86901
3776D025466o576j12117K25782J76009Q1224J03880J85316J91859J63337K02803
3766E236983L35149M19525M11090L67546O06218O37516P85342O35286M73846P36877
3756A0645378O74504Q39361J142236J628287J991383K100704Q03441L05619L43457
3747B0474370q27658j561390j020492n67330j51593K22739j05340n52007j285282
3738A4626017j281433j155400j019282j135672j026733p10903o71983o94364o58270
3729F271977m42771o03411n22929m06678j29368k15941j45920k6694k13855j56824
$$ plain form
3797 2744153 2743714 2641673 2653523 2629979 2972011 3017803 2943171 3165009 3079179 3062210 3113381
3786 3113381 3161267 3274755 3132950 3106815 3369135 3368144 3507341 3658885 3838565 4025466
3776 4025466 4018890 3906773 4132555 4308564 4389788 4493668 4678984 4870843 5034180 5236983
3766 5236983 5572132 5991657 6402747 6770293 7376511 8014027 8799369 9434655 9908501 10645378
3756 10645378 11319882 12159243 13301479 14929766 16921149 19021853 19825294 20130913 20474370
3747 20474370 19646712 18085322 17064830 16497500 16345907 16568646 16463306 15911299 14626017
3738 14626017 13344584 12189184 11169902 10034230 9007497 8296594 7624611 6930247 6271977
3729 6271977 5829206 5225795 4702866 4296188 4166820 3950879 3804959 3778265 3564410 3407586
3719C407586j81243l00328k77564j97676j87626K27970m1550j57075M4794j59699
3709B177589k86187p2705P4993P739N0345m1623r7139q9933j7627j49453K2428
3698A578427J77006k9373n8550p6171j64758K9097n4753o7530M8381O7329Q4173
3687A533278j06155P5642p6133j83351l4979L2160k14599J00491L6158j69154
3677I93358j9263K3759J24790j32446r3645M2569n3990L7581J3204k7315M4452
3666I53054m5930M6523p7279M2735Q3861r7910j48433k5415p7016J20536J50132
3655I24858j12410J6003l8241M105L4921r629k18109P1438K2667Q6462j3851k0348
3643G47866M338O0234j36240o4052J08096j88507J00243p1279N633k53781Q6446
$$ plain form
3719 3407586 3226343 2926015 2648451 2450775 2263149 2491119 2449569 2292494 2337288 2177589
3709 2177589 1891402 1818697 1893690 1901429 1951774 1910151 1813012 1723079 1705452 1555999 1578427
3698 1578427 1755433 1726060 1667510 1591339 1426581 1455678 1400925 1333395 1381776 1449105 1533278
3687 1533278 1427123 1502765 1426632 1243281 1208302 1240462 1025863 1126354 1162512 993358
3677 993358 974095 997854 1122644 990198 896553 939122 885132 922713 935917 908602 953054
3666 953054 907124 953647 876368 919103 1002964 905054 756621 731206 654190 774726 924858
3655 924858 812448 828451 790210 794315 829236 819607 601498 672936 695603 782065 768214 747866
3643 747866 752204 812438 676198 612146 720242 531735 631978 560699 566332 312551 398997
3632C98997J90216k552o3234N9906L3642o7951q466N786j81869K7767n600j3457
3620C73185R4936M8794J53747n3753j57320K7096N6537r0430j60243J16717L2731
3609D41997n8399R9086k74999N1789M3462k091N6141j66258M9371j671J2680j0687
3597B40421L1428N9208l311k2912o9659q2001O0082Q1837j18281J3329j447J4757
3585B03451n6966Q8980R789j5621J49279P6789j7626r2538o4524P223p6104k2835
3573A89297P2014l4831j29760J43045l5986M8988J93179m8778o4393Q297j34239
3562B06833J37467P7783l5120k5621q1238M5591L2089L4167R852j95771j5057
3551A90975N8828l2246k8912K5996Q338j639O1261L9374M9373K5303J15460j8112
$$ plain form
3632 398997 589213 586661 523427 583333 616975 549024 540558 546344 364475 392242 386642 373185
3620 373185 468121 516915 670662 616909 459589 486685 543222 452792 292549 409266 441997
3609 441997 383598 482684 207685 259474 302936 300845 356986 190728 240099 238428 251108 240421
3597 240421 271849 331057 327746 304834 235175 153174 213256 295093 176812 190141 188694 203451
3585 203451 146485 235465 245254 229633 378912 455701 438075 345537 281013 288236 212132 189297
3573 189297 261311 226480 96720 239765 203779 252767 445946 397168 332775 341072 206833
3562 206833 344300 422083 386963 361342 280104 325695 357784 391951 401803 206032 190975
3551 190975 249803 217557 188645 214641 222979 221340 282601 321975 371348 396651 512111 493999
3539D93999l2832j16567p0991J4254K386q8285J53444j89417o8010n7693K14292
3528B54580O5867m1234N2235o3437M173M1355j09517m5632J29801l1L3324K6938
3516C48422K7950o198q1072o30Q6780l8192R498N4741Q435l2504k0994Q8952q706
3503D36482j43388j74256r6903K16821J50100J50029M8872j51284J9084J41274
3493E96831j25396p7213O767O9435J564j38965n1311L9973J10954J94282r0694
3482E36227j87635o5226R7003o4375r228q4019J1135n3165J31816J15873k05017
3471B23389P155R8529P3353j4689Q2255j34883m022L6389j45927m6318k4768P8598
3459B29061J20172Q9086k797l9462l6953k23878K6382L7609n4632J49186L1619
$$ plain form
3539 493999 461167 344600 273609 287863 290249 201964 355408 165991 97981 40288 254580
3528 254580 320447 279213 331448 268011 272184 313539 204022 158390 288191 288160 321484 348422
3516 348422 376372 370174 289102 288472 375252 337060 346558 401299 409734 377230 356236 445188 436482
3503 436482 293094 118838 21935 238756 388856 538885 587757 436473 455557 596831
3493 596831 471435 394222 400989 470424 471988 333023 281712 321685 432639 626921 536227
3482 536227 348592 283366 380369 315994 306766 222747 233882 180717 312533 428406 223389
3471 223389 230544 329073 402426 387737 469992 335109 331087 367476 221549 175231 150463 229061
3459 229061 349233 438319 435522 396060 359107 135229 161611 199220 144588 293774 325393
3448C25393Q440L2323k20582J53776J11302n0060k25202m9981N6909J49502M7183
3437C39003j07058j6066j7375j4235j0298J74553m5089q2537N0322M2508o7562
3426B46166o2036j04392J2704L9929P4987p4126j42411Q8557j5720L094J49717
3415B16469l8875R5083K1386N1532j6999J4818q9705m1476J0813j15451K1450
3404A29045J54522j8425m6815n2065L7244J48020J01985m0232P026k481p0528
3393C47296K5036J4546N5812q2823m481r7113o1046Q8985J17920J12759o8574
3382D48317O267p5268q3948j75002J1493J30283n333l230j3273J06204n169L383
3370C44724k8269n1964o3429J07351J8709M6400j8059N4771P8208L9452p4977
$$ plain form
3448 325393 333833 366156 145574 299350 410652 360592 135390 85409 142318 291820 339003
3437 339003 231945 215879 198504 184269 173971 348524 303435 220898 271220 313728 246166
3426 246166 184130 79738 92442 132371 207358 133232 -9179 79378 63658 66752 216469
3415 216469 177594 272677 294063 345595 328596 343414 253709 212233 223046 107595 129045
3404 129045 283567 265142 218327 166262 203506 351526 453511 413279 420305 417824 347296
3393 347296 372332 386878 442690 359867 355386 258273 197227 286212 404132 516891 448317
3382 448317 454584 379316 295368 120366 131859 262142 256809 253579 240306 346510 341341 344724
3370 344724 316455 264491 201062 308413 327122 373522 355463 410234 488442 527894 452917
3359D52917k09237j2926J73670p0079J08182J03429p5233N2796j0502j53549j15269
3348B44199J16367K3412l796P6751r513j38309R1325J11101K8430R5788j04271
3337E31484M3035p9118p3870Q6551L4420J15454m5051L2155l1250j50915K11174
3326F74069J19700n0500j53122m0274N2373j38235r0965M3427P5994J08148J01499
3315G02114j20470j23974J82499l3340Q863M7405q6885K2992K07207m762N4121
3304H55770q9190k5258J49567K3207J7558j8615r1558l8664n2620m1040K13801
3293I02958R3661j24434j12361Q9108J37380o7193j75390J863L3598j12873L4534
3282G00851j2261j22187J53754K466J12427Q7736l5220j04644k3494j20482K77553
$$ plain form
3359 452917 243680 230754 404424 334345 442527 545956 470723 523519 513017 359468 244199
3348 244199 360566 383978 380182 456933 447420 309111 400436 511537 539967 635755 531484
3337 531484 574519 495401 421531 508082 542502 657956 612905 645060 613810 462895 674069
3326 674069 793769 743269 590147 549873 602246 464011 373046 416473 492467 600615 702114
3315 702114 581644 457670 640169 606829 615692 663097 576212 599204 806411 801649 855770
3304 855770 766580 741322 890889 914096 931654 913039 821481 782817 730197 689157 902958
3293 902958 996619 872185 759824 848932 986312 919119 743729 745592 779190 666317 700851
3282 700851 688590 566403 720157 722623 835050 922786 887566 782922 759428 638946 916499
3271I16499K6232j29002J01417j3889J08876J85296k0405j84458m1200m0633R97
3260I09730J30922l948q9678j21720R9231J14785L2559K8365R4912O5456q9900
3249A170714n0458L0752J15361J46571j1283N1846J63019L06364p5912R4622p1685
3238A869911M496J51466p2745M225j07457p8535j06435j90044r2870k2971j29338
3227A229703o8991n7736K9734L040o3059m2997m6562j64879j03337o4214O7254
3216G17956n1250k6693M4871P5239j71687M5498M3044j29867O506r9787K8841
3205D82671J04540m1461O5292j06449P0397k5099j16471j05440j2169J05474J11313
3194E32598Q8711j45612N0401k33461k886J55022K252p8023k18803Q9296J38424
$$ plain form
3271 916499 942731 813729 915146 901257 1010133 1195429 1175024 990566 949366 908733 909730
3260 909730 1040652 1036704 947026 825306 924537 1039322 1071881 1100246 1195158 1260614 1170714
3249 1170714 1120256 1151008 1266369 1412940 1401657 1453503 1616522 1922886 1846974 1941596 1869911
3238 1869911 1874407 2025873 1953128 1957353 1849896 1771361 1664926 1474882 1382012 1359041 1229703
3227 1229703 1160712 1102976 1132710 1135750 1072691 1029694 983132 818253 714916 650702 717956
3216 717956 666706 640013 684884 760123 588436 633934 676978 547111 553617 453830 482671
3205 482671 587211 545750 611042 504593 574990 549891 433420 327980 315811 421285 532598
3194 532598 621309 475697 526098 292637 289751 444773 447025 369002 150199 239495 377919
3183C77919k840j6980j6944K2805N8993o9161K8724j4166M1652l4414J9336M4420
3171D39344j26106J8439l7152m4978j939j7516J63917j29992J6859J64972q5477
3160C60371q1177M2324J10448L683j08964j29147Q7371K3453Q93m2921n062L6689
3148B97961P2638p4451n6565P7130M3660j82380q0184P0352N5957L7582l2547
3137B29153q9889M1144J03817q6547r2696Q982R3575M8593n301l3773n892j5365
3125A95801m4596j9623j622L8812J50613M7851n7913j41517K4518L607j30133
3114F5798Q4156j13170N2456J11542O1467R242l6556R7178j73469q4023l937J17021
3102A87705K3081m7543q1442J15249p7915k5706J350K9793r2942k9809J07632
$$ plain form
3183 377919 375079 358099 341155 363960 422953 353792 382516 368350 410002 375588 394924 439344
3171 439344 313238 331677 294525 249547 247608 230092 394009 264017 280876 445848 360371
3160 360371 279194 321518 431966 435649 326685 197538 284909 308362 309255 266334 261272 297961
3148 297961 370599 296148 239583 316713 360373 177993 97809 168161 224118 261700 229153
3137 229153 139264 180408 284225 197678 104982 113964 207539 256132 250831 217058 211166 195801
3125 195801 151205 131582 129960 168772 319385 367236 309323 167806 192324 195931 65798
3114 65798 149954 36784 89240 200782 262249 271491 234935 332113 158644 74621 70684 187705
3102 187705 210786 163243 81801 197050 119135 93429 94779 124572 31630 1821 109453
3091A09453j91269m4455N0353K37041O7578M182K5018j40857j63176j6146J28794
3080F6516P9786j48602o9407j3130L3226J18748K7529k5207j2626K38J2681r4791
3068b5039M8045J36989l9327p2036j250k4963n3866o108O1126L8735J07901N0714
3056B20921k23014l8151N3749l7496j25698j009J66250R3326J954k3055k8125
3045E9652j27041R4863R643J01598P4989J7119j37814q4501k8895J07392R0482
3034A77487l6114k15229J12210J94542r7090r0686j7836k7414J03393l5121Q462
3023G6604M9315o2228P5305M7832J6429j78139K4557r2637p4282J7568K0382J09781
3011C0487Q5640j06508J3873j24068m5928J40091J73846r6664P0533K7877N8808
$$ plain form
3091 109453 -81816 -126271 -75918 161123 228701 232883 257901 117044 -46132 -62278 66516
3080 66516 146302 -2300 -71707 -84837 -51611 67137 94666 69459 56833 57071 69752 -25039
3068 -25039 23006 159995 120668 48632 47382 22419 -31447 -37555 23571 62306 170207 220921
3056 220921 -2093 -40244 13505 -23991 -149689 -150698 15552 108878 110832 87777 59652
3045 59652 -67389 27474 37117 138715 213704 230823 93009 8508 -20387 87005 177487
3034 177487 141373 -73856 38354 232896 135806 45120 27284 -130 103263 68142 76604
3023 76604 125919 63691 138996 186828 203257 25118 49675 -42962 -117244 -99676 -79294 30487
3011 30487 116127 9619 23492 -100576 -146504 -6413 167433 70769 141302 169179 227987
3000B27987r6667p9027J10545j19496P9549j0753N0483Q5806j7872R2516j47396
2989A75675M5705j01434j635P552o886j62192k6875J82534J35681o3330q5323
2978I9472M815N5606J75620p9694J5160p0750m5627n9398J01114j3947o6283p9663
2966C6425M7016j8931K03881j07100j35524K5959P9032j03J4755O849k6068k05024
2954g8833J03444K92810k00274m1330J37417q4457p1644l7430J4009M5357N8847
2943A37916N1623M6275j87036J46077K1327K2056M9970q8859J72813Q104j41887
2932B38379L4424J2496k3015l8584k0793K5728N015j11456M1644m4723j59544
2921d0429K75498j32577j00823M4411J76183j069L6239J11225n11k0442J01328
$$ plain form
3000 227987 131320 52293 162838 43342 122891 112138 162621 248427 230555 323071 175675
2989 175675 221380 119946 118311 125863 118977 -43215 -70090 112444 248125 184795 99472
2978 99472 104287 159893 335513 255819 270979 200229 154602 95204 196318 182371 116088 36425
2966 36425 83441 64510 268391 161291 25767 51726 130758 130655 145410 152259 126191 -78833
2954 -78833 24611 317421 117147 75817 213234 128777 57133 19703 33712 79069 137916
2943 137916 189539 235814 48778 194855 216182 238238 288208 199349 372162 380266 238379
2932 238379 272803 285299 262284 223700 202907 228635 233650 122194 163838 119115 -40429
2921 -40429 235069 102492 1669 46080 222263 221194 257433 368658 368147 347705 449033
2910D49033q9232j39089q7955K25234n9526m3454r0880r8758N8278K03701J69854
2899D97206k467j87832r9370K6491Q370J66207j08811K3078J19274j41012N5017
2888C56151q9405m9709K72659O3974j26809j6831j6659n6645N8317l2124j07161
2877B55758J81854J4833n5783J15788q3110j18560J5711m8004k26795j9213J55320
2866A87799Q3721R8565j62747N931M8785j13137r7454J08022n9410O8775J34483
2855C03333k6878J7888j41370K771N1010p9058o5789J75097n2785Q7821l6068
2844B35972j17310j32301J54490k16319j649M6306K02298J35655r5486J178r2063
2833A20771p6791Q6230j75525j22489J78446p3199P6652N6994r2532o8461P550
$$ plain form
2910 449033 359801 220712 132757 357991 298465 255011 164131 65373 123651 327352 497206
2899 497206 494739 306907 207537 234028 242398 408605 299794 322872 442146 301134 356151
2888 356151 266746 217037 489696 553670 426861 410030 393371 336726 395043 362919 255758
2877 255758 437612 452445 396662 512450 429340 310780 326491 278487 51692 32479 187799
2866 187799 271520 370085 207338 213269 262054 148917 51463 159485 100075 168850 303333
2855 303333 276455 294343 152973 155744 206754 127696 61907 237004 184219 272040 235972
2844 235972 118662 -13639 140851 -75468 -77117 -30811 171487 307142 211656 212834 120771
2833 120771 43980 130210 -45315 -167804 10642 -62557 14095 71089 -21443 -89904 -82354
2822h2354J07328j5125k6591L7459r7899J47863p5784q1457n849o0252J5552k4071
2810a61180k6368K3184J64634L8070J6934r8568j12553P2095L9351k8278k8818
2799a01497J38739N1963j5163j68489N9372L3457M37M7051m0285m1751o2546n2163
2787a50875k4847Q0778L7281M3359j5068N1867j04263n3199n6132J33796O1519
2776D216p0023o1895k4244m3853P0979J73710R2070j18033j18621P4896J1919
2765h879j7028m6725P9339m7172O0108N4514p817O3149p2337j10711p1831o5414
2753a90804R083J03579J4187R1579k9566K6801L758o3259Q5507j00642n7080L2877
2741g3980k8280m2763R6507m317O1935K8938j07952m921J48269o6349m1783J74528
$$ plain form
2822 -82354 24974 9849 -16742 20717 -77182 70681 -5103 -86560 -92409 -152661 -137109 -161180
2810 -161180 -187548 -164364 270 38340 55274 -43294 -155847 -83752 -44401 -72679 -101497
2799 -101497 37242 89205 74042 -94447 -35075 -1618 -1181 45870 5585 -36166 -98712 -150875
2787 -150875 -175722 -94944 -57663 -14304 -29372 22495 -81768 -134967 -191099 -57303 4216
2776 4216 -65807 -127702 -151946 -195799 -124820 48890 140960 22927 -95694 -20798 -8879
2765 -8879 -25907 -72632 6707 -40465 19643 74157 66340 129489 57152 -53559 -125390 -190804
2753 -190804 -181721 -78142 -63955 27624 -1942 24859 28617 -34642 50865 -49777 -106857 -73980
2741 -73980 -102260 -145023 -48516 -52833 9102 38040 -69912 -74833 73436 7087 -34696 139832
2729A39832k09274j1094R4763K8106p1811k00046J08440j66627R2495R3783N5803
2718d5630L6623L4263M7733q8974m9801Q4061r667r0607l2611O3932q3864J0065
2706a24477J4940p0672m5738r733m9633N2777J02432k3500P1736q7641j9920M2098
2694a47331N7134r4555j4394R115K1054J24813r8259j20540J1225Q5574K2901
2683a43263j13227J02444N2633P343m1995J07240L4286l9404p092n1374p9137
2672a71546J41395J25382j22347j10606K6332q6586p4340N8616m2440m9149O9939
2661b35350Q1180N3772j2416j01659J77121m4686l7164M9815l6187K06288M5775
2650A46489N003l7943j07887M2231p5416l4602J09355M2845j4828L2355j15262
$$ plain form
2729 139832 -69442 -80536 14227 42333 -29478 -229524 -121084 -287711 -195216 -101433 -45630
2718 -45630 -9007 25256 72989 -15985 -65786 18275 8608 -81999 -114610 -50678 -134542 -124477
2706 -124477 -109537 -180209 -225947 -235680 -285313 -232536 -130104 -153604 -81868 -169509 -189429 -147331
2694 -147331 -90197 -184752 -199146 -190031 -168977 -44164 -142423 -262963 -251738 -166164 -143263
2683 -143263 -256490 -154046 -101413 -94070 -136065 -28825 5461 -33943 -41035 -92409 -171546
2672 -171546 -30151 95231 -27116 -137722 -111390 -197976 -272316 -213700 -256140 -305289 -235350
2661 -235350 -154170 -100398 -112814 -214473 -37352 -82038 -119202 -69387 -105574 100714 146489
2650 146489 151492 113549 5662 47893 -27523 -62125 47230 90075 75247 107602 -7660
2639g660o8018J96800m0041l2275k6894j57508M8633k02248L8017J61106p8915
2628a69003j1776K14505Q8904o5767k9813K9147o1955m8924o7388N9517J02109
2617C9556j15507R6382M8262l6768j19355J26764L6884j79672j579k4527J52902
2606B3342Q9653j92083o5926k1151K16292K429l8920n559J766K0621o7658j68602
2594b05796O7469O726J30129N8452o0561l7883O8389J67087k07716j25678j390
2583a40772P0470n1789n8707o7260J08550o9892J90916j30502j05019O4006J2212
2572a77787O0896R2489p364m8057M7273Q4995L3234p9796p5525K101l7516K3754
2560h1303o4177m5372K06177j2696p6812m6760j07908j25841K09955Q4173L0392
$$ plain form
2639 -7660 -75678 121122 81081 48806 21912 -135596 -86963 -289211 -251194 -90088 -169003
2628 -169003 -180779 33726 122630 56863 27050 56197 -5758 -54682 -122070 -62553 39556
2617 39556 -75951 20431 68693 31925 -87430 39334 76218 -103454 -105033 -129560 23342
2606 23342 112995 -79088 -145014 -166165 50127 52556 13636 8077 9843 30464 -37194 -205796
2594 -205796 -138327 -131601 -1472 56980 -3581 -41464 26925 194012 -13704 -139382 -140772
2583 -140772 -70302 -122091 -180798 -248058 -139508 -209400 -18484 -148986 -254005 -189999 -177787
2572 -177787 -116891 -24402 -31766 -79823 -32550 52445 85679 5883 -69642 -67541 -105057 -81303
2560 -81303 -145480 -190852 15325 2629 -74183 -120943 -228851 -354692 -144737 -60564 -30172
2549c0172L4919r7355j88102R8358J7725J81815M3944j3909Q2590o2928l4308
2538C2577k10121n5641l1159j22499R8066K6880l3386N4394Q7773P0862K1850
2527f0404K6987p7327n8050K7902O271O0476k7748M5093R2438j13918N7676q6581
2515a07185o4210K8991j1114p7632M8463J724j20914J32617l1570k0777P4942
2504a46665p8970R1305J26369L701N005j27106m2034P6341N2485L9138M7537j07643
2492f0537o4635J7733J10658k4571K4718q0590L6534k9121J914k4807J06022J8595
2480C1913j02947P4635o888o6948r5053N6326J80121j23368j69438J05751l1270
2469a47166R5085N0757J57673j18887r014J2679j63327m4482N4006J1761J32508
$$ plain form
2549 -30172 4747 -92608 -280710 -182352 -164627 17188 61132 47223 129813 66885 32577
2538 32577 -177544 -233185 -264344 -386843 -288777 -261897 -295283 -240889 -153116 -82254 -60404
2527 -60404 -33417 -110744 -168794 -140892 -134621 -74145 -101893 -56800 35638 -78280 -20604 -107185
2515 -107185 -171395 -142404 -153518 -231150 -182687 -180963 -301877 -169260 -200830 -221607 -146665
2504 -146665 -225635 -134330 -7961 -4260 745 -126361 -168395 -92054 -39569 -431 47106 -60537
2492 -60537 -125172 -107439 3219 -21352 3366 -77224 -40690 -69811 -67897 -92704 13318 31913
2480 31913 -71034 3601 -3287 -70235 -165288 -108962 71159 -52209 -221647 -115896 -147166
2469 -147166 -52081 -1324 156349 37462 28448 41127 -122200 -166682 -112676 -100915 31593
2458C1593K067q6377p8684J04718m6126K539m5714k7439O6371J92888j46185j1103
2446d1452Q6913n2561J24798m5135j46927R43j6080J2496O8920r8806J10866P5787
2434G9762j76723k5448J1596r804J24413J11196k5628q9030j21420J21934J20548
2423A21396j47775j05100J7869N7794q129K2683Q3839P3874p9223l6580j12491
2412a11843K8711n4096Q2891j0568l0645N1985J7352J31710j12453r3155J61364
2401F1253p602j17008P9992P2326p2057o6760l3587J021Q2461L3026J0669J04885
2389A48619j17964J01579J19442j81202j71625J40405P7380J26368r1610k21688
2379g0296K1458N0975M6969r7351M3469l3583r1676J24024j9333M8842O4029Q0750
$$ plain form
2458 31593 33660 -52717 -131401 -26683 -72809 -70270 -115984 -143423 -77052 115836 -30349 -41452
2446 -41452 45461 -7100 117698 72563 -74364 -73421 -89501 -77005 -8085 -106891 3975 79762
2434 79762 -96961 -122409 -110813 -120617 3796 114992 89364 334 -121086 848 121396
2423 121396 -26379 -131479 -113610 -55816 -63945 -41262 42577 116451 37228 648 -111843
2412 -111843 -83132 -137228 -54337 -64905 -95550 -43565 -26213 105497 -6956 -100111 61253
2401 61253 53651 -63357 16635 88961 16904 -49856 -83443 -82422 39 33065 43734 148619
2389 148619 30655 132234 251676 70474 -101151 39254 116634 243002 151392 -70296
2379 -70296 -48838 2137 49106 -48245 -4776 -38359 -130035 -6011 -25344 23498 87527 168277
2367A68277j75331J35106J67133j38613K4684j15083m1300J72199o2656m9290
2357H5126j15285p162L3473P2553K3282k03598M3212N3230o0841n8117O5722k3547
2345i1952P7238K12j23498P8057k5196k6677J48364O0099n5654j22333Q9742n7132
2333d8730J55519j61551p7036M2336K8440Q5742J01181q3074m5395j23346N6694
2322f9220Q9989N292k436j86115m2718N8639J25055J58315N4321Q3J6441j78741
2310B8905k4107P2726q245k4767N2805p4010K0905L664N8781M2837j36803n8595
2298d5904Q3153L448J4571j02321k2152m5104m0923n8583K82378K5502j50985
2287e6920J34491j0431P75J67421R966j26380r7236J04471L511J7305o7457Q0111
$$ plain form
2367 168277 -7054 128052 295185 156572 181256 66173 24873 197072 134416 85126
2357 85126 -30159 -37321 -3848 68705 91987 -111611 -68399 -15169 -76010 -134127 -68405 -91952
2345 -91952 -14714 -14502 -138000 -59943 -85139 -111816 36548 96647 40993 -81340 8402 -48730
2333 -48730 106789 -54762 -131798 -89462 -61022 24720 125901 42827 -2568 -125914 -69220
2322 -69220 20769 26061 23625 -162490 -205208 -146569 -21514 136801 191122 191205 207646 28905
2310 28905 4798 77524 69279 44512 97317 23307 44212 47876 106657 149494 12691 -45904
2298 -45904 37249 40697 55268 -47053 -69205 -114309 -155232 -213815 68563 94065 -56920
2287 -56920 77571 67140 67915 235336 245302 118922 21686 126157 129668 146973 79516 159627
2275A59627k7207o8857J20210k0256r480r8191L9955o3217l428o745K40820j27791
2263A35440o0629L2396r7083J5110J03609L3134J5840J39995m7842j00656K6197
2252A95511q1893P7490L929j41256J8237P1947J7029r8373J00309j3604j78571
2241b9245J93920m8003j2963N1935K5813J9923j5049m4589K12543o1110j16970
2230A76205M2671l541K12201k13233L5661M091R7743L2046j08883P9896l4889
2219C19968m3319o340L38n7419K27126j52296j35051K41150J35325o0634j21352
2208C47496m6242J21010j7000j69325J49151J08322k7292k34106J45340J58363
2198E35717l1645l9391O6255J20585r8919R0049Q7766j28824o9756J39828L02215
$$ plain form
2275 159627 132420 63563 183773 163517 154037 55846 95801 32584 29156 22411 263231 135440
2263 135440 74811 107207 10124 25234 128843 161977 177817 317812 269970 169314 195511
2252 195511 113618 191108 195037 53781 72018 143965 160994 62621 162930 149326 -29245
2241 -29245 164675 116672 103709 155644 181457 201380 186331 141742 354285 293175 176205
2230 176205 218876 215335 427536 214303 249964 254055 351798 383844 274961 354857 319968
2219 319968 276649 270309 270647 213228 440354 288058 153007 394157 529482 468848 347496
2208 347496 301254 422264 405264 235939 385090 493412 466120 232014 377354 535717
2198 535717 504072 464681 530936 651521 552602 642651 730417 601593 531837 671665 973880
2187I73880k16808O3712L2237p8958j09736Q4977J09340l1567Q2538J5144q547
2176I16212K279K26976j6957j5366r809J07521K6187K657p7297J20437k9006m2927
2164A210907J57280J27170n0290j06309L0151m673J54947n5087K44367K0495j06364
2153A622594l7270P2589J23799k966Q3887q6707J44779J06201J16869K4081M0949
2142B208805M4316l5429J90228R2980N2999R3689J25847R215J15278J84992J58641
2131C241561J65827M6761K79420L43984J75269Q1070L14376L11492J31919L40338
2121E432017L90356K50738J88948L48902L81027N05472O65150P84727Q81017P36218
2111A0564572N84896P35071Q62554J463216J872448K081273K838096L614357M225578
$$ plain form
2187 973880 757072 820784 853021 774063 664327 749304 858644 827077 909615 924759 916212
2176 916212 918491 1145467 1128510 1113144 1103335 1210856 1237043 1239700 1162403 1282840 1253834 1210907
2164 1210907 1368187 1495357 1445067 1338758 1368909 1364236 1519183 1464096 1708463 1728958 1622594
2153 1622594 1585324 1657913 1781712 1778746 1862633 1775926 1920705 2026906 2143775 2167856 2208805
2142 2208805 2253121 2217692 2407920 2500900 2553899 2647588 2773435 2782650 2897928 3082920 3241561
2131 3241561 3407388 3454149 3733569 4077553 4252822 4333892 4648268 4959760 5091679 5432017
2121 5432017 5822373 6073111 6262059 6610961 6991988 7497460 8162610 8947337 9828354 10564572
2111 10564572 11149468 11884539 12747093 14210309 16082757 18164030 21002126 24616483 28842061
2102B8842061N364934P845283J1434904J1707147L633820q525219j2504547j0513052
2094C7285331p917770n315939l956965k867084k271563j734850j426964r55725
2086A0838471q95993n03743l92089m70624o13738o15117o85229o34758l74987
2077E652193l98619l52525k66178m74471k12639q3921l24571k38181o5148j69547
2067C066393k49964j58295J17875l4132r3085j91249j08045j51195q6236k85476
2057A826591P178q5122k40264o21R1489P0376n6464k17079q8284R1823r2316J0640
2045A317947k2814o9335K7227N3150j14517m4131n1403n1096M7672L4773j01711
2034A025762O0859j82846n0662p9892N0393k3138o8927Q6325M3065J141P641q9501
$$ plain form
2102 28842061 34206995 42052278 53487182 65194329 68828149 60302930 47798383 37285331
2094 37285331 29367561 24051622 20094657 17227573 14956010 13221160 11794196 10838471
2086 10838471 9942478 9438735 9046646 8576022 7962284 7347167 6661938 6027180 5652193
2077 5652193 5253574 4901049 4634871 4160400 3947761 3863840 3539269 3301088 3235940 3066393
2067 3066393 2816429 2658134 2776009 2741877 2648792 2457543 2349498 2198303 2112067 1826591
2057 1826591 1833769 1748647 1508383 1507762 1599251 1669627 1613163 1396084 1307800 1399623 1307307 1317947
2045 1317947 1295133 1225798 1253025 1306175 1191658 1147527 1096124 1045028 1092700 1127473 1025762
2034 1025762 1086621 903775 853113 773221 823614 800476 731549 817874 860939 862080 869721 780220
2022G80220K0116l8149j60275q6554M3726l8159j0920J07266j50192j05844l4248
2011C26987J82355j7126l0656K4069j24919J94252l2727j13112j40406j5182k5198
2000B28337J33470R5698o2869j03283j28065R6093R422r0124k1430R1571L4166
1989B82986K2783q2878J00985l7940P1510l7037j77493O663O1075M08j09004m483
1977I7575N0316J37849Q9416l2336k9492J69146j91333k56167r372Q0771K0763
1966A27136Q3073L764m1525N9744J5168J2335j93435j450N4004J2106K05914r7592
1954B39242k3541r9204o1759K3383r865P2335J62609q532k17070J52431j9898
1943B10131l3387o8358L4258m0016L4002j19122L4082L7162q5411J39715J9699
$$ plain form
2022 780220 800336 762187 601912 515358 559084 520925 510005 617271 467079 361235 326987
2011 326987 509342 492216 461560 485629 360710 554962 522235 409123 268717 253535 228337
2000 228337 361807 457505 394636 291353 163288 259381 268803 178679 157249 248820 282986
1989 282986 305769 222891 323876 285936 357446 320409 142916 149579 210654 211062 102058 97575
1977 97575 147891 285740 375156 342820 313328 482474 291141 34974 25602 106373 127136
1966 127136 210209 213973 172448 232192 247360 259695 66260 64810 118814 130920 336834 239242
1954 239242 215701 116497 54738 78121 68256 140591 303200 294668 77598 230029 210131
1943 210131 176744 108386 142644 102628 136630 17508 51590 88752 3341 143056 162755
1932A62755k9216j8078l5416k66379K5907J71899J78773j76736k9531L3039J02035
1921A19052L128m4989J16745j07741N3984m9559N9403n9511o0310k1380m7870
1910c9048J54430m868j2180N4890j14808o7163R7696J43407j41801j26041J48545
1899I3059j32400Q0558K228k05333N2839R8340O5462q6188J25360J19895j04644
1888A09176l5350K8815Q8082J447j9880j08844q6566J20150L1224j22614l4705
1877b9065M6686J04527k8453r3322J01074o8960l2811L1230R7756J7586m4111
1866A02137k23666K16949o2027n248q9160L9673J97267M7170j29272p8546l7238
1855b1961L8169M3390P7883l9326k03348m2392O64J41275j30783Q8139P905r838
$$ plain form
1932 162755 133539 115461 80045 -186334 -160427 11472 190245 13509 -16022 17017 119052
1921 119052 122180 77191 193936 86195 140179 90620 150023 90512 30202 8822 -39048
1910 -39048 115382 110514 98334 153224 38416 -28747 68949 212356 70555 -55486 93059
1899 93059 -39341 41217 43445 -161888 -109049 -10709 54753 -31435 93925 213820 109176
1888 109176 73826 102641 190723 192170 172290 63446 -23120 97030 128254 5640 -29065
1877 -29065 17621 122148 93695 373 101447 32487 -324 30906 128662 146248 102137
1866 102137 -121529 95420 33393 28145 -61015 -21342 175925 223095 93823 15277 -21961
1855 -21961 16208 59598 137481 98155 -105193 -147585 -146921 -5646 -136429 -48290 -40385 -50223
1843e0223k442P6140N7320K4580m6831o1985Q4009p760j0016n8335j5290J60448
1831A49615N0516P0990J12784j06332q1120L2599j7084m8290k6227M2037j56730
1820B2758k822L552J29749n6939l7876L2802J45128k72375p6814J83012l116o6561
1808D98p5195o349L2969O3767J18696l3542j30947J779J62516j25207m2746J03081
1796F9320k1844k7906n4366J41912k27965J05648K2965L2235l3264K1285J3449
1785D1469j1456K6550j05825P8972Q0977n801j24223p6832K8022Q6994q917j29157
1773a19227P5571N3022p8584j8889m6169J31792J3605J3669l9208J10116M4794
1762A40492J6959p15j33986j1241J4135j90995K9212K13811N2288o8461j9485
$$ plain form
1843 -50223 -52665 23475 80795 105375 58544 -3441 80568 72808 62792 4457 -10833 149615
1831 149615 200131 271121 383905 277573 196453 229052 211968 163678 137451 179488 22758
1820 22758 19936 23488 153237 96298 58422 91224 236352 -36023 -112837 70175 67059 498
1808 498 -74697 -81046 -48077 15690 134386 100844 -30103 -28324 134192 8985 -33761 69320
1796 69320 47476 19570 -34796 107116 -120849 -15201 7764 39999 6735 28020 41469
1785 41469 30013 56563 -49262 29710 110687 104886 -19337 -96169 -68147 18847 9930 -119227
1773 -119227 -43656 9366 -69218 -88107 -134276 -2484 11121 24790 -14418 95698 140492
1762 140492 157451 156736 22750 11509 25644 -165351 -136139 77672 129960 61499 42014
1751D2014m2316J6923p0800j0206J91837j6230o2856m532l3987J55272n4177j99071
1739h8129N9337R6728n9122j56169J86399M8131l6853j0617P644q417j6228j64850
1727a42146k3130k2054k5126P3333K0413n013o1711J30888P1209k1559P168l3469
1715c1197m8414J7708j1752n8327O3989O1690j32831J6644J47607n4786J57892
1704A28223o2247Q2398q442n4618j7356O4983j23218J3619M4732J5596p9561m1165
1692c7056Q6564N4827q425N1689j58174n5622L2205k03278L6983L932j5465n178
1680b16998n12J87357j5233j06535Q9925k6837J03837o398n8792L2708j3710J19452
1668H8264m5818q6757L4688m0286Q2177J3612M4289k17621Q3700m7918J29730
$$ plain form
1751 42014 -302 16621 -54179 -64385 127452 111222 48366 43834 9847 165119 110942 -88129
1739 -88129 -28792 67936 8814 -147355 39044 87175 50322 39705 47349 38932 22704 -142146
1727 -142146 -165276 -187330 -212456 -139123 -118710 -123723 -185434 -54546 16663 -4896 2272 -31197
1715 -31197 -79611 -61903 -73655 -131982 -67993 -6303 -139134 -122490 25117 -29669 128223
1704 128223 65976 148374 139932 85314 67958 132941 9723 23342 68074 83670 4109 -37056
1692 -37056 49508 104335 95910 147599 -10575 -66197 -33992 -237270 -200287 -196355 -211820 -216998
1680 -216998 -217510 -30153 -45386 -151921 -61996 -88833 15004 8606 -50186 -17478 -31188 88264
1668 88264 42446 -44311 -9623 -49909 32268 45880 90169 -127452 -43752 -91670 38060
1657C8060q0284p4836j4518m5121J9771J22756O0392j27274M1739L0724O8336
1646C9745n7913P08j6200N4090l8921j74920j6587R1270R2999j314j97307L2536
1634a91814J56386R719j7888Q9732J89265j61125r0523k5451l8360n8353M272
1623a34140P5822K9924P2425N095j3047m1519n441r4233N4862J21748M1763k32874
1611a19615J30301L7270q1593R3742j02195o1559J07994n3668J8817N4573n6331
1600c2264P6648J4572p27k01284p6702l3735j8368J33099N7314k8572J45388j63977
1588a28608j4705P0324N0536j0872j3785Q9721l8521o8970L8555L86l7151n5089
1576a18179Q0019R3239p5872m1475m9940L8051j6682O9030p929q2467l4635J08211
$$ plain form
1657 38060 -42224 -117060 -131578 -176699 -156928 -34172 26220 -101054 -59315 -28591 39745
1646 39745 -18168 -17460 -33660 20430 -18491 -193411 -209998 -118728 -25729 -27043 -224350 -191814
1634 -191814 -35428 -25709 -43597 46135 235400 74275 -16248 -41699 -80059 -138412 -134140
1623 -134140 -58318 -28394 44031 49126 36079 -5440 -10881 -105114 -50252 71496 113259 -119615
1611 -119615 10686 47956 -33637 60105 -42090 -103649 4345 -49323 -30506 24067 -32264
1600 -32264 44384 58956 58229 -143055 -219757 -253492 -271860 -138761 -81447 -110019 35369 -128608
1588 -128608 -143313 -72989 -22453 -33325 -47110 42611 4090 -64880 -26325 -25939 -63090 -118179
1576 -118179 -38160 55079 -20793 -62268 -112208 -74157 -90839 -21809 -29738 -112205 -146840 -38629
1564c8629l3252Q84m7139L7701n477J126J28633J6003r5208k1296l7064l4565
1552a28283q4196M2943K32311j07358n5779L6981J30693j02097k0548J08428j08866
1541e5771L5495j37597M8885J15155m4267P7424N433j59705m0029R9125k6758
1530h2610O3739j09853j643J25216L7030l8960K2917o7061j5942Q3535J394j40509
1518a22747J58911J93837j22116k42588k4737K17733m2517q3186p9821l6018J08601
1507g4648N9174l0679k4377q7880P4347O4202O7136j7911Q1694j51712L5166k0764
1495b6252q5336J58329j71801L7828R5718P0380o4938Q4805p9668o2372J26798
1484H3491k10301P7317P1219j7003k839O0644R6816j08775j36646l7828N0159
$$ plain form
1564 -38629 -71881 -70997 -118136 -80435 -85912 -84786 43847 59850 -35358 -56654 -93718 -128283
1552 -128283 -212479 -169536 62775 -44583 -100362 -63381 67312 -34785 -55333 53095 -55771
1541 -55771 -20276 -157873 -108988 6167 -38100 39324 44757 -114948 -154977 -55852 -82610
1530 -82610 -18871 -128724 -130367 -5151 31879 -7081 15836 -51225 -67167 16368 17762 -122747
1518 -122747 36164 230001 107885 -134703 -159440 58293 15776 -67410 -147231 -183249 -74648
1507 -74648 -15474 -46153 -70530 -158410 -84063 -19861 47275 29364 111058 -40654 -5488 -26252
1495 -26252 -111588 46741 -125060 -87232 8486 78866 13928 98733 19065 -43307 83491
1484 83491 -126810 -49493 21726 4723 1884 62528 159344 50569 -86077 -123905 -73746
1473g3746J3428J39496j3392o0512n3383q051k4541J6182N6953o5278J84802o3359
1461D8599Q0523j31551J206O594L0442n7772r7775J74216k0695K4575j11281j27020
1449a79939J86098M8331K0404j123K8360j56489n0378J98582R73q7538j12742
1438a05461j649j62033L3203J46987J38566j31944N4530J86256j07108k2095j4993
1427A4259j31129J0807p6980j18256J06271P1297K7989j01769J30486J49863p8116
1416D722M6486K8147K5716j79745N2473J44986j2860k3653k12867m7663k0703
1405a94961P2933N6677o2309M4371k3398J10902n2116M8443K9080q7826P339k0827
1393g1692k3097P6372j13815k068n3432q1606J99979K03717O5458K0847k53673
$$ plain form
1473 -73746 -60318 79178 65786 5274 -48109 -56160 -80701 -64519 -7566 -72844 111958 48599
1461 48599 129122 -2429 -1223 5371 35813 -21959 -119734 54482 33787 58362 -52919 -179939
1449 -179939 6159 54490 74894 73771 102131 -54358 -104736 93846 94819 7281 -105461
1438 -105461 -107110 -269143 -235940 -88953 49613 -82331 -27801 158455 51347 29252 14259
1427 14259 -116870 -106063 -183043 -301299 -195028 -123731 -95742 -197511 -67025 82838 4722
1416 4722 51208 79355 105071 -74674 -22201 122785 109925 86272 -126595 -174258 -194961
1405 -194961 -122028 -65351 -127660 -83289 -106687 4215 -47901 542 29622 -58204 -50865 -71692
1393 -71692 -94789 -18417 -132232 -134300 -187732 -269338 -69359 134358 199816 220663 -33010
1382c3010J8664l7203j15661n347j588J26369N3389j01011l0884J11731j33377
1371a47928J92760M211J42779j42306j05588M6575N063j07395J36492m6417j03924
1360a25678Q6735k6676N5714J4831j0298M2273Q5061j99937Q6426J23044q9769
1349D1726J0253o6965n0774L8866m4117P3747Q8154Q8605l6729m1809q7753k258
1337A0946o7644m9957k8729K01223j21801P2356P0416o0376o4504J2033q0431
1326a06468K4062P2129j24694m8666Q3309n7972l5337J19938j00668Q2483P9245
1315a2639R3619p461K0101P215K5319l43l5815P8692l6407k9822j10577j76661
1303a84779L0370L4068Q9558j33979P8143M5791p4600n9412J6982J46415J29552
$$ plain form
1382 -33010 -14346 -51549 -167210 -172557 -174145 -47776 5613 -95398 -126282 -14551 -147928
1371 -147928 44832 49043 191822 49516 -56072 -9497 -4434 -111829 24663 -21754 -125678
1360 -125678 -38943 -65619 -9905 4926 -5372 36901 121962 -77975 8451 131495 41726
1349 41726 51979 -14986 -65760 -26894 -71011 2736 90890 179495 142766 100957 13204 10946
1337 10946 -56698 -106655 -135384 65839 -55962 16394 86810 26434 -38070 -26037 -106468
1326 -106468 -82406 -10277 -134971 -183637 -100328 -158300 -193637 -73699 -174367 -91884 -12639
1315 -12639 80980 73519 93620 100835 126154 125811 89996 168688 132281 102459 -8118 -184779
1303 -184779 -154409 -120341 -30783 -164762 -86619 -40828 -115428 -174840 -157858 -11443 118109
1292A18109q9359q4004k8856O2711K3485J28945j18136J8954l5753P86Q0650p5690
1280A842M5858N139n045n1401m9488j44621j38647K96014K32037M5650q5939l0030
1268A21369J53205k85007r7685M1411K7036p573l8513J15458j80389l4235Q5602
1257i9321Q7560K7224m9752q0938O3770O5674J1468P9256k89632J28516J03785
1246D7610j48352K7716L0598L3035J49525j30366J8073j5075N9670p9627m4745
1235e1938j22731l1134R4889J6259Q8922K6096N0686P4854J1217j39426J3352
1224C1046N8324J58450j37006k277l8749n8475j6942M1844M8230p991o4164o2506
1212e0216j46579J26853J31369k03064L4665J63544J2897m3877k243j55035R5087
$$ plain form
1292 118109 28750 -55254 -84110 -21399 2086 131031 12895 31849 -3904 -3118 77532 1842
1280 1842 47700 52839 47794 -3607 -53095 -197716 -336363 -40349 191688 237338 151399 121369
1268 121369 274574 -10433 -108118 -66707 -39671 -47244 -85757 29701 -150688 -184923 -99321
1257 -99321 -11761 15463 -34289 -115227 -51457 14217 25685 104941 -184691 -56175 47610
1246 47610 -100742 -73026 -42428 -9393 140132 9766 27839 12764 72434 -7193 -51938
1235 -51938 -174669 -205803 -110914 -94655 -5733 20363 71049 145903 157120 17694 31046
1224 31046 89370 247820 110814 108537 69788 11313 -5629 36215 84445 76454 12290 -50216
1212 -50216 -196795 -69942 61427 -141637 -106972 56572 69469 25592 23349 -131686 -36599
1201c6599Q7593J02222l424k57052q9842J6165J09731L0427R9186m8475j9370
1190i438n3246P442J11867p8642K29461j82382k09148R3958p7887L0564r3636
1179b31087O1903J49642j32019J64927L1121N175l6366k9926J34838q8453L7957
1168F7712R1477n7656j09464k1024J14224k10636J5624J79511J3337J15253j77460
1157B0898l3423M5249o9661K08133J0430j76297O1016j5242K6773J19529j01772
1146I5633q1105m6575K30N3103j7227q4954J31717r7640j66689R3306O914n7182
1134a70469J88399J02372q1680L2897k6252K0268l3964O3956j29564l3653J02273
1123C4583n9673j52519K45558N1143j3444j09966j87293K39308N3125o4517o2007
$$ plain form
1201 -36599 50994 153216 149792 -107260 -197102 -180937 -71206 -40779 58407 9932 -9438
1190 -9438 -62684 -55242 56625 -22017 207444 25062 -184086 -90128 -168015 -137451 -231087
1179 -231087 -169184 -19542 -151561 13366 44487 49662 13296 -16630 118208 29755 67712
1168 67712 159189 101533 -7931 -28955 85269 -125367 -109743 69768 83105 198358 20898
1157 20898 -12525 32724 -36937 171196 181626 5329 66345 51103 77876 197405 95633
1146 95633 14528 -32047 -31817 21286 4059 -80895 50822 -46818 -213507 -120201 -113287 -170469
1134 -170469 17930 120302 38622 71519 45267 65535 31571 95527 -34037 -67690 34583
1123 34583 -25090 -177609 67949 119092 105648 -4318 -191611 47697 100822 36305 -25702
1112b5702j01282J06822K3455j5923k2231j17639N6560P9259K5109p5668J01545
1101C4305L6703L6338j33573m2306R8091J04562j27624k5208k6227L1337k710
1090a6312K679j09482J50675J7715j01863N0762n737k6543j3707N2392p4887P0464
1078c844J1714j210r0268Q9817l1661j03983l8395J51915j5892M8319q4978J06206
1066C7740J78773j07606k13536l0263M0k5326J33160Q569J09106j16038j36029
1055a61410L8744L2250K7582P986N0792j29791R0888m9549O0401P6023L2411P200
1043H3527n3726J811J25863j91763j09511Q9304n0219J05071O3053N0458J3601
1032A27469j20557j16603p6732R2039J78391k15749J1246j52969R7916J44019
$$ plain form
1112 -25702 -126984 -20162 3293 -12630 -34861 -152500 -95940 -16681 8428 -67240 34305
1101 34305 71008 107346 -26227 -68533 29558 134120 6496 -18712 -44939 -13602 -16312
1090 -16312 -13633 -123115 27560 45275 -56588 -5826 -11563 -38106 -51813 579 -74308 -3844
1078 -3844 7870 6660 -83608 6209 -25452 -129435 -167830 -15915 -31807 16512 -68466 37740
1066 37740 216513 108907 -104629 -134892 -134852 -160178 -27018 -18449 90657 -25381 -161410
1055 -161410 -122666 -90416 -62834 -54848 -4056 -133847 -42959 -92508 -32107 43916 76327 83527
1043 83527 29801 31612 157475 -34288 -143799 -54495 -104714 357 63410 113868 127469
1032 127469 6912 -109691 -186423 -94384 84007 -131742 -120496 -273465 -175549 -31530
1022c1530L0802r5224K9662J2186k387L6823K8136J46748L5293j34015m5384r9
1010A1011N1206p1189j3823K4292M7768P020j60890M015M8183K1813M8884m3029
998b4739J9743l6811q7598O5834q5987O3905J63389l0798K6097L8175j98876m0894
986a28560n412j1778P5421p388R872J84413p5540O1301j8218o4035k2763J23972
974A21285J8636j66037K4939L3375m7284m9066J0612J76969j01476k7398j8794
963b4239M3279n6472M0870l0526p268j31365O4962K54294p062q7573n7519l9671
951c8290o3975j4464Q2697P3155P0251p7860r3344K07394r3876m9933J2814J19120
$$ plain form
1022 -31530 -728 -95952 -66290 -54104 -56491 -19668 8468 155216 190509 56494 11110 11011
1010 11011 62217 -8972 -22795 1497 49265 56285 -104605 -100590 -52407 -30594 18290 -24739
998 -24739 -4996 -41807 -129405 -63571 -149558 -85653 77736 46938 73035 111210 -87666 -128560
986 -128560 -133972 -145750 -70329 -77717 -67845 116568 41028 102329 84111 20076 -2687 121285
974 121285 139921 -26116 -1177 32198 -15086 -64152 -53540 123429 21953 -5445 -24239
963 -24239 19040 -37432 3438 -27088 -34356 -165721 -100759 153535 146473 58900 1381 -38290
951 -38290 -102265 -116729 -34032 39123 109374 31514 -61830 145564 51688 1755 14569 133689
$$ [...]
##END NTUPLES=NMR SPECTRUM
##END=
