##TITLE=1H_EC-3282(1)
 CDCl3
 8 sc, 
 25.10.2022
##JCAMPDX= 6.0         $$ Bruker NMR JCAMP-DX V2.0
##DATA TYPE= NMR SPECTRUM
##DATA CLASS= NTUPLES
##ORIGIN= UXNMR, Bruker Analytische Messtechnik GmbH
##OWNER= root
$$ XWIN-NMR		Version 3.5
$$ Tue Oct 25 14:31:29 2022 Russian Standard Time (UT+4h)  she@DPX200
##.OBSERVE FREQUENCY= 200.1313499994
##.OBSERVE NUCLEUS= ^1H
##.ACQUISITION MODE= SIMULTANEOUS
##.ACQUISITION SCHEME= undefined
##.AVERAGES= 8
##.DIGITISER RES= 18
##SPECTROMETER/DATA SYSTEM= spect
##.PULSE SEQUENCE= zg30
##.SOLVENT NAME= CDCl3
##.SHIFT REFERENCE= (INTERNAL, CDCl3, 0, 15.748)
##AUDIT TRAIL= $$ (NUMBER, WHEN, WHO, WHERE, WHAT)
$$ ##TITLE= Audit trail, XWIN-NMR		Version 3.5
$$ ##JCAMPDX= 5.01
$$ ##ORIGIN= Bruker BioSpin GmbH
$$ ##OWNER= she
$$ F:/spectra/data/she/nmr/H-F/1/pdata/1/auditp.txt
$$ ##AUDIT TRAIL=  $$ (NUMBER, WHEN, WHO, WHERE, WHAT)
(   1,<2022-10-25 14:30:20.34 +0400>,<she>,<DPX200>,
      <created by zg, POWCHK disabled, PULCHK disabled
       configuration hash MD5:
       00 E9 B6 7A A2 85 ED C7 34 08 36 98 17 FE 4E 26
       data hash MD5: 16K
       A1 39 F3 7F ED 16 6D 1B C4 CF F5 09 90 0F 48 B7>)
(   2,<2022-10-25 14:30:22.87 +0400>,<she>,<DPX200>,
      <Start of raw data processing
       efp BC_mod = 2 LB = 0.24 FT_mod = 6 PKNL = 1 PHC0 = -18033.84 PHC1 = 10.0007 SI = 16K 
       data hash MD5: 16K
       B5 A8 9B F9 55 D3 14 2F A6 BB 57 F0 B7 32 C2 03>)
(   3,<2022-10-25 14:30:39.92 +0400>,<she>,<DPX200>,
      <pk PHC0 = 0.9817169 PHC1 = -1 
       data hash MD5: 16K
       8E F4 28 92 82 03 0E C8 D2 09 FB 5C 5F EB 04 FE>)
(   4,<2022-10-25 14:30:43.59 +0400>,<she>,<DPX200>,
      <abs ABSG = 5 
       data hash MD5: 16K
       D5 80 B9 0E CB 61 D2 F6 22 4A 7F CB 74 1E A9 1F>)
$$ ##END=
$$ 
$$ hash MD5
$$ 3C 60 6D 2B C9 50 50 AC EE 2C 5E 54 A0 3D 70 F1
##$RELAX= 
##$RELAX= 
##$RELAX= 
##$RELAX= 
##$RELAX= 
##$RELAX= 
$$ Bruker specific parameters
$$ --------------------------
##$DU= <F:/spectra>
##$EXPNO= 1
##$NAME= <H-F>
##$PROCNO= 1
##$TYPE= <nmr>
##$USER= <she>
##$AMP= (0..31)
100 100 100 100 100 100 100 100 100 100 100 100 100 100 100 100 100 100 
100 100 100 100 100 100 100 100 100 100 100 100 100 100 
##$AQSEQ= 0
##$AQ_mod= 1
##$AUNM= <au_zg>
##$AUTOPOS= <>
##$BF1= 200.13
##$BF2= 200.13
##$BF3= 200.13
##$BF4= 200.13
##$BF5= 200.13
##$BF6= 200.13
##$BF7= 200.13
##$BF8= 200.13
##$BYTORDA= 1
##$CFDGTYP= 0
##$CFRGTYP= 5
##$CHEMSTR= <none>
##$CNST= (0..31)
1 1 145 1 1 1 1 1 1 1 1 1 1 1 1 1 1 1 1 1 1 1 1 1 1 1 1 1 1 1 1 1 
##$CPDPRG= <>
##$CPDPRG1= <>
##$CPDPRG2= <>
##$CPDPRG3= <>
##$CPDPRG4= <mlev>
##$CPDPRG5= <mlev>
##$CPDPRG6= <mlev>
##$CPDPRG7= <mlev>
##$CPDPRG8= <mlev>
##$CPDPRGB= <>
##$CPDPRGT= <>
##$D= (0..31)
0 1.2 0 0 0 0 0 0 0 0.06 0 0.03 0 0 0 0 0.0002 0 0 0 0 0 0 0 0 0 0 0 0 
0 0 0 
##$DATE= 1666693819
##$DBL= (0..7)
120 120 120 120 120 120 120 120 
##$DBP= (0..7)
150 150 150 150 150 150 150 150 
##$DBP07= 0
##$DBPNAM0= <>
##$DBPNAM1= <>
##$DBPNAM2= <>
##$DBPNAM3= <>
##$DBPNAM4= <>
$$ [...]
##$SUBNAM3= <"">
##$SUBNAM4= <"">
##$SUBNAM5= <"">
##$SUBNAM6= <"">
##$SUBNAM7= <"">
##$SUBNAM8= <"">
##$SUBNAM9= <"">
##$SW= 18.0517283424941
##$SWIBOX= (0..15)
0 0 2 0 0 0 0 0 0 0 0 0 0 0 0 0 
##$SW_h= 3612.71676300578
##$TD= 16384
##$TD0= 1
##$TE= 0
##$TE2= 300
##$TE3= 300
##$TEG= 300
##$TL= (0..7)
0 120 120 120 120 120 120 120 
##$TP= (0..7)
150 150 150 150 150 150 150 150 
##$TP07= 0
##$TPNAME0= <>
##$TPNAME1= <>
##$TPNAME2= <>
##$TPNAME3= <>
##$TPNAME4= <>
##$TPNAME5= <>
##$TPNAME6= <>
##$TPNAME7= <>
##$TPOAL= (0..7)
0.5 0.5 0.5 0.5 0.5 0.5 0.5 0.5 
##$TPOFFS= (0..7)
0 0 0 0 0 0 0 0 
##$TUNHIN= 0
##$TUNHOUT= 0
##$TUNXOUT= 0
##$USERA1= <user>
##$USERA2= <user>
##$USERA3= <user>
##$USERA4= <user>
##$USERA5= <user>
##$V9= 5
##$VALIST= <valist>
##$VCLIST= <CCCCCCCCCCCCCCC>
##$VD= 0
##$VDLIST= <DDDDDDDDDDDDDDD>
##$VPLIST= <PPPPPPPPPPPPPPP>
##$VTLIST= <TTTTTTTTTTTTTTT>
##$WBST= 1024
##$WBSW= 4
##$XGAIN= (0..3)
0 0 0 0 
##$XL= 0
##$YL= 0
##$YMAX_a= 382527
##$YMIN_a= -593360
##$ZGOPTNS= <>
##$ZL1= 120
##$ZL2= 120
##$ZL3= 120
##$ZL4= 120
##$ABSF1= 15.73918
##$ABSF2= -2.31267
##$ABSG= 5
##$ABSL= 3
##$ALPHA= 0
##$AQORDER= 0
##$ASSFAC= 0
##$ASSFACI= 0
##$ASSFACX= 0
##$ASSWID= 0
##$AUNMP= <proc_1d>
##$AZFE= 0.1
##$AZFW= 0.1
##$BCFW= 0
##$BC_mod= 2
##$BYTORDP= 0
##$COROFFS= 0
##$CY= -3
##$DATMOD= 1
##$DC= 0
##$DFILT= <>
##$DTYPP= 0
##$F1P= 0
##$F2P= 0
##$FCOR= 1
##$FTSIZE= 16384
##$FT_mod= 6
##$GAMMA= 0
##$GB= 0
##$INTBC= 1
##$INTSCL= 3.70164e-10
##$ISEN= 128
##$LB= 0.24
##$LEV0= 0
##$LPBIN= 0
##$MAXI= 10000
##$MC2= 0
##$MEAN= 0
##$ME_mod= 0
##$MI= 1.114404
##$NCOEF= 0
##$NC_proc= -5
##$NLEV= 6
##$NOISF1= 3.799351
##$NOISF2= 2.8
##$NSP= 0
##$NTH_PI= 0
##$NZP= 0
##$OFFSET= 15.74799
##$PC= 1
##$PHC0= -18032.86
##$PHC1= 9.0007
##$PH_mod= 1
##$PKNL= yes
##$PPARMOD= 0
##$PSCAL= 0
##$PSIGN= 0
##$REVERSE= no
##$SF= 200.130004712946
##$SI= 16384
##$SIGF1= 3
##$SIGF2= 2
##$SINO= 5.538805
##$SIOLD= 16384
##$SREGLST= <1H.CDCl3>
##$SSB= 0
##$STSI= 16384
##$STSR= 0
##$SW_p= 3612.71676300578
##$SYMM= 0
##$S_DEV= 0
##$TDeff= 16384
##$TDoff= 0
##$TI= <>
##$TILT= no
##$TM1= 0
##$TM2= 0
##$TOPLEV= 0
##$USERP1= <user>
##$USERP2= <user>
##$USERP3= <user>
##$USERP4= <user>
##$USERP5= <user>
##$WDW= 1
##$XDIM= 16384
##$YMAX_p= 332278174
##$YMIN_p= -244746
$$ End of Bruker specific parameters
$$ ---------------------------------
##NTUPLES= NMR SPECTRUM
##VAR_NAME=  FREQUENCY,     SPECTRUM/REAL,   SPECTRUM/IMAG
##SYMBOL=    X,             R,               I
##VAR_TYPE=  INDEPENDENT,   DEPENDENT,       DEPENDENT
##VAR_FORM=  AFFN,          ASDF,            ASDF
##VAR_DIM=   16384,         16384,           16384
##UNITS=     HZ,            ARBITRARY UNITS, ARBITRARY UNITS
##FACTOR=    0.220516191357247, 1,           1
##FIRST=     3151.64524378272, 0,            0
##LAST=      -461.071519223062, 0,           0
##MIN=       -461.071519223062, -244746,     0
##MAX=       3151.64524378272, 332278174,    0
$$ Real data points
##PAGE= N=1
##DATA TABLE= (X++(R..R)), XYDATA
$$ [...]
7206H98058n0128M8639K5822M1816O3098j29632r300N9725Q6047J8158L2213Q5705
7194A170221N3648p4736l5616L2937M6001j7748M4114R8855O9104N8456J04400
7183A549636J35284n2034J6469k3250Q9928R2699O9536m683J3601P748O9132M5594
7171B009660K5657R9128K1066M8257L3990p891L1923N3478Q8877N790P5527R9566
7159B585028j9236P6326J11399j8341N8268L0858m018O2494N787k9089J65260
7148C024736J03456K1301N8271R1145J21562P24J33222J69004N9024j6222J39444
7137C905667K18499J41512J52405K05239J47919J60241K35179K20818K25651L21878
7127E935008K47449K96322L64204L92052L60344M78889M54943L49752M67826M35089
$$ y = [898058, 847930, 896569, 922391, 964207, 1027305, 897673, 888373, 948098, 1034145, 1052303, 1084516, 1170221, 1223869, 1149133, 1113517, 1146454, 1192455, 1174707, 1218821, 1317676, 1386780, 1445236, 1549636, 1684920, 1632886, 1649355, 1626105, 1716033, 1808732, 1878268, 1873585, 1887186, 1894934, 1964066, 2009660, 2035317, 2134445, 2155511, 2203768, 2237758, 2229867, 2261790, 2315268, 2404145, 2409935, 2485462, 2585028, 2565792, 2642118, 2753517, 2735176, 2793444, 2824302, 2820284, 2882778, 2888565, 2859476, 3024736, 3128192, 3149493, 3207764, 3298909, 3420471, 3421195, 3554417, 3723421, 3782445, 3766223, 3905667, 4124166, 4265678, 4418083, 4623322, 4771241, 4931482, 5166661, 5387479, 5613130, 5935008, 6182457, 6478779, 6842983, 7235035, 7595379, 8074268, 8529211, 8878963, 9346789, 9781878]
7117I781878N23455N44392P06830P39676R05955J067519J261805J478975J768957
7108A8779442K003726K132728K258630K564148K846076L221054L876933M730864
7100D2413601N990878P448557Q902254Q689879O231397J816355l207837p016938
7092G1268146q884667q683745p704537o444881n013819l830949k983347k496690
7084B5225511k001503j585838j230398q71916o39513m68063m80266p54602r20325
7075A6273087j206643j341148j170294j062717q50389p34621o12797n12040m29965
7066H352473l54699l13936l90244k83264j50671k12762j59584j99414n4054P5938
7056F309783q705n8644j41705j97760k55845k53034j91718j86901k65353j38995
$$ y = [9781878, 10305333, 10849725, 11556555, 12296231, 13202186, 14269705, 15531510, 17010485, 18779442, 20783168, 22915896, 25174526, 27738674, 30584750, 33805804, 37682737, 42413601, 48404479, 55853036, 64755290, 73445169, 79676566, 81492921, 78285084, 71268146, 62383479, 53699734, 45995197, 39550316, 34536497, 30705548, 27722201, 25225511, 23224008, 21638170, 20407772, 19535856, 18896343, 18428280, 17948014, 17193412, 16273087, 15066444, 13725296, 12555002, 11492285, 10641896, 9907275, 9294478, 8782438, 8352473, 7997774, 7683838, 7293594, 7010330, 6859659, 6646897, 6487313, 6287899, 6233845, 6309783, 6301078, 6242434, 6100729, 5902969, 5647124, 5394090, 5202372, 5015471, 4750118, 4611123]
7046D611123m4564r8461j87057l5754o7243r2119R7528M5076k3060L5500K07418
7035D448387L26733L37451L62670L34250K45540l173k79621m01400n84018m90442
7025D296377m38177l74539k73136j71395k03993k77251j39111p7219o8532j30138
7015B142886p7757n7412q3574q3203l8939l9588m8272p078l4865p1749q4075J2279
7003A528653o7251r4388j54914l1854N9646j5565o3642r3616j14643O9960n596
6992A016790R107n4110p6188m2653m1830O5770k9172l634p3390j3344J9691n1049
6980G25988J7004L7561r0921n9025q146M6167M6099k6957o056k1886K5472l1585
6968F53715m2447l7075k0890L2230n7950o2040P2532p939R585J9307o6270k7667
$$ y = [4611123, 4566559, 4468098, 4281041, 4245287, 4178044, 4085925, 4183453, 4228529, 4205469, 4240969, 4448387, 4775120, 5112571, 5475241, 5809491, 6055031, 6051858, 5772237, 5370837, 4786819, 4296377, 3858200, 3483661, 3210525, 3039130, 2835137, 2557886, 2418775, 2341556, 2273024, 2142886, 2065129, 2007717, 1924143, 1840940, 1802001, 1762413, 1714141, 1707063, 1672198, 1600449, 1516374, 1528653, 1461402, 1367014, 1212100, 1180246, 1239892, 1224327, 1160685, 1067069, 952426, 1022386, 1016790, 1025897, 971787, 895599, 852946, 811116, 876886, 847714, 844080, 770690, 757346, 777037, 725988, 742992, 780553, 689632, 630607, 622461, 668628, 714727, 687770, 681714, 659828, 685300, 653715, 611268, 574193, 553303, 585533, 527583, 465543, 538075, 530136, 539721, 559028, 492758, 465091]
6956D65091K5418j0118k9000K9841R39k5768Q481n3978j3618M3339l4706j7491
6944C88430p907L5129l3978l2742L8616R033q3697j2365L1710j4841j9380l0960
6932B67048O2010K7110p1685n960m0824N0092O3029j6806Q336o14L0332q509K4196
6919C87755M3102q2198p5123o4981L3679O5682N3647q4101L5523n630m1181J788
6907B67962j6946k8959M8833m4920j1354K9793q4484R079P3181J3345l7396K2589
6895B40723o743J9571j2829N8931J302j08002j8081k5270K1700P8320l0460j6793
6883B02369K9203k6787j3004J8532J8241L5730m5878l1749m2666j3638J0290l2687
6871A07956j6502P0689N4360n6830k6876q2794K5450N4452L0947o8885K832P6473
$$ y = [465091, 490509, 480391, 451391, 481232, 482171, 456403, 464884, 410906, 397288, 440627, 405921, 388430, 380523, 415652, 381674, 348932, 387548, 396581, 312884, 300519, 332229, 317388, 298008, 267048, 329058, 356168, 284483, 278523, 237699, 287791, 350820, 334014, 342350, 341736, 372068, 363559, 387755, 430857, 348659, 273536, 208555, 242234, 307916, 361563, 277462, 312985, 307355, 266174, 267962, 251016, 222057, 270890, 225970, 214616, 244409, 159925, 169004, 242185, 255530, 218134, 240723, 233980, 253551, 240722, 299653, 300955, 192953, 174872, 149602, 171302, 249622, 219162, 202369, 231572, 204785, 191781, 210313, 228554, 264284, 218406, 186657, 143991, 130353, 140643, 107956, 91454, 162143, 216503, 159673, 132797, 50003, 75453, 129905, 160852, 91967, 94799, 171272]
6859A71272m9264J8716M9178l0233n5140M6452j9257r1024J9842P0414N6764k9478
6847A58242o2024P286q822O200J3713N1299j4041O6810n9940o9451M1782p3870
6835E7184k5261L7766J859J85165Q623q7113j07389N7153J0947P3692o4674q1692
6823F6260k7439q838J00786R7790K9801l5601K678k9483j2368N138j179l2050
6811A55495K5025m7479K0308j7324L3305J4226j0253m9214n0938k0448R756l6641
6799B5818M9198L6633J3497q0167l0256L5245J2947L9752J8787j4738k1589j3591
6787G1536p070o5267J8051L3089k5053J7002J1016J7224K3843r498j5412j5496
6775E3965N0004m784m714M1265l0605j8683n1007L0665n3291j7576k1579O3963
$$ y = [171272, 122008, 140724, 189902, 159669, 104529, 150981, 131724, 40700, 60542, 130956, 187720, 158242, 96218, 103504, 94682, 100882, 114595, 165894, 151853, 218663, 158723, 89272, 131054, 57184, 31923, 69689, 71548, 256713, 265336, 178223, 70834, 127987, 138934, 212626, 147952, 66260, 38821, 29983, 130769, 228559, 258360, 222759, 225437, 195954, 183586, 188724, 187545, 155495, 180520, 133041, 153349, 136025, 169330, 183556, 173303, 124089, 73151, 52703, 62459, 25818, 75016, 111649, 125146, 44979, 14723, 49968, 62915, 102667, 121454, 106716, 85127, 71536, 64466, -801, 17250, 50339, 25286, 42288, 53304, 70528, 94371, 84873, 69461, 53965, 103969, 99185, 94471, 135736, 105131, 86448, 35441, 66106, 12815, -4761, -26340, 37623]
6763C7623L2982o6442p600K7472L4486L0434o1496J7561J12739l4728K5602m2311
6751A06322l3803J4286j1000n4384K4917J3093K1942l8028P135L8589Q11N5967
6739A45847m4929m5776P8725k9224J1650P1188l690m2030M0420n5774j06161L5745
6727E5991N1258L9883P6899k4945n2102L7420K0185Q802l3151m8371o422J7351
6715A42798n0686J8872Q5396p4200j598J5024P9774m480P354J7775p6326M1875
6703B01578P8241m2382k3633L4859L9923L4471P7643R9392K8046m1756k2357j153
6691D62872j12193O2118l7680j0543j32150K7740O6792N668j6092p8274j6356
6680B21902k052r3596n93L3313Q6932m0868l4387j7818L263k3187k4437L2856
$$ y = [37623, 70605, 4163, -3437, 24035, 58521, 88955, 27459, 45020, 157759, 123031, 148633, 106322, 72519, 86805, 75805, 21421, 46338, 59431, 81373, 43345, 50480, 89069, 89880, 145847, 100918, 55142, 133867, 104643, 116293, 187481, 183791, 141761, 182181, 126407, 20246, 55991, 107249, 147132, 224031, 199086, 146984, 184404, 204589, 213391, 180240, 131869, 125447, 142798, 92112, 110984, 196380, 122180, 120582, 135606, 215380, 210900, 218254, 236029, 159703, 201578, 279819, 237437, 213804, 248663, 288586, 323057, 400700, 500092, 528138, 486382, 464025, 462872, 350679, 412797, 375117, 364574, 232424, 260164, 326956, 332624, 316532, 238258, 221902, 219850, 126254, 125661, 158974, 245906, 205038, 170651, 152833, 156096, 132909, 108472, 141328]
6668A41328K5853o0364o4629j0880m321P0258R3211p5810l6731O1116j461m8597
6656H8973j7322j22001N7960N323O2832P8213j6677m8758k1066Q9399m9982K856
6644A09750N9545p637p2034j823P7639Q1935j14744j07434l9633J2519M3746Q3096
6632A24925n058O6587n8888j4729n3427M2994n0646j6020P1354j4637l9189L0590
6620H3856O2885P634l5518j3441L7913m8512j1488Q0791l8846J9969N553k7518
6608A23278J5128N8716j0971n1811p8124k9816M3667L098k2616J6913N8545K1838
6596A47845k3454l7157n6046P9609m066J4986J5039L942o7604j7435P1417l993
6584A23083K3987o8921j07458J8633L1660L3177P383L2604L6946o6237K2588L5761
$$ y = [141328, 167181, 106817, 42188, 31308, 26987, 97245, 190456, 114646, 77915, 139031, 137570, 88973, 71651, -50350, 7610, 12933, 75765, 153978, 137301, 88543, 67477, 156876, 106894, 109750, 169295, 161658, 89624, 87801, 165440, 247375, 132631, 25197, -14436, -1917, 41829, 124925, 119867, 186454, 127566, 112837, 59410, 102404, 51758, 35738, 107092, 92455, 53266, 83856, 146741, 154375, 118857, 105416, 143329, 94817, 83329, 164120, 125274, 145243, 150796, 123278, 138406, 197122, 186151, 134340, 56216, 26400, 70067, 73165, 50549, 67462, 126007, 147845, 124391, 87234, 31188, 110797, 106731, 121717, 136756, 140698, 73094, 55659, 127076, 123083, 147070, 78149, -29309, -10676, 20984, 54161, 61544, 94148, 131094, 64857, 87445, 123206]
6572A23206L1391M3792N0186n8349O92k7394N6119p7704m5133q5082L1890P0750
6560A14364k5036L5878J7193k5688l2774O4641L9709l3501l2993K2414n2335j1582
6548H0290M6369k1179J8243J6387j0505M5851L6095k8233p9500O5133n0173M2943
6536A61721J0439m5256M9574m6149O4045K9341m5317l6905L9060k3261o2592j6634
6524G8066l3250J8789Q2424j3470l7094Q6108k9416Q986m9291J7305N6355m487
6512A81025P86m2659k8359L9983O55l1565j853J5610R513p8642o5637O6248J38894
6499B03999p716p3597L0364J11810m6798m6322j3032N0845m8108K2583m1671K5963
6487A68320j5949l4839M294M2213J0333L0265j2050l1488J3161l9608N952M2307
$$ y = [123206, 154597, 198389, 248575, 190226, 190918, 163524, 219643, 141939, 96806, 11724, 43614, 114364, 89328, 125206, 142399, 116711, 83937, 148578, 188287, 154786, 121793, 144207, 91872, 80290, 126659, 105480, 123723, 140110, 129605, 175456, 211551, 183318, 103818, 168951, 118778, 161721, 172160, 126904, 176478, 130329, 194374, 223715, 178398, 141493, 180553, 157292, 94700, 78066, 44816, 63605, 146029, 132559, 95465, 181573, 152157, 161143, 111852, 129157, 185512, 181025, 181811, 139152, 110793, 150776, 151431, 119866, 118013, 133623, 143136, 64494, -1143, 65105, 203999, 196283, 122686, 153050, 264860, 218062, 171740, 158708, 209553, 161445, 184028, 142357, 168320, 152371, 117532, 121826, 164039, 174372, 204637, 192587, 161099, 174260, 134652, 140604, 182911]
6475A82911K4952l8557m9959M9002K896J7208j5809K8536J3474L3059K5929m399
6463B69243q557j7709J2245m4586l6339J3161l9893R8044Q8054j24032k7833L2548
6451B14346K7930j062M679J6237J08m3863M9523L4316J3778k2857J4902o1155
6439B46882j873k0782K5150M0014j4327l5369L6580r020k3507m3527L1735k8914
6427B03042M0382J04730L7393l3882o2977J7782N6025J8228m2062N636P6821l1434
6415C89684m7101K6304R491J11124K3440k6181m6630N8868O5172l489l7348l6267
6403D87067k310J6351n1855N998Q5912n6646l2394K8764k6497J3666Q1051L1683
6391E80790L9731J6161k2900L8845J01485l8621n401k8894N2046M3278O2624K8205
$$ y = [182911, 207863, 169306, 119347, 168349, 171245, 188453, 172644, 201180, 214654, 247713, 273642, 269243, 260686, 242977, 255222, 210636, 174297, 187458, 147565, 245609, 333663, 209631, 181798, 214346, 242276, 241214, 245893, 262130, 262238, 218375, 267898, 302214, 315992, 293135, 308037, 246882, 245009, 224227, 249377, 289391, 275064, 239695, 276275, 267255, 243748, 200221, 231956, 203042, 243424, 348154, 385547, 351665, 288688, 306470, 362495, 380723, 338661, 344297, 421118, 389684, 342583, 368887, 378378, 489502, 512942, 486761, 440131, 498999, 564171, 560682, 523334, 487067, 484757, 501108, 449253, 455251, 541163, 484517, 452123, 480887, 454390, 468056, 549107, 580790, 620521, 636682, 613782, 652627, 754112, 715491, 710090, 681196, 733242, 776520, 839144, 867349]
6379H67349R291m966j00404k5360j3891p1444L9380O2064K9376j6437l900K5417
6367G96475M3680K4336l0973j2206q238q9240L0037Q7919K031L056m4302Q491
6355H11066n4500R6008K8202l790P098j666r140M1822M9786J9318O4750L0217
6343A079171r670n4960o5739l7255m2579K6396n9880r3794j0975j2813o4026k0349
6331F33527M8913k8091J1384J4928N2364j2017n8659O1889L4521K2449J701N30
6319G83439l8464O1255N3985o0910k1959o6602J8333L1788L9779q1499q7106L9851
6307F71890M9190j4182J481l3085J6202m42J9117R2911K1380m4527q9719J02726
6295G92942l4994j00074K5588P9955J5981l0827K2366M8213l4565K9596m3026
$$ y = [867349, 876640, 871674, 771270, 745910, 732019, 660575, 699955, 762019, 791395, 774958, 771058, 796475, 840155, 864491, 833518, 821312, 813074, 723834, 753871, 841790, 843821, 846877, 802575, 811066, 756566, 852574, 880776, 876986, 884084, 882418, 873278, 915100, 964886, 984204, 1048954, 1079171, 1069501, 1014541, 948802, 911547, 868968, 895364, 835484, 741690, 730715, 717902, 653876, 633527, 682440, 654349, 665733, 680661, 733025, 721008, 662349, 724238, 758759, 781208, 782909, 783439, 744975, 806230, 860215, 799305, 777346, 710744, 729077, 760865, 800644, 719145, 632039, 671890, 721080, 706898, 708379, 675294, 691496, 691054, 710171, 803082, 824462, 779935, 690216, 792942, 757948, 657874, 683462, 763417, 779398, 748571, 770937, 819150, 784585, 814181, 771155]
6284G71155K3510L112l9859M25O8534J27400j25023m3165O8284o9J0956M8597
6272I13857O1521m8350L0321K5655L4333J7652L593l0961J8894K7748n172l6795
6260A012296Q3564L6037n5589K7906q9685l0949K0364q439J2586O5560L0456o735
6248A097372L4029j8743L078M9719Q2776L0310j1180P857Q050J041N7756Q1626
6236A423691R3707k5291l5024n780m3671r9864j4041M2100n5266r395K2526K4292
6224A317984m0451J0932m4971k4188J3005P4460r386J15642n0763o6115O4148
6213A360297R7099O1681O05k4108P4562M243k0487N7906M0470r427n5568l6035
6201A551238p198j7760j0047K6829l8810j7591L8462j4197R4720n6808K5501J08019
$$ y = [771155, 794665, 797777, 757918, 758343, 826877, 954277, 829254, 786089, 854373, 854304, 865260, 913857, 975378, 927028, 957349, 983004, 1017337, 1034989, 1038582, 1007621, 1026515, 1054263, 1049091, 1012296, 1095860, 1131897, 1076308, 1104214, 1014529, 983580, 1003944, 995505, 1008091, 1073651, 1104107, 1097372, 1131401, 1112658, 1115736, 1165455, 1248231, 1278541, 1267361, 1275218, 1283268, 1284309, 1342065, 1423691, 1517398, 1492107, 1457083, 1451303, 1407632, 1307768, 1293727, 1335827, 1280561, 1271166, 1293692, 1317984, 1277533, 1288465, 1243494, 1219306, 1232311, 1306771, 1297385, 1413027, 1362264, 1296149, 1360297, 1457396, 1519077, 1519682, 1495574, 1570136, 1574379, 1553892, 1611798, 1652268, 1642841, 1587273, 1551238, 1544040, 1526280, 1516233, 1543062, 1504252, 1486661, 1525123, 1510926, 1605646, 1548838, 1574339, 1682358]
6189A682358J6708n4334J644O6623m6263J06655L3153J5440M130L2110M486j9325
6177A843385L1432R987N7861M5994m1087q08O1943J8993l2561R3889J5079o6522
6165B037585J08554N3051N4900L5105Q4699M7057r0302R979O1672O1490M2767
6154B506557R176P5425J09912O6471L7145M3095N9635L0946L4095N8800O4217
6143C095474O7743O4601L134L0454O3088K4352P5080J42610K3278M6518J6100
6132C652432J34069J51343J07351q474R5587J21202M8487J07831J5065O7553J08420
6121D600866P8129J06543J7527Q2760J55140J38766J28356P9214Q7082J08912
6111E583295J82638J47982J19945K02116K56894R2649J59634K36489K28971K73759
$$ y = [1682358, 1699066, 1644732, 1646376, 1712999, 1666736, 1773391, 1806544, 1821984, 1826114, 1858224, 1862710, 1843385, 1874817, 1884804, 1942665, 1988659, 1947572, 1946764, 2008707, 2027700, 1995139, 2089028, 2104107, 2037585, 2146139, 2199190, 2254090, 2289195, 2373894, 2420951, 2330649, 2340628, 2402300, 2463790, 2506557, 2515733, 2591158, 2701070, 2767541, 2804686, 2847781, 2907416, 2938362, 2972457, 3031257, 3095474, 3163217, 3227818, 3230952, 3261406, 3324494, 3348846, 3423926, 3566536, 3589814, 3636332, 3652432, 3786501, 3937844, 4045195, 4036721, 4132308, 4253510, 4301997, 4409828, 4424893, 4492446, 4600866, 4678995, 4785538, 4803065, 4885825, 5040965, 5179731, 5308087, 5387301, 5474383, 5583295, 5765933, 5913915, 6033860, 6235976, 6492870, 6585519, 6745153, 6981642, 7210613, 7484372]
6101G484372J85160K60612K78246L36668K97342J93703L81947L91568K31227L17125
6091A0357970M30201K12293L60138L18496M74551O13256O89314Q43678Q37981
6082A5137878J041291J120741J171634J365983J573769J789413K139391K463475
6074B7803575K996781L535929M077487M391639L838562J871116m88216k177854
6066D5849019k995980l214969l006433k582899k033579j483139j010829n17392
6058B9003799m0838M60509Q09502J107429J374408J712319J972849K382708K928688
6049D1711373L502042M373934N252487O481207P786076Q377827P176539M035749
6041H8697234m39678m717438p293609q234993p794014o926867n778919m532326
$$ y = [7484372, 7669532, 7930144, 8208390, 8545058, 8842400, 9036103, 9418050, 9809618, 10040845, 10357970, 10788171, 11000464, 11360602, 11679098, 12153649, 12766905, 13456219, 14299897, 15137878, 16179169, 17299910, 18471544, 19837527, 21411296, 23200709, 25340100, 27803575, 30800356, 34336285, 38413772, 42805411, 46643973, 48515089, 48026873, 45849019, 42853039, 39638070, 36631637, 34048738, 32015159, 30532020, 29521191, 29003799, 28962961, 29423470, 30232972, 31340401, 32714809, 34427128, 36399977, 38782685, 41711373, 45213415, 49587349, 54839836, 61321043, 69107119, 77484946, 84661485, 88697234, 88257556, 83540118, 76246509, 68011516, 60217502, 53290635, 47511716, 42979390]
6033D2979390l501690k630220j894492j315375p62630k59883M2312L32172N19362
6024C3508946P00252R20027J396818J911227K147689K749322L431697L843804
6016E0609782L668654K200182p0925j989546k909106k726494k013613j413464
6008D5355470k144899k891026l358208l354694k696617k462021k016720j536469
6000B4894816j089535r22928o87478o00858p98882p80028o52046o26672n66282
5991A8170107l61731k33129k07164j22077j7498J23232J18714K25620M92550N79137
5981A8767761Q48465J006178J439400J964973K293369J274918j92644j224621
5973B6177799j970887j567756j377961j289998r87226q55645o67827m53578l55476
$$ y = [42979390, 39477700, 36847480, 34952988, 33637613, 32874983, 32615100, 32657412, 32989584, 33508946, 34209198, 35129225, 36526043, 38437270, 40584959, 43334281, 46765978, 50609782, 54278436, 56478618, 56407693, 54418147, 51509041, 48782547, 46768934, 45355470, 43210571, 40319545, 36961337, 33606643, 30910026, 28448005, 26431285, 24894816, 23805281, 22882353, 22194875, 21594017, 20795135, 20015107, 19363061, 18736389, 18170107, 17808376, 17575247, 17368083, 17246006, 17228508, 17351740, 17470454, 17696074, 18188624, 18767761, 19616226, 20622404, 22061804, 24026777, 26320146, 27595064, 27402420, 26177799, 24206912, 22639156, 21261195, 19971197, 18983971, 18128326, 17460499, 17006921, 16651445]
5964A6651445k35868j30428M2658P2877M9307Q3130L8798J20164J27802J00569
5954A6920454K19155K07684L54787M66836O47447P86661Q89683J147183J426901
5945B3066791J752995J564271J220653J036635Q61090J249857J548223J895910
5937C4196425K330874K690166L276360L700575L949430L461989J581761n12423
5929E4675157k209315l120569l322100l160600k601908k051077j473303r13513
5921C5822772l81500L6777M52089Q20586J065308J370094J712219K017084K559360
5912D5474789L318616M021631M817737N653502O332373P169222P297854N712786
5904H9798510K325940j793166n357545p086021p427061p066527o271889n157342
$$ y = [16651445, 16415577, 16285149, 16327807, 16400684, 16449991, 16533121, 16571919, 16692083, 16819885, 16920454, 17139609, 17347293, 17702080, 18168916, 18816363, 19603024, 20492707, 21639890, 23066791, 24819786, 26384057, 27604710, 28641345, 29502435, 30752292, 32300515, 34196425, 36527299, 39217465, 42493825, 46194400, 50143830, 53605819, 55187580, 54675157, 52465842, 49345273, 46023173, 42862573, 40260665, 38209588, 36736285, 35822772, 35441272, 35478049, 35930138, 36750724, 37816032, 39186126, 40898345, 42915429, 45474789, 48793405, 52815036, 57632773, 63286275, 69618648, 76787870, 84085724, 89798510, 92124450, 90331284, 84973739, 77887718, 70460657, 63394130, 57122241, 51964899]
5896E1964899m149318l079340k241145j588131j096302n60362m20279k60042Q866
5887C8578846K32079L52780O23329J036924J447205J982183K538541L091786L077980
5878E2961653K526775O33283j728872l355156m011256m030600l737753l321292
5870C5936782k950698k548644k047021j703107j295400j028404q34088p01057
5862B2828363l96755j98478m3087k88830p58350r42849j058295j020053r82114
5853A7139552r22709q86062q30198o25386n05236m24400l17781k45433j96108
5844A2186239k81667k71549k39817k36330k46745l05611k16410j18413o5663k4445
5834A0179589Q8635J81614J66289L619j23744m38882m77437k92125l87817l74859
$$ y = [51964899, 47815581, 44736241, 42495096, 40906965, 39810663, 39250301, 38830022, 38569980, 38578846, 38810925, 39163705, 39787034, 40823958, 42271163, 44253346, 46791887, 49883673, 52961653, 55488428, 56121711, 54392839, 51037683, 47026427, 42995827, 39258074, 35936782, 32986084, 30437440, 28390419, 26687312, 25391912, 24363508, 23529420, 22828363, 22431608, 22233130, 22190043, 21901213, 21142863, 20200014, 19141719, 18121666, 17139552, 16216843, 15330781, 14500583, 13875197, 13369961, 12945561, 12627780, 12382347, 12186239, 11904572, 11633023, 11393206, 11156876, 10910131, 10604520, 10388110, 10269697, 10204034, 10179589, 10268224, 10449838, 10616127, 10619746, 10496002, 10057120, 9579683, 9287558, 8899741, 8524882]
5824H524882j95504k39534k96903l18895l64153l45035l04014k93953k08134k69333
5814E689424k99612k00953j42198j43520j63446j37984o2521j0803j51695l0802
5804D345890m4235K270j5253q9968L6672l8681j77152k9765o0613o081m0958q0916
5792C801210k6483J55m0251j59058k12592j08085p3463q9632j39142n2629l6535
5781B863495j42045l7565j6157k7829r2501p6776k1225k2649P8025l558p9127
5770B422088j7010j16196m2929L4096J4999r3724j21349j05015J8850n5007p3649
5759A865154k748n8940n467o3144m8311O995o5864M7485K9902k151p4710q972
5747A619229m7518q4250M9728k4964k7936O1991K7592k8879j6854N997j0031J5294
$$ y = [8524882, 8329378, 8089844, 7792941, 7474046, 7109893, 6764858, 6460844, 6166891, 5958757, 5689424, 5389812, 5188859, 5046661, 4903141, 4739695, 4601711, 4539190, 4528387, 4376692, 4345890, 4301655, 4303925, 4288672, 4198704, 4235376, 4196695, 4019543, 3989778, 3929165, 3923084, 3882126, 3801210, 3774727, 3774882, 3734631, 3575573, 3362981, 3254896, 3181433, 3091801, 2952659, 2900030, 2863495, 2721450, 2683885, 2667728, 2639899, 2547398, 2470622, 2449397, 2426748, 2504773, 2501215, 2422088, 2405078, 2288882, 2245953, 2280049, 2295048, 2201324, 2079975, 1974960, 1993810, 1938803, 1865154, 1862406, 1803466, 1797999, 1734855, 1686544, 1693539, 1627675, 1675160, 1705062, 1702911, 1628201, 1619229, 1571711, 1487461, 1537189, 1512225, 1484289, 1546280, 1573872, 1544993, 1528139, 1534136, 1524105, 1539399]
5735A539399Q6648m3727j31842N4378J30989n130j1400N0905M2276P0244k6809
5724A755931M4806l9741j02540O3081m7742j03421k5852R186n4251K8191K9549
5713A557197K1568p3448k6584J7735m6662o3430P6106M7844j0045L6507J28308
5702A665096N8611j1659N2630M1974J12524M6884j2740r8281j16630p6234n3595
5691A608580m1211m8786j38767j9483p7608J8133j6946L0518m4005r0048J537
5680A181914r6808J29897L0960j8683J877r8476Q968P8105P6167J08856l7730
5669A365047n4979m3491l4290R567k9879r3616j2845o4446p9295M2693M21q5325
5657I19562k556j20314N3305p4847O4409L370M3191p2201r3843N3910J5517l5275
$$ y = [1539399, 1626047, 1582320, 1450478, 1504856, 1635845, 1630715, 1619315, 1670220, 1712496, 1782740, 1755931, 1800737, 1760996, 1658456, 1721537, 1673795, 1570374, 1544522, 1553708, 1499457, 1527648, 1557197, 1578765, 1505317, 1478733, 1496468, 1449806, 1386376, 1462482, 1510326, 1500281, 1536788, 1665096, 1723707, 1712048, 1764678, 1806652, 1919176, 1966060, 1953320, 1855039, 1738409, 1662175, 1608580, 1567369, 1518583, 1379816, 1360333, 1282725, 1300858, 1283912, 1314430, 1270425, 1180377, 1181914, 1085106, 1215003, 1245963, 1227280, 1229157, 1130681, 1139649, 1217754, 1293921, 1402777, 1365047, 1310068, 1266577, 1232287, 1241854, 1211975, 1118359, 1105514, 1041068, 961773, 1004466, 1004887, 919562, 917006, 796692, 849997, 775150, 839559, 842929, 886120, 813919, 720076, 773986, 789503, 754228]
5645G54228L6978P7095m6129k7726m923j6673n6276Q0084O3007K9759m144j6978
5633H68302M713J04163j2476n4805q7177k6558k4146L1258n6473n6768L1347K1504
5621G42884k8411P4569m2006o5284N715J040j5670l4327J4912N3376L0237m9089
5609F87946O770J37545l8912j07070L0566N8314L3582l2485m9135M8528J1323
5598G86972P1584q0721O4305k8543n4549p6869K5344j5165j3872j3212n0577O7634
5586F82331o515L5947K4632p769n2020J8185l0318Q2407J0638O2519Q417L3625
5574H62079n4277k0561Q0936Q1489M2597N8322j01749o8609P378L6295k2726l0370
5562H70804j8038n8542k726q1499L0794k6380l3357J3426k636M7261L2019J014
$$ y = [754228, 791206, 868301, 822172, 794446, 789523, 772850, 716574, 796658, 859665, 889424, 885280, 868302, 873015, 977178, 964702, 909897, 822720, 796162, 772016, 803274, 746801, 690033, 721380, 742884, 714473, 789042, 747036, 681752, 687467, 688507, 672837, 638510, 653422, 706798, 737035, 687946, 694716, 832261, 793349, 686279, 716845, 775159, 808741, 776256, 727121, 775649, 786972, 858556, 777835, 842140, 813597, 759048, 682179, 707523, 692358, 678486, 665274, 614697, 682331, 675816, 711763, 736395, 728626, 676606, 694791, 664473, 746880, 757518, 820037, 828454, 862079, 807802, 787241, 868177, 949666, 992263, 1050585, 948836, 880227, 887605, 923900, 901174, 870804, 852766, 794224, 791498, 709999, 740793, 714413, 681056, 694482, 691846, 739107, 771126, 772140]
5550G72140J0889N4100l9636j04269O2435L4554Q7406N8416j274K3698p7133k7936
5538H53390j188P1160j0769m937o06q4648L8696L7517J718J7205K6473K2559k238
5525I64332r1831q4277j3932P8981J9073O3337m2589m0636n872j2661N352L034
5513H42311l9810k5113Q352k9520m2941M2814M7446M774l0523p2872l098n9994
5501F41826Q3825L351l4621P3266j372N0324L7171L381k4287o778P029l7689J45757
5488I41183P265m5641K1025J8500L3058m503j5436K3077J5299m8131J467Q4984
5476A032147o2279q324M7686l869K930N5558l8808P4059k6125m8368M2511q3788
5464I83330J1128O295j9787K12J6776N4438K7779N8558M2488K82R6803J8313P8858
$$ y = [772140, 783029, 837129, 797493, 693224, 755659, 790213, 877619, 936035, 934761, 958459, 881326, 853390, 852202, 923362, 912593, 907656, 907050, 822402, 861098, 898615, 900333, 917538, 944011, 966570, 964332, 872501, 788224, 774292, 853273, 872346, 935683, 893094, 852458, 846586, 833925, 839277, 842311, 802501, 777388, 785740, 756220, 713279, 756093, 803539, 808313, 777790, 704918, 701820, 641826, 725651, 729002, 694381, 767647, 766275, 816599, 853770, 857151, 832864, 826086, 833115, 795426, 941183, 948448, 902807, 923832, 942332, 975390, 970887, 955451, 978528, 993827, 945696, 947163, 1032147, 969868, 961544, 1009230, 1005361, 1008291, 1063849, 1025041, 1099100, 1072975, 1024607, 1067118, 983330, 994458, 1000753, 980966, 981178, 997954, 1052392, 1080171, 1138729, 1181217, 1181499, 1278302, 1296615, 1375473]
5451A375473p081N3341J35055J75161J82603J15482O0709j51889m3040q4392j06904
5440A704518n7524j23215R575p5839j27818k4733M557R4140L3304L4J68504J00470
5428A705973q008J6465Q3859P5243P1465J01955J52885J58885K08282L20837K60075
5417C147916N7638r0908k23317k89172k73746k11857j55301j91720r0394r1321
5407A587818o2032l1472l9978k2182m0656J1272K5945J57543r3596j3255N9025
5396A538432n054M361P1324P5571J33119J94497J55098J9660o4190j81996j32016
5385A808806j1578k00324j10465j48217m3724o2210o9431m1965J1456R005p9830
5374A061523k4492K3377L5164L6738j08280m2477l723J19566M1129l0138K4866
$$ y = [1375473, 1368392, 1421733, 1556788, 1731949, 1914552, 2030034, 2090743, 1938854, 1895814, 1811422, 1704518, 1646994, 1523779, 1533354, 1457515, 1329697, 1304964, 1309521, 1403661, 1436965, 1436999, 1605503, 1705973, 1697965, 1714430, 1798289, 1873532, 1944997, 2046952, 2199837, 2358722, 2567004, 2887841, 3147916, 3205554, 3114646, 2891329, 2602157, 2328411, 2116554, 1961253, 1769533, 1679139, 1587818, 1525786, 1494314, 1454336, 1432154, 1391498, 1402770, 1428715, 1586258, 1492662, 1479407, 1538432, 1533378, 1537739, 1609063, 1684634, 1817753, 2012250, 2167348, 2187008, 2122818, 1940822, 1808806, 1797228, 1596904, 1486439, 1338222, 1294498, 1232288, 1162857, 1120892, 1132348, 1141353, 1061523, 1037031, 1060408, 1095572, 1132310, 1024030, 981553, 977830, 1097396, 1138525, 1108387, 1133253]
5363A133253R522p1508J0772K5680j3818k915J14142O816K146k504J1040N4991
5351A277617J06302L4063l9748R7030P3850L8085J33846J23534K5765Q8395J70975
5340B129714J48487J28486O9118N3972J10599M7685l4615j00046p9337o6165J8664
5329B426562n8813l9538p1142N2756J51250R2028o4573J70261R7221J27961J66785
5318C050758K04241K25559J51329K89086K81975L38557K41578K89574L81438J98678
5308E652773J20496n8570j48396l47054k92876k50533k15025j66892j50870j68019
5298C975034j16484r9067J669m5329o8503L7687N1172R9601J12801J35986K07635
5287D292202K38300K04386M27381L32275J82111L36325K16357R2711o9732k93316
$$ y = [1133253, 1142775, 1071267, 1082039, 1107719, 1093901, 1090986, 1205128, 1211944, 1214090, 1211586, 1222626, 1277617, 1383919, 1417982, 1378234, 1475264, 1549114, 1587199, 1721045, 1844579, 1870344, 1958739, 2129714, 2278201, 2406687, 2475805, 2529777, 2640376, 2688061, 2653446, 2553400, 2474063, 2407898, 2426562, 2367749, 2328211, 2257069, 2309825, 2461075, 2553103, 2488530, 2658791, 2756012, 2883973, 3050758, 3254999, 3480558, 3631887, 3920973, 4202948, 4541505, 4783083, 5072657, 5454095, 5652773, 5773269, 5714699, 5566303, 5219249, 4926373, 4675840, 4460815, 4293923, 4143053, 3975034, 3858550, 3759483, 3761152, 3715823, 3647320, 3685007, 3736179, 3835780, 3948581, 4084567, 4292202, 4530502, 4734888, 5162269, 5494544, 5676655, 6012980, 6229337, 6322048, 6252316, 5959000]
5277E959000l22506m46232l51629j82537k68411j43619k02687j73756n3970j54800
5267C658853k55367j77406n2491j26425j07773j2648O4190k8951L7603O1273L5653
5256C096511Q8476J63476Q4083K5316q0037j41166j52436j00767j11591k0220
5246B851645r8287j40722o2277o9380k7027p5000o0225l0485j21760j38539j09819
5235A918124n639n3120p5849o1392K6398o5335j20005q6199J7064q2834m2836
5224A368377n3319K9526L4524l593N3929k8424j5950q0534R782l3836j06576k4467
5212A149439O6862L3981M3839p780q2922p4494j09442j0157M5829q618J3346M9645
5200A109528K1013p7731L1497M622n5794k2030k8752J2621o6426M5494Q479J6071
$$ y = [5959000, 5636494, 5190262, 4838633, 4656096, 4387685, 4244066, 4041379, 3867623, 3813653, 3658853, 3403486, 3226080, 3173589, 3047164, 2939391, 2926743, 2990933, 2961982, 2999585, 3060858, 3096511, 3184987, 3348463, 3432546, 3457862, 3377825, 3236659, 3084223, 2983456, 2871865, 2851645, 2753358, 2612636, 2550359, 2480979, 2453952, 2378952, 2318727, 2288242, 2166482, 2027943, 1918124, 1912485, 1859365, 1783516, 1722124, 1748522, 1683187, 1563182, 1476983, 1494047, 1411213, 1368377, 1315058, 1344584, 1379108, 1375515, 1429444, 1401020, 1385070, 1304536, 1314318, 1280482, 1173906, 1149439, 1216301, 1250282, 1294121, 1286341, 1203419, 1128925, 1019483, 1009326, 1055155, 1046537, 1059883, 1109528, 1130541, 1052810, 1084307, 1088929, 1033135, 1011105, 982353, 994974, 928548, 974042, 982521, 998592]
5188I98592q3084n0249k3283j12889K1292J0811o4257j2589J845J290j2213m5274
5176F29992Q6384J0689M4935J4291m6057l3482j1896J2010P9044q0971o1164K0652
5164F64427O3115j7047j4209O4770L6877K9794q3583l5564l4817K5790l4911m0298
5152F24344M8581k4316l4692j4743J03988P3376m1660N6843k8967j8431Q944J107
5140G54374o2415N436Q0316P6848o1420m6140L7628L0151J527k6274N9399k048
5128H47382L2168J25302N8242p314M6914k6169k5727p8505q3919Q1517k3019l5692
5116I11180Q2410K3540o3697N4112K5920J5074L4077j6400O7810q0325k9538l0347
5104I93816J9030M1648K8509M060J3960K1319J06540N3807p1149L5152K7038Q5854
$$ y = [998592, 915508, 865259, 841976, 729087, 750379, 761190, 696933, 684344, 686189, 687479, 675266, 629992, 716376, 727065, 772000, 786291, 740234, 706752, 694856, 706866, 785910, 704939, 643775, 664427, 727542, 710495, 696286, 761056, 797933, 827727, 744144, 708580, 673763, 699553, 664642, 624344, 672925, 648609, 613917, 599174, 703162, 776538, 734878, 791721, 762754, 744323, 753267, 754374, 691959, 697395, 777711, 854559, 793139, 746999, 784627, 814778, 816305, 790031, 849430, 847382, 879550, 1004852, 1063094, 1055780, 1102694, 1076525, 1050798, 972293, 888374, 969891, 946872, 911180, 993590, 1017130, 953433, 1007545, 1033465, 1048539, 1082616, 1066216, 1134026, 1053701, 1024163, 993816, 1012846, 1054494, 1083003, 1087063, 1101023, 1122342, 1228882, 1282689, 1211540, 1246692, 1273730, 1359584]
5092A359584O8045J01649J28600P584K06591K96500J46050Q5035j10943n3498
5082B235197p5672j32045j8366n2289k8700L90k1542j03793p0242p6205n8491
5071A598242r1679Q892o5526L596q0003l7669r0075o6238O2790J9579j25919K7930
5059A163920J00041k6804o1456J07117L5558j08571K8692J6005O2207R0041O8535
5048A475285P2410o091R8493P3802Q3457o9098l3423l1059n3144l9298q7298j35119
5036A348917p6313L0017m8720j8983M0494K1934p8265m719j3645j2028l9240O3205
5024A212654p869n4776R7771P5355j8638m535k7931m0929J5060O2945P3947m5581
5012A337473J5223J5519K2552R2165j29544R868k5581j31944j8629P1442L192
$$ y = [1359584, 1427629, 1529278, 1657878, 1665462, 1872053, 2168553, 2314603, 2399638, 2288695, 2235197, 2159525, 2027480, 2009114, 1956825, 1928125, 1928515, 1906973, 1803180, 1732938, 1656733, 1598242, 1506563, 1515455, 1449929, 1453525, 1373522, 1335853, 1245778, 1179540, 1242330, 1261909, 1135990, 1163920, 1263961, 1237157, 1175701, 1282818, 1318376, 1209805, 1238497, 1254502, 1316709, 1406750, 1475285, 1547695, 1541604, 1640097, 1713899, 1797356, 1728258, 1694835, 1663776, 1610632, 1571334, 1484036, 1348917, 1272604, 1302621, 1253901, 1234918, 1275412, 1297346, 1219081, 1214362, 1200717, 1188689, 1149449, 1212654, 1204785, 1150009, 1247780, 1323135, 1304497, 1299962, 1272031, 1231102, 1246162, 1309107, 1383054, 1337473, 1352696, 1368215, 1390767, 1482932, 1353388, 1363256, 1337675, 1205731, 1187102, 1258544, 1261736]
5001A261736O7135k238L340j3493J510m9999K1338J2149J08275q6591q761M7772
4989A362173j8349J0819Q9244J1744j968P6470m1511O392K8412K3025M7820L3711
4977A627982N5358p3097J7393l6524M0234l7252Q1851J230j3500j0883k1024m2592
4965A589176J1965K2137k660L0851k2076K8563n8063M2783l940j8125K6091P3245
4953A719947R7535m1994N5964k6945J1432k6196k2202N8027L3411k069N3393O6084
4941A976387J48161N3380M2226J32193n4427K7606Q8419n0097m3742J8908P1323
4930B410337j3088o8273l1121L1311P0311l3P1768o6295K937p430o2285J1562
4918B349701M0978K2994N0536r324J15624O1296K7407L2917N5383R956M4635Q8464
$$ y = [1261736, 1328871, 1326633, 1329973, 1316480, 1317990, 1267991, 1289329, 1301478, 1409753, 1323162, 1314401, 1362173, 1343824, 1354643, 1443887, 1455631, 1453663, 1530133, 1488622, 1495014, 1523426, 1546451, 1594271, 1627982, 1683340, 1610243, 1627636, 1591112, 1631346, 1594094, 1675945, 1677175, 1663675, 1652792, 1631768, 1589176, 1601141, 1623278, 1620618, 1651469, 1629393, 1657956, 1599893, 1642676, 1638736, 1620611, 1646702, 1719947, 1817482, 1775488, 1831452, 1804507, 1815939, 1789743, 1767541, 1825568, 1858979, 1856910, 1910303, 1976387, 2124548, 2177928, 2220154, 2352347, 2297920, 2325526, 2413945, 2363848, 2320106, 2339014, 2410337, 2397249, 2328976, 2297855, 2329166, 2399477, 2399444, 2471212, 2404917, 2407854, 2400424, 2338139, 2349701, 2390679, 2413673, 2464209, 2454885, 2570509, 2631805, 2659212, 2692129, 2747512, 2757468, 2802103, 2890567]
4906B890567K3267Q915L5826J05676J12681J3206N9034M0590J05003K9780R0238
4895C514783J18051J29602K0740P5878N6649J17698M1572n080O6789J76357J07391
4884D420430L8698J2414M4546N4938J14178J05405J65431N837J15750N6354J96844
4873E330825Q7315J70334R9111J33303J56624J37419J11279K35888K35284J74083
4863F871465K90828L49512L64895M06601L41478L25076K09639K68191K92186L69176
4853A0089047L21400M83178O39629O50530M06342J67413j92088j63957R154Q5900
4843A2496548J01786J83463J74670K22523L44117L43969L43543L53538L07116
4834A4871273L21482M21808M98690N53749O78803P40139P77210J014316J353274
$$ y = [2890567, 2913834, 2922749, 2958575, 3064251, 3176932, 3190138, 3249172, 3289762, 3394765, 3424545, 3514783, 3632834, 3762436, 3783176, 3859054, 3915703, 4033401, 4074973, 4069893, 4136682, 4313039, 4420430, 4459128, 4471542, 4516088, 4571026, 4685204, 4790609, 4956040, 4961877, 5077627, 5133981, 5330825, 5418140, 5588474, 5687585, 5820888, 5977512, 6114931, 6226210, 6462098, 6697382, 6871465, 7162293, 7511805, 7876700, 8283301, 8624779, 8949855, 9159494, 9427685, 9719871, 10089047, 10410447, 10893625, 11533254, 12183784, 12590126, 12757539, 12565451, 12401494, 12410648, 12496548, 12598334, 12781797, 12956467, 13178990, 13523107, 13867076, 14210619, 14564157, 14871273, 15192755, 15614563, 16113253, 16667002, 17345805, 18085944, 18863154, 19877470, 21230744]
4825B1230744J528620J594001J480278J606126J949699K071638K846254L413459
4817C7720819M129020N268054P100465R761532J0295871L309382k719439p476853
4809F7388851p723319o217225o283395m879772l600262k311016j504937q58233
4801C4010692o03663o1491N2936M08027M91464O66761Q34587R32343J137897J472163
4791C9341716J823588K247736K730391L411077M289238N478174O032031N343079
4783G0697030M787629N047872O478654P604750J0082007J2770747J5582602J9345847
4775A52397138K6356566L5564075L9593424J7454097j0216703l0820177l4129521
4768A96198899k8800252k8917350k4065184j9218653j4241337j1071225q397493
$$ y = [21230744, 22759364, 24353365, 25833643, 27439769, 29389468, 31461106, 34307360, 37720819, 41849839, 47117893, 54218358, 63979890, 74275761, 77585143, 74865704, 67388851, 59665532, 53448307, 47164912, 42285140, 38684878, 36373862, 34868925, 34010692, 33407029, 33345538, 33398474, 33806501, 34297965, 34964726, 35799313, 36731656, 37869553, 39341716, 41165304, 43413040, 46143431, 49554508, 53843746, 59321920, 65353951, 70697030, 75484659, 80532531, 87011185, 94615935, 104697942, 117468689, 133051291, 152397138, 178753704, 214317779, 253911203, 271365300, 261148597, 230328420, 196198899, 167398647, 138481297, 114416113, 95197460, 80956123, 69884898, 61487405]
4761F1487405o976349n351409m483054l656712l244317k646747k329532j749291
4753C1049994j594401j318310j359742j274394j390978j089721j040730q59798
4745B1121920r12406o98066p06290n81667o94845n57255o17553o38598p05708
4736A5009532n36993n63682m25601m77829m09406l02979l03352l86787l67794
4727A1235109m76809l30990m16276m28781l29388j93818l58095k30628l21381
4718H148943k60491k68856k85995k74431j50689j98057j33495j25343j60813r9973
4708F190800j71186k13461p1944l7751q8716o9259r5860j47901m5618p9559m4668
4697E124877j21138r7197p1658j03465l7520n5737j28515j08372j0539r7170j06764
$$ y = [61487405, 54511056, 49159647, 44676593, 41019881, 37775564, 35128817, 32799285, 31049994, 29455593, 28137283, 26777541, 25503147, 24112169, 23022448, 21981718, 21121920, 20209514, 19511448, 18805158, 18223491, 17528646, 16971391, 16353838, 15715240, 15009532, 14472539, 13908857, 13483256, 13005427, 12596021, 12293042, 11989690, 11602903, 11235109, 10758300, 10427310, 10011034, 9582253, 9252865, 9059047, 8700952, 8470324, 8148943, 7888452, 7619596, 7333601, 7059170, 6908481, 6710424, 6576929, 6451586, 6290773, 6190800, 6019614, 5806153, 5734209, 5696458, 5607742, 5538483, 5442623, 5294722, 5249104, 5169545, 5124877, 5003739, 4906542, 4834884, 4731419, 4693899, 4638162, 4509647, 4401275, 4390736, 4293566, 4186802]
4686D186802j05132n0476p9547n0906p2275j1840o1888p2282n9498l0718k2015
4675C570225j3698p4511q8099m4254p1619o2117m4705n8278r0906m3740M6185
4664C024483p8539L8522o4952Q8424J4986L085r494M6384P5647O7879J27544K92323
4652C626292J56137J64261N6237R078j83447j86638k11344l10502j92084r0686
4642B837304j15331j02676m8151q223r7435J32698K6481J05275j6095Q0277J13967
4631B908091k014j43044j35205p2025j80077k07281q4325n2773q6939p156m4356
4620A892896q0294l0847j04793q2693l5685m5768n1064N9928j9115l4937Q8569
4609A556197O7122m8988l43m5271k6004M0973k710L2809R8577O007J9398p0344
$$ y = [4186802, 4081670, 4031194, 3951647, 3900741, 3828466, 3816626, 3754738, 3682456, 3622958, 3592240, 3570225, 3556527, 3482016, 3393917, 3349663, 3278044, 3215927, 3171222, 3112944, 3022038, 2978298, 3024483, 2945944, 2984466, 2919514, 3007938, 3022924, 3026009, 3016515, 3062899, 3138546, 3206425, 3333969, 3626292, 3782429, 3946690, 4002927, 4012005, 3828558, 3641920, 3430576, 3120074, 2927990, 2837304, 2721973, 2619297, 2571146, 2562923, 2465488, 2598186, 2624667, 2729942, 2713847, 2794124, 2908091, 2906077, 2763033, 2627828, 2555803, 2375726, 2168445, 2084120, 2031347, 1944408, 1937252, 1892896, 1812602, 1781755, 1676962, 1594269, 1558584, 1512816, 1461752, 1521680, 1502565, 1467628, 1556197, 1623319, 1574331, 1573988, 1528717, 1502713, 1543686, 1540976, 1573785, 1672362, 1678369, 1697767, 1627423]
4597A627423l9449J1630j2505m1382o0351r8222l1589L5012r6830L4052Q168o8993
4585A266964n0389O4462k8798O1384l0963n4133k7441K2203m3627p5863L8966
4574A142765L9397O801o0848k4544M7167m1140k9706M011n5705m9765Q1018R1225
4562A150676j0925r4578K1291N9247o0043o7291K9306J5223J8248j6735K9997
4551A074416M0465l7619j2810P085l9703K4583L1153o8066p432O9064k5321P512
4539A063327K081K5411L8083M3151L7465k2650l597J67795K0435K7184q6397l6992
4527A275296k1548J8735J7872l8217N612n0189l6168M286J6765J3151M2470J9260
4515A267325k4204j4195l2198K6670K2874l8318L5171N306j8822L2529l1041M9809
$$ y = [1627423, 1587974, 1599604, 1587099, 1545717, 1485366, 1387144, 1355555, 1390567, 1293737, 1327789, 1335957, 1266964, 1216575, 1281037, 1252239, 1313623, 1282660, 1228527, 1201086, 1223289, 1179662, 1103799, 1142765, 1182162, 1188963, 1128115, 1103571, 1150738, 1109598, 1079892, 1083903, 1028198, 978433, 1059451, 1150676, 1139751, 1045173, 1066464, 1125711, 1065668, 998377, 1027683, 1042906, 1061154, 1044419, 1074416, 1114881, 1077262, 1064452, 1071537, 1031834, 1056417, 1087570, 1019504, 1012072, 1081136, 1055815, 1063327, 1065408, 1090819, 1128902, 1172053, 1209518, 1186868, 1183271, 1351066, 1371501, 1398685, 1312288, 1275296, 1253748, 1272483, 1290355, 1252138, 1257750, 1207561, 1171393, 1175679, 1192444, 1205595, 1248065, 1267325, 1243121, 1228926, 1196728, 1223398, 1246272, 1207954, 1243125, 1248431, 1229609, 1262138, 1231097, 1280906]
4503A280906p907m4336J65275o885N7114J07226J1603M0326o792l2526N449L7886
4491A607339m3327l3740L5189P018p2581J2559p6044J3157R5727L7321k0070m0544
4479A522004m2230k2267P8907K8967Q8316J8189k8164j1774L671J8725J05454
4468A759798P9807J8876N3346N5765J53422J08079J65017R7937j9051N1135J21681
4457B645812J81350J15693O5153n1737j89419j53982o7654j73650q1891q3483
4447B206192K7523q0476q4359j5065K923Q0624J938K6779K3581J06216L9964M1711
4435B377551J44762O3294J63058J93322P5251K24108J64834J8718j93633k38767
4425B992498j81651j04243j58732m4987r00k5831n5963p7582m9404k6562j7702
$$ y = [1280906, 1272999, 1228663, 1393938, 1387053, 1444167, 1551393, 1562996, 1603322, 1596530, 1564004, 1569453, 1607339, 1564012, 1530272, 1565461, 1572479, 1499898, 1512457, 1436413, 1449570, 1545297, 1582618, 1562548, 1522004, 1479774, 1457507, 1536414, 1565381, 1653697, 1671886, 1643722, 1631948, 1635619, 1654344, 1759798, 1839605, 1858481, 1911827, 1967592, 2121014, 2229093, 2394110, 2492047, 2472996, 2524131, 2645812, 2827162, 2942855, 3008008, 2956271, 2766852, 2612870, 2545216, 2371566, 2289675, 2206192, 2233715, 2153239, 2068880, 2053815, 2056738, 2137362, 2139300, 2166079, 2189660, 2295876, 2335840, 2377551, 2522313, 2585607, 2748665, 2941987, 3017238, 3241346, 3406180, 3424898, 3231265, 2992498, 2810847, 2706604, 2547872, 2502885, 2501985, 2476154, 2420191, 2342609, 2293205, 2266643, 2248941]
4414B248941o2787M3077L0453P28N6794R4236O5001J1864J2904J2621O0226P3323
4402B647381J8545J1296k0534J08173P021l851k446O6761P7058Q5498P9184J62284
4390C236370J22989Q8278J15374J15008P4043K07861J87704J06193K30810K80949
4380D765579L09623K25334P6244K42974L27142L49981J72584r6865k75788m83026
4370E613782m50704l45876k63519j72422k19016r0112o8279l0151R7327Q7650
4360D158680q6639K4865O0049P8107R9039k9847l385j10238q8207j11987r5340
4349C895097q2551j58916o5166j42202j25259k1816j4270P869M0353P065r3007
4338C247197M7286j3647L9528L2998N8395K2891P185O9923L2624K0593k723m0534
$$ y = [2248941, 2186154, 2229231, 2259684, 2260412, 2317206, 2411442, 2476443, 2488307, 2501211, 2513832, 2574058, 2647381, 2665926, 2677222, 2656688, 2764861, 2771882, 2768031, 2765585, 2832346, 2909404, 2994902, 3074086, 3236370, 3359359, 3447637, 3563011, 3678019, 3752062, 3959923, 4147627, 4253820, 4484630, 4765579, 5075202, 5300536, 5376780, 5619754, 5946896, 6296877, 6469461, 6372596, 6096808, 5613782, 5163078, 4817202, 4553683, 4381261, 4162245, 4072133, 4003854, 3973703, 4071030, 4158680, 4072041, 4096906, 4156955, 4235062, 4334101, 4304254, 4300869, 4190631, 4102424, 3990437, 3895097, 3812546, 3653630, 3588464, 3446262, 3321003, 3299187, 3284917, 3292786, 3333139, 3340204, 3247197, 3294483, 3280836, 3320364, 3353362, 3411757, 3434648, 3441833, 3511756, 3544380, 3564973, 3562250, 3521716]
4326C521716o551k7165j51771j14131J1082Q6520L5099o7448N779j6138n9249
4315C217743R1083Q6761M2868K4219J13080J43635M5843J06667J81681J35802
4305D189382Q4342J28915J85896K55989J12748J09786L0355l4645j08399n7039
4295D897330j7070j88143j87751j42511j19242k7654j3936K9407o6968J9624j4712
4284D168374M3932J2849j5240L3095K5930O2470R293k09N6505L2532Q7272P7647
4272D594450l2962k3760L5586K1669M9658P2878J15915J40284K0067J28011R0669
4261E212465Q3143K7885R1133J63113P0944J03399J20025J55836J90399J56507
4251F374849J62852K23333J54295K58326L17891K13287L55740M22024N26387N45037
$$ y = [3521716, 3515165, 3488000, 3336229, 3222098, 3233180, 3319700, 3354799, 3287351, 3293130, 3276992, 3217743, 3308826, 3395587, 3438455, 3462674, 3575754, 3719389, 3765232, 3871899, 4053580, 4189382, 4273724, 4402639, 4588535, 4844524, 4957272, 5067058, 5097413, 5062768, 4954369, 4897330, 4880260, 4692117, 4504366, 4361855, 4242613, 4214959, 4201023, 4230430, 4163462, 4183086, 4168374, 4212306, 4225155, 4209915, 4243010, 4268940, 4331410, 4340703, 4340494, 4396999, 4429531, 4516803, 4594450, 4561488, 4537728, 4573314, 4594983, 4644641, 4717519, 4833434, 4973718, 4993785, 5121796, 5212465, 5295608, 5323493, 5414626, 5577739, 5648683, 5752082, 5872107, 6027943, 6218342, 6374849, 6537701, 6761034, 6915329, 7173655, 7491546, 7704833, 8060573, 8482597, 9008984, 9554021]
4241I554021N06083L36423Q0573j20546j39378k60047k52919k60065j82834j2033
4231I249278p129Q8198J05413J64225Q4160J28667J99528J98320J75334J45891
4221A0531885J85139K03932K35646J04002J59187K03871K60264J16889J30932
4212A2131747K29599K54868K04629K34323L37279L43721L37738L74610L41987
4203A4790501L09993M02369L68267L19908K55625K05407K85377L66503K66338
4194A7570288L30728M14696M30063L15434L51584K52919M12980M54325N08780
4185B1041797P17284O80781P18800P73699R21648J024257J151700J309648J314228
4176B9653842J497897J667253J794721J938460K201542K242722K059396J798400
$$ y = [9554021, 10060104, 10396527, 10477100, 10356554, 10217176, 9957129, 9704210, 9444145, 9261311, 9249278, 9242149, 9330347, 9435760, 9599985, 9684145, 9812812, 10012340, 10210660, 10385994, 10531885, 10717024, 10920956, 11156602, 11260604, 11419791, 11623662, 11883926, 12000815, 12131747, 12361346, 12616214, 12820843, 13055166, 13392445, 13736166, 14073904, 14448514, 14790501, 15100494, 15502863, 15871130, 16191038, 16446663, 16652070, 16937447, 17303950, 17570288, 17901016, 18315712, 18745775, 19061209, 19412793, 19665712, 20078692, 20533017, 21041797, 21759081, 22439862, 23158662, 23932361, 24854009, 25878266, 27029966, 28339614, 29653842, 31151739, 32818992, 34613713, 36552173, 38753715, 40996437, 43055833, 44854233]
4168D4854233J448979J065364R34082Q80621R47569J324958J736316K139061K614120
4159E7945303L219111L966460M657051N444444O431909P054334P666637Q637884
4151A05023133R837652J1711205J3779213J6508446J9846135K4535805L0428573
4144B31670162L6808368L6408936K4444081K946627j8754242l0813967l4385041
4137B48324924l2064345k8693381k3830216j8899690j5119935j2554388j0601905
4130A06561064q847914p099478n650001m213930l086857k138784j352895n09896
4122G3661309K74122R93977J778926K465554L037293K950078K224486N90513j551609
4113H6424649l574274n099665n697155n590238n102115m458750l831177l254309
$$ y = [44854233, 46303212, 47368576, 48302658, 49183279, 50130848, 51455806, 53192122, 55331183, 57945303, 61164414, 65130874, 69787925, 75232369, 81664278, 88718612, 96385249, 105023133, 114860785, 126571990, 140351203, 156859649, 176705784, 201241589, 231670162, 268478530, 304887466, 329331547, 332278174, 313523932, 282709965, 248324924, 216260579, 187567198, 163736982, 144837292, 129717357, 117162969, 106561064, 97713150, 90613672, 84963671, 80749741, 77662884, 75524100, 74171205, 73661309, 73935431, 74929408, 76708334, 79173888, 82211181, 85161259, 87385745, 87976258, 86424649, 82850375, 77750710, 72053555, 66463317, 61361202, 56902452, 53071275, 49816966]
4105D9816966k685517k058584j776414j244765q88972n49348k42446j276L13025
4096D0682669P19413J082693J463923J782098K113671K610776K725732K335330
4088E5516305J181259o63122k507842l829150m265686m186849l760797l325494
4080C4158624k708799k180616j755973j482167j328638j066587q10632n77934
4072B2247278n02232l92531k84776j69176k8581P9442O6653K30746K95541M66687
4062B2009051L49414m2305l00038p68706r90477r91059p76072p44546o36190m65666
4052A6643406l01715k43103k90237m50963o54384o21992o92526o57962n60096
4043A2170428n25038l44362l63884k85081k86014k59542j73420j40845j45993
$$ y = [49816966, 47131449, 45072865, 43296451, 42051686, 41162714, 40613366, 40370920, 40369644, 40682669, 41402082, 42484775, 43948698, 45730796, 47844467, 50455243, 53180975, 55516305, 56697564, 56034442, 53526600, 49697450, 45431764, 41244915, 37484118, 34158624, 31449825, 29269209, 27513236, 26031069, 24702431, 23635844, 22825212, 22247278, 21745046, 21352515, 21067739, 20898563, 20869982, 20949424, 21016077, 21246823, 21542364, 22009051, 22358465, 22316160, 22016122, 21247416, 20256939, 19265880, 18489808, 17745262, 17109072, 16643406, 16341691, 16098588, 15808351, 15357388, 14703004, 14081012, 13388486, 12730524, 12170428, 11645390, 11301028, 10937144, 10652063, 10366049, 10106507, 9933087, 9792242, 9646249]
4034I646249j43972j03178o5699k7927O7287m101J03290J84127J65522K96472
4024A0118070M42950L45569K85509R5875j55162l36714m38990m88944m03820m23028
4014I041315l24242j59732k68745j46588n0517q0976o1904n5859m2622l5155O0375
4003G875350K2668J7614M1149J02453J75099K44248K26684J43629J85645J88625
3993I223164J36707j09095k22453k64041k84989l35042l17148j88103j11651j77464
3983G349885j61457j7687R834J63245J2742J03678J67742J02123K34099K01221
3973H165425K16863K98893K11343J67232J64465j02257J0839L6965L9175j3519
3963I195424Q2005K5629l4587o4878m6355M8255M8446J64245K68722K91021K98511
$$ y = [9646249, 9502277, 9399099, 9333400, 9305473, 9372760, 9368659, 9471949, 9656076, 9821598, 10118070, 10561020, 10906589, 11192098, 11287973, 11132811, 10796097, 10357107, 9868163, 9464343, 9041315, 8717073, 8557341, 8288596, 8142008, 8091491, 8010515, 7948611, 7892752, 7850130, 7814975, 7875350, 7898018, 7915632, 7956781, 8059234, 8234333, 8478581, 8705265, 8848894, 9034539, 9223164, 9359871, 9250776, 9028323, 8764282, 8479293, 8144251, 7827103, 7639000, 7527349, 7349885, 7188428, 7170741, 7180575, 7343820, 7356562, 7460240, 7627982, 7730105, 7964204, 8165425, 8382288, 8681181, 8892524, 9059756, 9224221, 9121964, 9132803, 9169768, 9208943, 9195424, 9277429, 9303058, 9268471, 9203593, 9157238, 9205493, 9253939, 9418184, 9686906, 9977927, 10276438]
3952A0276438L85324M82639L58670N26076N93275O26569P47078Q61850J049409
3943A5907328J327588J693982K171698K830220K540997O22974j404986k496555
3935B3193246k480094k336187k359223k021285j424635j090284p84008o68006
3927A0029524n10975l76597k45210j78518j36453j04735j53820p5811j948p7287
3917H168170j54409j8912p5113j01954j46593j7147J4574r6611q4783n6636q8650
3906G341936l0954N9779O8907O8840p7212j81792j95L5973j23724j18658q8022
3895F954878j12179j5717N828q089N0811J27989M8405P632J90593J44282J49350
3884G543783J68744J8901o694J1814J11081L7016J81225K68674K24536L06785
$$ y = [10276438, 10661762, 11144401, 11503071, 12029147, 12622422, 13248991, 13996069, 14857919, 15907328, 17234916, 18928898, 21100596, 23930816, 26471813, 27094787, 25689801, 23193246, 20713152, 18376965, 16017742, 13996457, 12571822, 11481538, 10697530, 10029524, 9518549, 9141952, 8896742, 8718224, 8581771, 8477036, 8323216, 8247405, 8245457, 8168170, 8013761, 7994849, 7919736, 7817782, 7671189, 7654042, 7668616, 7572005, 7487222, 7430586, 7341936, 7310982, 7370761, 7439668, 7508508, 7431296, 7249504, 7249309, 7285282, 7161558, 7042900, 6954878, 6842699, 6826982, 6832810, 6824721, 6875532, 7003521, 7051926, 7059558, 7250151, 7394433, 7543783, 7712527, 7731428, 7724734, 7736548, 7847629, 7884645, 8065870, 8334544, 8559080, 8865865]
3874H865865K25386L37731M14210M87300N29549M82813N68872N70128M91241K29466
3864A3202561l7442k80193l93555k85437k40015l20510l54182m71645l39669m30215
3854A0049698n17743m03197l15938l36417m46821n59126m85383m33037m48155
3845F103881l57799l43592l08693k33980k74182k02916j65742j76983j11341r8615
3835C830038o4889q5424m7756n5055l4694m7193j4356J7375r8447j16932k0318
3824C262349m5089k8815j9928p1954j04633j13432j01286o5801o2079j21782l1910
3813B495640r415q7317n0093J0326j4071p4828k0253n3728m0917Q6111P308p088
3801B241675l5465O7332k0800M867O196q761L9281m711j9749k5049j09786r4857
$$ y = [8865865, 9091251, 9428982, 9843192, 10330492, 10860041, 11342854, 11911726, 12481854, 12973095, 13202561, 13165119, 12884926, 12491371, 12205934, 11965919, 11645409, 11291227, 10819582, 10479913, 10049698, 9531955, 9128758, 8812820, 8476403, 8029582, 7470456, 6985073, 6552036, 6103881, 5746082, 5402490, 5093797, 4859817, 4585635, 4382719, 4216977, 4039994, 3928653, 3830038, 3765149, 3679725, 3631969, 3576914, 3542220, 3495027, 3480671, 3498046, 3399599, 3282667, 3262349, 3217260, 3188445, 3168517, 3096563, 2991930, 2878498, 2777212, 2711411, 2649332, 2527550, 2495640, 2486225, 2398908, 2348815, 2359141, 2345070, 2270242, 2249989, 2196261, 2155344, 2241455, 2248763, 2241675, 2206210, 2273542, 2252742, 2257609, 2263805, 2255044, 2294325, 2289614, 2269865, 2244816, 2135030, 2040173]
3789B040173K2586j7135j21515j35226L358O2392K7553n8183n3662P4748n9400
3778A785689j57632M7237L4325l9736M6423j9733M320J7853k8841j5573o3707
3767A610625r323L1542N053M1980L0931j02121j1984M048K0059q4010m4868K905
3755A494837q6946j34088j2042K8978O1000R339K5345o3693m7655N6557o553j8576
3743A306503m3160L6442k632q0282k816N2742K2064m2122J8251L1125k4572O9589
3731A341132o7930j6051O7413p170M2714m9595o9337L2888j2530l9214M137K8829
3719A255286J8002k5867K4299j9053m4488j5940M0642L7135p8323j22641J5549
3708A084601L2592K3269J5649m617k9360o1244j6420Q1612P8122L0452q5866K0172
$$ y = [2040173, 2062759, 2045624, 1924109, 1788883, 1792241, 1854633, 1882186, 1824003, 1770341, 1845089, 1785689, 1628057, 1675294, 1709619, 1669883, 1716306, 1696573, 1700893, 1718746, 1689905, 1674332, 1610625, 1601302, 1632844, 1637897, 1679877, 1710808, 1608687, 1596703, 1600751, 1620810, 1536800, 1491932, 1494837, 1407891, 1273803, 1261761, 1290739, 1351739, 1361078, 1386423, 1322730, 1275075, 1331632, 1325079, 1306503, 1263343, 1299785, 1297153, 1216871, 1214055, 1266797, 1288861, 1246739, 1264990, 1296115, 1271543, 1341132, 1273202, 1257151, 1324564, 1317394, 1360108, 1310513, 1241176, 1274064, 1261534, 1222320, 1226457, 1255286, 1273288, 1247421, 1271720, 1252667, 1208179, 1192239, 1232881, 1270016, 1191693, 1069052, 1084601, 1117193, 1140462, 1156111, 1151494, 1122134, 1060890, 1044470, 1126082, 1204204, 1234656, 1148790, 1168962]
3696A168962K084o5256L5793R9277K8734o2315K1923K1787O6962N1810l1874j9141
3684A318746M2209m814L1290L6121n3421p5126J16626p8271j15966K2853n8353
3673A181894n9138R2082k8802n6491J4610P777r610Q0689l448o612K3911J3990
3661A250852M513p7382m0637l5873j6134m4421l857m6139m578Q4547K5070n8239
3649A037722Q5604M937n2384K0277L7027L2057k8115K4929J01204l9045p4540
3638A149673J3066l9676M3823O3358L3488n3346N6785K7319r817N9414K5973n8788
3626A311272j18967M2114o4799N1769n7846J9898q9865q8115K3487K1068M6114
3615A096130p2459j6108P4763q1590j1469O2577j06925J6308L6817L3557o8194
$$ y = [1168962, 1171046, 1105790, 1141583, 1240860, 1269594, 1207279, 1229202, 1250989, 1317951, 1369761, 1337887, 1318746, 1360955, 1356141, 1387431, 1423552, 1370131, 1295005, 1411631, 1333360, 1217394, 1240247, 1181894, 1122756, 1214838, 1186036, 1129545, 1144155, 1151932, 1142322, 1223011, 1219563, 1212951, 1236862, 1250852, 1255365, 1177983, 1137346, 1101473, 1085339, 1040918, 1037061, 990922, 986344, 1070891, 1095961, 1037722, 1123326, 1128263, 1075879, 1096156, 1133183, 1165240, 1137125, 1162054, 1263258, 1224213, 1149673, 1162739, 1123063, 1166886, 1230244, 1263732, 1210386, 1267171, 1294490, 1284673, 1344087, 1370060, 1311272, 1192305, 1234419, 1169620, 1221389, 1163543, 1183441, 1093576, 1005461, 1028948, 1050016, 1096130, 1023671, 1007563, 1082326, 1000736, 989267, 1051844, 944919, 961227, 998044, 1031601, 963407]
3604I63407P6936Q256m4097N3659q578k5389K6695o8168o0322R2522j0158p3744
3592I31019O4091k8192m4085k8082R0706K3970p2737l6381p700N796M3155J40454
3580A082014p286n0697M1259p3995n5394N1452k5380O0251j4967L7966K4688n3469
3568A016442j8143K73n9552N4508M1358k9192o3805L109L1676k7408Q5445o745
3556A027966o8993j01990M3953Q0235j6475N7015n1725K3789j0374l9056J4732
3545I59077J8851P2987Q4768j9628l8522p6117K9783Q0104j5473L585J6234J7630
3533A133279K2224J8229j0162O3071p0317k0790J0188P4625r4604M7554K686j9496
3521A156487M529n914l1939N6012N2009P055K4323N8155l8645m383Q2087k1309
$$ y = [963407, 1040343, 1048599, 1004502, 1058161, 1049583, 1024194, 1050889, 982721, 922399, 1014921, 1004763, 931019, 995110, 966918, 922833, 894751, 985457, 1009427, 936690, 900309, 892609, 898405, 941560, 1082014, 1074728, 1024031, 1065290, 991295, 935901, 987353, 961973, 1022224, 1007257, 1045223, 1069911, 1016442, 998299, 998572, 939020, 993528, 1034886, 1005694, 941889, 944998, 976674, 949266, 1034711, 1027966, 958973, 856983, 900936, 981171, 964696, 1021711, 969986, 993775, 983401, 944345, 959077, 977928, 1050915, 1135683, 1116055, 1077533, 1001416, 1031199, 1111303, 1095830, 1099415, 1115649, 1133279, 1155503, 1173732, 1163570, 1226641, 1156324, 1135534, 1145722, 1220347, 1125743, 1173297, 1175983, 1156487, 1161016, 1155102, 1123163, 1179175, 1231184, 1238239, 1262562, 1320717, 1282072, 1277689, 1359776, 1338467]
3509A338467j9183q314K3605l3201o2729J05367l87j0369O7130m309R52l3100
3497A363929L941R046q324L2405K1897j0753K8805P5801J0118J2294j0636k2619
3485A505904K5870M821Q113J9322l799r783o183M476R7667l4108K8583Q7128q12
3472A727199k5788N7884P2642o1413l0005N2905K535R0872J3080j904m8745L6794
3460A886056M0246J23591K7550k702j2943K6433J4859N9873j5082J46223k7050
3449B267054J06747P8575R060j3606j3211J14369N6802P6281J6134P5077N1009
3438B824291R8365j2139J35817J48521M3611J01685O4000J73265P9193J37334
3428C793943J47254J46010J91874J72441J41051K29449K89401K99504M11407M06989
$$ y = [1338467, 1319284, 1310970, 1334575, 1301374, 1238645, 1344012, 1343625, 1333256, 1400386, 1396077, 1397029, 1363929, 1367870, 1376916, 1368592, 1400997, 1422894, 1412141, 1440946, 1516747, 1526865, 1539159, 1528523, 1505904, 1531774, 1536595, 1544708, 1564030, 1560231, 1550448, 1544265, 1548741, 1646408, 1612300, 1640883, 1728011, 1727199, 1701411, 1759295, 1831937, 1770524, 1740519, 1793424, 1795959, 1886831, 1899911, 1898007, 1849262, 1886056, 1926302, 2049893, 2077443, 2074741, 2061798, 2088231, 2103090, 2162963, 2147881, 2294104, 2267054, 2373801, 2452376, 2461436, 2447830, 2434619, 2548988, 2605790, 2682071, 2698205, 2773282, 2824291, 2922656, 2910517, 3046334, 3194855, 3238466, 3340151, 3404151, 3577416, 3656609, 3793943, 3941197, 4087207, 4279081, 4451522, 4592573, 4822022, 5111423, 5410927, 5822334, 6229323]
3418F229323L22279K83561L28232K93452L10903M70918O09209Q00189J024691
3409A0672757J271385J610765K324217K306907Q78777n95719j730146j801978
3401A4936965j543244j427679j122725q83766n56892l73293k36166j57428J9117
3392H654889R6169K05476M70863M71230N65272N53104M15719K23155K95898M43993
3382A2395768O31869O16665J066873J282081J588752K127705L021135M167630
3374B6898478M764932J956524r16934l334386l957273l169907l224228k724467
3366A6292739k140655j541905j172957p68712n18869n16633l60881k02003k20582
3357H849542L8893O6914J3513k762M463P1166J43549J47231K16933K49169N48962
$$ y = [6229323, 6551602, 6835163, 7163395, 7456847, 7767750, 8238668, 8847877, 9648066, 10672757, 11944142, 13554907, 15879124, 18186031, 19064808, 18469089, 16738943, 14936965, 13393721, 11966042, 10843317, 9959551, 9402659, 9029366, 8793200, 8635772, 8654889, 8751058, 8956534, 9427397, 9898627, 10463899, 11017003, 11432722, 11655877, 11951775, 12395768, 13027637, 13644302, 14711175, 15993256, 17582008, 19709713, 22730848, 26898478, 31663410, 33619934, 32703000, 29368614, 25411341, 22241434, 19017206, 16292739, 14152084, 12610179, 11437222, 10668510, 10149641, 9633008, 9272127, 9070124, 8849542, 8888435, 8955349, 8968862, 8966100, 8970563, 9041729, 9185278, 9332509, 9549442, 9798611, 10347573]
3346A0347573Q20421R07250J178290J742320K230067J390760k98624j437045k133160
3337A4747852j763869j619562j447979j172681r68845o79042m61114l96818l08091
3328E929851k73478k15100k19534j20620P618j17436j67893j74795q0377j778
3318D566458j7198r2953j26157p213k5669n2830r1872m8383p1267J3409k9300
3307D017025m4578p3631O853J6337m6360j6552p3624O8224K196K5206j3072P8218
3295C946242O6942M5256R3597J15888M0424J7107K7402j4986O0246J6060m0373
3284D373805P65l5061p1423k8547q5584p4174k1131J7886r158k580k6543k8878
3272D009377r184M3258L2565J13286N1560L1428l65Q4696J4136J32265J23668
$$ y = [10347573, 11167994, 12075244, 13253534, 14995854, 17225921, 18616681, 18318057, 16881012, 14747852, 12983983, 11364421, 9916442, 8743761, 7774916, 7095874, 6634760, 6237942, 5929851, 5656373, 5441273, 5221739, 5101119, 5108737, 4991301, 4823408, 4648613, 4568236, 4566458, 4549260, 4456307, 4330150, 4322937, 4297268, 4244438, 4152566, 4104183, 4032916, 4046325, 4017025, 3972447, 3898816, 3905669, 3922006, 3875646, 3859094, 3785470, 3853694, 3855890, 3881096, 3868024, 3946242, 4013184, 4058440, 4152037, 4267925, 4308349, 4325456, 4352858, 4337872, 4398118, 4414178, 4373805, 4374570, 4339509, 4268086, 4239539, 4153955, 4079781, 4058650, 4076536, 4067378, 4064798, 4038255, 4009377, 4000193, 4043451, 4076016, 4189302, 4240862, 4272290, 4271925, 4356621, 4370757, 4503022, 4626690]
3261D626690J04795Q4930Q4639J29880O2884L7542J56102P2644K8325J04685M4110
3250E537226J17060L7066N9428J29507J67506J99093K85294K43582K17639K87308
3240G280709K45906L21228L62735M12697L90817K61497K78782L34523K11691j12341
3230I988244q3087k72395m13855m68017m55425m67757l81637l97870l13259l35801
3220F399141k24126k44476j74049k08698j80161j02715k13554k29052j76310j51059
3210D494941j58597k32352j21139p6570n6202j37136p8545L6208m6634n7702l7004
3199C529268j0908J2323p2672j4358p86j01240N425K8441R7109M9510K4382R2327
3187C638821J57923N6327L9088r6392n5509j80871j86631j34850k25757j87725
$$ y = [4626690, 4731485, 4816415, 4901054, 5030934, 5093818, 5131360, 5287462, 5360106, 5388431, 5493116, 5537226, 5654286, 5691352, 5750780, 5880287, 6047793, 6246886, 6532180, 6775762, 6993401, 7280709, 7526615, 7847843, 8210578, 8623275, 9014092, 9275589, 9554371, 9888894, 10100585, 9988244, 9905157, 9632762, 9218907, 8750890, 8295465, 7827708, 7446071, 7048201, 6734942, 6399141, 6175015, 5930539, 5756490, 5547792, 5367631, 5264916, 5051362, 4822310, 4646000, 4494941, 4336344, 4103992, 3982853, 3906283, 3850081, 3712945, 3634400, 3670608, 3623974, 3566272, 3529268, 3518360, 3530683, 3458011, 3443653, 3442867, 3341627, 3347052, 3375493, 3472602, 3522112, 3546494, 3638821, 3796744, 3853071, 3892159, 3795767, 3740258, 3559387, 3372756, 3237906, 3012149, 2824424]
3177B824424j41377j07905m0017r9434p8260l6553L3160L596o7363n4274j6267
3166B219730l3214K5743o7250k7510J5235L8848K1394N665K8593l1568L8566N4149
3154B288381M6619P9454j7270j51508j21665m3386r7724o3918j06171j1410L920
3143A805322j30916m9639m4681P2826m0213o7789m9064k7098k0716L2555Q218
3132A488805j4369n264m4184p8454j905q1411r3816J19824K3388j07275K5767
3121A231106Q1094l758m5751p71l4566K2084L1542P477q929n5243M6868j0174
3109A260979k5001m2983p7778k6870O4162M6254k7110j9216o0230n7814j5848
3098A018545O6273K7327L6597j7365k289p8082k5887k9678N9243j0909o8906L7076
$$ y = [2824424, 2683047, 2575142, 2535125, 2435691, 2357431, 2320878, 2354038, 2357634, 2290271, 2235997, 2219730, 2186516, 2212259, 2145009, 2117499, 2132734, 2171582, 2192976, 2198641, 2227234, 2195666, 2234232, 2288381, 2335000, 2414454, 2397184, 2245676, 2124011, 2080625, 1982901, 1918983, 1812812, 1801402, 1805322, 1674406, 1624767, 1580086, 1652912, 1612699, 1544910, 1495846, 1468748, 1448032, 1480587, 1488805, 1474436, 1469172, 1424988, 1346534, 1344629, 1263218, 1169402, 1289226, 1312614, 1205339, 1231106, 1312200, 1308442, 1262691, 1261920, 1227354, 1249438, 1280980, 1288457, 1279528, 1224285, 1271153, 1260979, 1235978, 1192995, 1115217, 1088347, 1152509, 1198763, 1171653, 1152437, 1092207, 1034393, 1018545, 1084818, 1112145, 1148742, 1131377, 1129088, 1051006, 1025119, 995441, 1054684, 1043775, 974869, 1011945]
3086A011945Q5987O3376L393k0028O398j8257p1858L5737p3288J2882K7744q2651
3074I81380n2948j2606M7957m2038o1613N3645Q087k1834n068m4318R371K4208
3062H84223o2217J44611J4358l6000L5062K6689l2122j0828m9757n0183M3540
3051I07376K2298p5411N1163J7880j0370p9889R098N5842L2915n0294o2193q602
3039H09813O1790r170J8889K0839p2748Q960L6070p9173l66K9427K6395K9228
3027H79954L2172l3019n7999M1117J6625J6370j2326O2158q5067R3450m5740j0082
3015H97613J14155o2158l3182j2192Q671K9886O5661J691l6895M7941o629j9914
3003I94648m4641N4107Q9997Q9194k8935l0281l5181K8488M4313O127m0641L8482
$$ y = [1011945, 1097932, 1161308, 1164701, 1144673, 1151071, 1132814, 1060956, 1096693, 1023405, 1036287, 1064031, 981380, 928432, 915826, 963783, 921745, 860132, 913777, 921864, 900030, 894962, 850644, 860015, 884223, 822006, 966617, 980975, 944975, 980037, 1006726, 974604, 963776, 914019, 863836, 907376, 929674, 854263, 905426, 923306, 912936, 833047, 842145, 897987, 930902, 880608, 818415, 809813, 871603, 862433, 881322, 902161, 829413, 838373, 874443, 795270, 794904, 824331, 850726, 879954, 912126, 879107, 821108, 862225, 878850, 895220, 882894, 945052, 859985, 953435, 907695, 897613, 1011768, 949610, 916428, 904236, 912907, 942793, 1008454, 1010145, 973250, 1021191, 1014562, 994648, 950007, 1004114, 1094111, 1183305, 1154370, 1124089, 1088908, 1117396, 1161709, 1167836, 1127195, 1165677]
2991A165677Q0126l1004r5504O3760R5441l2962j06860J926r906O0367N8243k7350
2979A221954J5270P387P3024Q046J0486J6956L9978L1367o0397N4799K1324R5768
2967A535962M3675J06134J31773R1681J2337m7451J0796L1601l6806o1614J02054
2956A920142J1074j2122m5813j1986o6985M5026N1766L5333j21319m2700k3275
2945A739141L431L1691k6355j166k2378L1477k2174O6O5847L9977M4189M9354
2933A933100N4745P6725N9140J2974L9548m2892o1577q777K1425n789J19330k286
2921B195666O6328l8795M9571K0263j4557J3629j6599k9895K1396j5539O990J9406
2909B277864j8625P5162n8607N4171K4403J09047m5530K8871L2839N972m169Q5655
$$ y = [1165677, 1245803, 1214799, 1119295, 1183055, 1278496, 1245534, 1138674, 1140600, 1130694, 1191061, 1249304, 1221954, 1237224, 1244611, 1317635, 1325681, 1336167, 1353123, 1393101, 1424468, 1364071, 1418870, 1440194, 1535962, 1579637, 1685771, 1817544, 1909225, 1921562, 1874111, 1884907, 1916508, 1879702, 1818088, 1920142, 1931216, 1919094, 1873281, 1861295, 1794310, 1839336, 1891102, 1926435, 1805116, 1762416, 1739141, 1742572, 1774263, 1747908, 1746742, 1724364, 1755841, 1733667, 1733733, 1799580, 1839557, 1883746, 1933100, 1987845, 2064570, 2123710, 2136684, 2176232, 2133340, 2071763, 2062986, 2084411, 2078622, 2197952, 2195666, 2261994, 2223199, 2272770, 2293033, 2278476, 2292105, 2275506, 2245611, 2267007, 2251468, 2258458, 2277864, 2259239, 2334401, 2275794, 2329965, 2354368, 2463415, 2417885, 2446756, 2479595, 2485567, 2481398, 2567053]
2897B567053R7551J71656Q7262n2549L0256k2802R3056O4094k9845k0275l8043
2886B947414M1966k05691r5959o8530j05635k7837k6778j9066P7126k8448m6248
2875B442314L9296R658Q4898k7925P2458J3975L9351k015j3484M4015l66J8046
2863B720221j6239L0614l1401r8615r040j7008r5278j51564j03215p1647J3910
2852B170738m4074j02289k0974m5862j6193P504o6985o8346J9823j7563K6014
2841A841793m3947l74n9807j15991o3212N1575J5847q9351k5459j4538m0764j38632
2829A317140o8241j5171n6130p3696J9983n5306n0307J6900M9310l2798l4161
2818A017523o2801n311q3475P1598m5867r245q2014K5314L4230j6268m1311n6940
$$ y = [2567053, 2664604, 2836260, 2923522, 2870973, 2901229, 2878427, 2971483, 3035577, 3005732, 2985457, 2947414, 2989380, 2783689, 2687730, 2619200, 2513565, 2485728, 2458950, 2439884, 2517010, 2488562, 2442314, 2481610, 2491268, 2576166, 2548241, 2620699, 2634674, 2674025, 2672010, 2658526, 2702541, 2702175, 2720221, 2703982, 2734596, 2703195, 2604580, 2595540, 2578532, 2483254, 2331690, 2228475, 2156828, 2170738, 2126664, 2024375, 2003401, 1957539, 1941346, 1948850, 1881865, 1813519, 1833342, 1815779, 1841793, 1797846, 1797472, 1737665, 1621674, 1558462, 1610037, 1625884, 1536533, 1511074, 1496536, 1455772, 1317140, 1248899, 1233728, 1177598, 1103902, 1123885, 1068579, 1018272, 1035172, 1084482, 1051684, 1017523, 954722, 949411, 865936, 937534, 891667, 882422, 800408, 825722, 859952, 843684, 802373, 745433]
2806G45433L0572p3352l8163K7069J3167M6883M6513q0386r1636l125K5382q4779
2794E63578K2422n0929N1912N9142k7745K0799m6937j07616m4349K3880O7890
2783E32047r3838M1585K8622m8523J0529J7724k3981K6702J4636l3617m0877l7968
2771C93041L6036n944k3581j0606m9610L4609n743P6004q5885n390m818L2167
2759C80280m0001m671J5481P4386j3537o4283j51125l1553P3171J3341M4392l1031
2747B64850J0812k546L8696L2886o3435q5385r158j641P0574P0883L0748p5602
2735B81682m8697n1053J3157n880M4647k734L4729q5171K3744P1156l011o4094
2723B08475m1219K3447n4780l1098M2971N958P3145n9771k6572L7899p886M5574
$$ y = [745433, 776005, 702653, 664490, 691559, 704726, 751609, 798122, 717736, 626100, 622975, 648357, 563578, 586000, 535071, 586983, 646125, 618380, 639179, 592242, 484626, 440277, 464157, 532047, 438209, 479794, 508416, 459893, 470422, 488146, 464165, 490867, 505503, 471886, 431009, 393041, 429077, 423133, 399552, 388946, 339336, 373945, 368202, 444206, 358321, 352931, 348113, 380280, 340279, 335608, 351089, 425475, 411938, 347655, 196530, 164977, 238148, 251489, 295881, 264850, 275662, 273116, 311812, 344698, 281263, 195878, 186720, 185079, 255653, 326536, 357284, 281682, 232985, 181932, 195089, 189209, 233856, 231122, 265851, 180680, 204424, 275580, 272569, 208475, 167256, 190703, 135923, 104825, 147796, 153754, 226899, 167128, 140556, 178455, 170569, 216143]
2711B16143n4034o1766J05072P063r36l6230o0848j7784L1074M7844m831l8784
2699A31983m9020J816k5259M0507P0850M556k4667K7164R014n3753k5283j2697
2687I5211J6264m8225R600L9186M765l463m2578K3499n3756m7683L6124M8697
2675G7641k8030L2668M6759n6126L0458L6277M8269L7800o844j9787j6296l441
2663A79348J6082m6245o9216O7030p5405O604j728M4601N2552l2739k3337j23932
2651f385R040P7262r21K0670K9644M1134j7392J9345K188n922l9015p399L6835
2638A59084L9822o302Q572N3142l1443J1569n6004P0725m5771j1201M9680l1298
2626B10575n5133n920N471J0929L8046J1581j6007J1707q997j1149k5006o3903
$$ y = [216143, 162109, 100343, 205415, 212478, 211542, 175312, 114464, 96680, 127754, 175598, 170767, 131983, 82963, 84779, 59520, 100027, 170877, 175433, 150766, 177930, 186944, 133191, 107908, 95211, 111475, 63250, 72850, 112036, 116801, 113338, 70760, 94259, 40503, -7180, 28944, 77641, 49611, 82279, 129038, 72912, 103370, 139647, 187916, 225716, 218872, 199085, 182789, 179348, 195430, 149185, 79969, 146999, 71594, 78198, 76470, 121071, 173623, 140884, 117547, -6385, 2655, 79917, 78996, 99666, 129310, 170444, 153052, 172397, 174585, 168663, 129648, 122249, 159084, 198906, 192604, 201176, 254318, 222875, 234444, 178440, 249165, 203394, 192193, 241873, 210575, 155442, 149522, 154993, 165922, 203968, 215549, 199542, 211249, 202252, 191103, 166097, 102194]
2614A02194M9574Q0817J04386j28474k4912J5710j6583O9758J6603p0568K926
2603B01431N8176J0117j0327m9925P733J0947q6290j8986R4147O7020n7986K638
2591B28695l4120K8888N2483o0268r147J2488N833K2403N278M9812p3160l1974
2579A97211R5977m8926N0010k8414l78O2246r778m5203m3701K2853k8934m7008
2567A75955K6179O6243k3785J210N696M136m989N5129n8009p8676N2655P4193
2555B95937o495l5218O066p2087L9569Q9443l4451k5596K557j37o0072k5897K5740
2542A99359k4052j8759J9186J5551r442j3053j0431l8192M2760k2671q425K1569
2530A53400K1150q586j08930k7814j8105O5342l4262K1906q3664O1852N5169l8306
$$ y = [102194, 151768, 232585, 336971, 208497, 183585, 199295, 182712, 252470, 269073, 198505, 201431, 259607, 269724, 259397, 209472, 217205, 228152, 141862, 122876, 217023, 284043, 226057, 228695, 194575, 223463, 275946, 215678, 206531, 219019, 224852, 247255, 252533, 302345, 229185, 197211, 293188, 244262, 294272, 265858, 265480, 327726, 317948, 272745, 229044, 251897, 222963, 175955, 202134, 268377, 244592, 245802, 251498, 255634, 250645, 305774, 247765, 169089, 221744, 295937, 289442, 254224, 260290, 188203, 227772, 317215, 282764, 257168, 259725, 259588, 199516, 173619, 199359, 175307, 156548, 175734, 191285, 181843, 168790, 158359, 120167, 162927, 140256, 131831, 153400, 174550, 165964, 57034, 29220, 11115, 76457, 42195, 64101, -19563, 42289, 97458, 59152]
2518E9152K6236J7282n2889K0907l668j413l4302L162K013o1801R8736K4144o4009
2505C3550J7550K5709M1670l6015l7301m3909Q563Q8834p1293p9111M0142L2866
2493B1255L3566L8212j2255l8145r4128N2243J367j5259j7762q1094L8070P6938
2481C008o0892K5038M3956m4669k9449L8195k5468j749J7166O4876M2525p3144
2469f07m8241N9323O319p8500M1422m4380j5675P9873M1992m1744n7199M489q112
2456f1040j8689M011N6110R2130m6172l3893O9p7939O3520o779j8686R709J0382
2443b7267o2625R1153O740k3334K6582j04834K8447Q4429p887j21479Q0552J5344
2431a4179O724k892p5440L5887Q4757j9028L8149p9168L1897J5105J0097m2029
$$ y = [59152, 85388, 102670, 49781, 70688, 67020, 65607, 31305, 34467, 36480, -25321, 73415, 97559, 33550, 51100, 76809, 118479, 82464, 45163, 1254, 9817, 98651, 27358, -51753, -11611, 21255, 54821, 93033, 80778, 42633, -51495, 748, 2115, -13144, -30906, -112000, -73930, 3008, -57884, -32846, 11110, -33559, -63008, -24813, -50281, -52030, -34864, 30012, 72537, -607, -48848, 10475, 16794, -61706, -20284, -64664, -80339, -466, 41526, -218, -57417, -52928, -61040, -79729, -75718, -19608, 72522, 26350, -7543, -7474, -85413, -21893, -28672, -47358, -37649, -27267, -89892, 1261, 8001, -15333, 11249, -93585, -65138, 19291, 11404, -110075, -29523, -14179, -7455, -10347, -85787, -49900, 34857, 15829, 53978, -25190, 6707, 21812, 31909, -10120]
2419a0120k0030j0864M095J20455j02696J1590M9990k7206l6739L2471K7169n7592
2407a9477l27L9103m3010O3728O4253l2469r9509p079r5581m9351J7554J00700
2395f1465M4722R974j3174O5569L4579m8504j44L4223j4630q7844N6575m7012
2383b7131l9348K6437j617L5300P034l2678R065J3942j1844n101K2397P553M7669
2370E1678L3746j4989J7811k1710p6965k8134K3119L3100L9765K1617L2129k7429
2358H3738L2847K4639L8135J8176J9728j02989j3317N207n4495M8781r2096K25
2346H579J3439K8741o7990K9942j8643R251r7628N1293N8678m3488J3376Q4658
2334G0208L3686j23805j670l7831m719P0146K6430q676m2025l2850J8625k7159
$$ y = [-10120, -30150, -41014, -36919, 83536, -19160, -7570, 42420, 15214, -21525, 10946, 38115, -19477, -19804, 19299, -23711, 40017, 104270, 71801, -27708, -34787, -130368, -179719, -162165, -61465, -16743, -6769, -19943, 45626, 80205, 31701, 31557, 65780, 51150, -36694, 19881, -27131, -66479, -40042, -41659, -6359, 675, -32003, -22938, -8996, -20840, -25941, -3544, 4009, 51678, 85424, 70435, 88246, 66536, -10429, -38563, -15444, 17656, 57421, 79038, 111167, 83738, 116585, 141224, 179359, 197535, 217263, 114274, 100957, 106164, 51669, 100450, 8354, 8579, 22018, 50759, -17231, 12711, -5932, 3319, -94309, -43016, 15662, -27826, -14450, 70208, 103894, -19911, -21581, -59412, -64131, 6015, 32445, 23769, -18256, -51106, -32481, -59640]
2322e9640J6240q036m4225K8905K1812n596J5441j0806O3962J8235M6771L3396
2310A16459r5845l0437j8582P5974L793n5671M0310J4681o33l7982L7984K1328
2298G1379J1731M557o4150r2386M2879K7818K9213l7964J9704J1430J5055M9572
2286H8838n7521m2106l6103O9405P3664J9409r1047J6633M3739R5955r2428n4528
2274C3910Q9906J5488k3126j8602M996K498k5533l0642J1234K1963K1010K664
2262A05766J8560n785N0357j4623P452o5290J9925P326K3845j05294n6935L6270
2250B1574J2836l0364L5791N6034m2039k119L8839Q269M138K3202p7552J9383
2238F7992P076m4327M0998j014n2317N9937K1701k5115P8399q576j1026o4423
$$ y = [-59640, -43400, -51436, -95661, -66756, -44944, -50540, -35099, -45905, 18057, 36292, 83063, 116459, 20614, -9823, -28405, 47569, 51362, -4309, 36001, 50682, 50049, 12067, 50051, 71379, 83110, 87667, 23517, -68869, -25990, 1828, 31041, -6923, 12781, 24211, 39266, 88838, 31317, -10789, -46892, 22513, 96177, 115586, 24539, 41172, 84911, 180866, 88438, 33910, 123816, 139304, 116178, 97576, 102572, 105070, 79537, 48895, 60129, 82092, 103102, 105766, 124326, 118541, 168898, 154275, 161727, 96437, 116362, 123688, 147533, 42239, -14696, 21574, 34410, 4046, 39837, 95871, 53832, 51713, 90552, 98821, 102959, 126161, 48609, 67992, 75068, 30741, 71739, 70725, 18408, 78345, 100046, 74931, 153330, 144754, 133728, 69305]
2226F9305j2443L0213l067M8832j9065P8618K6553j9538p8019j8477J1638k4093
2214I0457Q7283P0921o7920J0808j13862l7729J20900l474j6561R455o7306R2144
2202A75116L8051J4726l7011J9467J3026P773N9969m8560O19l392K4291M8572
2190C12647k4328n2326J1195O3768O1715j292j5359Q581l7512Q126P8652r1651
2178C22216q901P9876l8384R532K9130N3033m3415l6195N6512M4774R2855l6202
2166E24831m7966N0606k2012N7360J7377j05865Q8673o535j4369O8580l695O757
2154F13742P6237k0990p7587K1541O0147Q6586k169k1538R1353K904M3757k9419
2142H44564j4401j6202k7028N9997K2371O8588K7641J5647M1223L0249N3048K3933
$$ y = [69305, 56862, 87075, 84008, 132840, 113775, 192393, 218946, 199408, 121389, 102912, 114550, 90457, 177740, 248661, 180741, 191549, 77687, 39958, 160858, 157384, 140823, 150278, 82972, 175116, 213167, 227893, 190882, 210349, 223375, 231148, 291117, 242557, 243176, 239784, 264075, 312647, 288319, 235993, 247188, 310956, 372671, 371379, 356020, 364601, 327089, 335215, 413867, 322216, 313315, 393191, 354807, 364339, 393469, 446502, 403087, 366892, 423404, 468178, 561033, 524831, 476865, 527471, 505459, 562819, 580196, 474331, 563004, 556469, 542100, 610680, 606985, 613742, 689979, 668989, 591402, 612943, 673090, 759676, 757507, 735969, 827322, 830226, 873983, 844564, 830163, 813961, 786933, 846930, 869301, 937889, 965530, 981177, 1022400, 1052649, 1105697, 1129630]
2130A129630M9036P8148Q3530N0807M247K1397J34333J09223Q3056J81317K4810
2119A949534J30538J73329J12295J33896J21055J40384J64539K14206J09562K01674
2109C451012L83296L80521M01138M47518M04611M55738L57068M38570O07771P03090
2099H030333R88913J104754J472210J678307K124923K904936M214893M537518
2091B7056787J737939k501988m333202l264409k997495k863789k247904j719152
2083H866787j234342r38408q41709o22729m53492l07320k65999k98777k64822
2074C639189l84178k21264j40243k08972j42456j80147j50925q7647p2200l6598
2064B014559r2078j31299n7301j21405j29775j8436q823m6320p4706r0777l1509
$$ y = [1129630, 1178666, 1256814, 1340344, 1391151, 1395398, 1416795, 1551128, 1660351, 1743407, 1924724, 1949534, 2080072, 2253401, 2365696, 2499592, 2620647, 2761031, 2925570, 3139776, 3249338, 3451012, 3834308, 4214829, 4615967, 5063485, 5468096, 5923834, 6280902, 6719472, 7327243, 8030333, 9019246, 10124000, 11596210, 13274517, 15399440, 18304376, 22519269, 27056787, 28794726, 26292738, 21959536, 18695127, 15697632, 12833843, 10585939, 8866787, 7632445, 6694037, 5852328, 5229599, 4776107, 4468787, 4202788, 3904011, 3639189, 3255011, 3033747, 2893504, 2684532, 2542076, 2361929, 2211004, 2123357, 2051157, 2014559, 1922481, 1791182, 1733881, 1612476, 1482701, 1464265, 1455442, 1409122, 1334416, 1243639, 1212130]
2053A212130P707l8990n3384j26817o8317L4904n5653n5792j15554l8666O6668
2042G68236j1863l382j49105m0376M0758l2982K3817J7463k2181N4560j5720k6169
2030F03056J6655l1377n8242r689n0402j2373J940k5777R628p360n2339n3425
2018C30295k1473L2200K7321j4885n4086l5586l0243J8078M3578L4059r996l5997
2006B83265k6155K7257n7794l4529Q350R409j0857J2874n1153l0640O5732L5484
1994B31243k8831l0910k4503J5707j3096j06698L7570Q8821P5249k4565j49631
1983G0356J2701m5877L937M5841K0204r825r41J5485l7214L6980J0653k7454J4811
1970A09657m9722j08648N9449O6081K5837j5331O6270n4468j1326J2184j8996
$$ y = [1212130, 1219837, 1180847, 1127463, 1000646, 932329, 967233, 911580, 855788, 740234, 701568, 768236, 756373, 752991, 603886, 563510, 604268, 571286, 595103, 612566, 590385, 644945, 629225, 603056, 619711, 588334, 530092, 520403, 470001, 457628, 459568, 433791, 443419, 436059, 383720, 330295, 308822, 341022, 368343, 353458, 299372, 263786, 233543, 251621, 295199, 329258, 319262, 283265, 257110, 284367, 226573, 192044, 200394, 209803, 198946, 211820, 160667, 130027, 195759, 231243, 202412, 171502, 146999, 162706, 149610, 42912, 80482, 169303, 244552, 219987, 70356, 83057, 37180, 41117, 86958, 107162, 97337, 96396, 111881, 74667, 111647, 122300, 94846, 109657, 59935, -48713, 10736, 76817, 102654, 87323, 153593, 99125, 87799, 99983, 80987]
1959H0987J4443k3538m1555K9845J1451j3217l7283P9487l804n853j4440p6907
1947c84L1839N4602N7078q1790o3720L8685l4861L5434R8986j6252o7350J4434
1935F6701J4011k9018j7214j1537O1460m1883J3607l9187k5751N8111m4115j7947
1923a2762M5330l7354M1940j1246m5507N6933m330j23034K3311P5204J1345J6756
1911C6586k067m9641l0097M1874R3062L1073j46996K9104L1193P0360L98q3682
1899B1167k996k1846K2406K1544L1277n6972N4562Q520r5673J6541J0710K1408
1887C0648J5137J894P458N6454r3061o8881l2190L7014k1455L5706P5326L788
1875D7838m547l491n9574r6494J6727O0572O5310K4333o9569J7098j00759j30097
$$ y = [80987, 95430, 71892, 30337, 60182, 71633, 58416, 21133, 100620, 96816, 90963, 76523, -384, 31455, 86057, 143135, 61345, -2375, 36310, 1449, 36883, 135869, 119617, 52267, 66701, 80712, 51694, 34480, 22943, 84403, 42520, 56127, 16940, -8811, 49300, 5185, -12762, 32568, -4786, 37154, 25908, -19599, 37334, 33004, -90030, -66719, 8485, 19830, 36586, 34519, -15122, -45219, -3345, 89717, 120790, -26206, 2898, 34091, 104451, 104849, 21167, 18171, -3675, 18731, 40275, 71552, 14580, 69142, 77662, -18011, -1470, 9240, 30648, 45785, 47679, 55137, 111591, 18530, -50351, -82541, -45527, -66982, -31276, 44050, 47838, 43291, 39800, -19774, -116268, -99541, -38969, 26341, 50674, -18895, -1797, -102556, -232653]
1863b32653Q8603M6211L2113L6906j6981K6580j7391N564k3886N4081O7711o4127
1851B731o3087J5873J7953l6483m878P8972L6965q1020k1343J4464J6267P5758
1839E2172J307M514J3522k3829j7554j2323n9313p7687L6640O4350K3051K0129
1827B4979M0658k9384O0312J2059M7577K9443k8545J1774M396j17607n614K7871
1815G7919n4151L4354o0707m6890J02644J069l8301m5322m7879r845K6878J2045
1803d8186M7512O1304j05492J6764M6653K438l4531M1510R750o4753j483o1902
1791i0416J7125M1063J9456n324L7178j1830K4145l4628L8011K518K3009p132
1779E3175j00833K098P1170N5495j4573J6668o1579o2238j1437l2108J4175k559
$$ y = [-232653, -144050, -97839, -65726, -28820, -45801, -19221, -36612, -31048, -54934, -853, 66858, 2731, -60356, -44483, -26530, -63013, -67891, 11081, 48046, -32974, -54317, -39853, -23586, 52172, 53479, 57993, 71515, 47686, 30132, 17809, -41504, -119191, -82551, -18201, 4850, 24979, 65637, 36253, 96565, 108624, 156201, 185644, 157099, 168873, 173269, 55662, 50048, 77919, 23768, 58122, -2585, -49475, 53169, 54238, 15937, -29385, -77264, -87109, -60231, -48186, -674, 60630, -44862, -28098, 18555, 20993, -13538, 27972, 37722, -27031, -28514, -90416, -73291, -32228, -12772, -18096, 19082, 7252, 31397, -3231, 34780, 37298, 60307, 53175, -47658, -45560, 25610, 81105, 66532, 83200, 21621, -40617, -52054, -84162, -69987, -72546]
1767g2546k0742Q0507L5201j7565N0023o6713k3802j4579m005L1635j7977l8728
1755g9291K7751O7022m5884q8835k9434j3874J29046J5301P121l3436P244K349
1743c4920L4927n8095J7503M5584j1591m6649j5057O6498j8227L8651M088O7942
1731I0654k0548J4943q9753j5164l9129r4091L3460P3481J5720j9121K3182N8542
1719C2176j3349L2287k200q9153k9596O6474o7070J3583M7492O657m0099q7226
1707a30024L4143P1186j1160k1846j3714R814L8640O5410q100l3428J5745l4802
1695a8136M0275j6010p9295M4223L8087j5178m3178O4627N922l2899j0910K6854
1683D382l4197j00522K2964J5483L0965K6523k3068o954M2756K5217n6288j5437
$$ y = [-72546, -93288, -12781, 22420, 4855, 54878, -11835, -35637, -50216, -54221, -22586, -40563, -79291, -51540, 15482, -30402, -119237, -148671, -162545, -33499, -18198, -11077, -44513, -37269, -34920, 7, -58088, -40585, 4999, -6592, -53241, -68298, -1800, -20027, 18624, 22712, 90654, 70106, 85049, -4704, -19868, -58997, -153088, -119628, -46147, -30427, -49548, -26366, 32176, 18827, 51114, 48914, -40239, -69835, -3361, -70431, -56848, -9356, -2699, -42798, -130024, -95881, -24695, -35855, -57701, -71415, -61601, -22961, 42449, 34349, 921, 16666, -18136, 22139, 6129, -73166, -28943, 9144, -6034, -49212, 15415, 21337, -11562, -22472, 4382, -29815, -130337, -107373, -91890, -60925, -34402, -57470, -64424, -21668, 3549, -52739, -68176]
1671f8176P5262j1873J6647L9842j7277m416m9602k2731l0984M7662O741M6582
1659B7677p256N93m8433Q399l1436L2179m9506R9437O43n8229N5967N6130Q161
1646I4326j018j30957j03587J01408J6082q438K3711M6622o9942M1321J1720r243
1634A2005k9076k6936l3372R7418r0747m9845R7864O1281j3431m1293Q295K749
1622e088L7326M0421k7009n6454n3045J3374r099m7105K2578L0176M4430K429
1610g066l5905K5569N1561J9211m9267Q4740p220n4699n8014n561J0406R9925
1598G3680o6819j1190n5055p0116M1161J0124L2487O0938o4328o6476N4804r208
1586f9998J8079J3493j896k8855p499n058j0381M1976R9315k7721j2764J9465
$$ y = [-68176, 7086, -4787, 11860, 51702, 34425, 30009, -19593, -42324, -73308, -25646, -18905, 27677, 20421, 21014, -27419, -19020, -50456, -18277, -67783, 31654, 32297, -25932, 30035, 86165, 94326, 93308, -37649, -141236, -39828, -23746, -32184, -8473, 38149, -31793, 9528, 21248, 12005, -17071, -44007, -77379, 20039, -70708, -120553, -22689, 38592, 25161, -16132, -7837, -5088, 32238, 72659, 45650, -10804, -63849, -50475, -59574, -106679, -84101, -53925, -9495, -7066, -42971, -17402, 34159, 53370, 4103, 88843, 81623, 26924, -31090, -36651, -26245, 73680, 6861, -4329, -59384, -129500, -88339, -78215, -45728, 15210, -49118, -115594, -60790, -69998, -51919, -38426, -40322, -69177, -76676, -81734, -92115, -50139, 49176, 21455, 8691, 28156]
1574B8156m5120N353r4647M9713O5249K3582L8278j16326n3570j3294K8982N3501
1562c0143K671l2885J5446j7379l7678j7125N5475j3291L41L4986N6006r006K2660
1549C0078j0799o3738j8383o2064O826R524R5395k1430J2734o6089J848J01898
1537A5800M6845q7205R3681k3967l7572m1528k7678J00624J7988j00044o3004
1526a06060L6390L2166k0368n6450J7780N0345P2889n2466O6480q0299k5463M1670
1514b3386n8288k4925P6241k7491M5027J7257o0331N7840M6124k7309j5558M73
1502E674K1764l5690j07227K8066N8733m6645Q7883L4808J1039l6025j3192j02521
1490i3333q663L7005p796M9294p292J3658m6242J285M5432M8890k5882k6620O0373
$$ y = [28156, -16964, -11611, -106258, -56545, 8704, 32286, 70564, -45762, -99332, -112626, -83644, -30143, -27472, -60357, -44911, -62290, -99968, -117093, -61618, -74909, -74568, -39582, 16424, 7418, 30078, 19279, -44459, -62842, -124906, -118080, -108556, -13161, -34591, -21857, -87946, -86098, 15800, 62645, -24560, 69121, 45154, 7582, -33946, -61624, 39000, 56988, -43056, -106060, -69670, -37504, -57872, -114322, -96542, -46197, 26692, -25774, 40706, -39593, -65056, -23386, -81674, -106599, -30358, -57849, -12822, 4435, -55896, 1944, 48068, 20759, 5201, 5674, 27438, -8252, -115479, -87413, -28680, -75325, 12558, 47366, 58405, 22380, 9188, -93333, -101996, -64991, -72787, -23493, -30785, -17127, -63369, -62084, -16652, 32238, 6356, -20264, 40109]
1477D0109m0804j0036O9832l4558j5154K5915k6296L6330k3813m8828l6338K0626
1465d3015K87J4001P160j2760l8672k4726N9602M4185l6719o0607l7643O9159
1453e9748J34711M19r3032n495k5675p536O7631N6355k3417j7549k9866o7565
1441g0767P3864n4662l3634L288M850k6535j4958P9825l4106K6749r95j0934M1692
1428a6323j0049m9566N4211J8492m1555m8583L0374J03900k116n0609Q496K2653
1416A9325Q423l2438m1496K8870k265n1324j5563L4669M1893L6687p7031O1429
1404A1179k5952j2791O9785m4040q1645N0997L043l9254Q0161k0005K7549k1411
1392b384j2835L874j3426n1333K2991K5875M730L6119q2674K7943l1400l2099
$$ y = [40109, -695, -10731, 59101, 24543, 9389, 35304, 9008, 45338, 21525, -27303, -63641, -43015, -42728, -28727, -21567, -34327, -72999, -97725, -38123, 6062, -30657, -91264, -128907, -59748, 74963, 75382, -17650, -23145, -48820, -56356, 11275, 67630, 44213, 26664, -3202, -70767, 3097, -51565, -85199, -81911, -77061, -103596, -118554, -38729, -72835, -46086, -47081, -58015, -16323, -26372, -75938, -21727, -3235, -44790, -93373, -62999, 40901, 38785, -11824, -3328, 19325, 27748, -4690, -46186, -17316, -19581, -70905, -86468, -51799, -9906, 26781, -50250, 11179, -14773, -27564, 42221, -1819, -83464, -32467, -29424, -68678, 11483, -8522, 19027, -2384, -15219, -11345, -24771, -76104, -53113, -27238, -22508, 13611, -69063, -41120, -72520, -104619]
1380a04619Q8572L4919n8239j858K3174N6878j6867k3938l4222j317O8410J3004
1368D3897j07975n6181J0536R7198M1577l0102M7597J2288j7774r5088K567K3084
1356b8376j100M7748J5421L6948n8163O1515M5823m2167l4463j3761J4423l9083
1344D765r79M357N46j5512L2916K7028m8887j815O870K9779p7296J3340p0086
1331i4974J27580m1162p9275M5851j7826k5077j5280l5618K225N0705P105M7025
1319b8721l0849p8254J20894K2613k2853n3307j3603R31j7898N1987N1896K2702
1307B5538j15712O7586Q746l0518K567M3348j0858o2340q2108K9433R6041K7405
1295h72k8653K5637j382K0567k1003K3296o9038M7154Q1503j27698l9840P1400
$$ y = [-104619, -16047, 18872, -39367, -41225, -18051, 38827, 21960, -1978, -36200, -37517, 30893, 43897, -64078, -120259, -109723, -12525, 29052, -1050, 46547, 58835, 41061, -54027, -51460, -28376, -29476, 18272, 33693, 70641, 12478, 73993, 119816, 77649, 43186, 29425, 43848, 4765, 3786, 8143, 8689, -6823, 26093, 53121, 4234, 2419, 9289, 39068, -38228, -24888, -94974, 32606, -8556, -87831, -41980, -59806, -84883, -100163, -135781, -133556, -82851, -75746, -28721, -59570, -137824, -16930, 5683, -17170, -70477, -84080, -83149, -101047, -49060, 2836, 25538, -90174, -22588, -13842, -44360, -41793, 1555, -9303, -71643, -153751, -124318, -28277, -872, -29525, -3888, -5270, 15297, -5706, 17590, -51448, -4294, 77209, -50489, -90329, -18929]
1283a8929q971K719k7328r271m9328M6616N7276N4388l927m9822j938J1817l822
1270e20O6652p889k0562k6100l0424O8467j833k6700K7126k4705l80o1321q7j8542
1256e6818L461l011J0978P3969J3947N7504o1267n9939J4251l3985Q4836j7538
1244B6388p7215k3015J8411l5923K190K5498P9920k8233k3805M4974K5711k3345
1232A1556k7134J9104J127k03q657l1781j2366J00431m3840p4728P0688J852k5735
1219a9686L0252r452L4873P294l2738K3827O3584n1404o4505L1242J9496q7178
1207e4395P57K5526P2217k7609J23M759k7295R510L5876m6875k0611n982O2921
1194B8922l4919K151J1873M9642p5389k4446K3979M4127K1736j8920M7845l4574
$$ y = [-18929, -27900, -25181, -52509, -61780, -111108, -64492, -7216, 47172, 43245, -6577, -8515, 3302, -520, 66132, 58243, 37681, 11581, -18843, 49624, 47791, 21091, 48217, 23512, 23132, -38189, -38276, -56818, -53357, -56368, -45390, 28579, 42526, 100030, 38763, -21176, -6925, -40910, 43926, 26388, -50827, -73842, -55431, -91354, -89164, -63666, 16254, -11979, -35784, 9190, 34901, 11556, -15578, 3526, 4653, 4450, -4207, -35988, -48354, 52077, 8237, -66491, 4197, 6049, -19686, 10566, 1114, 35987, 43281, 10543, 34370, 97954, 46550, -17955, 13287, 32783, -54395, -53638, -28112, 44105, 16496, 16619, 21378, -5917, 3593, 39469, -7406, -28017, -33999, 28922, -5997, -3846, 8027, 57669, -17720, -42166, -18187, 25940, 47676, 28756, 76601, 42027]
1182D2027M288n4270K4305M4110N0329k2428p3120k1684L439n9788L7286K7107
1170A601l9171l710N991O4754k7934m0342n194J9655o9591O2236M0658k7547R277
1157i317P0832m982q1972j6036N8669L4331o2504l8205j0010M6115l814j6546
1145c3439J3624l8789L7299J9473n3864o356O6834N7945q727j7905o949N1403
1133H0549l0118j2033l840P105o8070o4953K8238J2987M219J1888L27J00567o1525
1120E341k4955J7634j0700K8562J6192L1290r1351O062k0815m912m841J6185L0292
1107f016j2468l3159J8875L4888k6255k2415j0148M3637M7528r7853m3797K8873
1095g8310L7114M0631M0337o6167J683m541L9468L9125j3354j6842j5851m7020
$$ y = [42027, 46315, -7955, 16350, 60460, 110789, 88361, 15241, -6443, -3004, -62792, -25506, 1601, -37570, -41280, -35289, 29465, 1531, -38811, -44005, -24350, -93941, -31705, 8953, -18594, -9317, 61515, 56533, -25439, -41475, 17194, 51525, -10979, -49184, -59194, -13079, -16893, -33439, -19815, -58604, -21305, -1832, -55696, -62052, 4782, 62727, 54000, 36095, 29146, 80549, 50431, 38398, 34558, 41663, -26407, -91360, -63122, -50135, -45916, -34028, -33701, 66866, 5341, -19614, -1980, -12680, 15882, 32074, 63364, -27987, -21925, -42740, -47652, -52493, -36308, -6016, -18484, -51643, -32768, 2120, -24135, -46550, -56698, -13061, 34467, -63386, -107183, -78310, -41196, -565, 39772, -26395, -24712, -29253, 10215, 49340, 35986, 19144, 3293, -43727]
1083d3727j2294J7398K0770M1789K7005p6041j5378o8276J1175Q9319k2470P9181
1071D8451k908o8520M863J1791J497L8378R714K9364q2115n5309l3553O1570K1450
1058a5327k5072L3548k1985j28534L7385M9117N6460m1202j2679N7375k191r0891
1046a03996K6448J08126l2445n0549M966K6385O2711j4764q2955m8099L8987J2617
1034e2568O9586K5095M9491n0607J5105o2344p474O7126R7096P533j4340l5352
1022A08347o5993o7349l6072R4204P0751l8187K2945o0292J0318l6187N1297N5632
1010A09414j16899l1287J962P4997k1996m0305L2438M1696K6339k8571l3797O4740
998G8731m3824M2942K1933l3847m0429K6011k0421R240K8546j8252n9232m786
$$ y = [-43727, -56021, -38623, -17853, 23936, 50941, -25100, -40478, -108754, -97579, -8260, -30730, 48451, 45543, -22977, -18114, -6323, -4826, 33552, 43266, 72630, -9485, -64794, -98347, -36777, -15327, -40399, -6851, -28836, -157370, -119985, -70868, -14408, -55610, -68289, -10914, -13105, -103996, -77548, 30578, -1867, -52416, -47450, -21065, 41646, 26882, -56073, -104172, -65185, -52568, 17018, 42113, 91604, 40997, 56102, -6242, -13716, 53410, 150506, 158039, 143699, 108347, 42354, -24995, -61067, 33137, 103888, 65701, 88646, 28354, 38672, 2485, 53782, 109414, -7485, -38772, -36810, 38187, 16191, -24114, 8324, 50020, 76359, 47788, 13991, 78731, 34907, 77849, 99782, 65935, 25506, 51517, 31096, 40336, 68882, 50630, -8602, -13388]
986a3388K5314r3867n2243R4638M5625l79n4162O71k4905J9857K5748M3840j7254
973e05l5470L1094L1622o500P4639p1797p8821L943P406n095M7857O6171R7902
960A62446n1614n8106m8476l1418K2939J015j06451P6549n626M8492N28o869P8894
947H2303o8696m114j10198L9496Q1357J8950l2364M29M4415r8124M9313J8240
935B1007m742m469K7291R107p3774o6155j1825J11282j8516l5725M871N4198m7503
922c4953J5957p420K7962N6782j5165q156m9484m6606l79L300Q7196J27j00796
909g1635O8645R384J3090N279j2284o150P6529R699o4918j66672P4537N0820l6031
896d9707O8179o5960k0363Q6025r574k0423O4743l8134k2548K7228L7598l9995
$$ y = [-13388, 11926, -81941, -134184, -39546, 6079, 5700, -48462, -47791, -72696, -52839, -27091, 16749, -505, -35975, -4881, 26741, 20241, 94880, 23083, -55738, -51795, -44389, -49484, -1627, 64544, 162446, 110832, 52726, 4250, -27168, -4229, -3214, -109665, -33116, -38742, 9750, 10278, 3409, 82303, 13607, 9493, -100705, -61209, 20148, 39098, 6734, 7163, 51578, -46546, 2767, 21007, 16265, 11796, 39087, 48194, -25580, -91735, -103560, 7722, -10794, -46519, -41648, 12550, -34953, -18996, -26416, 1546, 58328, 43163, 35007, -14477, -61083, -61462, -58162, 29034, 29161, -71635, -2990, 6394, 19484, 24763, 12479, 6329, 82858, 92557, 27639, -139033, -64496, -13676, -49707, 18472, -47488, -67851, 18174, 8600, -11823, 52920, 14786, -7762, 19466, 57064, 17069]
884A7069O250k6727n7492M2192J30313j6283l7180l7159L639k3259L3265p2766
$$ y = [17069, 23319, -3408, -60900, -18708, 111605, 95322, 58142, 20983, 24622, 1363, 34628, -38138]
$$ [...]
##END NTUPLES=NMR SPECTRUM
##END=
