##TITLE=1H_EC-3281(2-3)
 CDCl3
 8 sc, 
 21.10.2022
##JCAMPDX= 6.0         $$ Bruker NMR JCAMP-DX V2.0
##DATA TYPE= NMR SPECTRUM
##DATA CLASS= NTUPLES
##ORIGIN= UXNMR, Bruker Analytische Messtechnik GmbH
##OWNER= root
$$ XWIN-NMR		Version 3.5
$$ Fri Oct 21 13:53:24 2022 Russian Standard Time (UT+4h)  she@DPX200
##.OBSERVE FREQUENCY= 200.1313499994
##.OBSERVE NUCLEUS= ^1H
##.ACQUISITION MODE= SIMULTANEOUS
##.ACQUISITION SCHEME= undefined
##.AVERAGES= 8
##.DIGITISER RES= 18
##SPECTROMETER/DATA SYSTEM= spect
##.PULSE SEQUENCE= zg30
##.SOLVENT NAME= CDCl3
##.SHIFT REFERENCE= (INTERNAL, CDCl3, 0, 15.737)
##AUDIT TRAIL= $$ (NUMBER, WHEN, WHO, WHERE, WHAT)
$$ ##TITLE= Audit trail, XWIN-NMR		Version 3.5
$$ ##JCAMPDX= 5.01
$$ ##ORIGIN= Bruker BioSpin GmbH
$$ ##OWNER= she
$$ F:/spectra/data/she/nmr/H-F/1/pdata/1/auditp.txt
$$ ##AUDIT TRAIL=  $$ (NUMBER, WHEN, WHO, WHERE, WHAT)
(   1,<2022-10-21 13:52:17.32 +0400>,<she>,<DPX200>,
      <created by zg, POWCHK disabled, PULCHK disabled
       configuration hash MD5:
       00 E9 B6 7A A2 85 ED C7 34 08 36 98 17 FE 4E 26
       data hash MD5: 16K
       1F 3B D4 01 3B C9 77 18 76 7E 47 4A F7 1B 80 8E>)
(   2,<2022-10-21 13:52:20.01 +0400>,<she>,<DPX200>,
      <Start of raw data processing
       efp BC_mod = 2 LB = 0.24 FT_mod = 6 PKNL = 1 PHC0 = -18033.77 PHC1 = 10.2007 SI = 16K 
       data hash MD5: 16K
       B9 88 B3 42 B3 3F 54 B3 20 C3 C6 90 B3 FF 17 B8>)
(   3,<2022-10-21 13:52:34.21 +0400>,<she>,<DPX200>,
      <pk PHC0 = 0.2415068 PHC1 = -1.400001 
       data hash MD5: 16K
       33 1B 49 EB 8A D1 B5 56 88 7B 11 F6 84 D8 A5 E4>)
(   4,<2022-10-21 13:52:37.51 +0400>,<she>,<DPX200>,
      <abs ABSG = 5 
       data hash MD5: 16K
       7B 15 65 30 BF 5F 8F 97 46 20 7A A0 52 E4 1C AB>)
$$ ##END=
$$ 
$$ hash MD5
$$ 99 9F 9E 77 3A 3E 73 D6 FE 00 EB C1 5E 85 45 30
##$RELAX= 
##$RELAX= 
##$RELAX= 
##$RELAX= 
##$RELAX= 
##$RELAX= 
$$ Bruker specific parameters
$$ --------------------------
##$DU= <F:/spectra>
##$EXPNO= 1
##$NAME= <H-F>
##$PROCNO= 1
##$TYPE= <nmr>
##$USER= <she>
##$AMP= (0..31)
100 100 100 100 100 100 100 100 100 100 100 100 100 100 100 100 100 100 
100 100 100 100 100 100 100 100 100 100 100 100 100 100 
##$AQSEQ= 0
##$AQ_mod= 1
##$AUNM= <au_zg>
##$AUTOPOS= <>
##$BF1= 200.13
##$BF2= 200.13
##$BF3= 200.13
##$BF4= 200.13
##$BF5= 200.13
##$BF6= 200.13
##$BF7= 200.13
##$BF8= 200.13
##$BYTORDA= 1
##$CFDGTYP= 0
##$CFRGTYP= 5
##$CHEMSTR= <none>
##$CNST= (0..31)
1 1 145 1 1 1 1 1 1 1 1 1 1 1 1 1 1 1 1 1 1 1 1 1 1 1 1 1 1 1 1 1 
##$CPDPRG= <>
##$CPDPRG1= <>
##$CPDPRG2= <>
##$CPDPRG3= <>
##$CPDPRG4= <mlev>
##$CPDPRG5= <mlev>
##$CPDPRG6= <mlev>
##$CPDPRG7= <mlev>
##$CPDPRG8= <mlev>
##$CPDPRGB= <>
##$CPDPRGT= <>
##$D= (0..31)
0 1.2 0 0 0 0 0 0 0 0.06 0 0.03 0 0 0 0 0.0002 0 0 0 0 0 0 0 0 0 0 0 0 
0 0 0 
##$DATE= 1666345936
##$DBL= (0..7)
120 120 120 120 120 120 120 120 
##$DBP= (0..7)
150 150 150 150 150 150 150 150 
##$DBP07= 0
##$DBPNAM0= <>
##$DBPNAM1= <>
##$DBPNAM2= <>
##$DBPNAM3= <>
$$ [...]
##$SUBNAM3= <"">
##$SUBNAM4= <"">
##$SUBNAM5= <"">
##$SUBNAM6= <"">
##$SUBNAM7= <"">
##$SUBNAM8= <"">
##$SUBNAM9= <"">
##$SW= 18.0517283424941
##$SWIBOX= (0..15)
0 0 2 0 0 0 0 0 0 0 0 0 0 0 0 0 
##$SW_h= 3612.71676300578
##$TD= 16384
##$TD0= 1
##$TE= 0
##$TE2= 300
##$TE3= 300
##$TEG= 300
##$TL= (0..7)
0 120 120 120 120 120 120 120 
##$TP= (0..7)
150 150 150 150 150 150 150 150 
##$TP07= 0
##$TPNAME0= <>
##$TPNAME1= <>
##$TPNAME2= <>
##$TPNAME3= <>
##$TPNAME4= <>
##$TPNAME5= <>
##$TPNAME6= <>
##$TPNAME7= <>
##$TPOAL= (0..7)
0.5 0.5 0.5 0.5 0.5 0.5 0.5 0.5 
##$TPOFFS= (0..7)
0 0 0 0 0 0 0 0 
##$TUNHIN= 0
##$TUNHOUT= 0
##$TUNXOUT= 0
##$USERA1= <user>
##$USERA2= <user>
##$USERA3= <user>
##$USERA4= <user>
##$USERA5= <user>
##$V9= 5
##$VALIST= <valist>
##$VCLIST= <CCCCCCCCCCCCCCC>
##$VD= 0
##$VDLIST= <DDDDDDDDDDDDDDD>
##$VPLIST= <PPPPPPPPPPPPPPP>
##$VTLIST= <TTTTTTTTTTTTTTT>
##$WBST= 1024
##$WBSW= 4
##$XGAIN= (0..3)
0 0 0 0 
##$XL= 0
##$YL= 0
##$YMAX_a= 136001
##$YMIN_a= -197280
##$ZGOPTNS= <>
##$ZL1= 120
##$ZL2= 120
##$ZL3= 120
##$ZL4= 120
##$ABSF1= 15.73477
##$ABSF2= -2.31708
##$ABSG= 5
##$ABSL= 3
##$ALPHA= 0
##$AQORDER= 0
##$ASSFAC= 0
##$ASSFACI= 0
##$ASSFACX= 0
##$ASSWID= 0
##$AUNMP= <proc_1d>
##$AZFE= 0.1
##$AZFW= 0.1
##$BCFW= 0
##$BC_mod= 2
##$BYTORDP= 0
##$COROFFS= 0
##$CY= -3
##$DATMOD= 1
##$DC= 0
##$DFILT= <>
##$DTYPP= 0
##$F1P= 0
##$F2P= 0
##$FCOR= 1
##$FTSIZE= 16384
##$FT_mod= 6
##$GAMMA= 0
##$GB= 0
##$INTBC= 1
##$INTSCL= 3.70164e-10
##$ISEN= 128
##$LB= 0.24
##$LEV0= 0
##$LPBIN= 0
##$MAXI= 10000
##$MC2= 0
##$MEAN= 0
##$ME_mod= 0
##$MI= 1.114404
##$NCOEF= 0
##$NC_proc= -7
##$NLEV= 6
##$NOISF1= 3.799351
##$NOISF2= 2.8
##$NSP= 0
##$NTH_PI= 0
##$NZP= 0
##$OFFSET= 15.73697
##$PC= 1
##$PHC0= -18033.53
##$PHC1= 8.800699
##$PH_mod= 1
##$PKNL= yes
##$PPARMOD= 0
##$PSCAL= 0
##$PSIGN= 0
##$REVERSE= no
##$SF= 200.130006916916
##$SI= 16384
##$SIGF1= 3
##$SIGF2= 2
##$SINO= 5.538805
##$SIOLD= 16384
##$SREGLST= <1H.CDCl3>
##$SSB= 0
##$STSI= 16384
##$STSR= 0
##$SW_p= 3612.71676300578
##$SYMM= 0
##$S_DEV= 0
##$TDeff= 16384
##$TDoff= 0
##$TI= <>
##$TILT= no
##$TM1= 0
##$TM2= 0
##$TOPLEV= 0
##$USERP1= <user>
##$USERP2= <user>
##$USERP3= <user>
##$USERP4= <user>
##$USERP5= <user>
##$WDW= 1
##$XDIM= 16384
##$YMAX_p= 528414366
##$YMIN_p= -629112
$$ End of Bruker specific parameters
$$ ---------------------------------
##NTUPLES= NMR SPECTRUM
##VAR_NAME=  FREQUENCY,     SPECTRUM/REAL,   SPECTRUM/IMAG
##SYMBOL=    X,             R,               I
##VAR_TYPE=  INDEPENDENT,   DEPENDENT,       DEPENDENT
##VAR_FORM=  AFFN,          ASDF,            ASDF
##VAR_DIM=   16384,         16384,           16384
##UNITS=     HZ,            ARBITRARY UNITS, ARBITRARY UNITS
##FACTOR=    0.220516191357247, 1,           1
##FIRST=     3149.4399045075, 0,             0
##LAST=      -463.276858498277, 0,           0
##MIN=       -463.276858498277, -629112,     0
##MAX=       3149.4399045075, 528414366,     0
$$ Real data points
##PAGE= N=1
##DATA TABLE= (X++(R..R)), XYDATA
$$ [...]
7091B9081651K821504L537166L903380M613774N575697O495433P594314R597809
7083G3220728J1632896J4098774J6503022J7891313J6338825R410948k621067
7076A56475439j3744953k1262958k2690327j9509117j4767107j0930201p968463
7069D5602313o231511n042794l847732k983150k301202k057302j569181j862691
7061A9706750j368209j373411j258417p55902p27237r01943p50796q49676p65528
7052A0955631n45051k83758m93642k83662n18416n22122l95227m40952q1732j23287
7042G267782k40514q9434k83790j43504k53384j60272j28614J7302K4170p6940
7032E932802k52527k13271j73336j41213k78810m97306j02275l7965K0438k59891
$$ y = [29081651, 31903155, 35440321, 39343701, 43957475, 49533172, 56028605, 63622919, 73220728, 84853624, 98952398, 115455420, 133346733, 149685558, 159096506, 156475439, 142730486, 121467528, 98777201, 79268084, 64500977, 53570776, 45602313, 39370802, 34328008, 30480276, 27497126, 25195924, 23138622, 21569441, 19706750, 18338541, 16965130, 15706713, 14950811, 14223574, 13321631, 12570835, 11721159, 10955631, 10410580, 10126822, 9633180, 9349518, 8831102, 8308980, 7913753, 7472801, 7391069, 7267782, 7027268, 6937834, 6654044, 6510540, 6257156, 6096884, 5968270, 5985572, 6009742, 5932802, 5680275, 5467004, 5293668, 5152455, 4873645, 4376339, 4274064, 4236099, 4256537, 3996646]
7022C996646j37685J53188l72204J05415k47015l388L0720J8252k31723k16861
7012C095345n564P3892q9310j04386j14172k36528j40884j99460n2383J24511
7002B351061M6345l77502K28209J68424k63656K3375J37428j29368l66328k64114
6992A553874J87481j82092M9026O4811L9715j38366n887J69567L21215Q0604m95588
6981A644360j88380N3722k6539k9513M5434L7789J52553K24226k60475J02692
6971A755869l709J27425j72100J91056j0534n40379J50285m062J95950j4914k00161
6960A474726M239k53987q8606K67946j10574k16508j5564m8911K39824l07716
6950I44869l14117j30376J38371K02602J1466r8893j8363n0050J314N4455j7113
$$ y = [3996646, 3858961, 4012149, 3639945, 3745360, 3498345, 3494957, 3525677, 3543929, 3312206, 3095345, 3089781, 3163673, 3074363, 2969977, 2855805, 2619277, 2478393, 2278933, 2226550, 2351061, 2397406, 2019904, 2248113, 2416537, 2152881, 2176256, 2313684, 2184316, 1817988, 1553874, 1741355, 1559263, 1608289, 1673100, 1712815, 1574449, 1568562, 1738129, 2059344, 2139948, 1644360, 1455980, 1509702, 1483163, 1453650, 1499084, 1536873, 1689426, 1913652, 1653177, 1755869, 1752160, 1879585, 1707485, 1898541, 1888007, 1347628, 1497913, 1493851, 1689801, 1674887, 1474726, 1478965, 1224978, 1136372, 1404318, 1293744, 1077236, 1061672, 1012761, 1252585, 944869, 630752, 500376, 638747, 841349, 852815, 753922, 735559, 685509, 686823, 741278, 724165]
6939G24165k58564J26015O2589O5100p6967O6023J3018J29628l3871k08533q7781
6928E20822j23325K02725K2567m5059l04293J87532m3205j59818M5322O0884K03699
6917E67851N2161j28944q9489O2539J78467J37746p4432k07851p2902j47913J50039
6906D27272k2853O0150r9304R4417l6602J9592k63334j90904O3698J80757p122
6895B25767j73646J52950N9404J71J41733j81521j5195q3529n8796J99422k29086
6884C7674J45454J00584p8249P3326n5770L1446j33694n0556O234J46816L43541
6873E66806n2852l0562m27796K477J02777j65741M4389K53877q2680j724k42643
6862c3672j77380L10735K0458M3010o2938j76355l227K52085P0435n3056k95608
$$ y = [724165, 465601, 591616, 654205, 719305, 642338, 708361, 721379, 851007, 817136, 608603, 520822, 397497, 600222, 622789, 577730, 273437, 460969, 417764, 257946, 303268, 364152, 567851, 620012, 491068, 401579, 464118, 642585, 780331, 705899, 498048, 425146, 277233, 427272, 404419, 464569, 365265, 459682, 423080, 442672, 179338, -11566, 52132, 232889, 225767, 52121, 205071, 264475, 264646, 406379, 224858, 209663, 126134, 67338, 266760, 37674, 183128, 283712, 205463, 278789, 223019, 254465, 120771, 70215, 76449, 223265, 566806, 513954, 483392, 55596, 58073, 160850, -4891, 39498, 293375, 210695, 208971, -33672, -211052, 99683, 120141, 163151, 100213, -76142, -79369, 172716, 243151, 190095, -105513]
6851a05513j6936k22626L5765L45354p7870J43060r212k42365R205K32784k21160
6840a29514q3398M41624J22795J93893k81058j86116Q6539j15070K1936k3908
6830D7723p3584r6470o0488J24722Q8042j66564J24656Q4718k0482K9770K7573
6819A09616J3871l1795j90937M471j62192K13052j20469J18483L54870k1727n7685
6808B29558j91728K13697l78964r5439K41664j00741K92497q3964j79637R1065
6798C8008P2653j36179l6221J6145J43542Q1959q0304K83303k3391q8584J4477
6787B85408k018j46287n4683K92363P6141k13517J6154q1014j60615j02980J56454
6776F5406J6045J05335J51683k57543j10566J93505r0367L6241j11536J52386
$$ y = [-105513, -122449, -345075, -309310, 36044, -41826, 101234, 92022, -150343, -141138, 91646, -129514, -212912, 228712, 351507, 545400, 264342, 78226, 164765, 49695, 71631, 47723, -25861, -122331, -182819, -58097, 29945, -136619, -11963, 72755, 52273, 82043, 109616, 123487, 91692, -99245, -94774, -256966, -43914, -164383, -45900, 308970, 287243, 229558, 37830, 251527, -127437, -222876, 18788, -81953, 210544, 126580, -53057, 38008, 110661, -25518, -61739, -45594, 97948, 179907, 99603, 382906, 359515, 270931, 285408, 283390, 137103, 82420, 374783, 450924, 237407, 253561, 172547, 11932, -91048, 65406, 81451, 186786, 338469, 80926, -29640, 163865, 73498, 109739, -1797, 150589]
6766A50589J453m1717j34657m2862J9986q8867q4278J85511l1424Q6272J19296
6755A39302M7738J11459j92651J58247j99550J48435j31416j56405q618N5091
6745b8368J63722J54124o2029o5654q0536L03312m4921j67753k38558J60882k4200
6734G0021j87994k1208J59648J90234j25295j5243J65212N8448k53813j83244
6724a43234J83964K58472l65321Q7807K03067M5862p8015K7783J922o6302j64644
6713h639j16417R6999J25311j06128O6J60850J38586k9894N3686k71601k08079
6702a65260K45622K13266j74157J21743j66871J02906K65319l72734J57246o811
6692B20269k3633m5229R2511K61900j38391M4315m4800j65427O1372J20564O1021
$$ y = [150589, 152042, 110325, -24332, -67194, -47208, -136075, -220353, -34842, -66266, 20006, 139302, 187040, 298499, 105848, 264095, 64545, 212980, 81564, -74841, -83459, -28368, 135354, 289478, 227449, 161795, 81259, 384571, 339650, 171897, -66661, 94221, 70021, -117973, -139181, 20467, 210701, 85406, 70163, 235375, 293823, 40010, -143234, 40730, 299202, -66119, 21688, 224755, 270617, 192602, 220385, 222307, 156005, -8639, -125056, -28057, 97254, -8874, -8808, 152042, 290628, 260734, 314420, 42819, -165260, 80362, 293628, 119471, 241214, 74343, 177249, 442568, 69834, 227080, 220269, 196636, 151407, 243918, 505818, 367427, 411742, 366942, 201515, 262887, 383451, 444472]
6681D44472M1932J96323O53K72997k8569j876j8011k06339k15974J17604j66643
6670D36569o4661J80946r8358j11896j82367j08448J224J4625J62700j11234J51185
6659B70285J01955J4231O7189j61813l5131n700j73360J33102J4807p4299q0413
6648G0853j10596j34758K31469L8J83374j46862j49998K09743j27800O8646J91028
6637B85137j66936m58212M12194J77404j0975K49825k94863j13484p5781j33016
6627a28707J38305O4453J73813r1015j24874n4641K07493N8167J73562l40115
6617G6441j64276M09290j8963l07855K34656k9219m9245M3882J23709O2856K8281
6606D09557j27575j6464j44999O7687j49814r1188J60280j6047L2141j94086K9122
$$ y = [444472, 486404, 682727, 683380, 956377, 927808, 925932, 907921, 701582, 485608, 603212, 436569, 371908, 552854, 454496, 342600, 160233, 51785, 53009, 67634, 230334, 119100, 270285, 372240, 386471, 453660, 291847, 256716, 251016, 77656, 210758, 225565, 151266, 70853, -39743, -174501, 56968, 57006, 240380, 93518, -56480, 153263, 25463, 94109, 285137, 118201, -340011, 72183, 249587, 238612, 488437, 193574, 80090, 4309, -128707, 9598, 74051, 247864, 156849, 31975, -22666, 184827, 242994, 416556, 76441, -87835, 321455, 302492, -5363, 229293, 200074, 150829, 194711, 318420, 381276, 409557, 281982, 265518, 120519, 188206, 38392, -52796, 107484, 91437, 123578, -70508, -41386]
6595d1386J29915r9687R3202m8672j35728q797J72197j08591K49070L7790j68138
6584G1175K599j91665j00395K35700P9032J47605n0546o2031K5015N533j40649
6573B1373p0051J20448K59360q4896m0286j7764R032O6118j43579R264K07667
6562C36686k5133j4549L90775k14704k89312j2139R511k86584R8896o9434J06969
6551C0982J90229k0190o5456j60346n9009K31219J61841j2528n7569j28414j04893
6540E866J86953M5566R5358j19589j58927L7695R8994k77984Q6429o7190L18012
6529B51183l9969j7267L7024o5531l3197l7589M6216J7290l5400k49959o0036
6518a87235K88584o5150K37995n2489N7688J6638O8701q4996m5595l0856p2193
$$ y = [-41386, 88529, -11158, 82044, 33372, -102356, -111153, 61044, -47547, 201523, 239313, 71175, 73774, -117891, -218286, 17414, 96446, 244051, 193505, 131474, 156489, 162022, 21373, -48678, 71770, 331130, 246234, 205948, 188184, 197216, 263334, 119755, 129019, 336686, 311553, 297004, 687779, 473075, 183763, 171624, 181135, -105449, -6553, -75987, 30982, 221211, 201021, 135565, -24781, -83790, 147429, 309270, 296742, 239173, 110759, 5866, 192819, 238385, 333743, 214154, 55227, 92922, 191916, -86068, 361, -66829, 251183, 211214, 193947, 230971, 165440, 132243, 94654, 140870, 158160, 122760, -127199, -187235, 101349, 36199, 274194, 221705, 279393, 296031, 364732, 279736, 234141, 203285, 131092]
6507A31092p5426P7019O9225K5038K84305j96095j38538J03646n7345j3494J25408
6496C34835j14879J41653j37675M020j8118M0059j77866J62233j14450j82012
6486f2200J71739K72683k57903P5568K67040k01012j58977R2223N6111l46239
6476i0967M0282L51860j21765j56985M54733n0179j54040j7028l14578N963J40405
6465H7701p8294J69379N9939J76383j75233o970K5007j7334M1195p1897r5920
6454A13956J6457K13575j08280j55404K7359r4453J2372N1838K21677p3445l6404
6443A89248J59471q7658M5400j22291m543j06435K13897l04544J99088J35774
6433C17407m1131O8077n2593l4218K07155j35585J7794J72247R3022l77831K9957
$$ y = [131092, 55666, 132685, 201910, 226948, 511253, 315158, 176620, 280266, 222921, 209427, 334835, 219956, 361609, 223934, 227954, 209836, 249895, 72029, 234262, 119812, -62200, 109539, 382222, 124319, 199887, 466927, 265915, 106938, 199161, 255272, -90967, -50685, 301175, 179410, 22425, 477158, 426979, 272939, 255911, -58667, -52704, 87701, 9407, 178786, 238725, 415108, 239875, 232905, 257912, 240578, 281773, 209876, 113956, 130413, 343988, 235708, 80304, 107663, 13210, 25582, 77420, 299097, 225652, 189248, 348719, 261061, 306461, 184170, 179627, 73192, 287089, -17455, 181633, 317407, 276276, 344353, 291760, 257542, 464697, 329112, 346906, 519153, 612175, 234344, 264301]
6422B64301k01395O9733J37921K31742j43192k25153K7403J0712O8742J63366
6412D04180N2320j20664n6621j89393J32487J11632J56157k96996j16084J21755
6402A98773P5484o2891O9073Q3113j22981J47082j57339J23180K7240J586Q9730
6391D72050j49581j23545m3913K29579n2395m3585M4226j2252K2514k9492n4652
6380B58954J48333M0544j03019J78686n3405j67695r5272P4691K00270j59039
6370C23048l1965j58543J02907j66653J68013n0726K39465j89571J23775j18124
6360B41626P6638P5799J2493L10057l77619J8064m1643P9105K14479k20927J32952
6349E21024K9972R8976r3583p8713M0806j04415J18450K6824p0630L858R7892
$$ y = [264301, 62906, 132639, 270560, 502302, 359110, 133957, 161360, 172072, 240814, 404180, 456500, 335836, 279215, 89822, 222309, 333941, 490098, 193102, 77018, 198773, 274257, 211366, 280439, 363552, 240571, 387653, 230314, 353494, 380734, 382320, 472050, 322469, 198924, 155011, 384590, 332195, 288610, 332836, 320584, 343098, 313606, 258954, 407287, 447831, 344812, 523498, 470093, 302398, 207126, 281817, 482087, 323048, 291083, 132540, 235447, 68794, 236807, 186081, 425546, 235975, 359750, 241626, 318264, 394063, 406556, 716613, 338994, 357058, 315415, 394520, 608999, 388072, 521024, 550996, 649972, 556389, 477676, 518482, 414067, 532517, 559341, 488711, 492569, 590461]
6338E90461j17561q8562J8610K6337R5247J06915p7692J250k6846m7618l0637
6327D49904j27915K08258p6643k60217K39327r9042m9859J36415J57644r4525
6317D83347J12235j06316j36010K38190k32891q407k6279M0156N7866K2157m1114
6306D02934L2194P1924J37163k6777n5093k14234R0707K62272j08721o1549q8529
6295D42291K65530O7355L4670K3814L7384j36146N421l5371k28509j58341Q5651
6284D03749K27346q5398J23534j49231m0165M3173K7057J48097N572p4322j64924
6273D64488q2910k7337J06325J95215j45249P3470L2666q7553K00325k4733J71477
6262H76184J73564j34627j9535Q0071j09578J07884J42346N9620k12921k23375
$$ y = [590461, 472900, 384338, 402948, 429285, 524532, 631447, 553755, 555005, 528159, 480541, 449904, 321989, 530247, 453604, 193387, 432714, 333672, 283813, 420228, 577872, 483347, 595582, 489266, 353256, 591446, 358555, 350148, 323869, 364025, 421891, 444048, 402934, 435128, 507052, 644215, 617438, 562345, 348111, 438818, 701090, 592369, 530820, 442291, 707821, 775176, 809846, 833660, 871044, 734898, 740319, 704948, 476439, 318098, 403749, 631095, 545697, 669231, 520000, 479835, 523008, 550065, 698162, 703734, 629412, 464488, 381578, 354241, 460566, 655781, 510532, 584002, 616668, 529115, 729440, 704707, 876184, 1049748, 915121, 895586, 975657, 866079, 973963, 1116309, 1175929, 963008, 739633]
6252G39633k99985Q6925P9000O0932J1445K48083J00167k11618r386k768J2409
6241H14837J69152j0696L4439k1374J57154K78128j86452n9248K70436J0440N0959
6230A507775o1145j20930j32695j34016r0582j66498o6502K0601k8025J08691
6220H36674Q7207N035k25325r8253K29672J61030J0249p7888j9012n9665o78l7744
6208H11302K05740l4073L90739j85952j81118m1649n6682P6871M3132L6483j67697
6197H97096L1311n8365J61098j06075J44934M9198j58179j11132J21234P6451
6187A047571o0432k01173J53988p773m28290J89530J96284k38810J25876k0576
6177G56195j71521J95779O474J23164p507K86545m7262J16254j67389k26208J32415
$$ y = [739633, 439648, 526573, 605573, 666505, 677950, 926033, 1026200, 814582, 805196, 802428, 814837, 983989, 973293, 1007732, 986358, 1143512, 1421640, 1235188, 1175940, 1446376, 1456816, 1507775, 1446630, 1325700, 1193005, 1058989, 968407, 801909, 735407, 756008, 727983, 836674, 923881, 928916, 703591, 605338, 835010, 996040, 1006289, 928401, 909389, 849724, 849046, 811302, 1017042, 982969, 1373708, 1187756, 1006638, 964989, 908307, 985178, 1028310, 1064793, 897096, 928407, 870042, 1031140, 925065, 1069999, 1119197, 961018, 849886, 971120, 1047571, 987139, 785966, 939954, 932181, 503891, 693421, 889705, 650895, 776771, 756195, 584674, 780453, 786927, 910091, 902584, 1189129, 1141867, 1258121, 1090732, 864524, 996939]
6166I96939l03213K21780M59042k74326j76303p7965J89386J00494o8057J8390
6156A086167o6946Q636r4225O8172k54089k83993L9158L95231J56944J75880j06013
6145A124922j79412J32525j14024j3131J30398q5010L8895K41574p4381o0664
6135A141692L6082j29428J15183J11638j71803L9339N497r8344L0759J64521O2234
6124A307370K6408q6320j98267M1971j32275m8291n2550J49356K22878k87346
6114I42934K4281M1665L04153J752M940J62603o0683q9759j26354M6023k596J0736
6102A259695N5752K236K56914J04273o5991J8452n5326k20156q919l7672J81781
6091A491039P2625N5825m1653j59189P4485K71036k36100k52745L99150L6785
$$ y = [996939, 693726, 915506, 1374548, 1100222, 923919, 845954, 1035340, 1135834, 1067777, 1086167, 1019221, 1027857, 933632, 1001804, 747715, 463722, 502880, 898111, 1055055, 1230935, 1124922, 945510, 1078035, 964011, 950880, 1081278, 996268, 1035163, 1276737, 1202356, 1141692, 1177774, 1048346, 1163529, 1275167, 1103364, 1142703, 1148200, 1049856, 1080615, 1245136, 1307370, 1333778, 1247458, 1049191, 1091162, 958887, 910596, 858046, 1007402, 1230280, 942934, 967215, 1008880, 1313033, 1314785, 1319725, 1482328, 1421645, 1331886, 1205532, 1251555, 1248959, 1259695, 1315447, 1317683, 1574597, 1678870, 1612879, 1631331, 1576005, 1355849, 1346930, 1309258, 1491039, 1563664, 1619489, 1577836, 1418647, 1493132, 1764168, 1528068, 1275323, 1674473, 1711258]
6081A711258l8037k9292R7930J51204j60480j01141L7657P6374j13869j48781
6071A482823J69315L10871k22213n1787j43837J39357L61640j49636j11060O1000
6061A846473j5943j0223p3990j8922J10278J81603l8464j59807M07813O3383o8692
6050B223509N1348J68330k14645j67059N3593N6786Q9311L6577o1195J4755j35198
6039B116112k0797K17569K01217j94987K86985M5804J05007L4232K25346L42143
6029C358631k93844k26538J35554Q4010q8715K08482j47602j12490K24246K42233
6019C383967j0239n4449K14324j31079M6484J22186n3769N3996J30106L19205
6009D020732q4532J32403r0340J65992R9101j15115L5664J09818L11927j53571
$$ y = [1711258, 1673221, 1643929, 1741859, 1893063, 1732583, 1631442, 1669099, 1745473, 1631604, 1482823, 1652138, 1963009, 1740796, 1689009, 1545172, 1684529, 2046169, 1896533, 1785473, 1846473, 1830530, 1820307, 1746317, 1727395, 1837673, 2019276, 1980812, 1821005, 2228818, 2292201, 2223509, 2274857, 2443187, 2228542, 2061483, 2115076, 2171862, 2261173, 2297750, 2236555, 2251310, 2116112, 2095315, 2312884, 2514101, 2319114, 2606099, 2651903, 2756910, 2791142, 3016488, 3358631, 3064787, 2838249, 2973803, 3057813, 2969098, 3177580, 3029978, 2917488, 3141734, 3383967, 3373728, 3319279, 3533603, 3402524, 3449008, 3571194, 3517425, 3571421, 3701527, 4020732, 3936200, 4068603, 3978263, 4144255, 4243356, 4128241, 4163905, 4273723, 4585650, 4432079]
5999D432079J71564l6023J0805Q8929K33350J03722j34786K84393J99460n9730
5989E293763K12941K28754K04697j24351J07360J48319K03485K54815L86304J03233
5979G019320o0111J41615M82536K80722j09194K52599J52925J22065K75246K56233
5969H813956K27396M07146K24548M74676N38994L59061K4180K08639P25472M03449
5959A2407517J59854M48039M16467N34685N05656O18909Q44737Q63952O55148
5950A7454964Q84896R07626P45126J049759P84539J279224J548905J628506J432825
5941B7716370J650682K176602K363718L171419L225589L935181M956354O167596
5933E5363511P760048R143097R421346P852822K806466l910833q271539r016645
$$ y = [4432079, 4603643, 4567620, 4578425, 4667354, 4900704, 5004426, 4869640, 5154033, 5353493, 5293763, 5506704, 5735458, 5940155, 5815804, 5923164, 6071483, 6274968, 6529783, 6916087, 7019320, 6959209, 7100824, 7583360, 7864082, 7754888, 8007487, 8160412, 8282477, 8557723, 8813956, 9041352, 9448498, 9673046, 10147722, 10686716, 11045777, 11069957, 11278596, 12004068, 12407517, 12567371, 13015410, 13431877, 13966562, 14472218, 15091127, 15935864, 16799816, 17454964, 18339860, 19247486, 19992612, 21042371, 21826910, 23106134, 24655039, 26283545, 27716370, 29367052, 31543654, 33907372, 37078791, 40304380, 44239561, 49195915, 55363511, 63123559, 72266656, 81688002, 89540824, 92347290, 88436457, 80164918, 71148273]
5925G1148273p564367n241753l988477k681419j847722j521218o33623K79670
5917D7949364Q38829J190083J481602J940605K506682L155790L804206N207311
5909F8074472O236676P769162R889364J2488818J5468076J7916241J8155387J2514711
5901A68512907L74949j3898165k1504845j9980020j5486496j1921129r396492
5894G6700709p732981o024416m579065l518688l003838k171370j427408r02549
5886D7340394k13317K81292Q39685J260412J899042K676564L798310N236507O587842
5877F9706731P591655Q572826P875930M178540k897373q925510j0662240r480654
5869F5959905p360822n893152n132029m623226m013829l435721l104616k858767
$$ y = [71148273, 63583906, 58342153, 54353676, 51672257, 49824535, 48303317, 47669694, 47949364, 48788193, 49978276, 51459878, 53400483, 55907165, 59062955, 62867161, 68074472, 74311148, 82080310, 91969674, 104458492, 119926568, 137842809, 155998196, 168512907, 168887856, 154989691, 133484846, 113504826, 98018330, 86097201, 76700709, 68967728, 62943312, 58364247, 54845559, 51841721, 49670351, 48242943, 47340394, 47127077, 47408369, 48248054, 49508466, 51407508, 54084072, 57882382, 63118889, 69706731, 77298386, 85871212, 93747142, 97925682, 95028309, 86102799, 75440559, 65959905, 58599083, 52705931, 47573902, 42950676, 38936847, 35501126, 32396510, 29537743]
5861B9537743k318498k165054j714405j568350j081676p42782r23915o65201p11163
5852A7646699p02631n53870l53411K0768k50452k16153j16947r5835j33054L13667
5842A5558781L02526K18295J07952k70060n14473o50805n25134r75326p05556
5833A2546200p25496m51279o11250o54499l38863m66022j65872m04234k22986
5824H505699k49082j89814j82412k99058k06630q7979r9452k03380k88711J20869
5814F820050l0237j9547j53706J22454j12960k22317J50513J23217o4351K58334
5804F871450k10706K44309r2998m84245n02100m16612O1502q2719n0115k52686
5794E085080P9621q8069j75950l09969p0762k54966n429J61459k03174r9072K12623
$$ y = [29537743, 27219245, 25054191, 23339786, 21771436, 20689760, 19946978, 19023063, 18357862, 17646699, 16944068, 16390198, 16036787, 16057555, 15807103, 15590950, 15474003, 15378168, 15245114, 15558781, 15861307, 16079602, 16187554, 15917494, 15403021, 14752216, 14227082, 13251756, 12546200, 11820704, 11369425, 10758175, 10103676, 9764813, 9298791, 9132919, 8728685, 8505699, 8256617, 8066803, 7884391, 7585333, 7378703, 7290724, 7191272, 6987892, 6699181, 6820050, 6789813, 6770266, 6616560, 6739014, 6626054, 6403737, 6554250, 6677467, 6613116, 6871450, 6660744, 6905053, 6812055, 6327810, 5825710, 5409098, 5470600, 5387881, 5337766, 5085080, 5164701, 5076632, 4900682, 4590713, 4519951, 4264985, 4259556, 4421015, 4217841, 4118769, 4331392]
5783D331392o2266k62392r2136j09301K10746j20103N931P7091l84375J85391
5773C779978R8046k12900k7525l6315p9338J35819K77503p075o0496P7509l8931
5762C906275j12771j45977j44349J81655J50015l04004J07862N6836k06100N9823
5752C549265K302L00669P4097K4415M7464L27479Q947k81671j59223j01292n986
5741C786466L8367O5394P5348K42625m9918j26625O3738J42348j90406j46009
5731C901328r0515k4815J97644J30141l405r8485L4232K05679j072J29926L62340
5720D742998L16657P1382J4803q2129j28289k04969N8639r6158j48155Q1279r441
5709D616617L8117K72247j95412J92084l0434l85871l41900p4705p9352j4438
$$ y = [4331392, 4269126, 4006734, 3914598, 3805297, 4016043, 3895940, 3901871, 3978962, 3594587, 3779978, 3878024, 3665124, 3637599, 3601284, 3521946, 3657765, 3935268, 3928193, 3867697, 3945206, 3906275, 3793504, 3647527, 3503178, 3684833, 3834848, 3530844, 3638706, 3695542, 3489442, 3549265, 3551567, 3852236, 3926333, 3950748, 3998212, 4325691, 4334638, 4052967, 3893744, 3792452, 3786466, 3824833, 3890227, 3965575, 4208200, 4158282, 4031657, 4095395, 4237743, 4047337, 3901328, 3810813, 3785998, 3983642, 4113783, 4110378, 4011893, 4046125, 4251804, 4250732, 4380658, 4742998, 5059655, 5131037, 5145840, 5063711, 4935422, 4730453, 4789092, 4692934, 4544779, 4626058, 4616617, 4654734, 4926981, 4731569, 4923653, 4893219, 4507348, 4165448, 4090743, 4011391, 3996953]
5699C996953J8004K2162k69212N362J74758K14990k30367j58317J48202J97652
5689D120187N8896J61766j64631n0751K27300k02657j00113M0422r7925K06552
5679D199046L32984j02774l20080m6082Q1206n723J49184j82268k51346Q531P7724
5668C940402q6624r8342j01633K66542j58396j52737R8181M0281M8292J36330
5658C932296J91367K54199p4604j6218J36184J70124j8319j44310Q2469J33177
5648D646365j73217l1759J30307Q4451j42473j76396R2879j086m8117K38875j01108
5637D518721J20360M64769k02911n5750K04387J74840J47680l04488L35930K69212
5627E672750K3156j34020P6436L7241k3087l6393R6701r7759L09791J71467j12076
$$ y = [3996953, 4014957, 4037119, 3767907, 3773269, 3948027, 4163017, 3932650, 3774333, 3922535, 4120187, 4179083, 4340849, 4176218, 4125467, 4352767, 4150110, 4049997, 4090419, 3992494, 4199046, 4532030, 4429256, 4109176, 4063094, 4144300, 4138577, 4287761, 4105493, 3854147, 3862678, 3940402, 3853778, 3755436, 3653803, 3920345, 3761949, 3609212, 3707393, 3747674, 3795966, 3932296, 4123663, 4377862, 4303258, 4287040, 4423224, 4593348, 4575029, 4430719, 4513188, 4646365, 4473148, 4441389, 4571696, 4656147, 4513674, 4337278, 4430157, 4429071, 4380954, 4619829, 4518721, 4639081, 5103850, 4900939, 4845189, 5049576, 5224416, 5372096, 5067608, 5403538, 5672750, 5695906, 5561886, 5638322, 5675563, 5652476, 5616083, 5712784, 5615025, 5924816, 6096283, 5984207]
5616E984207o8580Q5497l9909m7679j72223K32328J72259j04952J78127L63413
5606F582488q3331J93676M24156K5438J55198p2446J85114M9467J48633K22967
5596G831360J58972L31345K49139o8318L2196K62401K72848N5872K33738J76415
5586I535968N5957K04457M21629K63261K15907J94759L70526J48482L64518O67785
5576A2443249M25843N38747L56767O42322O50854M24817N80327N21991P23885
5567A7308802O05421Q37711P96657N91252O95998R36493J102251J065773J405237
5558B5345595J651628J737651K043756K201394K534547L159867L352031L248521
5550D5274990L823998M366784M668021N584209N614328M975371L321859N02789
$$ y = [5984207, 5915627, 6001124, 5961215, 5913536, 5741313, 5973641, 6145900, 6040948, 6219075, 6582488, 6499157, 6692833, 7116989, 7142427, 7297625, 7225179, 7410293, 7459760, 7608393, 7831360, 7990332, 8321677, 8570816, 8502498, 8534694, 8797095, 9069943, 9125815, 9359553, 9535968, 9591925, 9796382, 10218011, 10481272, 10697179, 10891938, 11262464, 11410946, 11775464, 12443249, 12869092, 13407839, 13764606, 14406928, 15057782, 15482599, 16062926, 16584917, 17308802, 17914223, 18751934, 19548591, 20139843, 20835841, 21772334, 22874585, 23940358, 25345595, 26997223, 28734874, 30778630, 32980024, 35514571, 38674438, 42026469, 45274990, 49098988, 53465772, 58133793, 63718002, 69332330, 74307701, 77629560, 78132349]
5542G8132349k155532l980515m685975m463392l540137k760551k096454j491449
5534E2958344p03050j90355K19353N88875J502617J789417K638634L301544M228773
5525F6334152M807664N656251O833938P702253Q887081R895668J0012245R066167
5517A29195419N854699R76833m898902r263073j0948001j1349362j0482201q909735
5509H0175677p052371n570645m859820l515040k703297j974379j079484p96911
5501E2623730k16877O91499J161737J480274K152654K309852K714470L239146
5493F6156485M136294M312879L954192K554043k02298k823990n351521p033302
5485F5702782o679502o563776n299013m630245m101720l116346k622730k138384
$$ y = [78132349, 75976817, 71996302, 67310327, 62846935, 59306798, 56546247, 54449793, 52958344, 52255294, 52064939, 52284292, 52873167, 54375784, 56165201, 58803835, 62105379, 66334152, 71141816, 76798067, 83632005, 91334258, 100221339, 110117007, 120129252, 129195419, 135050118, 136026951, 131128049, 121864976, 110916975, 99567613, 89085412, 80175677, 73123306, 67552661, 62692841, 59177801, 56474504, 54500125, 53420641, 52623730, 52406853, 53098352, 54260089, 55740363, 57893017, 60202869, 62917339, 66156485, 70292779, 74605658, 78559850, 81113893, 80911595, 78087605, 72736084, 65702782, 59023280, 52459504, 47160491, 42530246, 38428526, 35312180, 32689450, 30551066]
5477C0551066j967476j794578j277655r98129q73680j105560j125061n09510o68528
5468B0230889q72155o61489q93576o45028p19904q53138p68834q13527m35599
5459A3567639l11163m86419p29938k17533j81733l87074k75535l56566j00829
5450A0520849l19258k98728j48439m4285m2917k87042k61189j38427j6352o6369
5440H897843l55753l30032l7920J96642r0403q8759j29279k34119j56648j65777
5430G505795K4138l17339n6099J5687K0174K0840k69058j82979j27328J12894
5420F746725P7965l62263l14662K15984j83203M1971L41J03881J19080j20994
5410F324825N8764l7081n8597j94422J81560m6481J15580j349j11294j99238J94287
$$ y = [30551066, 28583590, 26789012, 25511357, 24513228, 23639548, 22533988, 21408927, 20899417, 20230889, 19358734, 18697245, 17803669, 17158641, 16438737, 15585599, 14816765, 14003238, 13567639, 13256476, 12770057, 12040119, 11822586, 11640853, 11253779, 10978244, 10621678, 10520849, 10201591, 9902863, 9754424, 9710139, 9667222, 9380180, 9118991, 8980564, 8964212, 8897843, 8542090, 8212058, 8174138, 8370780, 8280377, 8191618, 8062339, 7828220, 7671572, 7505795, 7529933, 7212594, 7156495, 7172182, 7192356, 7213196, 6944138, 6761159, 6633831, 6746725, 6824690, 6462427, 6147765, 6363749, 6180546, 6222517, 6222858, 6326739, 6445819, 6324825, 6383589, 6346508, 6287911, 6093489, 6275049, 6228568, 6344148, 6342799, 6231505, 6032267, 6226554]
5399F226554O5516k10360O7380J04128J74700J54014J39873J18683q8233J03690
5389F855945M41774M86348M65691Q905K91868M48938K62971L5924l76698n95590
5379H326076o33694k82476l65275p3063J13665l26720j97037j04743R2555K74870
5369F824158K01230O9821L46132l4388K03883L77992M79821O60033L45255N89697
5359A0063634Q51270Q96824R39066L49106j88501j83438m02907n86431k63414
5350A1475209l00153l64754p61749o82962l31435k95484J29995j06493k43053
5341H519121j87415J14584m4455K83653m671J05052M64789L57891Q17671O77146
5331A1103366M25272M24038K81887j39307l3698L21558J30693K69618J36145l22593
$$ y = [6226554, 6292070, 6081710, 6149090, 6253218, 6427918, 6581932, 6721805, 6840488, 6752255, 6855945, 7297719, 7784067, 8249758, 8258663, 8550531, 8999469, 9262440, 9298364, 8921666, 8326076, 7692382, 7409906, 7044631, 6971568, 7085233, 6758513, 6561476, 6456733, 6549288, 6824158, 7025388, 7095209, 7441341, 7406953, 7610836, 7988828, 8468649, 9128682, 9473937, 10063634, 10914904, 11811728, 12750794, 13099900, 12911399, 12727961, 12325054, 11738623, 11475209, 11175056, 10810302, 10048553, 9365591, 9034156, 8738672, 8868667, 8762174, 8519121, 8331706, 8446290, 8401835, 8685488, 8680817, 8785869, 9250658, 9608549, 10426220, 11103366, 11528638, 11952676, 12234563, 12095256, 12061558, 12383116, 12513809, 12783427, 12919572, 12596979]
5321A2596979p70128j038162q94963q57762o66685k15063k94501k25202q4438
5312G550075J66185j36054m56803o1927J89564K23922L09659L42302N25754J47017
5302H799694j20322j05547j92857l9386J21839P2370R0419l02477o02372m05281
5292G316080n21896n52763n00505q5545k00792l16664n9482j94341k99370K29511
5282D814233J12596J33051j62582r7634K56788j8700O3375M19282J01096J0325
5272E631830j77242k78297k23804j45157m09603l71984J40575l18273j11101K2164
5262C759108l90102P1048j32881l64052K46543K04979M493J0817O0734J6967J4839
5251C502493R9804o2121m2224J4073l5503k51328k7589L3542l4691k47520q8442
$$ y = [12596979, 11826851, 10788689, 9893726, 9035964, 8369279, 8154216, 7859715, 7634513, 7550075, 7716260, 7580206, 7123403, 7061476, 7251040, 7474962, 7784621, 8126923, 8652677, 8799694, 8679372, 8573825, 8380968, 8341582, 8463421, 8535791, 8626210, 8323733, 7721361, 7316080, 6794184, 6241421, 5740916, 5655371, 5454579, 5137915, 5078433, 4884092, 4584722, 4814233, 4926829, 5059880, 4897298, 4799664, 5056452, 5037752, 5101127, 5520409, 5621505, 5631830, 5454588, 5176291, 4952487, 4807330, 4397727, 4025743, 4166318, 3848045, 3736944, 3759108, 3369006, 3440054, 3307173, 2943121, 3189664, 3394643, 3399136, 3409953, 3470687, 3487654, 3502493, 3602297, 3540176, 3497952, 3512025, 3476522, 3225194, 3197605, 3231147, 3196456, 2948936, 2860494]
5240B860494J05129J98853k51065m47567k6797L33263J05850j76224J85118j85573
5230B701481K1909L176j38559J16868K32744P9439j12078O8003L10166o1988k2060
5219C199101O7761P9671j17470J44301M71268M80908k45997o9708K40063l7222
5209D212676k05600q3050l21231k53072k95174j25016p8158j21703j26972m43329
5199B159371M8347K11578R05P6078m3464p3942j36064L2895K9007k2558K0245
5188B302398o1819J53486j78865l7185k17886l04678J08073O6250p5709r7210
5178A656855J08024q5030r7134J50031Q7900j45680k11757J07478o0145J43766
5168A654308j18701K5097K2492O1022L22862j13823K1628P417j30898m90715j53369
$$ y = [2860494, 2965623, 3164476, 2913411, 2465844, 2439047, 2772310, 2878160, 2701936, 2887054, 2701481, 2723390, 2726566, 2588007, 2704875, 2937619, 3017058, 2904980, 2972983, 3283149, 3221161, 3199101, 3266862, 3346533, 3229063, 3373364, 3844632, 4325540, 4079543, 4009835, 4249898, 4212676, 4007076, 3924026, 3602795, 3349723, 3054549, 2929533, 2851375, 2729672, 2602700, 2159371, 2207718, 2419296, 2420201, 2496279, 2452815, 2378873, 2242809, 2275704, 2304711, 2282153, 2302398, 2240579, 2394065, 2215200, 2178015, 1960129, 1655451, 1763524, 1829774, 1754065, 1656855, 1764879, 1679849, 1582715, 1732746, 1820646, 1674966, 1463209, 1570687, 1510542, 1654308, 1535607, 1560704, 1583196, 1644218, 1967080, 1853257, 1874885, 1882302, 1751404, 1260689, 1107320]
5157A107320K76992j92886j14936J1170K6544o4890j24709L2428M3882m6868K86922
5146A240969J42194j9490P3925Q8581k70945o6042q6825J32908M6970j6541M351
5135A270055O573q0092j58705K07424k03495m3656K05491L5478j12586j6765l7143
5124A072579k0994k8274k13276m1305K02245M3302O2574N2370J44838J21918l46714
5113A049263O7743j15851J43469L898j77249N410M7783M2617j67665J55369l66
5102A054421j60798R8346P7067j51037k23451p4828J78772O1566r6028P6452j44516
5091F95966P9987R7576M9511K60756K2988k94199r4654J80583J01672O4612j5954
5080A148844k3360j36761m5858j0544j02793q7108J7713j45390J55590K40141
$$ y = [1107320, 1384312, 1191426, 1076490, 1087660, 1114204, 1049314, 924605, 957033, 1000915, 954047, 1240969, 1383163, 1363673, 1437598, 1526179, 1255234, 1189192, 1102367, 1235275, 1282245, 1265704, 1270055, 1276628, 1196536, 1037831, 1245255, 1041760, 998104, 1203595, 1239073, 1126487, 1109722, 1072579, 1051585, 1023311, 810035, 768730, 970975, 1014277, 1076851, 1129221, 1274059, 1395977, 1049263, 1117006, 1001155, 1144624, 1148522, 971273, 976683, 1024466, 1067083, 899418, 1054787, 1054421, 893623, 991969, 1069036, 917999, 694548, 619720, 798492, 860058, 764030, 840482, 695966, 775953, 873529, 923040, 1183796, 1206784, 912585, 817931, 998514, 1100186, 1164798, 1148844, 1125484, 988723, 942865, 932321, 829528, 742420, 760133, 614743, 770333, 1010474]
5070A010474j23866k14177M7410j59117J95017K6302j59802K66106R6620l18058
5060F66909J02481Q7209J0572n5880R6618n212r7952j36884L5870j34293M37Q1559
5048F51434l25319K42908K72833j88008m2539K50879n0005p1916K83466m2408
5038I81325j74920J979l04315P8184l0375J6423N6883N1198O2421j45649o0753
5027E32401J05552n1110O4887J09193j54943J90034O5479K18133k1371o7273R3552
5016A084534k02702J35299k44115k06493K17805M8118o6819j57761j17910N6586
5006E46542K1706n3799J5783R8978O1431J9259J40463j06114k5559L526J27195
4995H49411m5491k5694M2676k32378J06535P8198K1116m22372J75509K11300k55998
$$ y = [1010474, 886608, 672431, 719841, 560724, 755741, 782043, 622241, 888347, 984967, 666909, 769390, 856599, 867171, 811291, 907909, 902697, 804745, 667861, 703731, 569438, 569875, 651434, 326115, 569023, 841856, 653848, 611309, 862188, 812183, 740267, 1023733, 981325, 806405, 808384, 504069, 582253, 551878, 568301, 625184, 676382, 738803, 593154, 532401, 637953, 586843, 651730, 760923, 605980, 796014, 861493, 1079626, 1058255, 990982, 1084534, 881832, 1017131, 773016, 566523, 784328, 832446, 765627, 607866, 489956, 546542, 568248, 514449, 530232, 629210, 690641, 709900, 850363, 744249, 718690, 722216, 849411, 803920, 778226, 820902, 588524, 695059, 773257, 794373, 372001, 547510, 758810, 502812]
4984E02812P27J56098O9003k23945O2050n1717J9299j55873J12265o6229j2889
4973D11601J5636J53410J5725K05723J15632l98804p566J01430M6458M0730m0498
4962F59477k59070O0771K40494J68494j13030j54734q0947J03460o558j33983
4952D84374Q6028J26965j12740n4796R1166K06139j00721j51076J49777J1521
4942G36637o301j26490P0900K83349j84758o9950K5742J84273j82712j23353J0306
4931F17643L15316o5116k08851j17365K9985J69078M4484P3517K41363J07320
4921A207374j76840n800p8851K3265j47373J50833J2467j36752k38963p4604J30402
4910F65158L1959J35709q2198J59941K71968l01895J12674J36970j72684j20244
$$ y = [502812, 503539, 659637, 728640, 504695, 566745, 515028, 534327, 378454, 490719, 424490, 411601, 427237, 580647, 596372, 802095, 917727, 518923, 511357, 612787, 659245, 699975, 659477, 400407, 461178, 701672, 870166, 757136, 602402, 521455, 624915, 618357, 484374, 570402, 697367, 584627, 529831, 620997, 827136, 726415, 575339, 725116, 736637, 730336, 603846, 674746, 958095, 773337, 703387, 729129, 913402, 730690, 607337, 617643, 932959, 867843, 658992, 541627, 571612, 740690, 785174, 858691, 1100054, 1207374, 1030534, 1024734, 945883, 969148, 821775, 972608, 985075, 848323, 609360, 534756, 665158, 697117, 832826, 750628, 910569, 1182537, 880642, 993316, 1130286, 957602, 837358]
4900H37358k49506K58009j0090J38430L5901k58691r7303J01139J39023Q6175
4890I80445k4514j74106L1230O913p9960j30362J35147J27801j0973j14488K40333
4879I87466p1609n4653l5441J56123P9141l4556K5695k50644r8107j63271J34911
4868F75055J02306L54825J5411l31048J47216K1448J60651N7762k14896J48481
4858A137211o1907R7932p1926k16228N9738K38195O0435J38683k78227l9295L68614
4847A433225j08963M0068K50542j77999M4740J33069k431j23023M4029P7572n036
4836A605793p0737J60447J62705k31496N6672j86725n8375R9069p9388J39006
4826A596971K32667j28633p4236J03590K7390m2816L00010l7461M6199j31930
$$ y = [837358, 587852, 845861, 835771, 974201, 1010102, 751411, 654108, 755247, 894270, 980445, 955931, 781825, 813055, 819968, 740008, 609646, 744793, 872594, 861621, 747133, 987466, 915857, 861204, 825763, 981886, 1061027, 1026471, 1052166, 801522, 703415, 540144, 675055, 777361, 1132186, 1147597, 816549, 963765, 985213, 1145864, 1203626, 988730, 1137211, 1075304, 1173236, 1101310, 885082, 944820, 1183015, 1243450, 1382133, 1103906, 1064611, 1433225, 1324262, 1364330, 1614872, 1436873, 1481613, 1614682, 1612251, 1489228, 1533257, 1610829, 1605793, 1535056, 1695503, 1858208, 1626712, 1683384, 1496659, 1438284, 1537353, 1457965, 1596971, 1829638, 1701005, 1626769, 1730359, 1757749, 1714933, 2014943, 1977482, 2023681, 1891751]
4816A891751j9025j44429L21087M75376R4693J02373k18987k68946K60451k761
4806B491583K59887J19828K33544J39851J63756n1541K32180J60419r4395K54646
4796C909758J43986K29971j6228M68756J92455L4619J22372K88264K51344O99833
4786F325130N15210L75339N71587N96679J238472J024765R41241J532454K286283
4777A5407160K463613L429193M337746M580728L878781J505505j801437m670899
4769B9130390n614781m702587l379665k189003j889763j613157j050655q27595
4761G863184n49203q55380l74430k48590k63883k93595k23105m20039j25787j12549
4751D396623j94226Q7259k31105m1150k31754N4394Q6750j53048L8056R0006k72585
$$ y = [1891751, 1872726, 1728297, 2049384, 2524760, 2619453, 2721826, 2502839, 2233893, 2494344, 2491583, 2751470, 2871298, 3104842, 3244693, 3408449, 3356908, 3589088, 3749507, 3655112, 3909758, 4053744, 4283715, 4267487, 4736243, 4928698, 4963317, 5085689, 5373953, 5625297, 6325130, 6840340, 7215679, 7787266, 8383945, 9622417, 10647182, 11588423, 13120877, 15407160, 17870773, 21299966, 25637712, 30218440, 34097221, 35602726, 33801289, 29130390, 23515609, 18813022, 15433357, 13244354, 11354591, 9741434, 8690779, 7863184, 7313981, 6458601, 6084171, 5835581, 5571698, 5278103, 5054998, 4634959, 4509172, 4396623, 4202397, 4289656, 4058551, 4017401, 3785647, 3840041, 3926791, 3773743, 3811799, 3901805, 3629220]
4740C629220m6381N1579p6830j74669K45297j77K3987L66406J80322l0562l3013
4729D135179J28207l6599J23768L0818J88436j7618M13455K02837J45706N26584
4719E840773J42508K84555N50263K99832M76641M72465Q67440J026899J160385
4710A1121761J189669J657719K281694K946687L279320L966047M346562K516532
4702C3305991k16256j700449l543226m717114m589467l192061k282288k133850
4694A0931280j602770j328859r86603o86857m56026k31491n95222k49627o8644
4685D725181n16898m17662n5755r7992j34230k00819k71115l3681L7179j90969
4675B843239j68885j63139K4646j40236k62344J09282q9757k14095j12237L30575
$$ y = [3629220, 3582839, 3634418, 3557588, 3382919, 3628216, 3628039, 3652026, 4018432, 4198754, 4168192, 4135179, 4263386, 4226787, 4350555, 4381373, 4569809, 4552191, 4965646, 5168483, 5314189, 5840773, 5983281, 6267836, 6818099, 7117931, 7594572, 8067037, 8934477, 9961376, 11121761, 12311430, 13969149, 16250843, 19197530, 22476850, 26442897, 30789459, 33305991, 33089735, 31389286, 27846060, 23128946, 18539479, 15347418, 13065130, 10931280, 9328510, 7999651, 7013048, 6326191, 5870165, 5638674, 5043452, 4793825, 4725181, 4208283, 3790621, 3734866, 3636874, 3502644, 3301825, 3030710, 2997029, 3034208, 2843239, 2674354, 2511215, 2535861, 2395625, 2133281, 2242563, 2152806, 1938711, 1826474, 2157049]
4665B157049J22592j52528n7606K519j01691k12840j9893p4496k21125K44211
4655A686192R0699k82350K43450J4434j292R2170j82220P8293j02158r1365O5042
4644A610895j86503m147J79135j6899Q2192k45078J1423R4037J91363O3968k78377
4633A502009j30320o5050k3511r2361j94511K06276J10269n6202p594p1193r5560
4622A082252K72372k12181P0198Q0453M5607J35184k43615L1743j0510Q2378l4189
4611A299692j72548J03142k47977J9349k4565Q5801n1035J76451j09716K26739
4601A305333J58158m03952O652J57271j43958r4812J17097r4540J9466L433k3631
4590A006517R9683o4181K72462J47841m2551P6914l83020j665k22538K4216J70325
$$ y = [2157049, 2279641, 2127113, 2069507, 2072026, 1970335, 1757495, 1737602, 1663106, 1441981, 1686192, 1776891, 1494541, 1737991, 1752425, 1751133, 1843303, 1661083, 1739376, 1637218, 1545853, 1610895, 1424392, 1420245, 1599380, 1582481, 1664673, 1419595, 1431018, 1525055, 1716418, 1780386, 1502009, 1371689, 1306639, 1283128, 1190767, 996256, 1202532, 1312801, 1256599, 1249005, 1177812, 1082252, 1354624, 1142443, 1212641, 1293094, 1338701, 1473885, 1230270, 1262013, 1251503, 1333881, 1299692, 1127144, 1230286, 982309, 1001658, 977093, 1062894, 1011859, 1188310, 1078594, 1305333, 1463491, 1059539, 1066191, 1223462, 1079504, 984692, 1101789, 1007249, 1026715, 1030148, 1006517, 1106200, 1042019, 1314481, 1462322, 1419771, 1496685, 1113665, 1112000, 889462, 913678, 1084003]
4579A084003j15101Q5363p4910p4631K57655K02376L1624j67331Q1915J07738
4569A418701L3244K6994j71012o1364M2496J39015k25692j00080J17836J90982
4559A411120K00131j33987q2516j7516N7748K3469j23381l7735J01884l4391j53741
4548A211085K32893k47503q6520J02632p4455n0171J807M399n803O0224L5290
4537A183878J58142N4871N8845k87792j0545k0560J46131K48576M4739L4178j09792
4526A500671k30963J31082R2967J91378j8552J16799J1103P1685k13252K0285
4516A673203j83581k44543J59136L8798Q3451K13346M0389j43233j2254k05540
4506A419172R930R2808o6117n4770k9243J86521k4441j44107r5977J15168o082
$$ y = [1084003, 968902, 1054265, 979355, 904724, 1162379, 1364755, 1396379, 1229048, 1310963, 1418701, 1451945, 1478939, 1307927, 1246563, 1289059, 1428074, 1202382, 1102302, 1220138, 1411120, 1611251, 1477264, 1394748, 1377232, 1434980, 1458449, 1335068, 1297333, 1399217, 1364826, 1211085, 1443978, 1196475, 1109955, 1212587, 1138132, 1087961, 1089768, 1094167, 1088364, 1148588, 1183878, 1342020, 1396891, 1455736, 1167944, 1157399, 1136839, 1282970, 1531546, 1576285, 1610463, 1500671, 1269708, 1400790, 1493757, 1685135, 1666583, 1783382, 1794485, 1866170, 1652918, 1673203, 1489622, 1245079, 1404215, 1443013, 1526464, 1739810, 1780199, 1636966, 1624712, 1419172, 1429102, 1521910, 1455793, 1401023, 1371780, 1558301, 1533860, 1389753, 1293776, 1408944, 1402862]
4495A402862K601J99340j91526j8917J39142J74259J25817K14661j48921j33319
4485A765999l2925k5709n5721j32922R8138L3990L42516j42616J96410j8860n4192
4474A974108K5997N7148l9958J55154J39158q4525j47078j4318j74867J07696
4464A998515O2947P6243J01420k65263L2291K62119K0186j01231K76878p1707
4454B392398j6529n6757J92369J28054p6408J05160n469j1211p1476l7029K25636
4443B768738j1321K32772K48414j31461m875N18024k9146K31810l7835M39291
4433D224411L52141L02398K55516j66346k64904l41257m80781l30512k9475j66496
4423C354695j57125M4178k24914q8719P7249j2164k19841J69608l7451m8748K43524
$$ y = [1402862, 1405463, 1604803, 1413277, 1394360, 1533502, 1707761, 1833578, 2048239, 1899318, 1765999, 1733074, 1707365, 1651644, 1518722, 1616860, 1650850, 1993366, 1850750, 2047160, 2028300, 1974108, 2000105, 2057253, 2017295, 2172449, 2311607, 2227082, 2080004, 2065686, 1890819, 1998515, 2061462, 2137705, 2239125, 1973862, 2006153, 2268272, 2288458, 2187227, 2464105, 2392398, 2375869, 2319112, 2511481, 2639535, 2563127, 2668287, 2662818, 2651607, 2580131, 2543102, 2768738, 2757417, 2990189, 3238603, 3107142, 3102267, 3620291, 3591145, 3822955, 3785120, 4224411, 4576552, 4878950, 5134466, 4968120, 4703216, 4361959, 3881178, 3550666, 3521191, 3354695, 3197570, 3241748, 3016834, 2928115, 3005364, 2993200, 2773359, 2942967, 2905516, 2856768, 3100292]
4412C100292J41755j60344k43671L57618J16803o6063q3471J53476K03727L521
4402C523643q9j96384j07722q4854M02733L64025k44590J14916j30730K25935
4392C866883P5347P2641J92619o5497L31957K46670o7185k62861O6820J25420
4382D582814J80315j73887k5587K6649j0095R0341j3384m1630j57684P7341P9710
4371D614903J38705k5487q0055J46167J17199J51615J29645n1711p0180l8972
4361E031829K9780l9983P1220l5913p6240n381K32432m044k09043j1218P8123
4350E061562K3353J05647J35733K95002O5350K81137J36899r1463J07309J86408
4340F306937N8688j03810L8509l7368j24350p0419j87690j76157p3752J85350
$$ y = [3100292, 3242047, 3081703, 2838032, 3195650, 3312453, 3246390, 3162919, 3316395, 3520122, 3523643, 3523554, 3327170, 3219448, 3134594, 3537327, 3901352, 3656762, 3771678, 3640948, 3866883, 3942230, 4014871, 4207490, 4141993, 4473950, 4720620, 4653435, 4390574, 4457394, 4582814, 4763129, 4589242, 4563655, 4590304, 4580209, 4670550, 4657166, 4615536, 4457852, 4535193, 4614903, 4753608, 4728121, 4648066, 4794233, 4911432, 5063047, 5192692, 5140981, 5070801, 5031829, 5061609, 5021626, 5092846, 5056933, 4980693, 4975312, 5207744, 5203700, 4994657, 4983439, 5061562, 5084915, 5190562, 5326295, 5621297, 5686647, 5967784, 6104683, 6013220, 6120529, 6306937, 6365625, 6261815, 6300324, 6262956, 6138606, 6068187, 5880497, 5704340, 5630588, 5815938]
4330E815938n6033R6539J37755k4855j2988P3598J02576J41784p2891M6050K71634
4319F519107J7891O6106K34464K04844q9013o8497R8935Q0582K4659q6271j71958
4308F830849P7888m7023j19878j03849J5229l0169L07980n1394l37089j31487
4298F411057l866k740m6663K27342J02789J27594q0744K57111m6124J97652L38591
4287G481999p8021j11080J5537j73493O3666K45474m21156k33417R8111O6165
4277F953785P9565L38681q8811o1295J19493M5899J25182J37707n8154M439J41686
4266G738177l1031P3335K08210M7462N1361K45781L28169j0237J10876O9530J6536
4255H848169L59794L01871m0851k85263k20597M68594k1110m4240J01696K96370
$$ y = [5815938, 5759905, 5856444, 5994199, 5969344, 5956356, 6029954, 6132530, 6274314, 6201423, 6247473, 6519107, 6536998, 6603104, 6837568, 7042412, 6953399, 6884902, 6983837, 7064419, 7089078, 7002807, 6830849, 6908737, 6861714, 6741836, 6637987, 6653216, 6623047, 6931027, 6879633, 6542544, 6411057, 6407191, 6404451, 6357788, 6585130, 6687919, 6815513, 6734769, 6991880, 6945756, 7143408, 7481999, 7403978, 7292898, 7308435, 7134942, 7198608, 7444082, 7022926, 6789509, 6887620, 6953785, 7033350, 7372031, 7283220, 7221925, 7341418, 7387317, 7512499, 7650206, 7592052, 7596491, 7738177, 7707146, 7780481, 7988691, 8036153, 8087514, 8333295, 8661464, 8651227, 8762103, 8831633, 8848169, 9207963, 9509834, 9468983, 9183720, 8963123, 9431717, 9410607, 9366367, 9468063, 9764433]
4245I764433M36434p7294n433L61932R6299j48463K10619M21616O339M4635J54224
4234A1265341k6041P2993J71487J05168j30290K46723K74581K40474J68509J64957
4224A2553902K54661N03563J06237K63738P03233K15173L05050N36714K29763
4215A5672034M21655L18589L41744L24686K82288K52049J91588n4346L74324L92580
4205A8517191J21708N60114M25452J20547K70968N78103O89988N98239L88308
4196B2270618L92285N28400L87208O30567R23202N16380P19351O53695Q84257
4187B7905963O78789P07700J103270Q48545Q85694J020547J458014J300392J084994
4178C6993908J137376J497901J469046J763385J831887J824871J906087J942800
$$ y = [9764433, 10200867, 10123573, 10118140, 10480072, 10576371, 10427908, 10638527, 11060143, 11066482, 11111117, 11265341, 11239300, 11312293, 11483780, 11588948, 11458658, 11705381, 11979962, 12220436, 12388945, 12553902, 12808563, 13312126, 13418363, 13682101, 14385334, 14600507, 14905557, 15442271, 15672034, 16093689, 16412278, 16754022, 17078708, 17360996, 17613045, 17804633, 17750287, 18124611, 18517191, 18638899, 19199013, 19624465, 19745012, 20015980, 20594083, 21284071, 21882310, 22270618, 22662903, 23191303, 23578511, 24209078, 25132280, 25648660, 26368011, 27021706, 27905963, 28584752, 29292452, 30395722, 31244267, 32129961, 33150508, 34608522, 35908914, 36993908, 38131284, 39629185, 41098231, 42861616, 44693503, 46518374, 48424461, 50367261]
4170E0367261K076598K172329K314694K692209K827913K947360L635399L773618
4162G2807381L971371M375319M605047N764100O547545P698426R076684J0918274
4154A25764147J3295826J5534143J8534227K2145454K6869635L4543195M4348990
4147C01035617N6036913O5454274O5019067M0868495q218599n5407936q1018513
4140C83769318p5573794n6368682m1531401l0927009k3689012j8679806j4628430
4133A22371184j1668740r020717p139759n525792m533271m432944m594342m443207
4125G1012412m259403l659824l114909k563487k004117j905914j528087r69115
4117E1007556j413895j461448o87227m36105j9164L64725J70258o19337j315731
$$ y = [50367261, 52443859, 54616188, 56930882, 59623091, 62451004, 65398364, 69033763, 72807381, 76778752, 81154071, 85759118, 91523218, 98070763, 105769189, 114845873, 125764147, 139059973, 154594116, 173128343, 195273797, 222143432, 256686627, 301035617, 357072530, 422526804, 487545871, 528414366, 520195767, 464787831, 383769318, 308195524, 251826842, 210295441, 179368432, 155679420, 136999614, 122371184, 110702444, 101681727, 94541968, 89016176, 84482905, 80049961, 75455619, 71012412, 66753009, 63093185, 59978276, 57414789, 55410672, 53504758, 51976671, 51007556, 49593661, 48132213, 47444986, 47008881, 46989717, 47354442, 47524700, 46905363, 45589632]
4108D5589632j644180j577976j577613j306504r26227q30594r19487o26199m43417
4099C5737435m83473k06786j18689j76478M17076L57771J19894J90127L57982
4090C6194859j43953j66009l28298n01383n33164o23187l49597l99280n69341
4081C2580647n5544k96150l73020n13282n29821n63592o38918k83676k75832j69035
4071B8881777n65228p8365k16340n70413p2429m2603n1507r8781o3342P3789K00557
4060B7397115K0723R2582p6647J58151J53192k64511k48353K5798r6989k31588
4050B6929473J86362j44144L63048r6237J02831R0441L3484L70894K08277K61949
4040B8306378J50662L23620L13055K71321Q01253J07427j33651k4790k8202l8261
$$ y = [45589632, 43945452, 42367476, 40789863, 39483359, 38557132, 37726538, 36807051, 36180852, 35737435, 35253962, 35047176, 34928487, 34752009, 35169085, 35526856, 35646750, 35836877, 36194859, 36050906, 35884897, 35556599, 35055216, 34522052, 33898865, 33549268, 33149988, 32580647, 32525103, 32228953, 31855933, 31342651, 30812830, 30249238, 29610320, 29326644, 29050812, 28881777, 28316549, 28238184, 28021844, 27451431, 27379002, 27336399, 27284892, 27186111, 27122769, 27196558, 27397115, 27417838, 27510420, 27433773, 27591924, 27745116, 27480605, 27232252, 27258050, 27161061, 26929473, 27115835, 26971691, 27334739, 27238502, 27341333, 27431774, 27465258, 27836152, 28044429, 28306378, 28457040, 28780660, 29093715, 29365036, 30166289, 30273716, 30140065, 30115275, 30087073, 30048812]
4030C0048812o6572L44025j6659n2076k94042o7762j50471K95248J19256K58797
4020C0418556K11603M14988Q0427N1486K62663L0318J31915r0057l7748j2966
4010C1461185K04503Q7611J30418K99757K10742R5124K04140J41283L84800N51808
4000C3771371L27397K68739M84491M44723Q09998J028821J143710J495953J151183
3991D0926386J086935N20494P84391J124253J682969K090902K465201K869918
3983E3551449K680747J929868J39263j696672k688478k223366k241512j627977
3975D7823322j010946j048081j50133o3283J35040K46702N70553R50865J270187
3966D8724226J445916K211070K091963K721107L621098M001850N025481O131683
$$ y = [30048812, 29982240, 30326265, 30309606, 30257530, 29963488, 29895726, 29745255, 30040503, 30159759, 30418556, 30630159, 31045147, 31125574, 31177060, 31439723, 31470041, 31601956, 31511899, 31474151, 31461185, 31665688, 31753299, 31883717, 32183474, 32394216, 32489340, 32693480, 32834763, 33219563, 33771371, 34098768, 34367507, 34851998, 35296721, 36106719, 37135540, 38279250, 39775203, 40926386, 42013321, 42533815, 43318206, 44442459, 46125428, 48216330, 50681531, 53551449, 56232196, 58162064, 58301327, 56604655, 53916177, 51692811, 49451299, 47823322, 46812376, 45764295, 45614162, 45550879, 45685919, 45932621, 46503174, 47454039, 48724226, 50170142, 52381212, 54473175, 57194282, 60815380, 64817230, 69842711, 75974394]
3958G5974394P599453Q947729R438206Q270858M950226r09100o214022q094526
3950I9963218p479266p548684o640259n251052l607843k154438j471487j295167
3942F4515022j318526j355730n15889K81457J292407J765267K613956L135828
3934G0413792M113030N114085O448715Q547858J0171265J1369215J0696995O801641
3926A33676596L92230p283700j2702932j3305281j1196095q590087o628078m864791
3918F9497862l839751l274634k899521k226992j486076j046724l91511J08292
3910E4440945N57198Q44832R74213J329765K303111K874900L718671N391492O269070
3901G8704197O662037N182783J339074l303783p800875r592107r098063p571013
$$ y = [75974394, 83573847, 92521576, 101959782, 110230640, 115180866, 114271766, 108057744, 99963218, 92483952, 84935268, 78295009, 73043957, 69436114, 67281676, 65810189, 64515022, 63196496, 61840766, 61324877, 61606334, 62898741, 64664008, 67277964, 70413792, 74526822, 79640907, 86089622, 94637480, 104808745, 116177960, 126874955, 133676596, 134068826, 126785126, 114082194, 100776913, 89580818, 80990731, 74362653, 69497862, 65658111, 62383477, 59483956, 57256964, 55770888, 54724164, 54332653, 54440945, 54998143, 55842975, 56817188, 58146953, 60450064, 63324964, 67043635, 72435127, 78704197, 85366234, 90549017, 91888091, 88584308, 80783433, 71191326, 62093263, 54522250]
3893E4522250n859223m198321l382050l119350k503599j706546j436267j366279
3885C0950615r35530n39231m24292m49359J10298j32081L60146O36586Q98205
3876C0475357J602608J466749J401675R82283L12897q56487j821981k834273k985408
3867B7743420k299187j824666j782082j276872q90677j089756m82649n38804m17027
3858A7141700k11158l04746j49617J53814j12970l73029n85959n75003l56364
3849A4626668k49386k41688o17775n06995k82076m08471l6352O7832j12771J26827
3839A2365813k71481l25992m74287k04631n3353j90999k8570k6449m8908m0277
3829A0700866j76536l02734j33196Q592J14652j76308j97206L45P0666l740K6553
$$ y = [54522250, 48663027, 44464706, 41082656, 37963306, 35459707, 33753161, 32316894, 30950615, 30015085, 29475854, 29051562, 28602203, 28712501, 28580420, 28940566, 29577152, 30475357, 32077965, 33544714, 34946389, 35928672, 36241569, 35385082, 33563101, 30728828, 27743420, 25444233, 23619567, 21837485, 20560613, 19669936, 18580180, 18097531, 17558727, 17141700, 16930542, 16625796, 16476179, 16629993, 16517023, 16143994, 15558035, 14983032, 14626668, 14377282, 14135594, 13517819, 13010824, 12728748, 12320277, 12283925, 12351757, 12238986, 12365813, 12094332, 11768340, 11294053, 11089422, 11036069, 10845070, 10816500, 10790051, 10741143, 10700866, 10524330, 10221596, 10088400, 10096992, 10211644, 10035336, 9838130, 9838475, 9909141, 9905401, 9931954]
3818I931954J59074J57723n6276R489K27316q9925O2694J69498k34430p3626J85743
3807A0449234J90204L9077L06018k8059M16874M09751J49389L49754P68965M13934
3797A3465141K93635N55226P21871O88894Q36273R07040M48151k10124r07229
3788A6798878j132801q80798r84990r03735q53592o42999n61793k11359p8007
3779A0548804k93272L034J06142J96465J92532K5921J30864L66706L39606j40058
3769A1476744j72054l86857o13636n14868l63090j2932j77580l35744K36630R800
3759I146413m66515j68566j12473o6731J56249N7781l3961J92739J60240M4923
3749H910099M61385J80276M57183L93338K2807J40973k81450l42577p49986l58122
$$ y = [9931954, 10091028, 10248751, 10192475, 10201964, 10429280, 10339355, 10402049, 10571547, 10337117, 10263491, 10449234, 10639438, 10678515, 10984533, 10956474, 11373348, 11783099, 11932488, 12282242, 13051207, 13465141, 13758776, 14314002, 15035873, 15724767, 16561040, 17468080, 17916231, 17706107, 16798878, 15666077, 14785279, 13800289, 12896554, 12042962, 11399963, 10838170, 10626811, 10548804, 10255532, 10258566, 10364708, 10561173, 10753705, 10779626, 10910490, 11277196, 11616802, 11476744, 11304690, 10917833, 10304197, 9789329, 9426239, 9413307, 9235727, 8899983, 9136613, 9146413, 8679898, 8511332, 8398859, 8332128, 8488377, 8546158, 8512197, 8704936, 8865176, 8910099, 9371484, 9551760, 10008943, 10402281, 10425088, 10566061, 10284611, 9942034, 9192048, 8833926]
3739H833926n18032m07789k78063k77075k53182j80948J92002r4698m11834N4010
3729F658317j3782n006m990K4400K29414L57539K88554M5660L36256J14215j67579
3718G862998L58314k21942m47524l75188n75387n85174J3611l9139k58719R3056
3708E824906j92737j74141k3578j12004N7355k61909R5598n377k67223j21174
3698D819716K11022j04648J59172K30923j39915j88461J78723J38799l71321k67234
3688D666776J91008l5385j86940j10569P736j26260r97k25566j20738q314l2057
3677D018694j49316k24284l56659P5214M0997J40246j3380L6498J91473m9553
3667C709930n4679K40211K0207k55942n2549k18845J17630j63553N7186o9987
$$ y = [8833926, 8315894, 7908105, 7630042, 7352967, 7099785, 6918837, 7110839, 7016141, 6604307, 6658317, 6644535, 6639529, 6634539, 6658939, 6888353, 7245892, 7534446, 7580106, 7916362, 8030577, 7862998, 8221312, 7999370, 7551846, 7176658, 6601271, 6016097, 6029708, 5990569, 5731850, 5824906, 5632169, 5458028, 5434450, 5322446, 5379801, 5117892, 5213490, 5208113, 4940890, 4819716, 5030738, 4926090, 5085262, 5316185, 5176270, 4987809, 5166532, 5305331, 4934010, 4666776, 4857784, 4822399, 4635459, 4524890, 4532626, 4406366, 4405369, 4179803, 4059065, 4050751, 4018694, 3869378, 3645094, 3288435, 3363649, 3404646, 3544892, 3531512, 3568010, 3759483, 3709930, 3655251, 3895462, 3915669, 3659727, 3607178, 3388333, 3505963, 3342410, 3399596, 3329609]
3657C329609o1022k73498K02574j03032j11751J63722K05145K4553k07006j46589
3647C022705P3726n3495k06878J58228J88209J18957j9303k65273J72864r6880
3637C092860J4790j21530P9354k85458j18202m8543K29393J9483j2507q1538m7244
3626B720858q540k02938n2642J39494r2205l26642J70489M3107J99090L8294r5598
3615B532767j19045m8631q6223K86300j33947j64028R9963j90733J27793l3286
3605B270930j19974J95467J940l65054J63538l29208r179K27446r130Q4269j06415
3594B004630r1182m3032r9951M138J99525P815O9854n0426j13484P0273j45169
3583A812991L9910K3071k14931K05375J66484k61211n9875N3862P090j01899J12431
$$ y = [3329609, 3268587, 2995089, 3197663, 3094631, 2982880, 3146602, 3351747, 3376300, 3169294, 3022705, 3096431, 3042936, 2836058, 2994286, 3182495, 3301452, 3282149, 3016876, 3189740, 3092860, 3107650, 2986120, 3065474, 2780016, 2661814, 2613271, 2842664, 2862147, 2849640, 2768102, 2720858, 2712318, 2509380, 2456738, 2596232, 2504027, 2177385, 2347874, 2390981, 2590071, 2628365, 2532767, 2413722, 2365091, 2278868, 2565168, 2431221, 2267193, 2367156, 2176423, 2304216, 2270930, 2150956, 2346423, 2348363, 1983309, 2146847, 1817639, 1808460, 2035906, 2026776, 2111045, 2004630, 1913448, 1870416, 1770465, 1774603, 1974128, 1981943, 2051797, 2001371, 1887887, 1958160, 1812991, 1852901, 1875972, 1661041, 1866416, 2032900, 1771689, 1711814, 1765676, 1772766, 1670867, 1783298]
3572A783298R1221l6773J71141J76165q1247j38789j61956P7829K89701m8478
3562B122112J5118L5343K70388j04055K5918j61953j58526N7919j1455o9167j80686
3551A840956j57591J04373M1750m1771p250j50762P899K26355j12958p7186L8867
3540A712682m0122j53644Q7859n1220J132j70155J5936K36865J5597R4706J76892
3529A926528j52528l5356K8366J06611J41414J28385O4247j96991k1431P8080
3519B067325l78540l46856k8997M9387K27827P4018n2846k16741J07325j74044
3509A327858o8205J20875N1164L3766J77946j47549l5892k8787k89673r5889J11491
3498A157105Q8112n6066m2776j64924N661J33252J30156l88143j69454J52236
$$ y = [1783298, 1874519, 1837746, 2008887, 2185052, 2103805, 1965016, 1803060, 1880889, 2170590, 2122112, 2137230, 2172573, 2442961, 2338906, 2364824, 2202871, 2044345, 2102264, 2090809, 2021642, 1840956, 1683365, 1787738, 1829488, 1787717, 1780467, 1629705, 1637604, 1863959, 1751001, 1673815, 1712682, 1672560, 1518916, 1606775, 1555555, 1556687, 1386532, 1402468, 1639333, 1654930, 1749636, 1926528, 1774000, 1738644, 1767010, 1873621, 2015035, 2143420, 2207667, 2010676, 1989245, 2067325, 1688785, 1341929, 1312932, 1362319, 1590146, 1664164, 1611318, 1394577, 1501902, 1327858, 1259653, 1380528, 1431692, 1465458, 1643404, 1495855, 1459963, 1431176, 1141503, 1045614, 1157105, 1245217, 1189151, 1146375, 981451, 987112, 1120364, 1250520, 862377, 692923, 845159]
3488H45159L29332j49820n7471j16169j96782K45764J51548j9472r705n1745J41508
3477A112147J30026P412J85649k09558j02217O0522k22950l022L01575r6081m41
3466A163062k38092o1637J10377k58448R1995K22690M125Q893k2669j38085j0109
3455H72102J11114r3728l3949J20068L3979j3741k34349K13119J41043l6447O5661
3444A144872p4919j24278n616m0054p922K18189j21908l5415r0330o4271r5043
3433G03305M5417K03469R3334p0444M9561n1663O1832q7296K220J18072O6861
3422A134668O7407l545K3672j78834M863r3804K66411j85701j1533j04949j36082
3411G82573K07512O5549q42r1710J66250j37780J23598K44094j9610n6427q2029
$$ y = [845159, 1174491, 1024671, 967200, 851031, 654249, 900013, 1051561, 1032089, 1022384, 970639, 1112147, 1242173, 1249585, 1435234, 1225676, 1123459, 1183981, 961031, 958009, 1259584, 1163503, 1163062, 924970, 863333, 973710, 715262, 807257, 1029947, 1034072, 1042965, 1020296, 882211, 872102, 983216, 889488, 855539, 975607, 1009586, 995845, 761496, 974615, 1115658, 1079211, 1144872, 1069953, 945675, 940059, 900005, 892083, 1110272, 988364, 952949, 862619, 798348, 703305, 748722, 952191, 1045525, 975081, 1024642, 972979, 1034811, 947515, 949735, 1067807, 1134668, 1202075, 1198530, 1222202, 1043368, 1048231, 954427, 1220838, 1035137, 1023604, 918655, 782573, 990085, 1055634, 1054792, 963082, 1129332, 991552, 1115150, 1359244, 1339634, 1283207, 1201178]
3400A201178J22136K25957M7794J45071L5785k34859k19417M0161J81949K1041
3390A566796J04339r5325K6888O1951l35043J02005j9620l44490J47778j51254
3380A064025Q0524k5362p4864M33893k8057J70430j74488k08413J41983j302L0231
3369A408600j0356J91821m2060j99415P4208R1409J09504n1400j53086j56583
3359A262642Q9842O731J76076M2556J64145k66820j05971N3384L1805J30695p9177
3348A505908p8423l7793n3425j20429k978K42683M1894N2991K02356j60833J47296
3337A739247L65317R9324m05434l52842K43295M3918k04822J61372l0534j85656
3327A473185O4297j26087J22489K22244O761q9350K1587J36744j00813L8760k03630
$$ y = [1201178, 1323314, 1549271, 1597065, 1742136, 1777921, 1543062, 1323645, 1363806, 1545755, 1566796, 1671135, 1575810, 1602698, 1664649, 1329606, 1431611, 1411991, 1067501, 1215279, 1064025, 1144549, 1119187, 1044323, 1478216, 1450159, 1620589, 1446101, 1237688, 1379671, 1378369, 1408600, 1398244, 1590065, 1548005, 1348590, 1422798, 1514207, 1623711, 1572311, 1419225, 1262642, 1352484, 1359215, 1535291, 1577847, 1741992, 1475172, 1369201, 1422585, 1454390, 1585085, 1505908, 1427485, 1389692, 1336267, 1215838, 1212860, 1455543, 1497437, 1550428, 1752784, 1591951, 1739247, 2104564, 2203888, 1798454, 1445612, 1688907, 1732825, 1528003, 1689375, 1658841, 1473185, 1537482, 1411395, 1533884, 1756128, 1762889, 1673539, 1695126, 1831870, 1731057, 1769817, 1566187]
3316A566187M275J23580q037J33292K48765J53475j63365m0629K06987J0329P6686
3305B311545P3337n9664J22586M0419j25576o8718o9798k97661K69287J03616
3295B299373m5712P4751J22219k38243k00397K38306J64138q7636k68185L042
3285B061656K08685o4269j06882L93223m2622J18104k27140Q5550P8006L7449
3275B541760J51619N3886K6705k9388r7846J15077m8209J60498M5492J8052O4438
3264C002084j70012j21521m2506N5116J20533R389R2903j31592L16746J90504
3254C321644J7448p5306P6120j63058N7733K72315K64470J23933j71013L46967
3244D071253K34633J63362j7501N2071k96154o6286r9010Q5768k85200o2710k21289
$$ y = [1566187, 1570462, 1694042, 1686005, 1819297, 2068062, 2221537, 2058172, 2017543, 2224530, 2234859, 2311545, 2384882, 2325218, 2447804, 2488223, 2362647, 2293929, 2224131, 1926470, 2195757, 2299373, 2253661, 2328412, 2450631, 2212388, 2011991, 2250297, 2414435, 2326799, 2058614, 2061656, 2270341, 2206072, 2099190, 2492413, 2449791, 2567895, 2340755, 2426305, 2504311, 2541760, 2693379, 2747265, 2773970, 2744582, 2646736, 2761813, 2713604, 2874102, 2919594, 2937646, 3002084, 2832072, 2710551, 2668045, 2723161, 2843694, 2853083, 2945986, 2814394, 3131140, 3321644, 3339092, 3263786, 3339906, 3176848, 3234581, 3506896, 3771366, 3895299, 3724286, 4071253, 4305886, 4469248, 4451747, 4503818, 4207664, 4141378, 4042368, 4128136, 3842936, 3780226, 3558937]
3233C558937l87984J8623n13502l00416k7878p8160J80138j25425j68649n1794
3223B103890l5624j17725k7014p8782j51343j43479L33916K44921j11059L41828
3213B359529O0447m501J14290k88298k35370j69071j91472j60453Q6302r2978
3203A478425m04128q5602J75724k19202q0672J27334l8338j20455j03536p8954
3193F50596L382J21374k33849Q9029k958n0380J94527O5006R9932r8756J73644
3182A011547J93054J6819K71171m3364l83332o4862k0337p1675l1188j36260k1417
3171G20156n4871N882k2322j24297O4989q4141j16936p8707n0823K21343j78744
3160C01529j56643j15439J02971K47863j74096M0609P4942m646j45225o8825J2455
$$ y = [3558937, 3170953, 3189576, 2676074, 2375658, 2347780, 2269620, 2449758, 2324333, 2155684, 2103890, 2068266, 1950541, 1923527, 1844745, 1693402, 1549923, 1883839, 2128760, 2017701, 2359529, 2419976, 2415475, 2529765, 2241467, 2006097, 1837026, 1645554, 1485101, 1571403, 1478425, 1074297, 988695, 1164419, 945217, 864545, 991879, 953541, 833086, 729550, 650596, 653978, 775352, 541503, 630532, 627574, 577194, 771721, 836727, 936659, 837903, 1011547, 1204601, 1221420, 1492591, 1449227, 1065895, 1001033, 980696, 909021, 877833, 741573, 720156, 665285, 671167, 648845, 524548, 589537, 505396, 388460, 309753, 258930, 480273, 301529, 144886, 29447, 132418, 380281, 206185, 246794, 321736, 317090, 171865, 103040, 115495]
3149A15495J83723R0035j41388k30434K41577L73912k38179Q140J79068j53879
3139D28070J0088k66354j22951Q8711j60943J08671j96819k34763K24743J8865
3129a02682J13492j32132N2981J46195k12957J4289N439J42065J45092J68239
3119C40021n1046P7968o6381m6607J30780j32632j72556K55383j46673O1440N6328
3108C06025p5844J09339j81520J34923m2482l01314j72168K82023L4551j09043
3098a5510N5180M9283k7608j1972O6295O1231k30113n0739l8680L8653J5340J08473
3086A9833P7550j52638J9935N6791q2677K0423O3381o73o5135R1858Q9489j11487
3074B6650l8949l3359j25788p7839J20481Q2491L0179j21091j77652j6836K02569
$$ y = [115495, 299218, 389253, 247865, 17431, 259008, 632920, 394741, 402881, 581949, 428070, 438158, 171804, 48853, 137564, -23379, 85292, -111527, -346290, -121547, -102682, 10810, -121322, -68341, 77854, -135103, -120814, -115375, 26690, 171782, 340021, 288975, 366943, 300562, 253955, 384735, 252103, 79547, 334930, 188257, 249697, 306025, 230181, 339520, 158000, 292923, 250441, -50873, -223041, 58982, 93533, -15510, 39670, 88953, 61345, 49373, 115668, 176899, -53214, -103953, -142633, -103980, -88640, 19833, 97383, -55255, -35320, 21471, -61206, -40783, 22598, 21925, -43210, 48648, 138137, 26650, -12299, -45658, -171446, -249285, -128804, -46313, -16134, -137225, -314877, -331713, -129144]
3063a29144J52694J94446P6868j52421k5346J2623J9666k78538M8799l112J0803
3052g2662m9954j0868l384K2905J96431j48258K21147j4431k43255k4346q1098
3041b07773J49689k33090k04664K74370K01655P0184l46159P7131K03507J78524
3031A63374r4529q7689k4841K94864j73231j51264P1386j17529j22050J66551
3021g4958L2947N2444k38851K05280J83464k80888R4577J12838R575l3581j04126
3010d1279K81817L6330N9636l33121k16048J05566Q1491J07278M1814K01646k72541
2999E2589k30933L5603j26014l2475J79723Q2912K18538j35956Q5200N9135k74975
2988h6653k4486n3213J21056L8048L4741j32197q237j886J36070J65081J5615
$$ y = [-129144, 23550, 217996, 294864, 142443, 117097, 129720, 149386, -129152, -80353, -83465, -72662, -122616, -133484, -136868, -113963, 82468, -65790, 155357, 140926, -102329, -126675, -207773, -58084, -291174, -495838, -221468, -19813, 50371, -295788, -218657, -15150, 163374, 68845, -18844, -43685, 251179, 77948, -73316, -1930, -119459, -241509, -74958, -42011, 10433, -228418, -23138, 160326, -120562, -25985, 86853, 96428, 62847, -41279, 240538, 276868, 336504, 3383, -212665, -107099, -25608, 81670, 123484, 325130, 52589, -178344, -142741, -268755, -301230, -121507, -38595, 179943, 43987, 129187, 188322, -86653, -111139, -164352, -43296, -5248, 29493, -102704, -110941, -112827, 23243, 188324, 203939]
2977B03939o3477M2837K4978j70098J22310J52991R0567l05498K6041l4990K56569
2966C46169j1992j61516K692J07701r6174k22353R4771K4003Q4820R4519j89237
2955G3403J22400J11787j49236j42042l7279M2617K10002j73520k16170n5702
2945b13740L1477J72179L15478j20388j53222m7006J07229j97974K6433K52268
2935A72734j59231J43206J52987q4299K9881r4382k3012P6894J03152O6422n2611
2924C31741m41788J81351K64149K27296l03998k10306R6265P2979l8523m0774
2914A38392o9469R9043N1215J71642J25748r4937N9004j30305j70053J27896K96008
2903F04184l2302k1704p3927j46429j53567N8717P0188J32323j89874k9672p3786
$$ y = [203939, 140462, 183299, 208277, 38179, 160489, 313480, 404047, 98549, 124590, 89600, 346169, 334177, 172661, 175353, 283054, 186880, -35473, 59298, 83301, 168121, 262640, 73403, 195803, 307590, 158354, 16312, -20967, 21650, 231652, 58132, -158038, -213740, -182263, -10084, 305394, 185006, 31784, -15222, 92007, -105967, -79534, 172734, 13503, 156709, 309696, 225397, 255278, 160896, 137884, 214778, 317930, 384352, 331741, -110047, 71304, 335453, 562749, 258751, 48445, 144710, 217689, 179166, 138392, 68923, 167966, 219181, 390823, 516571, 421634, 480638, 350333, 180280, 308176, 604184, 571882, 550178, 476251, 329822, 176255, 234972, 305160, 437483, 247609, 217937, 144151]
2892A44151J4665K9957J78914j31239J15349K73768q7445k00766o8968k7700j50748
2881H9938M5308L43029j16253j79034O3665Q450L7179L0954K6927n385j62209
2870A82569J01833j71478P0021J27839p173J7484L7326K42033k38746j02390K30451
2859D89769l24415j13723J63444R7823J53723n9899l47262k7329Q5337o0381R1179
2848A48266R3321Q5987m8790l03075L02321J81914j93412O6215K7723j15478O115
2837B51107l10869J40815J9510j68281J63532J8816j7480j08135R8942j33567
2827d5610J68400J45878k77264L966J76278j3603k56081j30656M2343m8735m5045
2816b80129J71258Q7222L10920r7980l31230L2511k09526o8778M62301P6276J48021
$$ y = [144151, 158816, 188773, 367687, 236448, 351797, 625565, 538120, 337354, 268386, 240686, 89938, 135246, 478275, 362022, 182988, 246653, 255103, 292282, 323236, 350163, 344778, 182569, 284402, 112924, 182945, 310784, 303611, 321095, 358421, 600454, 361708, 259318, 489769, 165354, 51631, 215075, 312898, 466621, 406722, 59460, 32131, 117468, 57087, 148266, 241587, 327574, 278784, -24291, 278030, 459944, 266532, 332747, 360470, 244992, 251107, -59762, 81053, 100563, -67718, 95814, 114630, 97150, -10985, 87957, -45610, 122790, 268668, -8596, -4630, 171648, 158045, -98036, -228692, -186349, -235084, -280129, -108871, -21649, 289271, 191291, -139939, -107428, -316954, -385732, 76569, 152845, 300866]
2805C00866j91048j53670p2484J57143J14815k46110j14417M1043J66454j17808
2795a15216m3647J01239J24511j49018j74747k2582l9796p8518K31473J61846
2785d455Q3817j00768m3168j09373R4704P1883J47548k54230O81j01664j7218
2774b32243J56545K162k03320K32219L3701J366J75032j95839K6798J67833k42435
2763g8181j46444M405l2643J52481j338l23601J44804K96097m3905j80967J72271
2752c7021K41598j0003N1822k39240j08479R3091j17362L2096P7447m8406K31602
2741A67145j29722p4597L29889k26215l79117J32903Q6602j36420n1249M1428
2731b39353K4367j06497J57836M5012p1590P0580M5365k11106L1929L06642J01148
$$ y = [300866, 109818, -43852, -116336, 40807, 155622, -90488, -204905, -163862, 2592, -115216, -158863, -57624, 66887, -82131, -256878, -279460, -319256, -397774, -166301, -4455, 79362, -21406, -64574, -173947, -79243, -7360, 140188, -114042, -113361, -215025, -232243, -75698, -73536, -276856, -44637, -10936, -9570, 165462, -30377, -3579, 164254, -78181, -224625, -220220, -252863, -100382, -101720, -425321, -280517, 15580, -28325, -209292, -37021, 204577, 194574, 246396, 7156, -101323, -8232, -125594, -93498, -16051, -64457, 167145, 37423, -37174, 292715, 66500, -312617, -179714, -93112, -229532, -280781, -239353, -214986, -321483, -163647, -118635, -190225, -119645, -74280, -285386, -253457, 53185, 154333]
2720A54333j84928k13764K099N5000J92101m5288j52671m1767J12458K45029j17295
2709E307k16813J17778J01209j25281M2612J48331O6481m1770j77524J57974R8715
2698A77019j52311k35095K69441Q0384M0836J07341m11609Q7410J41479m5828
2688E9067R35l1422j29898j61821j57470K386J39397k7232R3346J09331K96543
2677A93162j75216n2933k01357K96877M3899j18114j9464J35944k43340k42380
2667c82922J23662J4664M7039J1783O9830n7238j7310J80490J46762J00907J01628
2656C39295l16008m3748p8239j16761K38893J41208j64067J25253M2650l46863
2646a78387N3370J90645J638j0747k10136n0778l2145J81002R4916Q4932j55957
$$ y = [154333, -30595, -244359, -242260, -187260, 4841, -40447, -193118, -234885, -122427, 122602, 5307, -211506, -93728, 7481, -117800, -75188, 73143, 139624, 97854, -79670, 78304, 177019, 24708, -210387, 59054, 139438, 180274, 287615, -123994, -36584, 104895, 59067, 60002, 28580, -101318, -263139, -420609, -418223, -278826, -306058, -212712, -103381, 193162, 17946, -34987, -236344, 60533, 104432, -13682, -33146, 102798, -140542, -382922, -259260, -244596, -197557, -185774, -115944, -173182, -190492, -10002, 136760, 237667, 339295, 23287, -20461, -98700, -215461, 23432, 164640, 573, 125826, 168476, -178387, -125017, 65628, 67266, 56519, -153617, -204395, -236540, -55538, 39378, 124310, -31647]
2635c1647j49219N2997P8614k45144j27320K60763M4832L45687j93273k36568
2625b00278N5685K12572q4058r3061j00017m7108p8143K34455K13737j08482j78048
2614a72746J9100L51061k88962O2937K01643j77184j47341J76732O2525K5333
2604A13098K81284k50328j49643k27341j02600J68932Q3378J54567j6033j90843
2594a35529j12384J8718J82487j2196n6646j26108L494m603K16715J78647j45593
2583G002K12361j43433P5539k25504J42543j89002J31848o0420K4412L1167J27716
2572A34229K058l07711O6996J5114l9816K4239O096k4177j08767o041M0444L06023
2560A08687j86166J85330K16213k93833P4603j87253Q4037o6549K1210k59015
$$ y = [-31647, -180866, -127869, -49255, -294399, -421719, -160956, -116124, 229563, 36290, -200278, -144593, 67979, -16079, -109140, -209157, -256265, -334408, -99953, 113784, 5302, -172746, -153646, 197415, -91547, -28610, 173033, -4151, -151492, 25240, 87765, 113098, 394382, 144054, -5589, -232930, -335530, -166598, -83220, 71347, 55314, -135529, -247913, -229195, -46708, -58904, -115550, -241658, -238164, -242767, -26052, 152595, 7002, 219363, 75930, 151469, -74035, 68508, -120494, 11354, -49066, -24654, 6513, 134229, 136287, -171424, -104428, -89314, -129130, -104891, -98795, -122972, -231739, -237780, -197336, 108687, -77479, 107851, 324064, 30231, 104834, -82419, 1618, -64931, -43721, -302736]
2550c02736j27043J29449Q0649O0047m4357J10181O7237J49875m0251L4567l84242
2539b66624k47721L30260k82627j56061M02852J42938p5796J13291J96830k18432
2529f1090J93639O5037O875m6025j60793R2188l4122m7564j46512q0860L1239
2518a87988R9279j17395J41852k77784K38586R6251k6409n1512N2632n7812R73
2507h9327p0690M9221Q3615q9206n7704J2351k66785J61354m2756J41454L3450
2496a35023q9141J90291K7728p6288Q0028O9570j25186L1611J22394O03r2112
2485D475J53330l6243k30936r7271r309K67177J26075k79220p2399L6206J4391
2474a23724J6854q0475Q3998K41614N7189j22069j36131L3048j06065o9149P6016
$$ y = [-302736, -429779, -300330, -219681, -159634, -203991, -93810, -26573, 123302, 83051, 117618, -266624, -514345, -184085, -466712, -622773, -219921, -76983, -152779, -39488, 157342, -61090, 132549, 197586, 204461, 158436, -2357, 89831, 55709, 8145, -138367, -219227, -187988, -88709, -206104, -64252, -342036, -103450, -7199, -33608, -85120, -32488, -90300, -89327, -160017, -110796, -27181, -116387, -174091, -161740, -428525, -267171, -309927, -168473, -135023, -224164, -33873, -6145, -82433, -2405, 67165, -58021, -26410, 95984, 96587, 4475, 157805, 121562, -109374, -206645, -215954, 51223, 177298, -101922, -174321, -138115, -123724, -106870, -187345, -103347, 138267, 195456, 73387, -62744, -29696, -135761, -204910, -128894]
2463a28894P1756j92471k3949O1354J27164N0299J01812k18359J09108k8000j26394
2452a96574P8006J42844k0871N1597r8569j93111K01757J68092r2589j7262j33280
2441a09960J5106K07320Q1950J76027k20035k6682m1669J738J20007k08943j1072
2430a6213J11124j847j17J29171n3244l28087L1233K54135k16485K62081O2196
2419B33947l8659K2403j35394N8540j48403o050J8657M53626L0815l47185k4106
2408A18191k45074J92402M4760L5872J33844O305k10222n071n9920j36057Q9767
2397c5203J93899k82326q752J31201l7830j2165j65331N0581K80765N1311j5987
2386A50163l8583j3620l1348J05626J34983k68638K48340K1402j2596l16159K39516
$$ y = [-128894, -57138, -249609, -273558, -212204, -85040, -34741, 67071, -151288, -42180, -70180, -196574, -118568, 24276, 3405, 55002, -43567, -236678, -34921, 133171, 40582, 23320, -109960, -94854, 112466, 194416, 370443, 150408, 123726, 82057, 83795, 203802, -5141, -16213, 94911, 93064, 92947, 222118, 168874, -159213, -127980, 126155, -90330, 171751, 233947, 195288, 217691, 82297, 140837, -7566, -13616, 5041, 458667, 489482, 142297, 118191, -126883, 65519, 110279, 146151, 279995, 286300, 76078, 71007, 11087, -124970, -35203, 158696, -123630, -132382, -1181, -39011, -51176, -216507, -165926, 114839, 166150, 150163, 111580, 97960, 66612, 172238, 307221, 38583, 286923, 308325, 295729, -20430, 219086]
2375B19086R2031j93198J08731O8998P1463K89504k1279M6609p6787n5299Q8737
2364F38596l51951j08191J09340j48358m9736J2996j781M6222J47410j62275q3038
2353D9234l4363p2120J21500J09947K6804L0275j21559j47408J37615k1364K22909
2342C01470l08986o6944K16911n0174J5701m1379M8299j48957N0289J58618m7626
2331A27222r2226p3711K28823J3158r8037J60829o8605m2808l11078K07113M89077
2320E39757j50056k61137J1892J9336j32994p2621J15960K0915J37688J26063
2310C54803j98979j6361Q8193j45919N6241l0145l9107q9987K41090L22712l37842
2299B04699j43253P698r6114P5307p7398P2434L78991k62605J3184Q6944k4487
$$ y = [219086, 311117, 117919, 226650, 295648, 367111, 656615, 635336, 681945, 605158, 549859, 638596, 286645, 178454, 287794, 139436, 89700, 102696, 100915, 147137, 294547, 132272, 49234, 14871, -57249, 64251, 174198, 201002, 231277, 109718, -37690, 99925, 78561, 301470, -7516, -74460, 142451, 92277, 107978, 66599, 114898, -34059, 16230, 174848, 127222, 34996, -38715, 190108, 203266, 105229, 266058, 197453, 154645, -156433, 50680, 539757, 389701, 128564, 140456, 159792, 26798, -45823, 70137, 91052, 228740, 354803, 155824, 139463, 227656, 81737, 137978, 107833, 68726, -21261, 219829, 542541, 204699, 61446, 69144, -26970, 48337, -29061, 43373, 422364, 159759, 172943, 259887, 235400]
2288B35400q896J37248J00808J24061k69458n9432P8667q8055L3097k5226j17226
2277A40988q5180J94901K69051k13095q3113N348k25138j35863K38087j7851R9091
2266A87226m0926k69919k219K91874K39629k18138n5226M8515J01593k05541K10214
2255B87082J83870j00863P9471J42308l68012k82407M43656O8223J18977j82792
2245C89513k07390K85426J10925k57884p9745J00723K50666J45406p8301J32848
2235G92187k1203j63357q5991J85958j63703Q880j90251P6347K48629l93026n4465
2224B40005J67806j53165J57696N8687K03482J68373j78638q62J7280o469n2795
2213F21400M6542j10476j23922J68241O3428L9357q9788J73200k45p7100J39833
$$ y = [235400, 226504, 363752, 464560, 588621, 319163, 259731, 338398, 250343, 283440, 258214, 140988, 55808, 250709, 519760, 306665, 223552, 228900, 3762, -132101, 105986, 88135, 187226, 146300, -123619, -125838, 166036, 405665, 187527, 132301, 180816, 282409, 76868, 287082, 470952, 370089, 449560, 591868, 223856, -58551, 385105, 453328, 572305, 389513, 182123, 467549, 578474, 320590, 240845, 341568, 592234, 737640, 659339, 792187, 770984, 607627, 521636, 707594, 543891, 552771, 362520, 438867, 687496, 294470, 240005, 407811, 254646, 412342, 471029, 674511, 842884, 664246, 663384, 680664, 674195, 621400, 667942, 557466, 433544, 601785, 665213, 704570, 614782, 787982, 787737, 710637, 850470]
2202H50470J16871J50536O1593j19512l7131k02j29132Q2416L84405k11375p9235
2191A069704M4351O2119P7452m8374j68661k8796k7432J27070R7409O555Q8424
2180A299821J76885J01017j55047J26035J58441J05610l27690J63533N2673j29826
2170A571452K85050R2860J48123J16632p3357mJ98123K29977j62858j42960j575
2159B261463p327K54158K29992K14971P5001l4704O8492J10308K33247j20439
2149C285162o1338K64156K95116N51P1918K35822M43121J43316K13151K88641
2139E179616K8555L40922J69744K66612K74272K55361O17118J81987o6561K99996
2129G547622P81138L45863L78067M00414N95536L67088P09134P59647Q68050R38552
$$ y = [850470, 967341, 1117877, 1179470, 1059958, 1022827, 1022625, 893493, 975909, 1360314, 1148939, 1069704, 1114055, 1176174, 1253626, 1205252, 1036591, 1007795, 980363, 1107433, 1204842, 1211397, 1299821, 1476706, 1577723, 1422676, 1548711, 1707152, 1812762, 1485072, 1648605, 1701278, 1571452, 1856502, 1949362, 2097485, 2214117, 2140760, 2140756, 2338879, 2568856, 2405998, 2263038, 2261463, 2254136, 2508294, 2738286, 2953257, 3028258, 2993554, 3062046, 3172354, 3405601, 3285162, 3223824, 3487980, 3783096, 3783647, 3855565, 4091387, 4534508, 4677824, 4890975, 5179616, 5208171, 5549093, 5718837, 5985449, 6259721, 6515082, 7132200, 7314187, 7247626, 7547622, 8328760, 8674623, 9052690, 9453104, 10048640, 10415728, 11124862, 11884509, 12752559, 13691111]
2119A3691111J071828J228376J177657R62988J110025Q04165J457773K271301
2111B3775224K784735L024122L723076M557668N753133P665171J0379435J4089996
2103G5752560J7820100J7581597J0663855j1401184k6466351k0506735j3182671
2096E0261171q897750o901737n315810m572194l288233k487413j499646j033943
2088A6264445o25086o32968m24926j415007j260508j368532r11998n26862o40484
2079H458074o39528o07522n33346k11524k64761l35183m32713q1550l12762k47370
2069D791815k52742O5824j92829l93134k03286j52567k25690p7873k21372j077
2059C137069J70902j38356m10236k66171O8319j75714J00005j35009J43272K20044
$$ y = [13691111, 14762939, 15991315, 17168972, 18131960, 19241985, 20046150, 21503923, 23775224, 26559959, 29584081, 33307157, 37864825, 43617958, 51283129, 61662564, 75752560, 93572660, 111154257, 121818112, 110416928, 83950577, 63443842, 50261171, 41363421, 34461684, 29145874, 24573680, 21285447, 18798034, 17298388, 16264445, 15639359, 15006391, 14581465, 13166458, 11905950, 10537418, 9625420, 9098558, 8458074, 7818546, 7211024, 6677678, 6466154, 6201393, 5866210, 5433497, 5351947, 5039185, 4791815, 4539073, 4604897, 4412068, 4018934, 3815648, 3663081, 3437391, 3359518, 3138146, 3137069, 3307971, 3169615, 2759379, 2493208, 2561527, 2385813, 2485818, 2350809, 2494081, 2714125]
2049B714125j84738l71274l45315J70585K16608n3546k15715j4679l21265j9946
2039A574840K42411j15973K5636r707J04951l92572j24986j02817j25967j54126
2029I21690L1275J04140P0900L184P5954O5340k90566j38253r1213j33255J94543
2018H13739M0073j84432J56678R7154j53733j42018q8419l6068p9394Q5334j35792
2007C73122K16503k6436L6643J56931l17069j26761K2017J1463o2550R2128m7612
1996C28379o8895l4567R0234r074j8529j28543p9656K48090J9372j80152j03923
1985F2736J32423p9330q6122m3256J1736K49248k9038k45194J88520j6975J51373
1974B96121l4642N6552n1824k95683j59108J01832J25349j25897j52351L05646
$$ y = [2714125, 2529387, 2158113, 1812798, 1983383, 2199991, 2146445, 1930730, 1916051, 1594786, 1574840, 1817251, 1701278, 1726914, 1717207, 1822158, 1429586, 1304600, 1201783, 1075816, 921690, 952965, 1057105, 1128005, 1131189, 1207143, 1272483, 981917, 843664, 752451, 619196, 813739, 853812, 669380, 826058, 923212, 769479, 627461, 539042, 502974, 423580, 508914, 373122, 589625, 563189, 599832, 756763, 439694, 312933, 334950, 346413, 283863, 375991, 328379, 259484, 224917, 315151, 306077, 287548, 159005, 79349, 327439, 346811, 166659, 62736, 195159, 115829, 29707, -13549, -1813, 247435, 218397, -26797, 161723, 144748, 296121, 261479, 318031, 266207, -29476, -188584, -86752, 38597, -87300, -239651, 65995]
1964F5995J98033k8195j80639m1028M857M6663L3965J11997k817n307K2085l2285
1952A93324l5795k1200K19899j14024j64467L42035r2743l9470O8859q2617l8701
1941B35100P087J4688j01367R8948q4561R7511j66627k46033K13879J4810m9286
1930C4149Q2720M754K76398j10217l04992o771o2910J9747J36984O1211l53025
1919b21952j85627R5556K83862K96242k03491Q760l10995J59356K54634o6371
1909A09974k64650J65184j48024K10810J47580j92354J36664j93983N5703n2023
1899b5119P4428j99560p8862J55711r2363j58681M568K59359N2877K3799r1733
1888g5576k55292k2223q4029J71587K78944q2918j29365K01095j01651p2850j59301
$$ y = [65995, 264028, 235833, 55194, 14166, 19023, 65686, 99651, 211648, 208831, 203524, 225609, 193324, 157529, 136329, 356228, 242204, 77737, 419772, 327029, 287559, 356418, 273801, 235100, 242187, 256875, 155508, 254456, 169895, 267406, 100779, -145254, 68625, 83435, 34149, 116869, 121623, 398021, 287804, -17188, -23959, -86869, -67122, 69862, 131073, -221952, -407579, -312023, -28161, 268081, 64590, 73350, -237645, -78289, 176345, 109974, -154676, 10508, -137516, 73294, 220874, 28520, 165184, -28799, 26904, -25119, 49309, -150251, -229113, -73402, -165765, -324446, -319878, -60519, -7642, 16157, -75576, -330868, -353091, -437120, -265533, 13411, -69507, -198872, 2223, -99428, -172278, -331579]
1877c31579K2512K37009l18302J6426J03948K48973P7047m5822R8576j57869o1713
1866a10794P3270M5439Q4858k97207K1425J9103K332L7988j0324L7839n2047J6835
1854a31283o8958k418P3593J15929Q6983k13999j8826N9690K77722J16900p6321
1843B19012k00834J04308q0127j51682L03525L9456j55502J31146J7789J58789
1833C85880J1698K6172Q877J4335j96139j65987J02502K7832K2833j92624K8194
1822G3573k4979O9354k15165N1085O3775j64415k9198J69270L841o4446N5026
1811a2279J44006O9410j42170r9700N3922k4135j08698k29086J96510O613L085
1800a42522l1527o7401J72726n4554o1488k850K72424P9978j96540j25532J37321
$$ y = [-331579, -309067, -72058, -390360, -373934, -269986, -21013, 56034, 10212, 108788, -49081, -110794, -37524, 7915, 92773, -204434, -183009, -163906, -161574, -123586, -133910, -96071, -148118, -131283, -200241, -202659, -129066, -13137, 73846, -140153, -158979, -99289, 178433, 295333, 219012, 18178, 122486, 42359, -109323, 194202, 233658, 78156, 209302, 227091, 385880, 397578, 423750, 432627, 446962, 250823, 84836, 187338, 215170, 238003, 45379, 73573, 48594, 117948, -97217, -46132, 17643, -146772, -175970, -6700, -2859, -67305, -12279, 131727, 201137, 58967, -40733, 13189, -10946, -119644, -348730, -152220, -145607, -142522, -174049, -241450, -68724, -123278, -184766, -187616, 84808, 164786, -31754, -157286, -19965]
1789a9965R2811k44680j68022K01642l1357l01007J66804M46360p7271r2452J10455
1778H3318O489o5454j54704N9367j83892L14882J31824P169j94145J09861r0119
1767B4596k34785J8381m3944J52625j5289r9395J18770L04984q7922M184j91082
1756d8877k56131K37189l3941k006k49981M4523J28685n4892J8446J87502L0120
1745F37j29668l9987P9973j21339P9028J17218j9589j1629R2928m4304j2285J00606
1733I1589k12398K08710k68359j0745L2950n8604N1469N6865j86438R2389J16684
1722h5888k62487n8456K43980J46550o2537O8149J47540J1633k00252k76579J16031
1711b12316K9867J17435J82534O1647j19525j51756J10609r427l36019Q4139J72064
$$ y = [-19965, 72846, -171834, -339856, -138214, -169571, -470578, -303774, 142586, 65315, -27137, 83318, 89807, 24353, -130351, -70984, -254876, 60006, 191830, 198999, 4854, 114715, 24596, -210189, -191808, -235752, -83127, -98416, -197811, -79041, 225943, 138021, 142205, -48877, -305008, -67819, -101760, -103766, -353747, -309224, -180539, -235431, -216985, -29483, 637, -129031, -169018, -89045, -210384, -131356, -14138, -33727, -45356, 47572, 3268, -9017, 91589, -120809, 87901, -180458, -191203, -158253, -216857, -165388, -108523, -294961, -202572, -85888, -348375, -406831, -162851, -16301, -78838, -10689, 136851, 148484, -51768, -328347, -212316, -182449, -65014, 117520, 179167, 59642, -92114, 18495, 9068, -326951, -242812, -70748]
1700g0748j20880L3916n0510k8185J51694L8250r5309j95606o4679J16248j7087
1689c02896Q9121k23725R58K14426n2045Q9911j33463P9088O0014J99888P5897
1678I7174P6536k02138k26948J92718J06314k035j38252l9196k5874N4117M3572
1667f4012k5107k536J65580M0652L9638j45112r9040J68050L44649k69672j57820
1656d730J11812n2083M1976j577j54452j2540k44137J43934J82482j69703O7043
1645i1975o8393k13123j91234J33094M03087J29189m60874K9661m8484p6256J72495
1634b82813J16897M961K58044k05308l01026k0181J50279K74214j33483K49237
1624A10821J51769j50327q7884j00932j22467K70226L4303K3435Q0077j59337
$$ y = [-70748, -191628, -157712, -208222, -236407, -84713, -46463, -141772, -337378, -402057, -285809, -302896, -213775, -437500, -436542, -222116, -274161, -184250, -317713, -238625, -178611, 21277, 97174, 173710, -28428, -255376, -62658, 43656, 41621, -96631, -135827, -161701, -107584, -64012, -89119, -91655, 73925, 114577, 154215, 9103, -89937, 78113, 422762, 153090, -4730, 107082, 54999, 96975, 95398, -59054, -71594, -315731, -171797, 10685, -159018, -91975, -160368, -373491, -564725, -431631, -28544, 100645, -360229, -330568, -379052, -455308, -282813, -165916, -160955, 97089, -108219, -409245, -429426, -279147, -4933, -138416, 110821, 262590, 112263, 24379, -76553, -199020, 71206, 105509, 128944, 209021, 49684]
1614D9684j50655K27312k30131j44103K85589l03114O6812J93973P0531J61273
1604B27171o352j89449o4848J11345J81961o2005o7005j89382J46881k11302j33754
1593b56739N1473j1416R7012m665M8989q2719k5862J04561l2292J7590l8877p9833
1581b12778K20998J74331k04683J55567j45791j00926p3413p5138P9556Q6785
1571i5492J17549p3716R2403k01397J79684J03933J39305p5688l38344k7697L7825
1560a41635l2819J77855n2199l3279m1724j53542Q0667j299n1651L27627n9976
1549A8025p9926J46598P4048k56730j47649J73142j15068J97609Q518j18282j12761
1538b12476M888M3662J47619J31498q990l9370O2540J61653l0689j52590l29968
$$ y = [49684, -100971, 126341, -103790, -247893, 37696, -265418, -198606, -4633, 65898, 227171, 220819, 31370, -33478, 77867, 259828, 197823, 130818, -58564, 88317, -122985, -256739, -205266, -216682, -119670, -124335, -75346, -158065, -183927, -79366, -111658, -94068, -132945, -212778, 8220, 182551, -22132, 133435, -12356, -113282, -186695, -261833, -182277, -95492, 22057, -51659, 40744, -160653, 19031, 122964, 262269, 186581, -151763, -179460, -141635, -174454, 3401, -48798, -82077, -123801, -277343, -196676, -197975, -249626, 78001, 18025, -61901, 84697, 158745, -97985, -245634, -72492, -187560, 10049, 18567, -99715, -212476, -207588, -163926, -16307, 115191, 106201, 66831, 129371, 291024, 260335, 107745, -222223]
1527b22223J99627L4683k6544N4988l13409M719J41654l8666L4238K20412l4517
1516E4962M0589L07761j37745k28980j22854m3705o2864J98853L52269J92472
1506E50758j38035j08023k86174n3057P7581j00189j94615Q8918O4639l9119J18924
1495a8392k79597P4416m4619J91971J16236j71217L08007J35512j68284j22026
1485B2007J00219k34420L9988J47823j40211p2650O6403j02150L59481J01920
1475B88410k01174o6513N0672N9708j68934n936j34997q1347J91261J16290k8888
1464A8552j34786j45170J48376L24131L8922k50773j49303j1378j25261K91298
1454D608R080j77830J51624O3487k8373l56052J23561N0271J23998j13884K37960
$$ y = [-222223, -22596, 12087, -14457, 40531, -272878, -268159, -126505, -165171, -130933, 89479, 54962, 95551, 403312, 265567, 36587, -86267, -129972, -192836, 6017, 358286, 550758, 412723, 304700, 18526, -34531, 43050, -57139, -251754, -162836, -98197, -137316, -18392, -297989, -223573, -268192, -76221, 40015, -131202, 176805, 312317, 144033, 22007, 122226, -112194, -72206, 75617, -64594, -137244, -70841, -172991, 186490, 288410, 87236, 20723, 71395, 131103, -37831, -43767, -178764, -260111, -68850, 47440, 18552, -116234, -261404, -113028, 211103, 250025, -748, -150051, -161429, -286690, 4608, 13688, -164142, -12518, 50969, 22596, -333456, -209895, -159624, -35626, -149510, 88450]
1443H8450m3911j81829J70930j3547k20452M1395K16569J92287k10238L1776j3394
1432E8036n7288J31753O9269p4578Q5170K8049k74411j9794J53547l724n6850
1421C9179O8655J39158j47559P961o4322j36119J32652N4317o5337q4585k24751
1410b80751J67733j5839N1221J15327j62198Q4002n3497j22398k02416O1448R3765
1399b63603J78749q5072O7288L8984j21466l5534J3931j17878j1115R3826q0082
1388c21972K52913M0098l17856k2410J7329M18809j13383j66873O6709j14534
1378b61170Q9019k1111J82423L93601j64111j10471O6197k39620k96696J54279
1368b07660J12217O2570k6263O4600m3106j01231K92872p6972j27865Q6288n0566
$$ y = [88450, 44539, -137290, 33640, 20093, -200359, -158964, 57605, 249892, 39654, 71430, 58036, 748, 132501, 201770, 127192, 212362, 240411, -34000, -53794, 99753, 96029, 39179, 107834, 246992, 99433, 107394, 43072, -93047, 39605, 93922, 28585, -56000, -280751, -113018, -128857, -77636, 37691, -124507, -40505, -94002, -216400, -418816, -357368, -263603, -84854, -169926, -102638, -63654, -185120, -220654, -206723, -324601, -335716, -241890, -321972, -69059, -28961, -346817, -369227, -351898, 66911, -46472, -213345, -146636, -261170, -172151, -193262, -10839, 382762, 218651, 108180, 174377, -65243, -361939, -207660, -95443, -32873, -59136, 5464, -37642, -138873, 153999, 77027, -50838, 35450, -15116]
1357a5116J1463l4254p035L6876j5445r5888j7359n6072O6122j42886J60194J20302
1345A0902L1722J56762j24189Q0048l09641j12890j77295q4189J55634J56767
1335b16369K1562K23017L6286R7009k49641j94065j58126P1148P0247j31169K78111
1324a51990N2576M1684R2702j10034M1477j27238j144N2756n5162K11993J80845
1313B28465r3501l18393k8440J8040J014K55971K49107j45541M227P0935j84176
1302E7708J9819j9046j37280Q5993Q46l5659j72167r6214K95683J55936r5476
1291F0143j21965J1678r2091O2815K16125j62650j3289j15114p9521Q3376K84848
1280A34355J41542j07240k88563p6857j68437P9632L33697N9920l69295k1115
$$ y = [-15116, -3653, -37907, -44942, -8066, -23511, -119399, -136758, -192830, -126708, -269594, -109400, 10902, 42624, 199386, 75197, 155245, -154396, -267286, -444581, -528770, -373136, -216369, -194807, 28210, 64496, 161505, -88136, -282201, -440327, -369179, -298932, -430101, -151990, -99414, -57730, 34972, -75062, -33585, -160823, -161967, -109211, -164373, 47620, 228465, 134964, -183429, -211869, -193829, -192815, 63156, 312263, 166722, 170949, 241884, 57708, 77527, 58481, -78799, 7194, 8040, -27619, -199786, -296000, -317, 155619, 60143, -61822, -50144, -142235, -79420, 136705, -25945, -39234, -154348, -233869, -150493, 134355, 275897, 168657, -119906, -196763, -365200, -285568, 48129, 108049, -261246, -282361]
1270b82361J11327o7946J5136j2471J64799q6802q4292K28038J94383j49040j44198
1259a13427J60278q7477r2150K2850M928j37986L08982L991Q8397K3438k64347
1248h2523m8247l6341O0018O7818l3642j24231j99458J93221J58179j0661L65472
1237C09605j0669o59267p8608K71764J42601K38091M5617p0087j27222j9028m9057
1226f260J2999p930J25308J8050M4594j25003R8623j27805l6100J9243L38303
1215C54022k58487j01270M4450r0516m708J45189o5778p460o0527q6592L86835
1204B55158j18488j47523K8400M4876l6056N0173J9793j18317M298K03281J32871
1193C18466j09729j24047l17529k5611M3661K0921K91097J12008j39353j25980
$$ y = [-282361, -171034, -238980, -223844, -236315, -71516, -158318, -242610, -14572, 179811, 30771, -113427, 46851, -40626, -132776, -109926, -104998, -242984, 65998, 69989, 158386, 181824, -82523, -130770, -167111, -107093, -39275, -72917, -197148, -396606, -203385, -45206, -55867, 309605, 298936, -360331, -438939, -167175, -24574, 213517, 259134, 189047, 61825, 42797, -6260, 6739, -1191, 124117, 142167, 186761, 61758, 160381, 32576, -3524, 15719, 354022, 95535, -5735, 38715, -51801, -56509, 88680, 22902, 15442, -45085, -131677, 255158, 136670, -10853, 17547, 62423, 26367, 76540, 96333, -21984, -17686, 185595, 318466, 208737, 84690, -232839, -258450, -214789, -193868, 97229, 209237, 69884, -56096]
1183e6096R7381j45880j12870J73572P7762M1671n4771j44936J60946k41327j0714
1172b15262K07627p1422O8537K5804J13561J10837m4871j92956k7392n2957K58145
1161A79651l4693l05141J45279O9564j90855k31289J42639K15505L59669l04789
1151D5540k72664J89382j5386Q2593J38068l41620k43788J63887K86368J14664
1141A47044o3770p6125j27872J59899J83606q1545k08000n4232n0686n8844L0553
1130a99972j13227k2300J83917Q0290J14023L4676j22676J98279O4201n4190p7393
1119H5628k46944l1979K13411J58264J0646L0025k89868R6935k37887J76408J49269
1108A13908k98493J6695K2691J46786P8583J22589Q9772j47999Q3230j06297M877
$$ y = [-56096, 41285, -104595, -217465, -43893, 33869, 75540, 20769, -124167, 36779, -204548, -215262, -7635, -79057, -10520, 15284, 128845, 239682, 194811, 1855, -25537, -78494, 179651, 144958, -160183, -14904, 54660, -136195, -367484, -224845, -9340, 350329, 45540, -227124, -37742, -53128, 29465, 167533, -174087, -417875, -253988, 32380, 147044, 83274, 7149, -120723, 39176, 222782, 141237, -66763, -120995, -171681, -230525, -199972, -313199, -335499, -151582, -71292, 42731, 77407, -45269, 153010, 217211, 163021, 85628, -161316, -193295, 20116, 178380, 189026, 219051, -70817, 26118, -211769, -35361, 113908, -184585, -167890, -145199, 1587, 80170, 202759, 292531, 144532, 227762, 121465, 126342]
1097A26342J63074k1190P9734k24217j48711n6298K5800j521K2009j96200M2494
$$ y = [126342, 289416, 268226, 347960, 123743, -24968, -81266, -55466, -56987, -34978, -231178, -188684]
$$ [...]
##END NTUPLES=NMR SPECTRUM
##END=
