##TITLE=1H_EC-3281(2-2)
 CDCl3
 8 sc, 
 21.10.2022
##JCAMPDX= 6.0         $$ Bruker NMR JCAMP-DX V2.0
##DATA TYPE= NMR SPECTRUM
##DATA CLASS= NTUPLES
##ORIGIN= UXNMR, Bruker Analytische Messtechnik GmbH
##OWNER= root
$$ XWIN-NMR		Version 3.5
$$ Fri Oct 21 14:00:24 2022 Russian Standard Time (UT+4h)  she@DPX200
##.OBSERVE FREQUENCY= 200.1313499994
##.OBSERVE NUCLEUS= ^1H
##.ACQUISITION MODE= SIMULTANEOUS
##.ACQUISITION SCHEME= undefined
##.AVERAGES= 8
##.DIGITISER RES= 18
##SPECTROMETER/DATA SYSTEM= spect
##.PULSE SEQUENCE= zg30
##.SOLVENT NAME= CDCl3
##.SHIFT REFERENCE= (INTERNAL, CDCl3, 0, 15.7359)
##AUDIT TRAIL= $$ (NUMBER, WHEN, WHO, WHERE, WHAT)
$$ ##TITLE= Audit trail, XWIN-NMR		Version 3.5
$$ ##JCAMPDX= 5.01
$$ ##ORIGIN= Bruker BioSpin GmbH
$$ ##OWNER= she
$$ F:/spectra/data/she/nmr/H-F/1/pdata/1/auditp.txt
$$ ##AUDIT TRAIL=  $$ (NUMBER, WHEN, WHO, WHERE, WHAT)
(   1,<2022-10-21 13:59:06.31 +0400>,<she>,<DPX200>,
      <created by zg, POWCHK disabled, PULCHK disabled
       configuration hash MD5:
       00 E9 B6 7A A2 85 ED C7 34 08 36 98 17 FE 4E 26
       data hash MD5: 16K
       6D 4C DE 9C 79 40 A9 20 7C E1 77 8A 7D 30 EA C4>)
(   2,<2022-10-21 13:59:13.21 +0400>,<she>,<DPX200>,
      <Start of raw data processing
       efp BC_mod = 2 LB = 0.24 FT_mod = 6 PKNL = 1 PHC0 = -18033.53 PHC1 = 8.800699 SI = 16K 
       data hash MD5: 16K
       1B A8 7F FB DA 7C 5F 7E 90 E4 EC 25 53 AC DF E2>)
(   3,<2022-10-21 13:59:34.48 +0400>,<she>,<DPX200>,
      <pk PHC0 = 0.5799428 PHC1 = 0.4000002 
       data hash MD5: 16K
       C5 F1 51 FA 8D 1B 46 80 C8 A1 BD CE E1 85 12 DC>)
(   4,<2022-10-21 13:59:37.81 +0400>,<she>,<DPX200>,
      <abs ABSG = 5 
       data hash MD5: 16K
       2B 2E 43 A1 7D 5D 4D B0 30 7B 7B 4E 3C 30 31 ED>)
$$ ##END=
$$ 
$$ hash MD5
$$ 5A 4E 98 0D 18 61 74 DC 6B AF 80 B3 98 51 E4 CD
##$RELAX= 
##$RELAX= 
##$RELAX= 
##$RELAX= 
##$RELAX= 
##$RELAX= 
$$ Bruker specific parameters
$$ --------------------------
##$DU= <F:/spectra>
##$EXPNO= 1
##$NAME= <H-F>
##$PROCNO= 1
##$TYPE= <nmr>
##$USER= <she>
##$AMP= (0..31)
100 100 100 100 100 100 100 100 100 100 100 100 100 100 100 100 100 100 
100 100 100 100 100 100 100 100 100 100 100 100 100 100 
##$AQSEQ= 0
##$AQ_mod= 1
##$AUNM= <au_zg>
##$AUTOPOS= <>
##$BF1= 200.13
##$BF2= 200.13
##$BF3= 200.13
##$BF4= 200.13
##$BF5= 200.13
##$BF6= 200.13
##$BF7= 200.13
##$BF8= 200.13
##$BYTORDA= 1
##$CFDGTYP= 0
##$CFRGTYP= 5
##$CHEMSTR= <none>
##$CNST= (0..31)
1 1 145 1 1 1 1 1 1 1 1 1 1 1 1 1 1 1 1 1 1 1 1 1 1 1 1 1 1 1 1 1 
##$CPDPRG= <>
##$CPDPRG1= <>
##$CPDPRG2= <>
##$CPDPRG3= <>
##$CPDPRG4= <mlev>
##$CPDPRG5= <mlev>
##$CPDPRG6= <mlev>
##$CPDPRG7= <mlev>
##$CPDPRG8= <mlev>
##$CPDPRGB= <>
##$CPDPRGT= <>
##$D= (0..31)
0 1.2 0 0 0 0 0 0 0 0.06 0 0.03 0 0 0 0 0.0002 0 0 0 0 0 0 0 0 0 0 0 0 
0 0 0 
##$DATE= 1666346345
##$DBL= (0..7)
120 120 120 120 120 120 120 120 
##$DBP= (0..7)
150 150 150 150 150 150 150 150 
##$DBP07= 0
##$DBPNAM0= <>
##$DBPNAM1= <>
##$DBPNAM2= <>
##$DBPNAM3= <>
$$ [...]
##$SUBNAM3= <"">
##$SUBNAM4= <"">
##$SUBNAM5= <"">
##$SUBNAM6= <"">
##$SUBNAM7= <"">
##$SUBNAM8= <"">
##$SUBNAM9= <"">
##$SW= 18.0517283424941
##$SWIBOX= (0..15)
0 0 2 0 0 0 0 0 0 0 0 0 0 0 0 0 
##$SW_h= 3612.71676300578
##$TD= 16384
##$TD0= 1
##$TE= 0
##$TE2= 300
##$TE3= 300
##$TEG= 300
##$TL= (0..7)
0 120 120 120 120 120 120 120 
##$TP= (0..7)
150 150 150 150 150 150 150 150 
##$TP07= 0
##$TPNAME0= <>
##$TPNAME1= <>
##$TPNAME2= <>
##$TPNAME3= <>
##$TPNAME4= <>
##$TPNAME5= <>
##$TPNAME6= <>
##$TPNAME7= <>
##$TPOAL= (0..7)
0.5 0.5 0.5 0.5 0.5 0.5 0.5 0.5 
##$TPOFFS= (0..7)
0 0 0 0 0 0 0 0 
##$TUNHIN= 0
##$TUNHOUT= 0
##$TUNXOUT= 0
##$USERA1= <user>
##$USERA2= <user>
##$USERA3= <user>
##$USERA4= <user>
##$USERA5= <user>
##$V9= 5
##$VALIST= <valist>
##$VCLIST= <CCCCCCCCCCCCCCC>
##$VD= 0
##$VDLIST= <DDDDDDDDDDDDDDD>
##$VPLIST= <PPPPPPPPPPPPPPP>
##$VTLIST= <TTTTTTTTTTTTTTT>
##$WBST= 1024
##$WBSW= 4
##$XGAIN= (0..3)
0 0 0 0 
##$XL= 0
##$YL= 0
##$YMAX_a= 135220
##$YMIN_a= -190573
##$ZGOPTNS= <>
##$ZL1= 120
##$ZL2= 120
##$ZL3= 120
##$ZL4= 120
##$ABSF1= 15.73697
##$ABSF2= -2.314879
##$ABSG= 5
##$ABSL= 3
##$ALPHA= 0
##$AQORDER= 0
##$ASSFAC= 0
##$ASSFACI= 0
##$ASSFACX= 0
##$ASSWID= 0
##$AUNMP= <proc_1d>
##$AZFE= 0.1
##$AZFW= 0.1
##$BCFW= 0
##$BC_mod= 2
##$BYTORDP= 0
##$COROFFS= 0
##$CY= -3
##$DATMOD= 1
##$DC= 0
##$DFILT= <>
##$DTYPP= 0
##$F1P= 0
##$F2P= 0
##$FCOR= 1
##$FTSIZE= 16384
##$FT_mod= 6
##$GAMMA= 0
##$GB= 0
##$INTBC= 1
##$INTSCL= 3.70164e-10
##$ISEN= 128
##$LB= 0.24
##$LEV0= 0
##$LPBIN= 0
##$MAXI= 10000
##$MC2= 0
##$MEAN= 0
##$ME_mod= 0
##$MI= 1.114404
##$NCOEF= 0
##$NC_proc= -7
##$NLEV= 6
##$NOISF1= 3.799351
##$NOISF2= 2.8
##$NSP= 0
##$NTH_PI= 0
##$NZP= 0
##$OFFSET= 15.73587
##$PC= 1
##$PHC0= -18032.95
##$PHC1= 9.2007
##$PH_mod= 1
##$PKNL= yes
##$PPARMOD= 0
##$PSCAL= 0
##$PSIGN= 0
##$REVERSE= no
##$SF= 200.1300071368
##$SI= 16384
##$SIGF1= 3
##$SIGF2= 2
##$SINO= 5.538805
##$SIOLD= 16384
##$SREGLST= <1H.CDCl3>
##$SSB= 0
##$STSI= 16384
##$STSR= 0
##$SW_p= 3612.71676300578
##$SYMM= 0
##$S_DEV= 0
##$TDeff= 16384
##$TDoff= 0
##$TI= <>
##$TILT= no
##$TM1= 0
##$TM2= 0
##$TOPLEV= 0
##$USERP1= <user>
##$USERP2= <user>
##$USERP3= <user>
##$USERP4= <user>
##$USERP5= <user>
##$WDW= 1
##$XDIM= 16384
##$YMAX_p= 515154155
##$YMIN_p= -648955
$$ End of Bruker specific parameters
$$ ---------------------------------
##NTUPLES= NMR SPECTRUM
##VAR_NAME=  FREQUENCY,     SPECTRUM/REAL,   SPECTRUM/IMAG
##SYMBOL=    X,             R,               I
##VAR_TYPE=  INDEPENDENT,   DEPENDENT,       DEPENDENT
##VAR_FORM=  AFFN,          ASDF,            ASDF
##VAR_DIM=   16384,         16384,           16384
##UNITS=     HZ,            ARBITRARY UNITS, ARBITRARY UNITS
##FACTOR=    0.220516191357247, 1,           1
##FIRST=     3149.21984771636, 0,            0
##LAST=      -463.496915289423, 0,           0
##MIN=       -463.496915289423, -648955,     0
##MAX=       3149.21984771636, 515154155,    0
$$ Real data points
##PAGE= N=1
##DATA TABLE= (X++(R..R)), XYDATA
$$ [...]
7132D764293J68423k4935J64414r6013L13985M71998Q5631J73605M40975J56811
7122F619187J62808R1080K71243L60028M13113M69253N55204M25937N45376M83869
7112A0397098L46846J78665N36991P44354Q11012L83351O85595P34124L84290
7103A5202326R43056R31155O22796J220605J074854J285872J560309J681793K069174
7094B6591940K289007K551251L169500L664903M347189N308006O032363P771871
7086F1726030R604486J1732908J4583826J6447890J7265785J5494613Q352820
7079A55208358k625333j3089287k0484123k1724660j8432679j4073217j0382637
7072E4396422p809752o063349m532364l476441l239255k509523k095775j936123
$$ plain form
7132 4764293 4932716 4907781 5072195 4976182 5290167 5762165 5847796 6021401 6462376 6619187
7122 6619187 6781995 6873075 7144318 7504346 7917459 8386712 8941916 9367853 9913229 10397098
7112 10397098 10743944 10922609 11459600 12203954 13014966 13398317 14083912 14818036 15202326
7103 15202326 16145382 17076537 17699333 18919938 19994792 21280664 22840973 24522766 26591940
7094 26591940 28880947 31432198 34601698 38266601 42613790 47921796 53954159 61726030
7086 61726030 71330516 83063424 97647250 114095140 131360925 146855538 155208358
7079 155208358 152583025 139493738 119009615 97284955 78852276 64779059 54396422
7072 54396422 46586670 40523321 35990957 32514516 29275261 26765738 24669963 22733840
7064B2733840j596332j369870j279888j252942q71741r14227j009324o48755q82899
7055A2907862o56217n69914n74782l75327k15836n16679k70504o13575m78161
7046H636867k17529k70023j14476k66637j29405j27016M7890O3650Q6058j16178
7036G593201j16661o338j73522m07873n85426m83215k58900l48470j92331N670
7026E026135l34573l8330j61491k85607l23153K83028k24797j40622K8829j69852
7016C659567J9899P208j46306j37076O7321l68817j70732j23602j3342k6539l20627
7005B446954j07402N7201j25857m5987k07137q1124J62504Q9484q7340k47864
6995A853432l0033o2974K035J40238J01412l06506k30985m5629j06224L4434m0985
$$ plain form
7064 22733840 21137508 19767638 18487750 17234808 16363067 15448840 14439516 13790761 12907862
7055 12907862 12251645 11681731 11106949 10731622 10515786 9999107 9728603 9115028 8636867
7046 8636867 8419338 8149315 8034839 7768202 7638797 7511781 7559671 7623321 7709379 7593201
7036 7593201 7476540 7470202 7296680 6888807 6303381 5820166 5561266 5212796 5020465 5026135
7026 5026135 4691562 4653232 4491741 4206134 3882981 4166009 3941212 3800590 3829419 3659567
7016 3659567 3679466 3686674 3540368 3403292 3470613 3101796 2931064 2807462 2794120 2767581 2446954
7005 2446954 2339552 2396753 2270896 2224909 2017772 1936648 2099152 2188636 2101296 1853432
6995 1853432 1823399 1760425 1762460 1902698 2004110 1697604 1466619 1420990 1314766 1349200 1308215
6984A308215L6283R4162l36614k0804j79461j11156L63909Q2417j12423q6629
6974A037899M2838M1733O6439K4118p4756P082j90420L22980j16786k75622J08292
6963I93797j20734p1948J67786j27852Q2436j28935L686K02359j27375j65636
6953G07584K326J56498j32336P7350K8459k48148r9357J78667n5605K1488p532
6942F29394j89365j41518J69927J6229K9766j14424m2372N834Q4897q9098k06959
6931A52311l1114l0150m2853J48933J47521K24046j13465k59776R3668J61050
6921D50171J84483j28110K3450j05323k426Q3480j73934l4083K98518O9096k11805
6910D53517O1662p4284J50383r871n3484j63447N9835P4728j15775k63806k14793
$$ plain form
6984 1308215 1344498 1438660 1102046 1081242 901781 790625 1154534 1236951 1124528 1037899
6974 1037899 1080737 1122470 1188909 1213027 1138271 1145353 954933 1277913 1161127 885505 993797
6963 993797 873063 801115 968901 841049 923485 794550 798236 1000595 873220 707584
6953 707584 709910 866408 734072 811422 839881 591733 492376 671043 615438 636926 629394
6942 629394 440029 298511 468438 484667 514433 400009 357637 363471 448368 359270 152311
6931 152311 121197 91047 48194 197127 344648 568694 455229 195453 289121 450171
6921 450171 634654 506544 529994 424671 422245 505725 331791 297708 596226 665322 453517
6910 453517 515179 440895 591278 581407 527923 364476 424311 499039 383264 119458 -95335
6899i5335J44674L418p3380J23940N6431M050L3679n3181J43504j19822k02806
6888c4828K29942j40540K56667j47370L6501o7995j08689P4151J76756N0431k86178
6877C8848l1095n262j51868J22031J87752O8021M5901n9319j12712p7182o0851
6866c5736N8672J23793p2618p538P5109L86911j85592k28235j66107q1749K32799
6855I9709M4601r6415m8539m7708J66677k1476j14416k51136K01040J14784n2983
6844e862L5178r4492J51519J40777Q0267k92941O1537J38567j41921l2493K0582
6833F0718J51379j997j91905J04976l0129p0077L0597M9958K92566l13788n2376
6822B9922L16476k40935j49370J05528K06197N419j67485J3764P6314m65837J9968
$$ plain form
6899 -95335 49339 52757 -20623 103317 159748 163798 197477 144296 287800 167978 -34828
6888 -34828 195114 54574 311241 163871 200372 132377 23688 97839 274595 325026 38848
6877 38848 7753 2491 -149377 -27346 160406 228427 274328 215009 102297 25115 -35736
6866 -35736 22936 146729 74111 66573 141682 528593 343001 114766 -51341 -133090 99709
6855 99709 144310 47895 -644 -48352 118325 96849 -17567 -268703 -67663 47121 -5862
6844 -5862 29316 -65176 86343 227120 307387 14446 75983 214550 72629 40136 60718
6833 60718 212097 210100 18195 123171 93042 22965 53562 103520 396086 82298 29922
6822 29922 346398 105463 -43907 61621 267818 273237 105752 119516 195830 -270007 -250039
6811b50039R6772Q4543L30568q0223j16564o6997M34239j43193j61408R0177J38517
6800C56392j04007p9002j60256k5159o4270J41931k06562M1961j7709J54727K43510
6789B81556j56528k32441j203j38534K99822K51514j67263K8103j65268J02706
6779A02464j12640k42077L16981q2127k62128J20922J72798J0949j14403j3816
6769a03077r2581Q0293Q1709K01056j19555j76009J01402l0736p764J07852j86021
6758a43431j20162J70959k60059K0961M00920j08071m7454J62094r3031r3431
6748a10705J56810j81335j40726p7709J15358J65628N9181m0122R6617j30177
6738h7180j32565K92982J63351j7601j50491Q1690K0952k54257o470j08610N7376
$$ plain form
6811 -250039 -153267 -68724 261844 181621 65057 -1940 432299 289106 127698 217875 356392
6800 356392 252385 173383 13127 -12032 -76302 65629 -140933 -98972 -116681 38046 281556
6789 281556 125028 -107413 -108616 -247150 52672 304186 136923 165026 -242 102464
6779 102464 -10176 -252253 64728 -17399 -279527 -158605 14193 25142 -89261 -103077
6769 -103077 -195658 -115365 -33656 167400 47845 -128164 -26762 -57498 -65262 42590 -143431
6758 -143431 -263593 -92634 -352693 -331732 69188 -38883 -86337 75757 -17274 -110705
6748 -110705 46105 -135230 -275956 -353665 -238307 -72679 -13498 -53620 42997 -87180
6738 -87180 -219745 73237 236588 218987 68496 150186 171138 -83119 -89589 -198199 -140823
6727a40823K5007J2176k1256L782m7009K7759j05440K28519N117R50o0855N7280
6715a4793K11535q7731l2475J5552J77529J38985l60062K9024J07393j62396J07988
6704A30549j43892K10198K45040l81092O143J24768l86951O7182L48722m7441
6694A73226k57705q3240L73459j16935p8830Q9802J09151L9555j5804Q1626J68523
6683D82828P0178N5877j96507j8420K44049J13220p864k34654j61794r5603q8240
6672A63070m2301K21602L6503j51398k34435J50208j90643l6211J32900R2175
6662A41470j32109J14108O6793j46279k7494j70018K65816R8006k03887K8270
6652C4676J80685j95682q257J86828j55633j9537N8710R481Q3895j5406J08826
$$ plain form
6727 -140823 -115816 -103640 -124896 -121114 -168123 -140364 -245804 -17285 -12168 -11218 -72073 -14793
6715 -14793 196742 109011 76536 92088 269617 408602 48540 77564 184957 22561 130549
6704 130549 -13343 196855 441895 60803 66946 191714 -195237 -128055 220667 173226
6694 173226 -84479 -167719 205740 88805 9975 99777 208928 248483 232679 314305 482828
6683 482828 553006 608883 412376 393956 638005 751225 743361 508707 346913 251310 163070
6672 163070 120769 342371 378874 227476 -6959 143249 -47394 -83605 49295 141470
6662 141470 9361 123469 190262 43983 16489 -153529 112287 210293 6406 34676
6652 34676 215361 19679 11422 198250 42617 23080 81790 91271 175166 159760 268586
6641B68586n0114k57329j19285j66974J43068R2089M862n0266r9984J05492Q3120
6630d6735o2298n2974l3301L21806k74194j02874j17644J40880K13779j4576o2558
6619i0689k26519M7693l946J28643J82045m4502N3658L36314k28886l22563j26128
6608b94880Q4764J73705L3815q7279K1864k0512J17949L8392l04088j04360J84282
6597a56348p8207j5262p9203r8894R0808j39957J89638k9765J62311J1397o8925
6586b12407k98361M7463L54239k53145L2816J31197Q9588K4743k20659q6907K6513
6575c64920M7498O7301J39164j0732K78204n4624J04253R7890k87127j32540k29975
6564c45608K07934L50854k23405k70301M5283K4793L115O2831Q9782r2450j38448
$$ plain form
6641 268586 218472 -38857 -158142 -325116 -182048 -89959 -85097 -135363 -235347 -129855 -46735
6630 -46735 -109033 -162007 -195308 126498 -147696 -250570 -368214 -227334 -13555 -28131 -90689
6619 -90689 -317208 -269515 -273461 -144818 37227 -7275 46383 382697 153811 -168752 -294880
6608 -294880 -210116 -36411 -2596 -89875 -68011 -88523 29426 67818 -236270 -340630 -156348
6597 -156348 -234555 -249817 -329020 -427914 -337106 -477063 -287425 -317190 -154879 -143482 -212407
6586 -212407 -510768 -463305 -109066 -362211 -329395 -198198 -108610 -83867 -304526 -391433 -364920
6575 -364920 -317422 -250121 -110957 -121689 156515 101891 206144 304034 16907 -115633 -345608
6564 -345608 -137674 213180 -10225 -280526 -235243 -210450 -207335 -144504 -54722 -147172 -285620
6553b85620L6997K58498J63329n4973n8747o096r8016m0374J08553j51169K5781
6542a01837J27575l8460n5628J01711J31052j60274Q3366k31994k24495J00377
6532b68607L32093j51529j4213m419K03629j9186j11916o4315j53627j41436J17590
6521b75936K52637k3176m545j90908j38824J82590j18321k76717Q4548L26211
6511a82441j02693K1084J55889M7160L33315m6505j11987r1541j32464l2323j94947
6500c37453q2363J02328J5500K19734L8037n3764J29302j20843l8309L111j9268
6489a43988J59863m7737j76470K01229n4128L8944k71230J47484K47080k02495
6479a01448j58081Q7016K08118J14456j90291k29800K98741Q6027O1067Q3633
$$ plain form
6553 -285620 -248623 9875 173204 118231 59484 53388 -44628 -85002 23551 -127618 -101837
6542 -101837 25738 -12722 -68350 33361 164413 4139 87505 -144489 -368984 -268607
6532 -268607 63486 -88043 -102256 -106675 96954 77768 -34148 -98463 -252090 -393526 -275936
6521 -275936 -23299 -46475 -51020 -241928 -380752 -198162 -316483 -593200 -508652 -182441
6511 -182441 -285134 -264050 -108161 -61001 272314 225809 113822 22281 -110183 -142506 -337453
6500 -337453 -419816 -317488 -301988 -82254 -44217 -97981 31321 -89522 -127831 -124720 -143988
6489 -143988 15875 -31862 -208332 -7103 -61231 -22287 -293517 -146033 101047 -101448
6479 -101448 -259529 -172513 35605 150061 -40230 -270030 28711 114738 175805 259438
6469B59438j65611j92772N7594n7769j76610j03822K48602n274r8076N4996j28430
6458c07734L0276J75001J96434L4628j04763j75092o4337J21131N4866J99632
6448A60042j07854j4095O7111J0788j96785K9092k70678P3912J467n5375K12315
6437i0060n1365j10670q9530M7708K44909J09868j18243j32432p1874Q0560j9845
6426b00974R863o2487m8237K70969p7059r5095J38493J20388j70612q7358L47748
6415A45639m7539p7447J9869j7619J3419q7521n7030M6962J40379j06966j77134
6404b04988Q4887J63231k1539k09483J10064m9816m7734m7745M4852r6848K28106
6393d7013J59312j83579j5358j11388J72770R1406q3928J4149J61852j39830J34496
$$ plain form
6469 259438 93827 -98945 -41351 -99120 -275730 -379552 -130950 -136224 -234300 -179304 -307734
6458 -307734 -277458 -102457 93977 128605 23842 -151250 -215587 -94456 -39590 160042
6448 160042 52188 38093 105204 115992 -80793 -51701 -322379 -248467 -247000 -302375 -90060
6437 -90060 -141425 -252095 -341625 -293917 -49008 60860 -57383 -189815 -261689 -181129 -200974
6426 -200974 -191111 -253598 -301835 -30866 -107925 -203020 -64527 55861 -114751 -202109 145639
6415 145639 98100 20653 40522 22903 36322 -51199 -108229 -61267 79112 -27854 -204988
6404 -204988 -120101 43130 21591 -187892 -77828 -127644 -175378 -223123 -178271 -275119 -47013
6393 -47013 112299 -71280 -86638 -198026 -25256 66150 -17778 -3629 158223 18393 152889
6382A52889k258J8548J25263J1800j99313l03901K5374L05649J99051r6400k00019
6371C6683j9607q1402K2516O8619j08703J30766L66263p1192m50259J34479K4530
6360E2693o0971O714J75206J09225l564p5239j52651j6678J44084L49897q7634
6349D41082J1897j53205M6481o2658R538k83384q1303L33182j23777Q5067j32530
6338I0390J49501M2496O6782m6749k3425l93487K5212j6886J2058J37027K23220
6327B66139J055j0718R5407n9114n7149k3340M8486r5769j39182j04909M454j83529
6315b58169M2431J91377K05076K33157l65960J34804n8256K9487R2958j50509
6305I6396j66328p4936J55955k6438K07209J30061j2541L5137o9402m9826j98407
$$ plain form
6382 152889 150631 169179 294442 306242 106929 -196972 -171598 134051 333102 236702 36683
6371 36683 17076 -64326 -41810 26809 -81894 48872 415135 343943 -106316 28163 52693
6360 52693 -8278 -1564 173642 282867 279303 204064 51413 34735 178819 528716 441082
6349 441082 452979 299774 346255 283597 293135 9751 -71552 261630 137853 222920 90390
6338 90390 239891 282387 349169 302420 278995 -114492 -89280 -106166 -94108 42919 266139
6327 266139 267194 256476 351883 292769 235620 212280 260766 164997 25815 -79094 -74640 -258169
6315 -258169 -215738 -24361 180715 413872 47912 182716 124460 153947 246905 96396
6305 96396 -69932 -144868 11087 -15351 191858 321919 309378 344515 275113 225287 26880
6294B6880R994N1601j5568O9372J57511K3108j34327j69061R36K27375j10837
6283A36984J20339n1567J35584j734l3729J555K08286l93073K9455K28129J3095
6272C93324J35181j00711J07251p962j16386P7068n7400Q7043R4936k0753J29646
6261G21237Q9337j62652J91963L8120l11825m6016j00533p1030j6365k40191J36247
6250B28292M77552M9782n19608L5921J39078k03619Q0008N6983j18480J84574
6240D10483l8206K64502L48079l71283j85258J45642L33730r4497l7552j75446
6230F00194j23553L0163k6963q4533P4708N7254j64866o8747J39167M2871o8130
6219D07565p5175O9872K4639j70420R0435o0666J65658M6188n8898q6432L08800
$$ plain form
6294 26880 36874 88475 72907 142279 299790 322898 188571 19510 20446 247821 136984
6283 136984 257323 205756 341340 339606 305877 307432 515718 122645 152100 380229 393324
6272 393324 528505 427794 535045 527083 410697 487765 430365 517408 612344 591591 721237
6261 721237 810574 647922 839885 878005 566180 520164 419631 348601 332236 92045 228292
6250 228292 705844 755626 236018 271939 411017 207398 287406 344389 225909 410483
6240 410483 372277 636779 984858 613575 428317 573959 907689 813192 775640 600194
6230 600194 476641 506804 479841 395308 470016 527270 362404 293657 432824 475695 407565
6219 407565 332390 402262 426901 256481 346916 286250 451908 498096 439198 352766 661566
6208F61566O1915j94512K1053m4086j77492q2596K26443Q7789J29229j35869o6448
6197D86992j10991k00275j87425K26801O6072R3750k44848K9866J6961J12779
6187B89682J41788J31697j64544j97237O6686j89678j61485J95859K54541K2069
6177C89378j37151k47863K7230K21826M0205Q5094M8930j17491j60016q825J87367
6166C28684l22509j61654L68437J77288j88779K8486j05068j9270J25332L2069
6156B63016R3465r1654l9092j15352j09541R4106L01855K9166n2524k9374k17574
6145A26497O3067K9297L4875J97564K30206k51013o9748p5781M9332o4017j19428
6134A50851L998J34377M3769R4792o4912J4049M6010n9684q1271P7579M9851O7651
$$ plain form
6208 661566 723481 528969 550022 505936 328444 245848 472291 560080 689309 553440 486992
6197 486992 376001 175726 -11699 215102 281174 374924 130076 159942 176903 289682
6187 289682 431470 563167 398623 201386 268072 78394 -83091 112768 367309 389378
6177 389378 252227 4364 31594 253420 293625 378719 427649 310158 150142 141317 328684
6166 328684 6175 -155479 212958 390246 201467 229953 124885 105615 230947 263016
6156 263016 356481 264827 225735 110383 842 94948 396803 425969 373445 344071 126497
6145 126497 189564 218861 253736 451300 681506 430493 360745 284964 334296 270279 150851
6134 150851 154849 289226 332995 427787 362875 376924 422934 363250 281979 359558 409409 477060
6122D77060K09143k30586N0979L0934p8103n4928K8540k0229q9756j44643K88533
6111D66944L47230L1729J55199k42873L20999j86135j24946K1051M0437n5588
6101G74047j75925J39779J29751j220j86742j22412l1317J47183m5093K71450
6091H99501K17508p5568k15805k21586j81588K44436J21781n0889j13523R2103
6081G16370J25579M017K61180O1883k8237N7326j52730j8381K30403l09051K08344
6070A156703p4192j63619K78390O0241K00299l72338J82946L3860O6219K6611
6060A395120j69046q7403J12332k60608r4088K66587L04888J59017P1127l99100
6050A298826j18420J70453P5937m4308K8764J16895L4247j17616J43855J58704
$$ plain form
6122 477060 686203 455617 506596 537530 459427 404499 433039 412810 323054 178411 466944
6111 466944 814174 845903 1001102 758229 1079228 893093 768147 789198 829635 774047
6101 774047 598122 737901 867652 866432 679690 557278 525961 673144 628051 899501
6091 899501 1117009 1041441 825636 604050 422462 666898 788679 737790 624267 716370
6081 716370 841949 845966 1107146 1169029 1140792 1198118 1045388 1027007 1257410 948359 1156703
6070 1156703 1082511 918892 1197282 1257523 1457822 1085484 1268430 1302290 1368509 1395120
6060 1395120 1226074 1138671 1251003 990395 896307 1162894 1467782 1626799 1697926 1298826
6050 1298826 1180406 1350859 1426796 1382488 1411252 1528147 1562394 1444778 1588633 1747337
6040A747337j40605J04267j07635O7335K84999K71716j95544L5371J46696o7926
6030B146011m9850L8482K6651k11167J29861J97947q3302J85831j5185K41342
6020B606621o8010N8357n3177M45835N4342p3606k3256K05025M1157L26421J37797
6009C657506j0600L53039j96115Q3289j66468P2114N0452K20430o7978J48903
5999D144572N9801J00199Q8935r5346K50851j1671J0572N7177L99977K29028M7097
5988E281192L97742J72893J59943o921K94686K07854J27812K47190J22991J07038
5978G112420R1453K41532L90901P7225J59507J16265K51473o8296L91059M66041
5968I229580J31003O14012M00574M26633J16615L30530M71038O36729N29211L54404
$$ plain form
6040 1747337 1606732 1710999 1603364 1670699 1955698 2227414 2031870 2067241 2213937 2146011
6030 2146011 2096161 2134643 2161294 1950127 2079988 2277935 2194633 2380464 2365279 2606621
6020 2606621 2538611 2596968 2543791 2989626 3043968 2970362 2947106 3152131 3193288 3519709 3657506
6009 3657506 3646906 3999945 3803830 3887119 3720651 3792765 3843217 4063647 3995669 4144572
5999 4144572 4204373 4304572 4393507 4298161 4549012 4537341 4547913 4605090 5005067 5234095 5281192
5988 5281192 5678934 5851827 6011770 6004849 6299535 6507389 6635201 6882391 7005382 7112420
5978 7112420 7203873 7445405 7836306 7913531 8073038 8189303 8440776 8372480 8763539 9229580
5968 9229580 9360583 9974595 10375169 10801802 10918417 11248947 11719985 12356714 12885925 13240329
5958A3240329N38090P73033P93606O31635P80105N78006P60530Q25830J121322
5949B0042486J243931J122630J544930J493193J614801J650695J805003J811320
5941C2328989K343168K710291L269651M426790N349609O816970Q107250Q910836
5933G4263554Q850950O078677M46826n747496q485934q056706o294088m563886
5925E6491897l376308k334588j412352o76135n3075N52688J356769J696079J750799
5916E3995774K234659K357001K739789L637565M771806O381444Q242473J0682794
5908I5043305J3442305J6281392J8039799J6057030Q132237n416151j7009779
5901A44570138k0056043j7902027j3446205j0273366p874434o031165n067810
$$ plain form
5958 13240329 13778419 14551452 15345058 15976693 16756798 17334804 18095334 18921164 20042486
5949 20042486 21286417 22409047 23953977 25447170 27061971 28712666 30517669 32328989
5941 32328989 34672157 37382448 40652099 45078889 50428498 57245468 65352718 74263554
5933 74263554 83114504 89193181 89640007 83892511 75406577 67349871 61055783 56491897
5925 56491897 53115589 50781001 49368649 48692514 48639439 49192127 50548896 52244975 53995774
5916 53995774 56230433 58587434 61327223 64964788 69736594 76118038 84360511 95043305
5908 95043305 108485610 124767002 142806801 158863831 166996068 161579917 144570138
5901 144570138 124514095 106612068 93165863 82892497 75018063 68986898 63919088
5894F3919088m058819l418251k239184k031860j621402p63268j2569L24106O95165
5885E0793006J078402J553712K788665M186419N362866P095034Q269288Q152606
5877H9279998O472622J275341n289035r486875r994349p954421o230566m889882
5869E3182833m150083l693480l480441l112075k995687k738492k793841k661693
5861B7557041j867782j366400j545626j173899r34651p51851n96989n42171m90053
5852A8287619l86337k83508m20449k30702o8979j39696L68017K78271K434J11161
5842A7517831J88538k2103l34038k94407o80455p17485j115281r14035p41744
5833A2886821o72729q29265k60590m79583n92662n47465j77573k17468o01608
$$ plain form
5894 63919088 59860269 56442018 54202834 52170974 50549572 49786304 49773735 50097841 50793006
5885 50793006 51871408 53425120 56213785 60400204 65763070 72858104 81127392 89279998
5877 89279998 95752620 97027961 91738926 82252051 72257702 64303281 58072715 53182833
5869 53182833 49032750 45339270 41858829 38746754 35751067 33012575 30218734 27557041
5861 27557041 25689259 24322859 22777233 21603334 20668683 19916832 19319843 18777672 18287619
5852 18287619 17901282 17617774 17197325 16966623 16897644 16757948 17125965 17404236 17406670 17517831
5842 17517831 17706369 17684266 17350228 17055821 16375366 15657881 14542600 13628565 12886821
5833 12886821 12214092 11384827 11124237 10644654 10051992 9504527 9326954 9109486 8507878
5824H507878o4598k70317j51642l37830l3947O1101k52066j25393j8162R416q2730
5813G241710j72077J52835k43815j76773O9361j16186o9275n0715J40475k84974
5803F490566k73308N8694k10k17037k26481k60508m94705l52479k43537j24683
5793D356312k09446K12217J99857j73211k46859M365K2045k09893j93889k725
5783C758773J63559j59176m5978j31160j18039k30849L28693M5747M6626j99794
5773C458402r845r2787n65368J38231J61939P4292l71470r0194L3013m6966J46707
5762B835954j23728j70485K55864K51167r005j83265J9017K42112L48640K10729
5752C677000k39777l36925P8203p4758J20272K5927R4319J2178j67113n5023k52944
$$ plain form
5824 8507878 8443280 8172963 8021321 7683491 7649544 7710645 7458579 7333186 7315024 7324440 7241710
5813 7241710 7069633 7222468 6978653 6801880 6871241 6755055 6685780 6635065 6775540 6490566
5803 6490566 6217258 6275952 6275742 6058705 5832224 5571716 5077011 4724532 4480995 4356312
5793 4356312 4146866 4359083 4558940 4385729 4138870 4143235 4165280 3955387 3761498 3758773
5783 3758773 3922332 3763156 3717178 3586018 3467979 3237130 3565823 3611570 3658196 3458402
5773 3458402 3448557 3355770 2790402 2928633 3090572 3164864 2793394 2703200 2736213 2689247 2835954
5762 2835954 2712226 2541741 2797605 3048772 3039767 2856502 2875519 3117631 3466271 3677000
5752 3677000 3437223 3100298 3178501 3103743 3224015 3249942 3344261 3356439 3189326 3134303 2881359
5741B881359O6301J80039q1945n3175J71562L2792J15815J23203p5348J2421k37103
5730C135921k7529P4446N7506L06314O7053l25387o737K24458P0333R8944M9880
5719C725202l1262p4212j38486j64522K74058J41318K6816J24054K33587n2695
5709D063858l2664J29746O1180k03873j83574k82180O6974j64603K6815j24526
5699C357153k4333j77463P3237J27548j79800K20473J0717N5712J2440M6442j60210
5688C361916j42719j50983K3826j40691J66450J89442J52045m2605n8410J38353
5678C496624J20713j6537k93871K7236m3062m6912j26240o19k53450j35670P6922
5667B805134K14443K63187l58256k00331m9843L02294N4836k83609j00640J21727
$$ plain form
5741 2881359 2947660 3127699 3045754 2992579 3164141 3196933 3312748 3435951 3360603 3373024 3135921
5730 3135921 3108392 3182838 3240344 3546658 3613711 3288324 3281587 3506045 3576378 3675322 3725202
5719 3725202 3693940 3619728 3481242 3316720 3590778 3732096 3758912 3882966 4116553 4063858
5709 4063858 4031194 4160940 4222120 4018247 3834673 3552493 3619467 3454864 3481679 3357153
5699 3357153 3332820 3155357 3228594 3356142 3176342 3396815 3407532 3463244 3475684 3522126 3361916
5688 3361916 3219197 3068214 3092040 2951349 3117799 3307241 3459286 3416681 3358271 3496624
5678 3496624 3617337 3600800 3306929 3334165 3291103 3244191 3117951 3117332 2863882 2728212 2805134
5667 2805134 3019577 3282764 2924508 2724177 2674334 2976628 3031464 2747855 2647215 2768942
5657B768942K19141J06652J15060R0734J38778o820P1440j32997j33782J89627
5647C426775J80442J16753j38576l52985K01624K32776p3548l21417J0030J38036
5637C419910j97439K93086j40786r4147L42029J83755j34531N0697j54102L41007
5627C909479L7010R0924J82722p6668O9951K53916J399J83357L9559k39775N2808
5616D504682J89379J77598j8611K10688J71245J753L28437J59821N802J20802
5606E851596P830J10731J69797K82920Q4970J70673J44859K15096J94235K27890
5596G460597L08822K24219J3889J77428Q9744K07854L90473J89031M51767L75260
5586I889084J2980K36198M26055L93500M27177L48946J12683M07150O19709M87600
$$ plain form
5657 2768942 2988083 3094735 3209795 3300529 3439307 3432487 3503927 3370930 3237148 3426775
5647 3426775 3607217 3723970 3585394 3232409 3434033 3666809 3593261 3271844 3281874 3419910
5637 3419910 3222471 3515557 3374771 3280624 3622653 3806408 3671877 3722574 3568472 3909479
5627 3909479 3946489 4037413 4220135 4143467 4213418 4467334 4468733 4652090 4691649 4451874 4504682
5616 4504682 4694061 4871659 4853048 5063736 5234981 5236734 5565171 5724992 5730794 5851596
5606 5851596 5859426 5970157 6139954 6422874 6507844 6678517 6823376 7038472 7232707 7460597
5596 7460597 7769419 7993638 8007527 8184955 8274699 8482553 8873026 9062057 9513824 9889084
5586 9889084 9902064 10138262 10564317 10957817 11384994 11733940 11846623 12253773 12873482 13361082
5576A3361082M69880M09238N10704R48160R54932O03705P81372Q35203P75335
5567A9649611P31108R77981R91614J000072J441445J232536J310398J545662K030240
5558C0910667K375622K382340L001997K801699L061520L185250L058802K767357
5550E3545254K598197K703149K219645J581324Q28910J32421l91754r71688j053596
5541F1191862q79565j294283j177230o16376k17661J86349L53492P36619J409981
5532E9693188J859192K078830K853121L247813L501807M246317M360562M720010
5524H6560840M687568M683640M141361L370065J872216L48327j229525k313966
5516A02120526l678922m561159n163857n040852m790347m202211l656783l147102
$$ plain form
5576 13361082 13830962 14240200 14750904 15699064 16653996 17257701 18039073 18874276 19649611
5567 19649611 20380719 21358700 22350314 23350386 24791831 26024367 27334765 28880427 30910667
5558 30910667 33286289 35668629 38670626 41472325 44533845 47719095 50777897 53545254
5550 53545254 56143451 58846600 61066245 62647569 63476479 63608900 63217146 62245458 61191862
5541 61191862 60312297 59018014 57840784 57224408 57006747 57193096 57546588 58283207 59693188
5532 59693188 61552380 63631210 66484331 69732144 73233951 77480268 81840830 86560840
5524 86560840 91248408 95932048 100073409 103443474 105315690 105664017 104434492 102120526
5516 102120526 98441604 93880445 88716588 83675736 78885389 74683178 71026395 67879293
5508F7879293k855381k336259j664009j076446l87926l62320q8328M31389O78538
5499F0218551J111364J337206J307094J544607J460932M97482r3446m46185j458433
5490F5479172k099527k722056l189628l330508l700780l392217l215538k681898
5482D1147020k649613k800345k268349j840160j431915j563922j669971j549086
5474B5373659r04924j089600r73590j019170r84536o59473o68451r81475o99974
5465A7392466q60014p01453n08604j01199n06145p23889n46070j41900m58519
5456A2844673n43021l91334l00696l58639n34310l19286k37297l6001r0018n69354
5446I464717l8306k3653j95387l40522l79091j86673P8498p0563l20094j33318
$$ plain form
5508 67879293 65023912 62687653 61023644 59947198 59559272 59196952 59108624 59540013 60218551
5499 60218551 61329915 62667121 63974215 65518822 66979754 67477236 67383790 66937605 65479172
5490 65479172 63379645 60657589 57467961 54137453 50436673 47044456 43828918 41147020
5482 41147020 38497407 35697062 33428713 31588553 30156638 28592716 26922745 25373659
5474 25373659 24468735 23379135 22405545 21386375 20401839 19742366 19073915 18092440 17392466
5465 17392466 16532452 15830999 15322395 15221196 14715051 13991162 13445092 13303192 12844673
5456 12844673 12301652 11910318 11609622 11250983 10716673 10397387 10160090 10124089 10034071 9464717
5446 9464717 9426411 9402758 9207371 8866849 8487758 8301085 8379583 8309020 7988926 7855608
5436G855608q0197k19400l17848L3172o4025j72816l02337r9788k02843q0348
5426F349178j07388k10349K6429J14075r6667k09056P6109M3968M5998j66171
5416E866126J29792k03975k51065k92460L7547K01393N9048Q0458j99780J30594
5406E557678k11795l5809j19066j84049k5931K69965J04495k6372j09431R2990
5396E312675Q8560J38721J73964k7799L36393L58481K66966M20965K14518J20252
5386G403696L73342K29080O3333k71799m93254o58196m04508k64688j10781j21238
5376E744987K6067j92084o5859K86221L64380R7236j15518L12113J44305J87715
5366F789563R2796K04670L64072P54408N31553P56123R46548P80949M04775J63846
$$ plain form
5436 7855608 7775411 7556011 7238163 7271335 7207310 7034494 6732157 6632369 6429526 6349178
5426 6349178 6241790 6031441 6057870 6171945 6075278 5866222 5942331 5986299 6032297 5866126
5416 5866126 5995918 5791943 5540878 5248418 5285965 5487358 5546406 5626864 5427084 5557678
5406 5557678 5345883 5310074 5191008 5006959 4981028 5250993 5355488 5329116 5219685 5312675
5396 5312675 5401235 5539956 5713920 5686121 6022514 6380995 6647961 7068926 7283444 7403696
5386 7403696 7777038 8006118 8069451 7797652 7304398 6646202 6241694 5977006 5866225 5744987
5376 5744987 5771054 5578970 5513111 5799332 6163712 6260948 6145430 6457543 6601848 6789563
5366 6789563 6882359 7087029 7451101 8205509 8737062 9493185 10439733 11220682 11625457 11789303
5356A1789303m37712m49945n89531j50897m28857n84359m44818l78958o01073
5347G723153k62553r6987J3674k1816J36965M5306J58844M6853m2972K20241L67642
5336H288350M72003N67229P09572L99371N86173L34117r412j81746j26633L16290
5326A1355314J86555p0329k74351m56366q49678j132026m78300n77737m29096
5317G273986l17739L0613K7225j40122j38392N331l4847k815P7903L1263N13889
5306G326295P83210N98719J43485m91239l5167p4674n9651j82981j08358k26414
5296G673225m1070m99963o29201n33628m02509l17471j01215p273k67740k11203
5286D661952O4135j06359j0720K8443j10160K12956M9652K26943K09538o4450
$$ plain form
5356 11789303 11351591 10901646 10312115 10161218 9732361 9148002 8703184 8324226 7723153
5347 7723153 7460600 7363613 7377287 7355471 7492436 7537742 7696586 7743439 7700467 7920708 8288350
5336 8288350 8760353 9327582 10037154 10436525 11022698 11356815 11347403 11165657 11039024 11355314
5326 11355314 11541869 11471540 11197189 10740823 9891145 8759119 8280819 7703082 7273986
5317 7273986 6956247 6986860 7014085 6873963 6735571 6740902 6706055 6703240 6781143 6812406 7326295
5306 7326295 8109505 8708224 8851709 8360470 8325303 8250629 8190978 8007997 7899639 7673225
5296 7673225 7632155 7132192 6502991 5969363 5566854 5249383 5148168 5140895 4873155 4661952
5286 4661952 4726087 4619728 4609008 4637451 4527291 4740247 4789899 5016842 5226380 5161930
5276E161930J91888p8719P5939j16712j34828l84884k43223l15184k69826j59231
5266C727150k16692r4740o3732q8140p3299K40247l30495n3674J18690P5716p3637
5255C167394j03737L8478K19952L2630k75418n1928K5468J55799j55263k8081
5245C025294p9930m2349J94236N0500p0879l26303k9800J5409L8231M5185K312
5234B821906j98400j41603Q7081K88140Q9642O690k64207o1581o8862O9200K26007
5223B854013J17601K65979N9406L00047L56569R8492L10932M32329M05927O4629
5213E265924K80646j95890k08160j44140m40440m22106k95197k83651l87890l06320
5203B862776K4274m28558l21275N8925l965m9595j45528k46297J83139P721M3321
$$ plain form
5276 5161930 5353818 5275099 5351038 5234326 5099498 4714614 4471391 4156207 3886381 3727150
5266 3727150 3510458 3415718 3351986 3263846 3190547 3430794 3100299 3046625 3165315 3241031 3167394
5255 3167394 3063657 3102135 3322087 3354717 3079299 3027371 3052839 3208638 3053375 3025294
5245 3025294 2945364 2903015 3097251 3147751 3076872 2750569 2720769 2736178 2774409 2819594 2821906
5234 2821906 2623506 2481903 2568984 2857124 2946766 2953456 2689249 2627668 2558806 2628006 2854013
5223 2854013 2971614 3237593 3296999 3597046 3953615 4052107 4363039 4795368 5201295 5265924
5213 5265924 5546570 5350680 5142520 4998380 4557940 4135834 3840637 3556986 3169096 2862776
5203 2862776 2887050 2458492 2137217 2196142 2192177 2142582 1997054 1750757 1933896 1941617 1984938
5192A984938K53086k68039L0734l54274j33738R2708k77646P1016r4260m5710
5182A258815j28025K39562O4508k95810p4878M8571J78115N0635m5074j50223
5172A146196k00556J11664O2017J12261O8749k16763n6666j25814J75153l20670
5162G55571q146J22090K78866k36713J38585k83523L3771K56206j66195J10561
5152A001073J20220K9308l02552n5500j33068j04658J8847k79117J17340L94175
5142H06068J5490n9704n0158k4223o9044r2296J69105k1045k2240J8538j896j92994
5130D75601N4526K06714j75841M5848o9185J77172p4656j95707J34059r9077l3595
5119D45859j2822l26647K07782J91561N7924J45262o8376j34990J95976n8229
$$ plain form
5192 1984938 2238024 1969985 2000719 1646445 1512707 1605415 1327769 1398785 1304525 1258815
5182 1258815 1130790 1370352 1434860 1139050 1064172 1112743 1290858 1341493 1296419 1146196
5172 1146196 945640 1057304 1119321 1231582 1300331 1083568 1026902 901088 1076241 755571
5162 755571 747425 869515 1148381 911668 1050253 766730 800501 1056707 890512 1001073
5152 1001073 1121293 1150601 848049 792549 659481 554823 573670 294553 411893 806068
5142 806068 821558 761854 711696 687473 618429 526133 695238 674193 651953 670491 668595 475601
5130 475601 530127 736841 561000 606848 537663 714835 640179 444472 578531 479454 445859
5119 445859 433037 106390 314172 505733 563657 708919 640543 505553 701529 643300
5109F43300M1962j06542m911l58750J0247O0868K80949J14326k14775j74937Q6990
5098C78727J30244N827J4134p8q8418k21302K65325k4162l06579Q9235K05251
5087D48204k54941Q9846J62037m9652J90187j62609q7826J39830J10960j60348
5077D25688M4659K78233l75374L5809j01984l8711j18563L5344P7112M7736p6238
5066B33711N3865J254l7411O9929k01494J15287J38481j91806M8928l02827J38032
5055F5949J54203K74459j45319k74926q1418K05001J34460K17r1511n8452l7036
5044A45627j18669K05741j2710k37463J25121J00332j25262J33339k73148J69535
5034A12443j50508K0950j2326J73531M2055J41634K2306j68279j00668l48352
$$ plain form
5109 643300 685262 578720 573809 215059 225306 286174 567123 681449 466674 291737 378727
5098 378727 508971 514798 528932 528854 440436 219134 484459 460297 153718 242953 448204
5087 448204 193263 283109 445146 395494 585681 423072 335246 475076 586036 425688
5077 425688 470347 748580 373206 409015 307031 268320 149757 185101 262213 309949 233711
5066 233711 287576 288830 251419 321348 119854 235141 373622 181816 230744 -72083 65949
5055 65949 220152 494611 349292 74366 -7052 197949 332409 332626 241115 182663 145627
5044 145627 26958 232699 219989 -17474 107647 207979 82717 216056 -57092 112443
5034 112443 -38065 -17115 -29441 144090 186145 327779 350085 181806 81138 -267214
5024b67214K69086K99703m8161J87394k6146j43153J51919q8429q258r6180j0031
5013B20530J94928l4836n0364n0420p8044L7242j26327J6335l4768J77196N4746
5002C26218p9394J2122p8832J03621m8876k22067k3405j72903L4165K85812J32526
4991B68987n6298p8080N0647R1178k09378J92422J10980J3518j08517l11104R9438
4980F3793K19222l0957L01870j6067o6976J44400j69507m4006m34039o9063K59090
4969A57760O7117r9385J12242j54029J34031L0525j05897J1354m9111k99894K44174
4958D8887J41050K51513j56637j27448J9276J19744k60770l2722J22721q1172
4948D4442K8806j84073Q0291R2683J98493j71902K0682M5219J7103J07069k14939
$$ plain form
5024 -267214 1872 301575 253414 440808 414662 271509 423428 334999 326741 230561 220530
5013 220530 415458 380622 330258 279838 201794 239036 112709 129044 94276 271472 326218
5002 326218 246824 258946 180114 283735 234859 12792 -10613 -183516 -149351 136461 268987
4991 268987 212689 134609 185256 276434 67056 259478 370458 383976 275459 -35645 63793
4980 63793 283015 252058 553928 537861 470885 615285 445778 401772 -32267 -101330 157760
4969 157760 224877 125492 237734 83705 217736 248261 142364 153718 104607 -195287 48887
4958 48887 189937 441450 284813 157365 176641 296385 35615 2893 125614 44442
4948 44442 73248 -110825 -30534 62149 260642 88740 109422 154641 171744 278813 63874
4937F3874N6145k7856J1407K30301k3799j02660p9688j09205J19844M2657N8682
4926B39702j32493q1134Q2836q0216q552k6130M0691J97542J35158k52772k5588
4915H9044L2666j19209J12464q300J4360J17742M8857M05l7506j93020J19394
4904A76897J22949j0707r7925j17309K37760p676J24743j21497j511j66764k14528
4893g5568p1254J85911J6897J65842j16363J96835J3060P8433n5307j26416r0765
4882A21305n5059J17818L616p8634j1426Q3248m988J75262n5070j24615K1380
4871A92837N4871j51521j36389j63709M16090J08873J50377q8275k38697O5043
4861B09500P8482q7083q0901J07312J33675J8349k23029M0176l6785n4303J63181
$$ plain form
4937 63874 120019 92163 103570 333871 310072 207412 127724 18519 138363 181020 239702
4926 239702 107209 26075 108911 28695 20143 -5987 34704 232246 367404 114632 89044
4915 89044 121710 2501 114965 106665 121025 238767 287624 288029 250523 57503 176897
4904 176897 299846 289139 191214 73905 311665 303989 428732 307235 305724 138960 -75568
4893 -75568 -146822 39089 55986 221828 105465 302300 315360 393793 338486 212070 121305
4882 121305 66246 184064 187680 109046 97620 180868 175880 351142 296072 171457 192837
4871 192837 247708 96187 -40202 -203911 212179 321052 471429 383154 144457 209500
4861 209500 287982 200899 119998 227310 360985 379334 156305 196481 159696 105393 268574
4850B68574K33813k281o7125k44891K2267J23981N1143k8498m2570j8042L234
4839B99605l6428m3669J71868L46988k24657n646J49347q9144J13516k8615k58813
4828C94352R1301N8092N9365J16421K7721p9370J16663J60288k65120J68758n5297
4817G93174J7992j13129J43104J98726q2392N9567P1257L8925M4881J72485q6103
4806A258487j46696K74047K92741M8354J19519p8505r0459R43K4077K67913K40447
4795B210868M9907p304J32449K82723K99331q8601j61444L57310K95258L68952
4785C739449N61670N31015P19132Q02875J114326J219191J452238J910635K463540
4776A4514071K249782R78770o06596j721236k506240k449273k211148j424946
$$ plain form
4850 268574 502387 500106 432981 188090 210357 334338 385481 356983 314413 296371 299605
4839 299605 263177 219508 391376 738364 513707 508061 657408 568264 681780 653165 394352
4828 394352 485653 543745 603110 719531 747252 667882 784545 944833 679713 848471 793174
4817 793174 811166 698037 841141 1039867 957475 1017042 1088299 1127224 1172105 1344590 1258487
4806 1258487 1111791 1385838 1678579 1726933 1846452 1767947 1677488 1678431 1702508 1970421 2210868
4795 2210868 2260775 2253471 2385920 2668643 2967974 2879373 2717929 3075239 3370497 3739449
4785 3739449 4301119 4832134 5551266 6354141 7468467 8687658 10139896 12050531 14514071
4776 14514071 16763853 17742623 17136027 15414791 12908551 10459278 8248130 6823184
4768F823184j147434o58136l61545n77498k62569n31299k91521m83033J05560
4759B615709O0534l31787k75242j39191K31805K0995n0902j70389k15855q6524
4749A659153J91800J37534k2548l05289k29739p1884J63262L5921Q0140J82520
4739A820870k3499j60091J79353j17474j15407R9034L4100L92461J16285l6386
4729B189246j57828K84241K90487j13767j53903K04934L63343j2000o3690K80911
4719C111974K53855M46159L95335M62710P64225N57461R94399J210772J385430
4710I582320J673093K165923K131213J092236l65250q43161j686735k532357k330230
4701H887052j509260j282602p93281o90682o51825l98246m48211l03455j67930
$$ plain form
4768 6823184 5675750 5017614 4656069 4078571 3816002 3284703 2993182 2510149 2615709
4759 2615709 2676243 2344456 2069214 1930023 2161828 2182823 2131921 1961532 1745677 1659153
4749 1659153 1850953 1988487 1965939 1660650 1430911 1359027 1522289 1558210 1638350 1820870
4739 1820870 1797371 1637280 1816633 1699159 1583752 1682786 1716886 2109347 2225632 2189246
4729 2189246 2031418 2315659 2606146 2492379 2338476 2543410 2906753 2894753 2831063 3111974
4719 3111974 3365829 3811988 4207323 4670033 5434258 5991719 6986118 8196890 9582320
4710 9582320 11255413 13421336 15552549 16644785 16279535 15436374 13749639 11217282 8887052
4701 8887052 7377792 6095190 5301909 4611227 3959402 3561156 3112945 2809490 2641560
4692B641560k08751q7063l67451K01259O4495m06061n2838k28187R5449q7432
4682A564980l23511K47560j21486k3721M2804k13052p3589k20290J9575Q8716
4672I87986j95387P2079Q9099m1958l1481r2546J97608l20927m1486n5085K38984
4661H06886R844j13645j00966K59228j29425j92906N0786J17070l14253n7000
4651C35619J73197o4094o3833P96L35935O9819p6708J20458p3870m9139m0530
4640F67650Q4948j5449J6066r9522j13627q3478L9464q1137j85932L6563J56631
4629D22177m0654j78824P0451R418J45792J2918j04459J53381q3779J30840k28670
4618C08591n5327j47221J64104O5205P5888M3042o0493j41589N7257p6327j26244
$$ plain form
4692 2641560 2432809 2345746 1978295 2179554 2244049 1837988 1785150 1556963 1652412 1564980
4682 1564980 1241469 1489029 1367543 1343822 1386626 1173574 1099985 879695 899270 987986
4672 987986 792599 864678 953777 911819 880338 787792 985400 664473 622987 567902 806886
4661 806886 816730 703085 602119 861347 731922 539016 589802 706872 392619 335619
4651 335619 508816 444722 380889 381685 717620 787439 710731 831189 757319 708180 667650
4640 667650 752598 737149 753215 653693 540066 456588 496052 414915 228983 265546 422177
4629 422177 381523 202699 273150 282568 428360 441278 336819 490200 406421 537261 308591
4618 308591 253264 106043 270147 335352 411240 454282 393789 252200 309457 233130 106886
4607A06886J16212J8714K96635j01524k85136o8554K15697l5415r1018J9099J89877
4596C81473R780p894J85012O701J3570J5352k37882j16052o7527J65616r2662
4585B55487K26171N9432J01k84502N5532q7627J38217p93P6374j88449p1947k45613
4573f7617k7900j13642K44498J92257J99485K6184p3104l1828k41179R6971n7014
4562A47111O2808k02526J16459j8501Q7134R2169L1606j68364K9441K90056L4207
4551E01600K12616j51024l51973O9108J86318J82953k09492M7151k46171R1749
4541C32835J78258k74653K22312o06M8291L9420k55319j26419K2969k25674J08973
4530G0387L59580K70425j92705P3192n8249n7736P0909j26285J21999k4994N8237
$$ plain form
4607 106886 223098 241812 538447 436923 151787 83233 298930 263515 172497 191596 381473
4596 381473 391253 383359 568371 575072 588642 603994 366112 250060 182533 348149 255487
4585 255487 481658 541090 541191 256689 312221 224594 362811 362018 438392 249943 177996 -67617
4573 -67617 -95517 -209159 35339 227596 427081 453265 380161 348333 107154 204125 147111
4562 147111 209919 7393 123852 105351 192485 284654 316260 147896 177337 467393 501600
4551 501600 714216 563192 211219 280327 466645 649598 440106 487257 241086 332835
4541 332835 511093 236440 458752 458146 506437 545857 290538 164119 187088 -38586 70387
4530 70387 429967 700392 507687 580879 522630 464894 535803 409518 531517 506523 564760
4519E64760J5866L4389k0776k09779K56168Q0689j96304J35317l4620l1763r2466
4508E01481n9032P5535P3290L6224j00225j36154L48690J87034l24666j48939
4498D53238Q4150J81536k6955q2076L1767j24705r1951L9785M8442J50230K8303
4487F91764q4209J43715j34714k31949m81K29533J76100R3193j40283r4142O263
4476F54790J26050r7618O1477J31823K9669j82338K43276L2641k22260N4681J07559
4465I39750k0800J9941n088R611J93175p2197N2973m8079j20444j44816n5292
4454G48734J76462L625K5741Q9958J98061J70036m3004J53251m7024k19825M0120
4443A296135K49547m2166L20147j0251K94842J65364K97599M74347K89157L86444
$$ plain form
4519 564760 580626 615015 594239 384460 640628 721317 525013 660330 625710 593947 501481
4508 501481 442449 517984 591274 627498 527273 391119 739809 926843 602177 453238
4498 453238 537388 718924 691969 609893 641660 516955 425004 464789 513231 663461 691764
4487 691764 607555 751270 616556 384607 384126 613659 789759 882952 742669 648527 654790
4476 654790 780840 683222 744699 876522 906191 723853 967129 999770 777510 832191 939750
4465 939750 918950 938891 933803 943414 1136589 1064392 1117365 1069286 948842 804026 748734
4454 748734 925196 928821 954562 1044520 1242581 1412617 1369613 1522864 1475840 1256015 1296135
4443 1296135 1545682 1503516 1823663 1813412 2108254 2273618 2571217 3045564 3334721 3721165
4433C721165k45360j76660l16823l52090k07302j89537j82352p6171k25936K8981
4423A777915k5408j93175r1625K33023Q5431l1720k72130o5472Q6422l7310K30479
4412A696430O6815Q8728j06267j46594M8111m2404K5443Q6647K83071k9394p7218
4401A893368Q308K15844P8525j64561o895J77096J12582l6614K81751K56742L726
4390B819872L12686n0934K07335p1208O3444J11506Q3219l558m08865j04628J79918
4379C138787R4158J22134r1851J65610j11565k74700K25806k44973K5792k56961
4369B792237K959J55811N0327j76533j39816j54494N7795J18379R9282K65752
4359C071699p3463j10139L0065J5360K98269j49817K06911P5426J05292K49375
$$ plain form
4433 3721165 3475805 3299145 2982322 2630232 2422930 2233393 2051041 1974870 1748934 1777915
4423 1777915 1752507 1559332 1467707 1700730 1786161 1754441 1482311 1416839 1503261 1465951 1696430
4412 1696430 1763245 1851973 1745706 1599112 1647223 1604819 1630262 1716909 1999980 1970586 1893368
4401 1893368 1901676 2117520 2196045 2031484 2024589 2201685 2314267 2277653 2559404 2816146 2819872
4390 2819872 3132558 3081624 3288959 3217751 3281195 3392701 3475920 3472362 3063497 2958869 3138787
4379 3138787 3232945 3355079 3263228 3428838 3317273 3042573 3268379 3023406 3049198 2792237
4369 2792237 2795196 2951007 3001334 2824801 2684985 2530491 2588286 2706665 2805947 3071699
4359 3071699 2998236 2888097 2918162 2933522 3231791 3081974 3288885 3364311 3469603 3718978
4349C718978R4088N7747J03233l0510J15355p2479m1250J98450J35890k06376
4339D073126L6262J23611o8189J254J14308j89387l67003l8163K8286l1974q0620
4328C601511J51575O4505l8147p8946M9364K41348J95410Q814K13609J6978Q4277
4317D510298M93860K60020j66160J35593k06986j46639j41582j82201K91210J73715
4307E021128m52543k06174M6755j23850M2297K01992M2072l56034K236n0973p722
4296D159184R313J42561j18581J52327M37201k50917j18982M82863K89534J79908
4286E364411j99907L6799j57427k83615o2655m0534j43854P0064r435J67574j97001
4275D544420k25500M15904J0774J29516J04084N0081J78166J04459J91579l0476
$$ plain form
4349 3718978 3813066 3870813 3974046 3943536 4058891 3986412 3945162 4143612 4279502 4073126
4339 4073126 4109388 4232999 4164810 4166064 4280372 4090985 3723982 3685819 3714105 3682131 3601511
4328 3601511 3753086 3817591 3779444 3700498 3749862 3991210 4186620 4195434 4409043 4426021 4510298
4317 4510298 5004158 5264178 5098018 5233611 5026625 4879986 4738404 4556203 4847413 5021128
4307 5021128 4568585 4362411 4409166 4285316 4327613 4529605 4571677 4215643 4217879 4166906 4159184
4296 4159184 4168497 4311058 4192477 4344804 4782005 4531088 4412106 4894969 5184503 5364411
4286 5364411 5164504 5201303 5043876 4760261 4697606 4657072 4513218 4583282 4573847 4741421 4544420
4275 4544420 4318920 4734824 4745598 4875114 4979198 5029279 5207445 5311904 5503483 5473007
4265E473007r6358o563K04359J88720Q1478L20479R5051M11003M74815K85555
4255G431546J0854Q2515j11437J27794k2512k13833l9424R6670p4717J07463K78222
4244G673141J1678K02414K75094P333N8689M8584M0103J38052R0860n3948L20654
4233H812654K05949L21558K61683L68804J81381M30835L15346R9454K59697L97662
4223A1655023M06952L49792K02670L23514K06861K46976M54518K53124Q9447M2038
4213A4230915K97581M8270r4377O5629L12150N17157J50900J62050K39264K83371
4203A6212910N78584K89166M48241O27065K94307O80111M75615M04150Q45181
4194B0855330N25367K95075P20072Q03091P02657N37399N35685Q86869J215886
$$ plain form
4265 5473007 5376649 5370086 5574445 5763165 5844643 6165122 6260173 6671176 7145991 7431546
4255 7431546 7442400 7524915 7413478 7541272 7518760 7304927 7265503 7362173 7287456 7394919 7673141
4244 7673141 7684819 7887233 8162327 8169660 8228349 8276933 8317036 8455088 8545948 8492000 8812654
4233 8812654 9018603 9340161 9601844 9970648 10152029 10582864 10898210 10997664 11257361 11655023
4223 11655023 12061975 12411767 12614437 12937951 13144812 13391788 13846306 14099430 14188877 14230915
4213 14230915 14528496 14576766 14482389 14548018 14860168 15377325 15528225 15690275 15929539 16212910
4203 16212910 16791494 17080660 17528901 18155966 18450273 19130384 19605999 20010149 20855330
4194 20855330 21380697 21675772 22395844 23198935 23901592 24438991 24974676 25861545 27077431
4185B7077431R48232J070336J349398J260797J533382J503511J224153J731979
4177C7699219J758137J437021J843076J940446J833296K054005K138098K133540
4169E2836838K372079K375089K972915L101427L716750M480643M823489N375710
4161H2054940O236305O719981Q076363R475113J1301762J3266156J5887427J8881378
4153A71899425K3737317L0560585L9819832N0348613O0227172O4158506N5112402
4146D95863852J9290303k8971662o7362265p8858489o4506183m7668998l5147563
4139A92638995k7092883k0963223j6927145j3380776j1086238r205261p626959
4132H6356510o228620n027156m795285m273705l500317l507401k661483k744201
$$ plain form
4185 27077431 28025663 29095999 30445397 31706194 33239576 34743087 35967240 37699219
4177 37699219 39457356 40894377 42737453 44677899 46511195 48565200 50703298 52836838
4169 52836838 55208917 57584006 60556921 63658348 67375098 71855741 76679230 82054940
4161 82054940 88291245 95011226 103087589 112562702 123864464 137130620 153018047 171899425
4153 171899425 195636742 226197327 266017159 316365772 376592944 440751450 495863852
4146 495863852 515154155 486182493 418820228 339961739 275455556 227786558 192638995
4139 192638995 165546112 144582889 127655744 114274968 103188730 93983469 86356510
4132 86356510 80127890 75100734 70305449 66031744 62531427 59024026 56362543 53618342
4124E3618342k394363k099959j716025j720784j381278j047897j113874l89742
4116D1754420j51253J1547k5390j22175n32016j087974j760340k127692k009896
4107C3949231j466250j161761r74415o34613n13976n77948m97373m02450j99648
4098B7520797J28732L12862M26959O12279N53818K40152J42452m76930p81457
4089B8679664q36758p04129r14984q31043n98593l77293l54708j34734m44644
4080B3482778q03709o36843o14625l78730m48013l88810m03906n91156j51239
4071A9065747l1661l07084P8680K3696N5044J55188O1901L9298K93487J68491
4061A9602787N26862L32327N43070J87249k22448p6059o5584j05116J3832p5609
$$ plain form
4124 53618342 51223979 49124020 47407995 45687211 44305933 43258036 42144162 41754420
4116 41754420 41603167 41614714 41589324 41467149 40935133 39847159 38086819 35959127 33949231
4107 33949231 32482981 31321220 30346805 29712192 29198216 28620268 28122895 27720445 27520797
4098 27520797 27649529 27962391 28389350 29001629 29555447 29795599 29938051 29461121 28679664
4089 28679664 27842906 27138777 26223793 25392750 24794157 24416864 24062156 23927422 23482778
4080 23482778 22679069 22042226 21427601 21048871 20600858 20212048 19808142 19216986 19065747
4071 19065747 19034086 18727002 18805682 18829378 18884422 19039610 19101511 19140809 19434296 19602787
4061 19602787 20129649 20461976 21005046 21192295 20969847 20893788 20828204 20723088 20736920 20661311
4051B0661311K13235J56304J75166L60049J11601M51570J58695L97377N34418
4042B3219726N38080P39676Q13225P29834J032410J026436M84463N63881P33329
4033B9881060O06261P26340N82342L89401J62651J26652O1209L23014L82336J09981
4023C3351247M28313M91593N65941N44688M72145P23897P95138N96951Q03438
4014C8773351Q80518P97250P95958R77612R59225P02196N46051M81868P32544
4005D5646573J009151N19163M23999Q97282L50830J84841M57714N67980N23430
3996E0580963P88006J350697J119293J041589J087118J354965J511684J714632
3988F0548947K325517K624748K907161K737219J620651O8364j905282l454235
$$ plain form
4051 20661311 20874546 21030850 21206016 21566065 21677666 22129236 22287931 22685308 23219726
4042 23219726 23757806 24497482 25310707 26040541 27072951 28099387 28583850 29147731 29881060
4033 29881060 30487321 31213661 31796003 32185404 32348055 32474707 32535916 32858930 33241266 33351247
4023 33351247 33779560 34271153 34837094 35381782 35853927 36577824 37372962 37969913 38773351
4014 38773351 39653869 40451119 41247077 42224689 43183914 43886110 44432161 44914029 45646573
4005 45646573 46655724 47174887 47598886 48496168 48846998 49031839 49489553 50057533 50580963
3996 50580963 51368969 52719666 53838959 54880548 55967666 57322631 58834315 60548947
3988 60548947 62874464 65499212 68406373 71143592 72764243 72832607 70927325 67473090
3980F7473090l000724k452507j736863j451337r08851p59020q51547l83374o5973
3971E5862894M66705O05777P26548R77456J674090K241877K784299L230942L862248
3962G2432836N160141O529888P886323Q970672R085708P084956K710695l051102
3954A16810117o603627o869533n402100m591161n399406o261915n642106m170101
3946G1870168k533490k137144j561554n44649k42902m8213Q49982J696381K296060
3937F9644639L323358M121036N147069O901804Q855921J0467934J0985666R534793
3929A28982220M286207k667454r788914j3572864j2638029j0328262q071602o259921
3921F9941381m364752l597133k972120k576154k173401j637753j090553n82102
$$ plain form
3980 67473090 64472366 62019859 60282996 58831659 57922808 57163788 56312241 55928867 55862894
3971 55862894 56329599 56935376 57661924 58639380 60313470 62555347 65339646 68570588 72432836
3962 72432836 77592977 84122865 92009188 100979860 110065568 117150524 119861219 116810117
3954 116810117 110206490 103336957 97934857 93343696 87944290 81682375 76040269 71870168
3946 71870168 69336678 67199534 65637980 65093331 64850429 64802216 65652198 67348579 69644639
3937 69644639 72967997 77089033 82236102 89137906 97993827 108461761 119447427 128982220
3929 128982220 133268427 130600973 120812059 107239195 94601166 84272904 76201302 69941381
3921 69941381 65576629 61979496 59007376 56431222 54257821 52620068 51529515 50947413
3913E0947413j93626N36198J049425J455837J629992K614594L690612M663555
3905F6394000O059958O633696O340460M477196n7458m928916q480760r418852
3897F7019324p935424o372157m850656l947231k985687k471671j987327j795504
3889C4673667j400402j286393j014587q74014m80808k89807l7281k55180J3992
3880B9049187M81669Q17491R58065J247962J425179J223533J59852r40314j837301
3871C2585323k615528k296458k013603j745457j194791p85082q39563p95997n95500
3862A9703344l34283l29167k21827k18396j10815M7556J229l87432o72638m71174
3852A7006397k75198n47962m44185l3113l13562k37722O564p9042l24582p5652
$$ plain form
3913 50947413 50753787 51289985 52339410 53795247 55425239 58039833 61730445 66394000
3905 66394000 72453958 79087654 85428114 89905310 89847852 84918936 76438176 67019324
3897 67019324 59083900 52711743 47861087 43913856 40928169 38456498 36469171 34673667
3889 34673667 33273265 31986872 30972285 30098271 29617463 29327656 29290375 29035195 29049187
3880 29049187 29530856 30348347 31306412 32554374 33979553 35203086 35362938 34422624 32585323
3871 32585323 29969795 27673337 25659734 23914277 22719486 21934404 21094841 20298844 19703344
3862 19703344 19369061 19039894 18818067 18599671 18488856 18536412 18537641 18150209 17477571 17006397
3852 17006397 16731199 16183237 15739052 15705939 15392377 15154655 15161219 15082177 14757595 14681943
3842A4681943N2253j1750j42753j57903j92538k23999K6459k0410l53131k30271
3832A3427900k85829K0920J28987L1319j40065k35510q5047Q3864p627j72416
3822A2766496j42249J22505L82908K62453K68504R6587q8674r1982r5881O8457
3812A3549124J9611J66829N441j6144J1070l4374Q7172L1811L65712J61123R4420
3801A4441795k02876o6682J83776Q9833k06751l1207Q4961K69925R160M33989
3791A5005923L64545M24078K31664K44168J45130l15810o89112m86840n77947
3782A4345799R7842l27380l82530j0748J03512K51466O700K86054L78581J55374
3772A4904670o746k39396p46102l68734m02787m58311j05681j91097l08093p4257
$$ plain form
3842 14681943 14734196 14722446 14579693 14421790 14229252 14005253 14031712 14011302 13658171 13427900
3832 13427900 13142071 13162991 13291978 13323297 13183232 12947722 12862675 12946539 12938912 12766496
3822 12766496 12624247 12746752 13129660 13392113 13660617 13757204 13668530 13576548 13480667 13549124
3812 13549124 13568735 13735564 13741005 13724861 13735931 13701557 13788729 13820540 14186252 14347375 14441795
3801 14441795 14238919 14172237 14356013 14445846 14239095 14207888 14292849 14562774 14571934 15005923
3791 15005923 15370468 15794546 16026210 16270378 16415508 16099698 15410586 14923746 14345799
3782 14345799 14443641 14116261 13733731 13722983 13826495 14077961 14084661 14370715 14749296 14904670
3772 14904670 14897924 14658528 13912426 13543692 13140905 12682594 12576913 12385816 12077723 12003466
3762A2003466n6317j27023l64253j87079k29136J69306k09484j09319J34420J08998
3752A1133579J63599R99L05383K54018K24707M50366J76426j45465l57597p08326
3742A1497689m37698n98837l49125o25662l10679N5986n8176l61373n01607k0216
3732H290302j20638j32924k94006K86460R8790L557p9051J68385J7286O8501K77120
3721H583782J15902P1591R5870k27342n78837m09747o49981k19447k85892J6137
3711F512036l04977k62241O1032k10553k49678j20352j11999r7110j6284j06042
3701E093832J48629J18530N8255R8590m1455k51926Q5005J96994j39264j19816
3691E247374m8848l69508j17976j53729j91666j26619o4885K36270L6018j36630
$$ plain form
3762 12003466 11947149 11820126 11455873 11268794 11039658 11208964 10999480 10890161 11024581 11133579
3752 11133579 11297178 11298177 11603560 11857578 12082285 12532651 12709077 12563612 12206015 11497689
3742 11497689 11059991 10461154 10112029 9486367 9175688 9231674 9173498 8812125 8310518 8290302
3732 8290302 8169664 8036740 7742734 8029194 8127984 8131541 8052490 8220875 8238161 8306662 8583782
3721 8583782 8699684 8771275 8867145 8639803 8060966 7651219 7001238 6781791 6495899 6512036
3711 6512036 6207059 5944818 6005850 5795297 5545619 5425267 5313268 5216158 5199874 5093832
3701 5093832 5242461 5360991 5419246 5517836 5476381 5224455 5309460 5506454 5367190 5247374
3691 5247374 5198526 4829018 4711042 4557313 4365647 4239028 4174143 4410413 4446431 4309801
3681D309801q0690j42258m1943r8160Q7599l25392R3695j07004k67289K785p7106
3670C354038P6195k25862J96561o7590J24009R7819j36095j35515K48331r1980
3660C439911m03155Q6126K45135M8622l17976r7487k31240k9547j3097J83671
3650B910963J5850q1575k62833K27858N0896q9057j95449K09317L67381n4174
3640C099177n1561j97590Q1438j43290J31490j21270k19515K9043p5964j37321
3630B394637j87668J13712J25641L6658j94605j22300j78024m2954r4610r7769
3620A752718J3927P3279O2269J98375k3219j52074M8815j67391K6912J94838l4070
3609A994379k44399l7718j42604K3063N6671L4209j85108r1636j52116k4786K48696
$$ plain form
3681 4309801 4229111 4086853 4044910 3946750 4034349 3708957 3802652 3695648 3428359 3431144 3354038
3670 3354038 3430233 3204371 3400932 3333342 3457351 3555170 3419075 3283560 3531891 3439911
3660 3439911 3036756 3122882 3368017 3416639 3098663 3001176 2769936 2740389 2727292 2910963
3650 2910963 2926813 2845238 2582405 2810263 2861159 2772102 2576653 2785970 3153351 3099177
3640 3099177 3047616 2850026 2931464 2788174 2919664 2798394 2578879 2607922 2531958 2394637
3630 2394637 2206969 2320681 2446322 2482980 2288375 2166075 1988051 1945097 1850487 1752718
3620 1752718 1766645 1839924 1902193 2100568 2077349 1925275 1974090 1806699 1833611 2028449 1994379
3609 1994379 1749980 1712262 1569658 1592721 1649392 1683601 1498493 1406857 1254741 1229955 1478651
3598A478651K30640p8267j4286j2569L06560l83978l22640J39394J9455l1864
3588A331096n673k8018L141P5069j11022J69724p9860L3971J21663r5641o3034
3577A351416l3150J42426j04278k17180J56816K9876J86099j12795k6604K03913
3567A576539J94185j84919l1207M3733J06649j10417Q007j24458j34478R5831
3557A439465k3262J82406k30445n0176k17769J77828r4449n5699K53969j4738
3547A367130k69111n7925j75584K0831N1039l969J35460K69073j39006k16030
3537I81908P8281r0341J34538K54111K27862m4222J36291J10437J03999k19094
3527A673770l04321L330K04013k28835Q1903p424j91346m0373Q870K80488j77547
$$ plain form
3598 1478651 1709291 1631024 1616738 1604169 1910729 1526751 1204111 1343505 1362960 1331096
3588 1331096 1325423 1297405 1300546 1375615 1264593 1434317 1354457 1388428 1510091 1414450 1351416
3577 1351416 1318266 1460692 1356414 1139234 1296050 1325926 1512025 1399230 1372626 1576539
3567 1576539 1770724 1585805 1554598 1598331 1704980 1594563 1602570 1478112 1343634 1439465
3557 1439465 1416203 1598609 1368164 1317988 1100219 1278047 1183598 1127899 1381868 1367130
3547 1367130 1098019 1040094 864510 885341 936380 932411 1067871 1336944 1197938 981908
3537 981908 1060189 969848 1104386 1358497 1586359 1542137 1678428 1788865 1892864 1673770
3527 1673770 1369449 1372779 1576792 1347957 1429860 1422436 1231090 1190717 1199587 1480075 1302528
3516A302528j80654j8312j33332J93193J39181m24524J16002j24565J27029o4451
3506I32095J6859O2681l02049j07718K20760n9166J5633J33418o4078M9834l4113
3495H64156Q0608L0375k2974p7519M9553j39105R1921O3484j72146J95628j4284
3484I49697p1760R6023j83864J88179J98014j34882k21395K0082O7649j44768
3474G62975j07658J17804J75174O8271L4134l5799k06965q0230L09408k78062
3464G59052m3493K75609j89980k09507J54355L8214J98548K2964j15538J25697
3454A015921j45047p6103k28581J14313K01081k17478j44633M8453j17583K07121
3444F57464P8384J69774J96635J686k70009l80541J32993L86460R5570r7262j43194
$$ plain form
3516 1302528 1121874 1103562 970230 1163423 1302604 878080 994082 869517 996546 932095
3506 932095 948954 1011635 709586 601868 822628 763462 779095 912513 848435 898269 864156
3495 864156 944764 975139 952165 874646 924199 785094 877015 940499 768353 963981 949697
3484 949697 877937 973960 790096 978275 1176289 1041407 820012 840094 907743 762975
3474 762975 655317 773121 948295 1016566 1050700 1014901 807936 727706 1037114 759052
3464 759052 715559 991168 801188 591681 746036 784250 982798 1005762 890224 1015921
3454 1015921 870874 794771 566190 680503 881584 664106 519473 567926 450343 657464
3444 657464 735848 905622 1102257 1103943 833934 453393 586386 972846 1068416 971154 827960
3433H27960O2287K67384N3527k9313L686l19022J275p1191L5685j11439N7572
3422G78411R7649j29158Q6899j59496j42051K37135J04856j14407l1965J12166
3412H40039M831J03681p9927q9826N3830n9171P2072J5601j7014J87703L4421
3401A066240K87874J71455L4742K1733k33496m9023J45226L7259k19848l56544
3391I05618J04525K01066M0094l52804j29038K03952j08949m1137m9801M1366
3381H14892J790Q1068l1112k57218m83J05141K69591P9766m2446J10064l6148
3370A094905J72461K4421J37885P3228l20886K45420j07195k70635m041l2390
3360A013173K3180k24628J66660J65115R5320k12134j8259m5239J21200J50661
$$ plain form
3433 827960 890247 1157631 1211158 1181845 1185531 866509 867784 796593 832278 720839 778411
3422 778411 876060 746902 833801 674305 532254 769389 874245 759838 727873 840039
3412 840039 844870 948551 868624 778798 832628 773457 845529 861130 844116 1031819 1066240
3401 1066240 1354114 1525569 1560311 1582044 1348548 1299525 1444751 1482010 1262162 905618
3391 905618 1010143 1211209 1251303 898499 769461 973413 864464 823327 773526 814892
3381 814892 816682 897750 866638 609420 608937 714078 983669 1063435 1020989 1131053 1094905
3370 1094905 1267366 1291787 1429672 1502900 1182014 1427434 1320239 1049604 1045563 1013173
3360 1013173 1036353 811725 978385 1143500 1238820 1026686 1008427 963188 1084388 1235049
3350A235049P3102j73185k3477j5028o0572L4286J90421J3291p8922j29608k17911
3339H47446J07125L04256n3712l5358m7499K6757Q5835l4471m8826n5321N4055
3328A150287k2517k30959L53728J35650p7299J09827J36905j38234N3655K1566
3318A492609l1007k15559J26760j39678O8142K06171r1132N5691p339K49415J9586
3307A733659K00976O4087P0905r8817P6275j6874J16790m5416J5944k00523j27313
3296A789693J39632j57718m122k23P5312p7861j26429R8643J83359k1642j32261
3285A766383J08652L13141J85955m47267l3346J43428k00494k2438L34934N0738
3275B199686q3093K5255m7778Q2320K50557J72070K04985l0997j82708k25366
$$ plain form
3350 1235049 1308151 1134966 1111489 1096461 1035889 1070175 1260596 1273887 1194965 1065357 847446
3339 847446 954571 1258827 1205115 1169757 1122258 1149015 1234850 1200379 1151553 1096232 1150287
3328 1150287 1127770 896811 1250539 1386189 1308890 1418717 1555622 1417388 1471043 1492609
3318 1492609 1461602 1246043 1372803 1233125 1301267 1507438 1416306 1471997 1464658 1714073 1733659
3307 1733659 1934635 1998722 2069627 1970810 2047085 2030211 2147001 2101585 2117529 1917006 1789693
3296 1789693 1929325 1771607 1767485 1767262 1842574 1764713 1638284 1736927 1920286 1898644 1766383
3285 1766383 1875035 2188176 2374131 1926864 1893518 2036946 1836452 1814014 2148948 2199686
3275 2199686 2116593 2141848 2094070 2176390 2426947 2599017 2804002 2773005 2590297 2364931
3265B364931j22255K27366N4586M2637k49268j06499k514O073j32237K65751J01884
3254B450455j2815J56525J94585J53638L5398J97408K61778l1552Q5617M22563
3244C913600N8741j82136J5287J45713K7877k57318O0727k8764k67064k1547n72826
3233B892290l07757l72754j09303m054j83764p8676n6685J44727O6028k88749
3223A701303L0327k47619K28708J46415J32596j02632J4361K09958l242L65659
3213B475834K43686k18940m07818l47696l73829J52578N1365m46149k6732J14036
3203A216335j52082J769J38883j03341n4338p1461K8923j36681L457k37226q2071
3192E52167K15638J63856R032j07557r0100m8167K29449K6990J90240J70676J7011
$$ plain form
3265 2364931 2242676 2470042 2524628 2567265 2317997 2211498 2208984 2215057 2082820 2348571 2450455
3254 2450455 2437640 2594165 2788750 2942388 2977786 3175194 3436972 3405420 3491037 3913600
3244 3913600 3972341 3790205 3805492 3951205 3979082 3721764 3782491 3753727 3486663 3465116 2892290
3233 2892290 2584533 2211779 2102476 2098422 1914658 1835982 1779297 1924024 1990052 1701303
3223 1701303 1731630 1484011 1712719 1859134 1991730 1889098 1903459 2113417 2110175 2475834
3213 2475834 2719520 2500580 2092762 1745066 1371237 1523815 1575180 1129031 1102299 1216335
3203 1216335 1064253 1066022 1204905 1101564 1047226 975765 1004688 868007 871464 634238 552167
3192 552167 767805 931661 940693 833136 743036 694869 924318 951308 1141548 1312224 1329235
3181A329235M7636k65004k82009J963p5045j29413J41650l6544k09366m5264J21183
3170E99022J10296j11289P2819j41982k25346R0210j80032K78518L2548p2543
3160D52221j35802j36676J03163J57734M051m24545N5891K67601K26616j67917
3150D02337j15530M186K92211j17053p6490k40605J53522J57842N3021n5537j43254
3139C14650m9073K77864j57837k01669j26013p3214K00611J26000l9976L959N1269
3128C26571L0656O7731n7832m5676O4440o2418j01288j35151K01285L4166r5138
3117B27346r3271j42941j1504J81728K4371Q8540J65928k8916k90354m5632J55874
3106B31169R4696Q0713k3129Q4685k98604j28181j89275K27146J08680J9464j01231
$$ plain form
3181 1329235 1376871 1111867 829858 831821 756776 627363 769013 732469 523103 477839 599022
3170 599022 709318 598029 670848 528866 303520 393730 213698 492216 524764 452221
3160 452221 316419 179743 282906 440640 444691 20146 76037 343638 570254 402337
3150 402337 286807 290993 583204 466151 389661 149056 302578 460420 513441 457904 314650
3139 314650 265577 543441 385604 183935 57922 -15292 185319 311319 271343 275302 326571
3128 326571 357227 424958 367126 321450 385890 323472 222184 87033 288318 322484 227346
3117 227346 134075 -8866 -20370 161358 185729 274269 440197 411281 120927 75295 231169
3106 231169 325865 406578 383449 468134 169530 41349 -147926 79220 187900 207364 106133
3095A06133J748j36879M4881J79339J83382J01000m04050O1799n1364J0775q0875
3084A5889J75884q5251l5329Q487L6378L34949k60911m8063O6204P0520L773j38595
3072A43935j62478p5240J02644r8071R5103K10644m4508j654j25881J2616J33910
3061A91020Q9684j93795N5593j79406J55998K08542j89334L170j32690j4454J39106
3050A33434m0140R1230k8709n5734J03690k699J22341k85173J41899J60684k00249
3039A40574p1795J80360M5293k02950J63230j39172l28894p0150K43988K34615
3029A95099r774N368P0725j32303Q5234m382N487o9543j54241L2729o4169k2516
3017f2286J31077j75778N7010J12501O1521k00318n0773K11528k01945R892k9223
$$ plain form
3095 106133 107881 -28998 15883 195222 378604 479604 75554 137353 85989 96764 15889
3084 15889 191773 106522 71193 79680 116058 451007 190096 142033 208237 278757 282530 143935
3072 143935 -18543 -93783 8861 -89210 5893 216537 172029 170375 44494 57110 191020
3061 191020 280704 86909 142502 -36904 119094 327636 138302 141472 8782 -5672 133434
3050 133434 93294 184524 155815 100081 203771 201072 323413 38240 180139 340823 140574
3039 140574 68779 249139 294432 91482 254712 115540 -213354 -283504 -39516 195099
3029 195099 185325 190693 261418 129115 214349 209967 215454 145911 -8330 24399 -39770 -62286
3017 -62286 68791 -106987 -49977 62524 124045 -76273 -127046 84482 -117463 -107571 -136794
3006a36794J96756j5278P5114M900j28328L1265j30690J41442j12806J952J20031
2995D7564k0838N8329J20776j55620n5945R5132k005j02433K142q66J78715j5920
2983A49031l04245R3778J89283M250j22876M8486J81346N3915j39324j48078J24059
2972A29625k0155N571J29765k23040j81161j95658L80696L79981j20712j7938
2962B66974j91292m388n3837J3831M0426r0097o4827K08280L24371l3619j79545
2951B36277Q7456Q574m9090o7009m192p9390L6915Q6503J09328J6817l02911Q7120
2939A66398J32566L09798k61917j54482N3720n4084l2890Q7047Q5100N6664j94595
2928A93325K47770J34178n0085m6600Q8833p6082k85880N8001J45724j43426k77969
$$ plain form
3006 -136794 59962 44684 119798 124698 -3630 27635 -103055 38387 -74419 -72467 47564
2995 47564 26726 85055 205831 50211 -5734 89398 87393 -15040 -12898 -13764 164951 149031
2983 149031 -155214 -61436 127847 132097 9221 57707 239053 292968 153644 5566 129625
2972 129625 109470 115041 244806 21766 -159395 -355053 25643 405624 284912 266974
2962 266974 75682 71294 17457 31288 71714 -18383 -83210 125070 449441 415822 236277
2951 236277 323733 332307 283217 216208 212016 132626 169541 256044 365372 382189 79278 166398
2939 166398 298964 608762 346845 192363 246083 191999 159109 246156 331256 387920 193325
2928 193325 441095 575273 525188 478588 567421 491339 205459 263460 409184 265758 -12211
2917a2211J40747L2511K31526L07914j73479k2824j54104j8617K06329o0418k63977
2906B13397j05033J18456M9339K42738J02918j71098j11707Q4764k2743j79888
2896B21143M639J732o590L99423k09511q7831O8669J45896k9528l4558j29619
2885C43865k40294J31161N6418O439r1706j20586K43643p9801l7884P6449R2060
2874C79764J725n7485M7168J29163N6278j18720R7402j39573l1293j10210N5193
2863C09412J47905q5870j58501J30823o0157P3640m5651K2469r8330j47948L1796
2852A19588K7868J18302j05553l18506o529K85850Q508k06703K15817K91399L5091
2841D65132k23096N3379O6803k06423r0312K7080k27976J76742K2018k60958J22981
$$ plain form
2917 -12211 128536 161047 392573 700487 527008 504184 350080 331463 537792 477374 213397
2906 213397 108364 226820 276159 518897 621815 450717 339010 423774 401031 221143
2896 221143 225782 227514 220924 620347 410836 323005 391674 537570 508042 473484 343865
2885 343865 103571 234732 291150 297589 205883 85297 328940 249139 211255 287704 379764
2874 379764 381489 324004 371172 500335 556613 437893 535295 395722 364429 254219 309412
2863 309412 457317 371447 212946 343769 283612 357252 311601 334070 235740 87792 119588
2852 119588 147456 265758 160205 -158301 -164830 121020 129528 -77175 138642 430041 465132
2841 465132 242036 295415 362218 155795 65483 92563 -135413 41329 63347 -197611 -74630
2830g4630Q6834m5746J94431k46074n3079J39766r8394j45708K67420J12227l0123
2819A06924j15154P0131r8419r2127L67700q3955o4406p5630O8111j65589k2520
2808a04934m6157K81547J03097k31088j58963J01612j34987J17516R013J37387
2798G4043K0177K312j48701k55469o8672J46732J21183K3303j21197Q2970l23721
2787d47040j18660K40197M36355n8547q0873m1555k900J51192J87304l80351Q4017
2776c0861J8074q5440J35833k13549j53415J1549K3695j17730J16186Q7980J01689
2765a05989K21438j16611j95624q3305J3652J60307j98743R3345J3152M3258p5759
2754b30879M7434l1665l7466J65048O1687j89712J48319M5065o4399Q8662j62714
$$ plain form
2830 -74630 12204 -33542 160889 -85185 -138264 1502 -96892 -242600 24820 137047 106924
2819 106924 -8230 61901 -36518 -128645 239055 155100 90694 15064 83175 -82414 -104934
2808 -104934 -151091 130456 233553 2465 -156498 -54886 -189873 -72357 -63344 74043
2798 74043 94220 96532 -52169 -307638 -376310 -229578 -108395 -85092 -206289 -123319 -447040
2787 -447040 -565700 -325503 110852 52305 -28568 -70123 -73023 78169 265473 -114878 -30861
2776 -30861 -12787 -98227 37606 -175943 -329358 -317809 -294114 -411844 -295658 -207678 -105989
2765 -105989 115449 -1162 -196786 -280091 -266439 -106132 -304875 -211530 -198378 -155120 -230879
2754 -230879 -183445 -215110 -252576 -87528 -25841 -215553 -67234 -22169 -86568 2094 -160620
2743a60620l32622L94102K40657l7994r9795j750j75926P1927k9932R9989R6378
2732F4414l12967k95377L51683J48576r4428L6948K33285q1206k28114o4501J57492
2721h4195m5997p9535J83725o9961M0698Q1053K1331k05045J45753Q417k4449
2710b8205O4903l8001P4428L14926j13851k90185j19029j81675K12981J21088
2700A7380j99080j61993Q7749J31105m9063n0913Q0097J05698l29144j10137K49774
2689b28527M4392l9513n3032J25312J52253j44254j04088N4818J85610j89683
2679a96712j78793J05138O5354O8170J26793r0350n6712J56358j66450K4048j40703
2668b83859q2213J54985K2279M2181M0414j34203k5018K65686Q7498k37188o3076
$$ plain form
2743 -160620 -493242 -99140 141517 103523 3728 1978 -173948 -102021 -131953 -31964 64414
2732 64414 -248553 -543930 -192247 -43671 -138099 -101151 132134 50928 -177186 -241687 -84195
2721 -84195 -130192 -209727 -26002 -95963 -55265 25788 47119 -157926 -12173 -3756 -28205
2710 -28205 36698 -1303 73125 388051 274200 -15985 -135014 -316689 -103708 17380
2700 17380 -181700 -343693 -255944 -124839 -173902 -224815 -144718 -39020 -368164 -478301 -228527
2689 -228527 -184135 -223648 -276680 -151368 885 -143369 -247457 -192639 -7029 -196712
2679 -196712 -375505 -270367 -205013 -136843 -10050 -100400 -157112 -754 -167204 -143156 -283859
2668 -283859 -366072 -211087 -188808 -146627 -106213 -240416 -265434 252 87750 -149438 -212514
2657b12514K28949N0338J0421j60278k18027J08800J84762J28262j01534j28209
2647a09030K5456P5830Q3668l41524j34100J39365J83946j12317k00184J10128
2637b78762J59376P235q5196r1948M4306K39904j05502j7760j40103J28654J51424
2626A1628k47551m2593L7863n320J0048K64590J7685n5568j68678J63116n8048
2615g2828j53542R1065P6857j82809N1938J46559j3877k06504j45165L45640K9363
2604c3303L7359p9712K3500j80063j45692J52981K6397p4012j5544J13479P1956
2593a02654l4303j10368J3502P2172K01419J73794l1521k65578o8878L865P8129
2582g0421k09798J9549m7087L2890J63025Q528j12533P4209j50384J81477j27167
$$ plain form
2657 -212514 16435 66773 77194 -83084 -301111 -192311 -7549 120713 19179 -109030
2647 -109030 -83574 -7744 75924 -265600 -399700 -260335 -76389 -188706 -388890 -278762
2637 -278762 -119386 -112151 -197347 -289295 -244989 -5085 -110587 -128347 -268450 -139796 11628
2626 11628 -235923 -278516 -240653 -245973 -235925 28665 46350 -9218 -177896 -14780 -72828
2615 -72828 -226370 -135305 -58448 -241257 -189319 -42760 -56637 -263141 -408306 -62666 -33303
2604 -33303 4056 -75656 -52156 -232219 -377911 -224930 -198533 -272545 -288089 -174610 -102654
2593 -102654 -136957 -247325 -233823 -161651 39768 213562 182041 -83537 -152415 -148550 -70421
2582 -70421 -280219 -260670 -307757 -274867 -111842 -103314 -215847 -141638 -292022 -110545 -237712
2571b37712l16167J60270L06057q2837k25921K32428k9022j00740Q2284K23851
2561A2491k72455j15055l1619n4843q9102M54724R3486R7613O2148j97384j05987
2550a45983J29631R2220J94714l51668k8692j9426k11079J07228Q1150j31517
2540b83422J55644L1764m0377J31826k87423N8514J23037m7309q6822J18202j52361
2529b78727n6887N41183j3911j27429q1728J24601J3075j09927r0756K45558m0425
2518A24627k45356j1575q542K2548j25358r6119p0170K85128J25125q29J38892
2507A38371r7904m79742J77451J4558L2717M8800J21230o7829o4265K0125J40138
2496a6350k755j13531K07749L814k32270J1080j35837k14997K90310m4157J05025
$$ plain form
2571 -237712 -553879 -393609 -87552 -170389 -396310 -163882 -192904 -293644 -211360 12491
2561 12491 -259964 -375019 -406638 -461481 -550583 -95859 -2373 95240 157388 -39996 -145983
2550 -145983 -16352 75868 270582 -81086 -109778 -129204 -340283 -233055 -151905 -283422
2540 -283422 -127778 -96014 -136391 -4565 -291988 -233474 -110437 -157746 -244568 -126366 -278727
2529 -278727 -335614 205569 191658 64229 -17499 107102 120177 10250 -80506 165052 124627
2518 124627 -120729 -132304 -140846 -118298 -243656 -339775 -409945 -124817 308 -521 138371
2507 138371 40467 -439275 -261824 -247266 -214549 -165749 -44519 -112348 -176613 -156488 -16350
2496 -16350 -19105 -132636 75113 78927 -153343 -142263 -278100 -493097 -202787 -246944 -141919
2485a41919K2610r2117J78395m56543K74906K73744l22892O6422j4505J06116
2475a05783K64480q5140k27790O0437j4859j2842L5912k07890o3480M00038J91635
2464B34718j54249N0477k38039j58022K58058J30787l89972k9979O9836J4956
2454b11429R8161j60811K9895K57980j37252j49314L5458j19069j04159j82L05683
2443a55039J11847j43576L3893j07615K24754J35215j57512R5032K590l47523
2433c07934l4705J89790J63977j78149P982L9859q6198J32521l66o9785k03150
2422c46158L0128J69961K93825K2704k55055r6400J17052J5445J73718p4933J39521
2411A89808r3972k4728Q1203p4425k4247K6107Q5440k1092J8643k11486j53282
$$ plain form
2485 -141919 -119309 -211426 -33031 -489574 -214668 59076 -263816 -197394 -211899 -105783
2475 -105783 158697 73557 -154233 -93796 -108655 -121497 -85585 -293475 -356955 43083 234718
2464 234718 80469 130946 -107093 -265115 -7057 123730 -266242 -296221 -226385 -211429
2454 -211429 -113268 -274079 -244184 13796 -123456 -272770 -237312 -356381 -460540 -460722 -155039
2443 -155039 -43192 -186768 -152875 -260490 -35736 99479 -58033 36999 39589 -307934
2433 -307934 -342639 -152849 11128 -167021 -159039 -119180 -205378 -72857 -73223 -143008 -346158
2422 -346158 -316030 -146069 147756 170460 -84595 -180995 -63943 -48498 125220 50287 189808
2411 189808 95836 71108 152311 77886 53639 79746 165186 144094 162737 -48749 -202031
2400b02031L14965p9075j41238k39391J15687J97650j11378L30773l4868k02430
2390e1336l4988j7320N7704Q9635J40564P7573j95627R6712p6533j18017j3458
2379d5091J17422J84501k31426r3104J26195J90866J9500O5607n1936K47258L681
2368E33473o0212o985p6361j33998j41904j67984j68640J59126J51076K5196k2541
2357I0246J19991k8606j35950L3186j17761n0495J55045r4536J56992Q9187l17798
2346a00499K06213j337r1634r1808J67449J08639j13675P4799j18331M4638m7648
2335C6806N2838K8146j99838K5176l3108J15253J1042k42294O1456p3523J52171
2324f5875J75518j89556k50048K82210j12870j0059J71599n798j02232j45206
$$ plain form
2400 -202031 112934 33859 -107379 -346770 -231083 -33433 -144811 185962 151094 -51336
2390 -51336 -86324 -103644 -45940 43695 184259 261832 66205 162917 86384 -31633 -45091
2379 -45091 72331 256832 25406 -67698 58497 249363 268863 334470 282534 529792 533473
2368 533473 473261 466276 389915 255917 114013 -53971 -222611 -63485 87591 112787 90246
2357 90246 210237 181631 45681 78867 -38894 -89389 65656 -28880 128112 217299 -100499
2346 -100499 105714 104377 12743 -79065 88384 197023 83348 158147 39816 84454 36806
2335 36806 89644 117790 -82048 -56872 -89980 25273 36315 -205979 -144523 -218046 -65875
2324 -65875 109643 -79913 -329961 -47751 -160621 -170680 919 -4879 -107111 -252317
2314b52317K14269Q3118k7161L1798P8887N348k86561q9474J75819J57767K03257
2303B94750q9943j66190q221j40002J24145j52850l11242K53107K72065R5682
2293A71301j19711J43204q1262l4466j14404n252l5669L4850J35070k2800n1556
2282A9305K55145n1750k53342J74035l29137q1296j3503k46002L73850K66109
2272A13414l1765Q790J5375K74500j63857k04853J12109J21899k14046L63711
2262C95277j17682o1432k39388n4668K15406K18318p2920J4979k63726j5871Q0078
2251I8371j71325J19013J82706J89679n9233k55537J45104K06402k49429k0643
2241A85108K80301M8753K826k879J73174p3607j81716j1072j140P9409K9240p742
$$ plain form
2314 -252317 -38048 45070 17909 49707 128594 133942 -152619 -242093 -66274 91493 294750
2303 294750 204807 38617 30396 -109606 14539 -138311 -449553 -196446 75619 171301
2293 171301 51590 194794 113532 79066 -35338 -40590 -76259 -41409 93661 70861 19305
2282 19305 274450 222700 -30642 143393 -185744 -267040 -280543 -526545 -152695 113414
2272 113414 81649 90439 105814 380314 216457 11604 123713 245612 31566 395277
2262 395277 277595 216163 -23225 -77893 137513 355831 282911 297890 34164 18293 98371
2251 98371 -72954 46059 228765 418444 359211 103674 248778 455180 205751 185108
2241 185108 465409 514162 516988 514109 687283 613676 431960 420888 419748 499157 528397 520655
2229E20655j04342J47932k10533J41626M838n8374k217L3798l5385j28791P8884
2218C88091J12262j40118R446l441M1989j66750L90400K46628m1775j72799J1191
2207F75124k35028J08469K71390J2803K0236l2396K17265j27477K97569L0363
2197A238318l86951J63299N3655k53125l6094K71835m072l7043j6726j69382K31938
2186A055652P3518j10309L70113K3172P8430n484J5384K17427o315J28556J05404
2175A945548q3779l3886N2327L8153l3923L4293K4189P5730K26665P1241k39843
2164B076715P0436J40854K28795J11920j31424J00726q6723J23410O9558N5881
2154B760148M5915j219O10577Q3631j91901M7449l186L24007k94199p8246M42422
$$ plain form
2229 520655 416313 564245 353712 495338 500176 441802 439585 473383 437998 309207 388091
2218 388091 500353 360235 369681 366240 408229 241479 631879 878507 836732 663933 675124
2207 675124 440096 548565 819955 832758 852994 820598 1037863 910386 1207955 1238318
2197 1238318 851367 1014666 1068321 815196 779102 1050937 1046865 1009822 993096 823714 1055652
2186 1055652 1129170 1018861 1388974 1412146 1490576 1485092 1500476 1717903 1711588 1840144 1945548
2175 1945548 1861769 1827883 1880210 1918363 1884440 1918733 1942922 2018652 2245317 2316558 2076715
2164 2076715 2147151 2288005 2516800 2628720 2497296 2598022 2511299 2634709 2704267 2760148
2154 2760148 2806063 2804844 3415421 3499052 3307151 3354600 3351414 3675421 3381222 3302976 3745398
2143C745398L28196K87552L18419J65233K30037J10114J99751L43639K91268L12034
2133F331641K62589J39220M24090N38275L36277M53529L34971N72333L11043M59253
2123A0163221N35198Q25154P76712Q94651J005024J365527J405161J353817R28782
2114A9253247R43420J563272K216301K351666K817693L659067M721798O608920
2106D4135384R308052J2023313J5477113J7009619J5578876L421949j9260397
2099I7693909k4183789j6862957j0833006p357893o087214m757075l510743k830129
2091B1271103j721349j470978j119107j073440o58509q37113j161828j177531
2083A2051248j187132p25397n57933r07930o00590k96225n85307n36421l05764
$$ plain form
2143 3745398 4073594 4361146 4679565 4844798 5074835 5184949 5384700 5728339 6019607 6331641
2133 6331641 6594230 6733450 7157540 7695815 8032092 8485621 8820592 9392925 9703968 10163221
2123 10163221 10698419 11523573 12300285 13194936 14199960 15565487 16970648 18324465 19253247
2114 19253247 20196667 21759939 23976240 26327906 29145599 32804666 37526464 44135384
2106 44135384 53443436 65466749 80943862 97953481 113532357 116954306 97693909
2099 97693909 73510120 56647163 45814157 38456264 32369050 27611975 24101232 21271103
2091 21271103 19549754 18078776 16959669 15886229 15227720 14390607 13228779 12051248
2083 12051248 10864116 10138719 9580786 8672856 8072266 7776041 7190734 6654313 6348549
2074F348549k97794q4650k16182k29797j2872j34070k46799j73337j06952k47205
2064D598891k43423l72681N3185l12176j72838l35915L640O6982j06125r9073
2054C080467j53787k27273P990K00511l09440k08424q1343o3669P2146j64870
2044B152308J34620J75035k16793j30095q6309l4131o1704J0106o4984k13763
2034A664290M8324J24667p0674p2530j85194j58523L7221k01728j53744q9961
2024I42148J6902P5420J66115m3813m5996q9161k47382O2519r7969O731J23749
2013H69263n9345J22243o6589Q6941l4187j07745m3111j37026L40795j29725l08125
2002E33389J52650o9352J45248j5984O6179j58315n9608o5913K11848j73030N5763
$$ plain form
2074 6348549 6050755 5966105 5749923 5520126 5507254 5373184 5126385 4953048 4846096 4598891
2064 4598891 4355468 3982787 4035972 3723796 3550958 3215043 3218683 3285665 3179540 3080467
2054 3080467 2926680 2699407 2707397 2907908 2598468 2390044 2308701 2245032 2317178 2152308
2044 2152308 2286928 2461963 2245170 2115075 2028766 1994635 1932931 1943037 1878053 1664290
2034 1664290 1712614 1837281 1766607 1694077 1508883 1350360 1387581 1185853 1032109 942148
2024 942148 959050 1034470 1200585 1156772 1110776 1021615 774233 836752 738783 745514 869263
2013 869263 809918 932161 865572 952513 918326 810581 767470 630444 971239 841514 533389
2002 533389 686039 616687 761935 745951 812130 653815 594207 528294 740142 567112 622875
1991F22875K41133j02529j6255l3633j34598L8895q6214J28531P071j70449j95166
1980B99661Q5107J36842R6993q8942j49288M7362p8166l177j48753K08596j13187
1969B93048m5320L7132j45171p5024J88754J65297K13922r9321k90605j70915
1959G1797o8907R5848J64639m3943n8819P7389r2479n6479N5040J26096k46406
1948B3776j4374P8325J35469K22791L6446m7582l05852m647o8579N04154k07044
1937C52883q7715R5464M8965j14597r3491R3357r8374P8174J65058J48695j11535
1926D76884k00849j29835j39465J58922K29726R0949k58953r0928J22638o5771
1916A93318j65246j12440K0864K94345K39963j61018l89197j26926R1014o5480
$$ plain form
1991 622875 864008 761479 745224 711591 576993 615888 529674 658205 665276 494827 299661
1980 299661 384768 521610 618603 529661 380373 427735 349569 346392 197639 406235 293048
1969 293048 247728 284860 139689 64665 253419 418716 632638 533317 242712 71797
1959 71797 2890 98738 263377 219434 160615 238004 145525 89046 144086 270182 23776
1948 23776 9402 87727 223196 445987 482433 434851 128999 124352 55773 559927 352883
1937 352883 265168 360632 409597 295000 201509 294866 196492 274666 439724 588419 476884
1926 476884 276035 146200 6735 165657 395383 486332 227379 136451 259089 193318
1916 193318 28072 -84368 -63504 230841 470804 309786 -79411 -206337 -115323 -180803
1906a80803J90713N4877j34937J64556J18976p0729L5058l5179l42214O2507K65579
1895A28404j1385j49141O0968L74145o7767j99210J16986O3448k15284n3072J97730
1884B45822k43924J02779R9823k79188q1165L2790N8883n5309P2563J97765Q9764
1873B40603k48513O5673j36692J23773r3841q8864J73532m8451J36386j20956
1863B650J74162j98155j23977j07681k3739L0601K95186M16975k25578j36676
1853A03768O6560m5789O1586n4413j03229J75774j78M1580p6248J9214k46604
1842e7979M3370L1415l990L5331l867j80676M61469q2386J67804j6107o8616K71160
1830E96928k24476k56802R55k10183J29602q077M5416R1447j84510N9357J79772
$$ plain form
1906 -180803 9910 64787 -70150 94406 213382 142653 177711 142532 -199682 -137175 128404
1895 128404 117019 -32122 28846 402991 335224 136014 253000 316448 101164 48092 245822
1884 245822 1898 104677 204500 -74688 -155853 -123063 -64180 -119489 -46926 150839 240603
1873 240603 -7910 57763 -78929 44844 -48997 -137861 35671 -12780 123606 2650
1863 2650 176812 -21343 -145320 -253001 -276740 -246139 49047 466022 240444 103768
1853 103768 170328 124539 186125 131712 28483 204257 204079 245659 169411 188625 -57979
1842 -57979 -14609 16806 12816 48147 44280 -136396 325073 242687 410491 394384 325768 596928
1830 596928 372452 115650 116605 -93578 36024 27947 73363 164810 -19700 39657 219429
1819B19429j07644j04656j39123n2835K03070M3754K5015q7218j10945K60008
1809A48855P0296j11552J35381m6057j1402j62383K2881R7224l9429j24667N3096
1798C2243j4407j56198k9021P9649P0831q2871j25449l9948J11824J50839q2921
1787h5429J96991j23962n8970j38766J36043N0940J03613l2106j13788J292K0956
1776d3186l88263O9762J68540L60889p6003l54323n6769K00800k8526q60J30400
1765a7539J37585m7822Q2018j95671j71204N7469r634M13134K4100q3715m2804
1754A45917m1021k82906k19282K25518P5361k8443R4692K10707k71679J10295
1744A9159M5698l28588m531J72703J291j94420K50927J510m955j04412O8792J56613
$$ plain form
1819 219429 111785 7129 -131994 -184829 18241 61995 87010 -208 -111153 148855
1809 148855 219151 107599 242980 196923 185521 23138 46019 143243 103814 -20853 32243
1798 32243 17836 -138362 -167383 -87734 -16903 -99774 -225223 -265171 -153347 -2508 -85429
1787 -85429 111562 -12400 -71370 -210136 -74093 -23153 80460 48354 -65434 -64142 -43186
1776 -43186 -431449 -361687 -193147 167742 91739 -262584 -319353 -118553 -147079 -147939 -17539
1765 -17539 120046 72224 154242 -41429 -212633 -155164 -164798 248336 272436 188721 145917
1754 145917 104896 -178010 -397292 -171774 -96413 -124856 -30164 180543 -91136 19159
1744 19159 64857 -263731 -268262 -95559 -94268 -288688 -37761 -36251 -41206 -145618 -76826 79787
1732G9787q3625j80605j19084J16412Q1242p1776L0067m5918P0477q9835J30373
1721h2485K46127j14002o3456N6537K06131K31800j22323K5934k04026k02523
1711b2286P8178n899J59233l8145o7916k48454p0316J25924q2961R2772l6504
1700a16374q7804q5904L01477j36705K3907J16972r1516N4703k841k5369k780
1689e2234j02363K37338P458O3914k79857K45883M9267l03437R8578P440j68281
1678a96294m2080K8928K01742L14985k36371j32115p5041J47303K5562P7888j28053
1667a3546m08530K22808K79159j66247q8870J86691J73468O7851j76687n7758
1657A8339j51553k7308k47868K01457J08110j46867J65898J70194m2372p0384
$$ plain form
1732 79787 -3838 -184443 -303527 -187115 -105873 -177649 -147582 -193500 -123023 -212858 -82485
1721 -82485 163642 49640 -13816 42721 248852 480652 358329 384263 180237 -22286
1711 -22286 55892 49993 209226 171081 103165 -145289 -215605 -89681 -172642 -79870 -116374
1700 -116374 -204178 -290082 11395 -125310 -101403 15569 -75947 -21244 -24085 -49454 -52234
1689 -52234 -154597 82741 90199 154113 -125744 120139 169406 -134031 -35453 -28013 -196294
1678 -196294 -238374 -209446 -7704 307281 70910 -61205 -136246 11057 36619 114507 -13546
1667 -13546 -422076 -199268 79891 -86356 -175226 11465 184933 252784 76097 18339
1657 18339 -133214 -160522 -408390 -206933 -98823 -245690 -79792 90402 48030 -22354
1647b2354K33518l13720J3143k34089J77575L15151r4988k73283k5267K73649
1637D9335K00190j19765k39490j80314O7599L01285k08235j41299J02571J85341
1627A7218j97380j37620K76089j50025M4759J47613o2240R6752J70422n0598j18558
1616C6432l50420J07255j64827J92800L05035j65885j13579R9205J19120k30774
1606a65638m597J54323J64523j49086j62355J98710j84890R0337N2179Q4724J35886
1595B14116j23394k2506k44535j54675N4265L990O9945K2593J24103O6323o984
1584C241J05003k57222N1041o7399O4036r3303m7623K96804M0256m6483n4315
1573e964Q3842L26346l46067j60763L9341p1229K03196k4571O3418m152k2914
$$ plain form
1647 -22354 211164 -102556 -89413 -323502 -145927 169224 74236 -199047 -224314 49335
1637 49335 249525 129760 -109730 -290044 -222445 78840 -129395 -270694 -168123 17218
1627 17218 -180162 -317782 -41693 -191718 -146959 654 -61586 35166 205588 154990 36432
1616 36432 -313988 -206733 -371560 -178760 126275 -39610 -153189 -53984 65136 -165638
1606 -165638 -170235 -15912 148611 -475 -162830 35880 -149010 -58673 -6494 78230 214116
1595 214116 90722 68216 -176319 -330994 -276729 -272739 -202794 -180201 -56098 10225 3241
1584 3241 108244 -148978 -97937 -165336 -101300 -194603 -242226 54578 94834 48351 -5964
1573 -5964 77878 404224 58157 -102606 -63265 -134494 68702 44131 107549 103397 80483
1562H0483p641J29957l17957J00210k4825o7854J29404l45066m2099K16980K13987
1551F5579p7784k89061K19088K28977r3798n8761k5528o5229J60731p4988l1837
1540d2611J6636O2571k08707M4053n787k11382K63998R5441K01528l30148k1642
1529a36050J86316J99084j56347j40012K02244N5926k40930j64035k29006M7831
1519c74979O8604m2416K45194j64806J83693K1970K10943m6995j36747P2690k87862
1508b50711r816K59877J3256j58255K32914l4336q1860k14417J72165L57116j48242
1497A37691j27258j37544N0829j0406K4568j60204M1531K44144O1399n2798L3417
1486A05369q0924k09904n4854J66937K20383j1655p9194J14671M2968k33389K7460
$$ plain form
1562 80483 72842 202799 -115158 -14948 -39773 -107627 21777 -323289 -365388 -148408 65579
1551 65579 -12205 -301266 -82178 146799 53001 -5760 -31288 -96517 64214 -10774 -42611
1540 -42611 -25975 36596 -172111 -128058 -133845 -345227 -81229 14212 215740 -114408 -136050
1529 -136050 50266 249350 93003 -47009 155235 211161 -29769 -193804 -422810 -374979
1519 -374979 -306375 -348791 -103597 -268403 -84710 -62740 148203 101208 -35539 37151 -250711
1508 -250711 -260527 -650 12606 -145649 87265 52929 -28931 -243348 -71183 285933 137691
1497 137691 10433 -127111 -76282 -86688 -62120 -222324 -180793 63351 124750 71952 105369
1486 105369 24445 -185459 -240313 -73376 147007 135352 56158 170829 213797 -19592 7868
1475G868k25437O1394K8818N9185J368J37601k0017R2045o6170k13513k945J20443
1463a9360j92730q6451q6080O5458K62667L5150K8003K78839j34093j39172J554
1452A3785j48801p2603J5684J22113q4452Q4530J87488J313k05990R0615o8684
1441f5002J17576M4829r4396J67867j31199o5469R690m45850J60931J37162Q9538
1430g4323J73531k7083j51534k0394P3517J8278n2693O2846J19107j56870j65753
1419b01371q376K69173j15338j99143J05434o2775j8180N7485N5831K11490k12617
1408a18387R2306r5264j34499l3453N0705J12047J1729p4859L2584Q5635J76121
1397A04665N0101k85445P2796J99887J27588L1200k32711k01745J51524J49781
$$ plain form
1475 7868 -217569 -156175 -127357 -68172 -66804 70797 50780 142825 76655 -136858 -139803 -19360
1463 -19360 -212090 -298541 -384621 -319163 -56496 -21346 6657 285496 151403 12231 13785
1452 13785 -135016 -207619 -191935 -69822 -154274 -69744 117744 119057 -86933 3682 -65002
1441 -65002 52574 97403 3007 170874 39675 -25794 -16104 -461954 -301023 -163861 -74323
1430 -74323 99208 72125 -79409 -99803 -26286 -8008 -60701 2145 121252 -35618 -201371
1419 -201371 -209747 59426 -55912 -255055 -149621 -212396 -230576 -173091 -117260 94230 -118387
1408 -118387 -26081 -121345 -255844 -289297 -238592 -126545 -114816 -189675 -157091 -71456 104665
1397 104665 154766 -130679 -57883 142004 269592 300792 68081 -133664 17860 167641
1387A67641J83635l43641R785N2243j11713p517j92667o7297J78537j12472J26113
1376a17353R3495K2969n2737O418j61192j16566j65464J55564J95322P1110O2602
1365e832m5630j7274R7614p3908j28739N4841K07684l3163Q2723k27280J26541
1354C7577j8093k0293J82938j35685J36721q1878k1530j89374P5231L41123l88390
1343h1653Q3091L4116P4165l4158k39163j4993K97525O8653j14725R702k12720
1332a30160R2775N8294J79425l67472K11961j18488K83894j65577O2042P5569
1322A82263k65026m0847j12278j20063L53440L14510j31894j45284P9859O6789
1312A81469n3686k51582M2096R7503J68771j64550k12964J76700j0303Q6570k19190
$$ plain form
1387 167641 351276 7635 17420 69663 -42050 -49567 -242234 -309531 -130994 -243466 -117353
1376 -117353 -23858 -889 -53626 -47208 -208400 -324966 -490430 -334866 -139544 -68434 -5832
1365 -5832 -51462 -68736 28878 -45030 -173769 -118928 88756 55593 138316 -88964 37577
1354 37577 19484 -809 182129 46444 183165 101287 79757 -109617 -34386 306737 -81653
1343 -81653 1438 35554 109719 75561 -163602 -178595 118930 187583 72858 82560 -130160
1332 -130160 -37385 20909 200334 -167138 44823 -73665 210229 44652 106694 182263
1322 182263 -82763 -123610 -235888 -355951 -2511 311999 180105 34821 114680 181469
1312 181469 127783 -123799 -81703 15800 184571 20021 -192943 -16243 -26546 60024 -159166
1301a59166J5620L3151n1796K05988J23301j00587L5773N7255k63739m4054j5006
1290a63260n2300J54497R1508j7630N2426k6698p9636m8234M44J20019n677P8834
1278A04293n4946L1295L0587J99860k26768r8729k08722p4141O9828Q7902L21592
1267A82051j62910k83887j04674J4895K42979O1002R9971j67791K56698J0534
1257A48868k35017R572j02571j22114J06328j13678J5534k175J11977K21064r730
1246B8058j70384q8913M549p7538K26377k59473n6156N2704R4587N3056L6229
1235a56904j1327N7216l9769R7820k25857j9745r1703J55846J44067l9428j26218
1224b56002M6172L13613K678k29720k7826n3933L9126R6635K1141j38390J51397
$$ plain form
1301 -159166 -143546 -110395 -162191 43797 167098 66511 102284 159539 -104200 -148254 -163260
1290 -163260 -215560 -61063 30445 12815 65241 38543 -41093 -89327 -88883 31136 25459 104293
1278 104293 49347 80642 111229 311089 84321 -14408 -223130 -297271 -227443 -139541 182051
1267 182051 19141 -264746 -369420 -354525 -111546 -50544 49427 -118364 138334 148868
1257 148868 -86149 -76577 -179148 -301262 -194934 -308612 -293078 -295253 -183276 37788 28058
1246 28058 -142326 -231239 -226690 -304228 -77851 -337324 -393480 -340776 -246189 -193133 -156904
1235 -156904 -168231 -111015 -150784 -52964 -278821 -298566 -390269 -234423 -90356 -129784 -256002
1224 -256002 -209830 103783 106461 -123259 -151085 -205018 -165892 -69257 -48116 -186506 -35109
1213c5109J05724L9645m5832j59333k72143J33863L55078o8552m2124l50192O0025
1202b78950K00468q7847o7312l2748J00486L4071J68674j3114j12274K15597j35672
1191h621j80449Q5554k33242l6723R4540K01394Q1264k35295R4749K37015k8260
1180G1926l85239N7827K41320M9066k09720J91534Q9616k17824N9085J53704k01022
1169i9727J44332l6750j98262o5499Q516L56662j08975M1569J42939O1190j41706
1158A04289j91685q0460j10593J78232p6635J17278J09821o3150k8041J58512
1148A17568L7765l9206k13387R3301K38534k46343l1307r7504J988Q7502j25419
1137a76508K03386l3430J61310l4438j85245o9861O1738L26532o064m05444K6449
$$ plain form
1213 -35109 70615 110260 64428 -94905 -367048 -233185 121893 53341 11217 -338975 -278950
1202 -278950 -78482 -166329 -233641 -266389 -165903 -131832 36842 23728 -88546 127051 -8621
1191 -8621 -189070 -103516 -336758 -373481 -278941 -77547 3717 -231578 -136829 100186 71926
1180 71926 -313313 -255486 -14166 34900 -174820 16714 106330 -111494 -52409 101295 -99727
1169 -99727 44605 7855 -190407 -255906 -247390 109272 297 41866 184805 245995 104289
1158 104289 -87396 -167856 -278449 -100217 -176852 -59574 50247 -12903 -40944 117568
1148 117568 155333 116127 -97260 -3959 234575 -11768 -43075 -140579 -138591 -51089 -176508
1137 -176508 26878 -6552 154758 120320 -64925 -134786 -73048 253484 247420 -158024 -131575
1126a31575Q3628J51435N656j68012q0661M7862P6210M5993M5241P6303j65252
1115a3172n3043j35899J26693Q0205k7552J08095j14978Q8626l0295j18432m9560
1104a39312M6598r3643l0328K28003J11646q0120p3394j27240N5790o7386k0148
$$ plain form
1126 -131575 -47947 103488 109144 -58868 -139529 -91667 -15457 30536 75777 152080 -13172
1115 -13172 -66215 -202114 -75421 4784 -22768 85327 -29651 58975 28680 -89752 -139312
1104 -139312 -92714 -186357 -216685 11318 122964 42844 -30550 -157790 -102000 -169386 -189534
$$ [...]
##END NTUPLES=NMR SPECTRUM
##END=
