##TITLE=1H_EC-3281(2-1)
 CDCl3
 8 sc, 
 21.10.2022
##JCAMPDX= 6.0         $$ Bruker NMR JCAMP-DX V2.0
##DATA TYPE= NMR SPECTRUM
##DATA CLASS= NTUPLES
##ORIGIN= UXNMR, Bruker Analytische Messtechnik GmbH
##OWNER= root
$$ XWIN-NMR		Version 3.5
$$ Fri Oct 21 13:47:04 2022 Russian Standard Time (UT+4h)  she@DPX200
##.OBSERVE FREQUENCY= 200.1313499994
##.OBSERVE NUCLEUS= ^1H
##.ACQUISITION MODE= SIMULTANEOUS
##.ACQUISITION SCHEME= undefined
##.AVERAGES= 8
##.DIGITISER RES= 18
##SPECTROMETER/DATA SYSTEM= spect
##.PULSE SEQUENCE= zg30
##.SOLVENT NAME= CDCl3
##.SHIFT REFERENCE= (INTERNAL, CDCl3, 0, 15.7348)
##AUDIT TRAIL= $$ (NUMBER, WHEN, WHO, WHERE, WHAT)
$$ ##TITLE= Audit trail, XWIN-NMR		Version 3.5
$$ ##JCAMPDX= 5.01
$$ ##ORIGIN= Bruker BioSpin GmbH
$$ ##OWNER= she
$$ F:/spectra/data/she/nmr/H-F/1/pdata/1/auditp.txt
$$ ##AUDIT TRAIL=  $$ (NUMBER, WHEN, WHO, WHERE, WHAT)
(   1,<2022-10-21 13:45:51.34 +0400>,<she>,<DPX200>,
      <created by zg, POWCHK disabled, PULCHK disabled
       configuration hash MD5:
       00 E9 B6 7A A2 85 ED C7 34 08 36 98 17 FE 4E 26
       data hash MD5: 16K
       F4 75 89 67 5A C8 35 5D 02 91 70 D1 D4 A2 F8 8A>)
(   2,<2022-10-21 13:45:54.03 +0400>,<she>,<DPX200>,
      <Start of raw data processing
       efp BC_mod = 2 LB = 0.24 FT_mod = 6 PKNL = 1 PHC0 = -18035.08 PHC1 = 12.2007 SI = 16K 
       data hash MD5: 16K
       D2 2D 50 F0 E1 AE 94 BA 85 4D 2D EB F7 C8 64 97>)
(   3,<2022-10-21 13:46:09.26 +0400>,<she>,<DPX200>,
      <pk PHC0 = 1.308018 PHC1 = -2 
       data hash MD5: 16K
       7F 81 27 9A FD 78 CD 78 1F 15 F4 8C 53 87 80 CD>)
(   4,<2022-10-21 13:46:12.89 +0400>,<she>,<DPX200>,
      <abs ABSG = 5 
       data hash MD5: 16K
       53 E0 A5 17 12 91 63 AA 97 FB 2E 09 88 5D E4 66>)
$$ ##END=
$$ 
$$ hash MD5
$$ DD A0 AB C6 75 34 7E E2 B1 C3 D0 32 F0 98 5E 62
##$RELAX= 
##$RELAX= 
##$RELAX= 
##$RELAX= 
##$RELAX= 
##$RELAX= 
$$ Bruker specific parameters
$$ --------------------------
##$DU= <F:/spectra>
##$EXPNO= 1
##$NAME= <H-F>
##$PROCNO= 1
##$TYPE= <nmr>
##$USER= <she>
##$AMP= (0..31)
100 100 100 100 100 100 100 100 100 100 100 100 100 100 100 100 100 100 
100 100 100 100 100 100 100 100 100 100 100 100 100 100 
##$AQSEQ= 0
##$AQ_mod= 1
##$AUNM= <au_zg>
##$AUTOPOS= <>
##$BF1= 200.13
##$BF2= 200.13
##$BF3= 200.13
##$BF4= 200.13
##$BF5= 200.13
##$BF6= 200.13
##$BF7= 200.13
##$BF8= 200.13
##$BYTORDA= 1
##$CFDGTYP= 0
##$CFRGTYP= 5
##$CHEMSTR= <none>
##$CNST= (0..31)
1 1 145 1 1 1 1 1 1 1 1 1 1 1 1 1 1 1 1 1 1 1 1 1 1 1 1 1 1 1 1 1 
##$CPDPRG= <>
##$CPDPRG1= <>
##$CPDPRG2= <>
##$CPDPRG3= <>
##$CPDPRG4= <mlev>
##$CPDPRG5= <mlev>
##$CPDPRG6= <mlev>
##$CPDPRG7= <mlev>
##$CPDPRG8= <mlev>
##$CPDPRGB= <>
##$CPDPRGT= <>
##$D= (0..31)
0 1.2 0 0 0 0 0 0 0 0.06 0 0.03 0 0 0 0 0.0002 0 0 0 0 0 0 0 0 0 0 0 0 
0 0 0 
##$DATE= 1666345550
##$DBL= (0..7)
120 120 120 120 120 120 120 120 
##$DBP= (0..7)
150 150 150 150 150 150 150 150 
##$DBP07= 0
##$DBPNAM0= <>
##$DBPNAM1= <>
##$DBPNAM2= <>
##$DBPNAM3= <>
##$DBPNAM4= <>
$$ [...]
##$SUBNAM3= <"">
##$SUBNAM4= <"">
##$SUBNAM5= <"">
##$SUBNAM6= <"">
##$SUBNAM7= <"">
##$SUBNAM8= <"">
##$SUBNAM9= <"">
##$SW= 18.0517283424941
##$SWIBOX= (0..15)
0 0 2 0 0 0 0 0 0 0 0 0 0 0 0 0 
##$SW_h= 3612.71676300578
##$TD= 16384
##$TD0= 1
##$TE= 0
##$TE2= 300
##$TE3= 300
##$TEG= 300
##$TL= (0..7)
0 120 120 120 120 120 120 120 
##$TP= (0..7)
150 150 150 150 150 150 150 150 
##$TP07= 0
##$TPNAME0= <>
##$TPNAME1= <>
##$TPNAME2= <>
##$TPNAME3= <>
##$TPNAME4= <>
##$TPNAME5= <>
##$TPNAME6= <>
##$TPNAME7= <>
##$TPOAL= (0..7)
0.5 0.5 0.5 0.5 0.5 0.5 0.5 0.5 
##$TPOFFS= (0..7)
0 0 0 0 0 0 0 0 
##$TUNHIN= 0
##$TUNHOUT= 0
##$TUNXOUT= 0
##$USERA1= <user>
##$USERA2= <user>
##$USERA3= <user>
##$USERA4= <user>
##$USERA5= <user>
##$V9= 5
##$VALIST= <valist>
##$VCLIST= <CCCCCCCCCCCCCCC>
##$VD= 0
##$VDLIST= <DDDDDDDDDDDDDDD>
##$VPLIST= <PPPPPPPPPPPPPPP>
##$VTLIST= <TTTTTTTTTTTTTTT>
##$WBST= 1024
##$WBSW= 4
##$XGAIN= (0..3)
0 0 0 0 
##$XL= 0
##$YL= 0
##$YMAX_a= 108621
##$YMIN_a= -160503
##$ZGOPTNS= <>
##$ZL1= 120
##$ZL2= 120
##$ZL3= 120
##$ZL4= 120
##$ABSF1= 15.71934
##$ABSF2= -2.332509
##$ABSG= 5
##$ABSL= 3
##$ALPHA= 0
##$AQORDER= 0
##$ASSFAC= 0
##$ASSFACI= 0
##$ASSFACX= 0
##$ASSWID= 0
##$AUNMP= <proc_1d>
##$AZFE= 0.1
##$AZFW= 0.1
##$BCFW= 0
##$BC_mod= 2
##$BYTORDP= 0
##$COROFFS= 0
##$CY= -3
##$DATMOD= 1
##$DC= 0
##$DFILT= <>
##$DTYPP= 0
##$F1P= 0
##$F2P= 0
##$FCOR= 1
##$FTSIZE= 16384
##$FT_mod= 6
##$GAMMA= 0
##$GB= 0
##$INTBC= 1
##$INTSCL= 3.70164e-10
##$ISEN= 128
##$LB= 0.24
##$LEV0= 0
##$LPBIN= 0
##$MAXI= 10000
##$MC2= 0
##$MEAN= 0
##$ME_mod= 0
##$MI= 1.114404
##$NCOEF= 0
##$NC_proc= -7
##$NLEV= 6
##$NOISF1= 3.799351
##$NOISF2= 2.8
##$NSP= 0
##$NTH_PI= 0
##$NZP= 0
##$OFFSET= 15.73477
##$PC= 1
##$PHC0= -18033.77
##$PHC1= 10.2007
##$PH_mod= 1
##$PKNL= yes
##$PPARMOD= 0
##$PSCAL= 0
##$PSIGN= 0
##$REVERSE= no
##$SF= 200.130007357839
##$SI= 16384
##$SIGF1= 3
##$SIGF2= 2
##$SINO= 5.538805
##$SIOLD= 16384
##$SREGLST= <1H.CDCl3>
##$SSB= 0
##$STSI= 16384
##$STSR= 0
##$SW_p= 3612.71676300578
##$SYMM= 0
##$S_DEV= 0
##$TDeff= 16384
##$TDoff= 0
##$TI= <>
##$TILT= no
##$TM1= 0
##$TM2= 0
##$TOPLEV= 0
##$USERP1= <user>
##$USERP2= <user>
##$USERP3= <user>
##$USERP4= <user>
##$USERP5= <user>
##$WDW= 1
##$XDIM= 16384
##$YMAX_p= 394325580
##$YMIN_p= -720274
$$ End of Bruker specific parameters
$$ ---------------------------------
##NTUPLES= NMR SPECTRUM
##VAR_NAME=  FREQUENCY,     SPECTRUM/REAL,   SPECTRUM/IMAG
##SYMBOL=    X,             R,               I
##VAR_TYPE=  INDEPENDENT,   DEPENDENT,       DEPENDENT
##VAR_FORM=  AFFN,          ASDF,            ASDF
##VAR_DIM=   16384,         16384,           16384
##UNITS=     HZ,            ARBITRARY UNITS, ARBITRARY UNITS
##FACTOR=    0.220516191357247, 1,           1
##FIRST=     3148.99960008405, 0,            0
##LAST=      -463.717162921727, 0,           0
##MIN=       -463.717162921727, -720274,     0
##MAX=       3148.99960008405, 394325580,    0
$$ Real data points
##PAGE= N=1
##DATA TABLE= (X++(R..R)), XYDATA
$$ [...]
7143C785269j2444R7316J48756j00102K66029K04898p2090K11592R2318R3933
$$ 3785269 3772825 3870141 4018897 3918795 4184824 4389722 4317632 4529224 4621542 4715475
7133D715475K99560q1092O1518K23685J78911M19479N73376J52916L5907K02171
$$ 4715475 5015035 4933943 4995461 5219146 5398057 5817536 6390912 6543828 6579735 6781906
7123F781906K80618K07967J70612M17622N43136K33275L30381M03550L08250N31966
$$ 6781906 7062524 7270491 7441103 7858725 8401861 8635136 8965517 9369067 9677317 10209283
7113A0209283L27776J62879P32841M55144O13774M98103P40304Q18564R48410
$$ 10209283 10537059 10699938 11432779 11887923 12501697 12999800 13740104 14558668 15507078
7104A5507078R41967J174104J284413J591048K091742K472161K339348K964397
$$ 15507078 16449045 17623149 18907562 20498610 22590352 25062513 27401861 30366258
7096C0366258L628427L892058M698197N870525P709368R944119J2757396J5201578
$$ 30366258 33994685 37886743 42584940 48455465 56164833 66108952 78866348 94067926
7088I4067926J4817889J0127256J440817p706664j4786872j7242018j5564976
$$ 94067926 108885815 119013071 120453888 112747224 97960352 80718334 65153358
7081F5153358j2557326r303704o745589n111487l920725k906725k016069j857739
$$ 65153358 52596032 43292328 36546739 31435252 27514527 24607802 22591733 20733994
7073B0733994j329937j189016j099896r67068q60088n37328o16342m5420l43840
$$ 20733994 19404057 18215041 17115145 16148077 15287989 14750661 14134319 14088899 13745059
7064A3745059n39042p20857q58626n19119p98446n23561n99398o55225k61452
$$ 13745059 13206017 12485160 11626534 11107415 10308969 9785408 9186010 8530785 8269333
7055H269333m29159m65098k04443J9394m5104P3007m91495n9375J8468n0932N3232
$$ 8269333 7840174 7375076 7170633 7190027 7144923 7217930 6726435 6667060 6685528 6634596 6687828
7044F687828K77885M21589O51448O80592O97310P10065K8085m34446j029290r89984
$$ 6687828 6965713 7387302 8038750 8719342 9416652 10126717 10154802 9720356 8691066 7701082
7034G701082j274509p95255n06667p25598O528k10129l72352k70810m2713j57521
$$ 7701082 6426573 5631318 5124651 4399053 4405581 4195452 3823100 3552290 3509577 3352056
7024C352056k21613m90792N9534K7411j43445J22628L941J4627k37807k06965
$$ 3352056 3130443 2639651 2699185 2726596 2583151 2705779 2709720 2724347 2486540 2279575
7014B279575q265O6813j59487j37792q2976n59503q4191L53810j4077j47028q7513
$$ 2279575 2271310 2338123 2178636 2040844 1957868 1398365 1314174 1667984 1653907 1506879 1419366
7003A419366M2430j76387o2212k24940O0617j25477k03691P1950J42899k31403
$$ 1419366 1461796 1285409 1223197 998257 1058874 933397 729706 801656 944555 713152
6993G13152Q4814j03125L2535L68064P172k44487j55400J2325j8623k9552j30073
$$ 713152 797966 694841 727376 1095440 1102612 858125 702725 715050 696427 666875 536802
6982E36802J82216K44424n1899r6202l16511k324K32415l87702K017O1135J49154
$$ 536802 719018 963442 911543 815341 498830 496506 728921 341219 343236 404371 553525
6971E53525N6560N1911l3140j5938N9844l4536j94848n7561o7943j34515J65074
$$ 553525 610085 661996 628856 612918 672762 638226 443378 385817 317874 183359 348433
6960C48433J83245j65481J68930j06457j39578K14024j01563j41166k09239K84987
$$ 348433 531678 366197 535127 428670 289092 503116 401553 260387 51148 336135
6950C36135J42172L2040Q9912k58980K8796R659j01427m4142J19238O9924n0457
$$ 336135 478307 510347 600259 341279 370075 379734 278307 234165 353403 423327 372870
6939C72870j22868O4353J65480O2980o7033j17636j34948J2468k1103p4085K97845
$$ 372870 250002 314355 479835 542815 475782 358146 223198 235666 214563 140478 438323
6928D38323q9013r5822p1844n6956j5417J82401m2372l4718j35975j21899j24071
$$ 438323 349310 253488 181644 124688 109271 291672 249300 214582 78607 -43292 -167363
6917a67363K30993M80678k43663k06578l1493J46571J87743j88030k1607O0731
$$ -167363 63630 544308 300645 94067 62574 209145 396888 208858 187251 247982
6907B47982j89849m8018K48154L2498J9726o3573J51439k09044J4770K12003m08227
$$ 247982 58133 10115 258269 290767 310493 246920 398359 189315 204085 416088 7861
6896G861o3521K34062q684j50179j47678R3364P4809L487P1026K9404J30429j43329
$$ 7861 -55660 178402 169718 19539 -128139 -34775 40034 43521 114547 143951 274380 131051
6884A31051k02788r4455J12075K53007J18223k59064j88604R6838J01521K44484
$$ 131051 -71737 -166192 -54117 198890 317113 58049 -130555 -33717 67804 312288
6874C12288l4104K1379l39370o3591M2594J883n9290L9248J27171j36683J94358
$$ 312288 278184 299563 -39807 -103398 -60804 -58921 -118211 -78963 48208 -88475 105883
6863A05883j14050O7963L0213O5773n6173J17856r5230J48239j8706k49214k03952
$$ 105883 -8167 59796 90009 155782 99609 217465 122235 270474 251768 2554 -201398
6852b01398O6353J9093M236J0299k13377R880J15240K011J02723k52317j66752
$$ -201398 -135045 -115952 -111716 -101417 -314794 -304914 -189674 -187663 -84940 -337257 -504009
6841e04009J07222Q7525K07590J24244j03517o6069Q8201r3849O3301J03439O1806
$$ -504009 -396787 -309262 -101672 22572 -80945 -147014 -58813 -152662 -89361 14078 75884
6830G5884J52785j36103M675K82078j95145j22096K0190J45664j42402j84538
$$ 75884 228669 92566 97241 379319 184174 62078 82268 227932 85530 -99008
6820i9008o7404P8313o329K38409P4410k74707M5200J42084j41805J29379J69492
$$ -99008 -166412 -88099 -94428 143981 218391 -56316 -11116 130968 -10837 118542 288034
6809B88034o5096l28885l6555M07555q9615m2228L7326Q9180j10474m8374n2097
$$ 288034 222938 -105947 -142502 265053 175438 133210 170536 259716 149242 100868 48771
6798D8771J95285J0052k43379j27291k14541Q5571L55163J40060j63328K9319
$$ 48771 244056 254108 10729 -116562 -331103 -245532 109631 249691 86363 115682
6788A15682k17697k50099J07551K02765M3551j84010n4033R4736j49197K53516
$$ 115682 -102015 -352114 -244563 -41798 1753 -182257 -236290 -141554 -290751 -37235
6778c7235K9483l6586Q4814j122O578j36914j9145j9753K18461J39774M059l26261
$$ -37235 -7752 -44338 40476 39354 45932 -90982 -110127 -129880 88581 228355 232414 -93847
6766i3847k34134J32121Q4927m2014J55788p0771M6428J6751L221o0896l12843
$$ -93847 -327981 -195860 -110933 -152947 2841 -67930 -21502 -4751 -1530 -62426 -375269
6755c75269K09137R1480L5180J22813k5349j05224k62685K61643J19645N9150
$$ -375269 -166132 -74652 -39472 83341 57992 -47232 -309917 -48274 71371 130521
6745A30521j39248j26192K23744J05577J27822m48256n0387m0135J00125N8390
$$ 130521 -8727 -134919 88825 194402 322224 -126032 -176419 -216554 -116429 -58039
6735e8039L9075P4346K46000l233j9026j23102j55262j40024j45897L13689J82009
$$ -58039 -18964 55382 301382 298149 279123 156021 759 -139265 -285162 28527 210536
6724B10536p626p1813K10357l7703l47058J00349Q1144p9494k44684J94133K10152
$$ 210536 202910 131097 341454 303751 -43307 57042 138186 58692 -185992 8141 218293
6713B18293j17718k11368l0956O1674K0488J4152p3325J31363k69480J43059J76515
$$ 218293 100575 -110793 -141749 -80075 -59587 -45435 -118760 12603 -256877 -113818 62697
6702F2697O5196k34622j55251L01899N3478j66723J92359r606J53945K5535j86530
$$ 62697 127893 -106729 -261980 39919 93397 -73326 119033 109427 263372 288907 102377
6691A02377L2260L30987K17648K4506k49465j5833K81626n9555k22809j78631
$$ 102377 134637 465624 683272 707778 458313 442480 724106 664551 441742 263111
6681B63111j86563k5565J20345J29880j49072M4738J15245k00573J01944o4301
$$ 263111 76548 50983 171328 301208 152136 196874 312119 111546 213490 149189
6671A49189M8706o686p2446j47889q3330N4105J15623j4923o0293K80194j54965
$$ 149189 197895 191209 118763 -29126 -112456 -58351 57272 42349 -17944 262250 107285
6660A07285j07462J21796k50905J0609R9574p4462o7675J36022K22788l25302
$$ 107285 -177 121619 -129286 -118677 -19103 -93565 -161240 -25218 197570 -127732
6650a27732p6459m419L946J4759N4493J81045n9053l5249J42069j07029m3982
$$ -127732 -204191 -208610 -204664 -189905 -135412 45633 -13420 -48669 93400 -13629 -57611
6639e7611O7933q8894o5779q817R2248O9291J2327l06610J04987K779L20893m2500
$$ -57611 10322 -78572 -144351 -153168 -60920 8371 20698 -285912 -180925 -178146 142747 100247
6627A00247j87638J70204j75159P9244N131k6982j21483j08400K26280J0312m9572
$$ 100247 -87391 82813 -92346 -13102 -7971 -34953 -156436 -264836 -38556 -28244 -77816
6616g7816J57851M3585j74119N5679M9771q0839P0818J83582j39548K9800l20658
$$ -77816 80035 123620 -50499 5180 54951 -25888 44930 228512 88964 118764 -201894
6605b01894j1839K96594N2090j04533l09779J7199m7465j11666L13114r8830P4677
$$ -201894 -213733 82861 134951 30418 -279361 -262162 -309627 -421293 -108179 -207009 -132332
6594a32332J02163k8270R4014j22778J4870J18965J40974j52734j30207J31732
$$ -132332 -30169 -58439 35575 -87203 -72333 46632 187606 34872 -95335 36397
6584C6397P6759j61623K2099J76803j45280k59160L6516J83908J76776k69691
$$ 36397 113156 -48467 -26368 150435 5155 -254005 -217489 -33581 143195 -126496
6574a26496j60432J76123L02197K3272m46776o051M28625r8354J80563r7171l25106
$$ -126496 -286928 -110805 191392 214664 -232112 -238163 190462 92108 272671 175500 -149606
6563a49606l3050p2245J26917J91058k2794j23283N7510o100l8180Q3182N3259
$$ -149606 -182656 -254901 -127984 63074 40280 -83003 -25493 -31593 -69773 13409 66668
6552F6668p361K6379O7924j00641j72434l5837K46066j38146p3846J32172J5910
$$ 66668 59307 85686 153610 52969 -119465 -155302 90764 -47382 -121228 10944 26854
6541B6854o7581m2246o4076L2153M1065q395j88900l36493K59101K48733L267
$$ 26854 -40727 -82973 -147049 -114896 -73831 -82226 -271126 -607619 -348518 -99785 -96518
6530i6518J75613j12488j77793r0941K84010J65887N883M3451j73890j4125j70377
$$ -96518 79095 -33393 -211186 -302127 -18117 147770 153653 197104 23214 9089 -161288
6519a61288K71383J00013l03628n4734J10563m7819m8094J99425N4192r0381J31572
$$ -161288 110095 210108 -93520 -148254 -37691 -85510 -133604 65821 120013 29632 161204
6508A61204k73802L1443o9732K11068O8115j74884K96611Q9576m8267j24770P2366
$$ 161204 -112598 -81155 -150887 60181 128296 -46588 250023 339599 291332 166562 238928
6497B38928q9399q6104r3272j34384R8549K185K04849L48781l93086L40J73641
$$ 238928 149529 63425 -29847 -164231 -65682 -63497 141352 490133 97047 97387 271028
6486B71028l4799n1505r1543p0971k9814k83910K65645J67460K10002k75683j18495
$$ 271028 236229 184724 93181 22210 -7604 -291514 -25869 141591 351593 75910 -42585
6475d2585J24261k853J56005l9024p9163j37725l3479K05694R1363j34291L9805
$$ -42585 81676 78823 234828 195804 116641 -21084 -54563 151131 242494 108203 148008
6464A48008j60588P6158J69429p4334Q985j95392j72987M02649J58163O5068j48966
$$ 148008 -12580 63578 233007 158673 167658 -27734 -200721 201928 360091 425159 276193
6453B76193q4671p2565m812J2293l8991J62729O4027n9369J52961k98946l60435
$$ 276193 191522 118957 114145 126438 87447 250176 314203 254834 407795 108849 -251586
6442b51586k4440K31961Q9103J84829j4673j36915J64510q9239q6733L55387o4785
$$ -251586 -276026 -44065 45038 229867 215194 78279 242789 153550 66817 422204 357419
6431C57419o4223j65234K4357k9875J9695K63986l85130J5948J12931m784K85279
$$ 357419 293196 127962 152319 122444 142139 406125 20995 36943 149874 145090 430369
6420D30369m3729n3674k57544n8827N9905J88322O1468R8125J01633l26646j49767
$$ 430369 386640 332966 75422 16595 76500 264822 326290 424415 526048 199402 49635
6409D9635N5440K55204j64079j12533L42745k07179j64905j1287K14838K14227
$$ 49635 105075 360279 196200 83667 426412 219233 54328 43041 257879 472106
6399D72106q70K99476l3261j15827J64791j85420k03854R8619q1089L8333K25054
$$ 472106 471236 770712 737451 621624 786415 600995 397141 495760 414671 453004 678058
6388F78058K5555j25814O2103O0514J13042J3567K28517J66848j29450j9309n3989
$$ 678058 703613 577799 639902 700416 813458 827025 1055542 1222390 1092940 1073631 1019642
6377A019642m3799l24947j84704Q6461l9942P2994N3940J00499j25515r9292P752
$$ 1019642 975843 650896 466192 552653 512711 585705 639645 740144 614629 515337 523089
6366E23089J28905Q8942M9383j00147k57367O4139R0247J06074k9225L3186K24869
$$ 523089 651994 740936 790319 690172 432805 496944 587191 693265 664040 697226 922095
6355I22095p4257j11007P1095J47898k42029j86080o7649J30000o6540j61923
$$ 922095 847838 736831 807926 955824 713795 527715 460066 590066 523526 361603
6345C61603n5125P7894N3803J26716j76738J33444J79502k39998N136J28505R1054
$$ 361603 306478 384372 438175 564891 388153 521597 701099 461101 466237 594742 685796
6334F85796o8899j3441K30865p5598J27804j11590m2933q1605k37825o9988N6691
$$ 685796 616897 603456 834321 758723 886527 774937 732004 650399 412574 342586 399277
6323C99277j03297k10074J31513K72612j76745m2619J73949J51420j08501j50141
$$ 399277 295980 85906 217419 490031 313286 270667 444616 596036 487535 337394
6313C37394j37734J76782j20911j14807P3812K81602j28039j57428J26276J82261
$$ 337394 199660 376442 255531 140724 214536 496138 368099 210671 336947 519208
6303E19208n4571M0576K44426k36588J27665j43338n8774M2117N4727j06307L9843
$$ 519208 464637 505213 749639 513051 640716 497378 438604 480721 535448 429141 468984
6292D68984j61523N2117p0016J69543M1621J74947p6572M7521K71791j14989q5743
$$ 468984 307461 359578 289562 459105 500726 675673 599101 646622 918413 803424 717681
6281G17681o8097k02490j41931j8517J78795k06309L8058j3824L20201R6039J36919
$$ 717681 649584 447094 305163 286646 465441 259132 297190 283366 603567 699606 836525
6270H36525j55255j02111j20968j74590K90916O3438q6617J02870N4519j52334
$$ 836525 681270 579159 458191 283601 574517 637955 551338 654208 708727 556393
6260E56393P1762K37452n3416M3071j67592j75578L7564Q3187N8548P9680r9425
$$ 556393 628155 865607 812191 855262 687670 512092 549656 632843 691391 771071 671646
6249F71646R3956L394k03544K66554j83404P0744K29016r3001j67310J67287j28530
$$ 671646 765602 768996 565452 832006 648602 719346 948362 855361 688051 855338 726808
6238G26808k57308m2913J19492r0753L5622N6361J25722M3125p4115p5025J19984
$$ 726808 469500 426587 546079 455326 490948 547309 673031 716156 642041 567016 687000
6227F87000j63514j03128J24225p6976P3502J4449M5030K48149k22389j01759
$$ 687000 523486 420358 544583 467607 541109 555558 600588 848737 626348 524589
6217E24589J26943J92897M9812J5457K18356o3358n9713q2784J3270l1935Q9975
$$ 524589 651532 844429 894241 909698 1128054 1064696 1004983 922199 935469 903534 993509
6206I93509j10571j25875J5878J81224o2701k59612O9226r218j95766K16345K19210
$$ 993509 882938 757063 772941 954165 891464 631852 701078 691860 496094 712439 931649
6195I31649k14713N9865o6062p4483R259j33805O2663j9315J95431M4589j25410
$$ 931649 716936 776801 710739 636256 645515 511710 574373 555058 750489 795078 669668
6184F69668M1033k64171j03502K37463R1330k3885l8005J51326K04535J1882p210
$$ 669668 710701 446530 343028 580491 671821 647936 609931 761257 965792 977674 970464
6173I70464k25470j26770J4029J84420K2948j24865J7434K94494N6557p0929j78280
$$ 970464 744994 618224 632253 816673 839621 714756 732190 1026684 1083241 1012312 834032
6162H34032J85856j53695j92896r5217j84414K73757J31696K05847j33666l1111
$$ 834032 1019888 866193 673297 578080 393666 667423 799119 1004966 871300 840189
6152H40189O3046k2682l43r8975o3871o3838K89075k79648l06385o1273K56374
$$ 840189 903235 880553 880210 781235 717364 653526 942601 662953 356568 295295 551669
6141E51669R4750J39399P457J89983o7492J14388L0413k3057o8182j44292K18856
$$ 551669 646419 785818 793275 983258 915766 1030154 1060567 1037510 969328 825036 1043892
6130A043892p7353j75055J5550K2100j11711K65345k3826j19560K31097M0349
$$ 1043892 966539 791484 807034 829134 717423 982768 958942 839382 1070479 1110828
6120A110828j55525o6227l5975K41913n0470j7019k8588J25419k0783M3001r1394
$$ 1110828 955303 889076 853101 1095014 1044544 1027525 998937 1124356 1103573 1146574 1055180
6109A055180M9173J40800q9843j68542m2370j2971J55884q5789K21985J19702
$$ 1055180 1104353 1245153 1155310 986768 944398 931427 1087311 1001522 1223507 1343209
6099A343209q0585O8404j19687O019J30954J11564O9489n982Q9644K81047p3371
$$ 1343209 1262624 1331028 1211341 1217360 1348314 1459878 1529367 1523385 1613029 1894076 1820705
6088A820705m8231J5005k19013R316R9737j96115j25744K53049K76122O4474j27571
$$ 1820705 1772474 1787479 1568466 1577782 1677519 1481404 1355660 1608709 1884831 1949305 1821734
6077A821734K6327q2243J2821K38038K16005j44303j85226p674q5945o1482J14218
$$ 1821734 1848061 1765818 1778639 2016677 2232682 2088379 1903153 1895479 1809534 1748052 1862270
6066A862270J63288q7361Q0932j632J50449k3910J61855O4846p7809J29873p2381
$$ 1862270 2025558 1938197 2019129 2017497 2167946 2144036 2305891 2370737 2292928 2422801 2350420
6055B350420P1344P7731N3259j98786L6265l5590R3715K89661N61924J16177j41283
$$ 2350420 2421764 2499495 2552754 2353968 2390233 2354643 2448358 2738019 3299943 3416120 3274837
6044C274837L5355K25025P5901J96733J20792J79702j00070J48759Q9632k83350
$$ 3274837 3310192 3535217 3611118 3807851 3928643 4108345 4008275 4157034 4246666 3963316
6034C963316Q1574P0911j36235m10536K41735m6111L5376L37183L23263o2824
$$ 3963316 4044890 4115801 3979566 3569030 3810765 3764654 3800030 4137213 4460476 4397652
6024D397652Q2024O7155J82493M12146K78452k3009J49347J86540J48238Q3455
$$ 4397652 4479676 4546831 4729324 5141470 5419922 5396913 5546260 5732800 5881038 5964493
6014E964493R0922r9275O9689j03108m3684K94701m20256R3548p0308n656J71182
$$ 5964493 6055415 5956140 6025829 5922721 5879037 6173738 5753482 5847030 5776722 5771066 5942248
6003E942248m2512J83517Q6483J31929J21957L48517K37863R8539M21713L17277
$$ 5942248 5899736 6083253 6169736 6301665 6423622 6772139 7010002 7108541 7530254 7847531
5993G847531J24253N43K68261L46062k43969j28383Q7384R2196K0191J00253n9846
$$ 7847531 7971784 7972327 8240588 8586650 8342681 8214298 8301682 8393878 8414069 8514322 8454476
5982H454476L47552N5907K29100L95362K0901N6671M56755M21886K60397R2279
$$ 8454476 8802028 8857935 9087035 9482397 9503298 9559969 10016724 10438610 10699007 10791286
5972A0791286L53991N15240K52448L57883N45702N70103L40947N45174M91520
$$ 10791286 11145277 11660517 11912965 12270848 12816550 13386653 13727600 14272774 14764294
5963A4764294P53842P42356N53580Q25539N48422Q40709J344006J352299J361549
$$ 14764294 15518136 16260492 16814072 17639611 18188033 19028742 20372748 21725047 23086596
5954B3086596J692808K321237K306319K599333L000126K528650K036277J419598
$$ 23086596 24779404 27100641 29406960 32006293 35006419 37535069 39571346 40990944
5946D0990944J731079L001660L742008N243964O113823N063097J887330k862203
$$ 40990944 42722023 45723683 49465691 54709655 60823478 65886575 67773905 64911702
5938F4911702n263555n376715m760811l499888k214590j348639n99784M22855
$$ 64911702 59648147 54271432 49510621 46010733 43796143 42447504 41847720 42270575
5930D2270575O75393J069579J397427J762662J907978K912556L755679N006780
$$ 42270575 42945968 44015547 45412974 47175636 49083614 51996170 55751849 60758629
5922F0758629N187714M591914L717694L127246L138842M754307P846269J0318390
$$ 60758629 65946343 70538257 74255951 77383197 80522039 85276346 93122615 103441005
5914A03441005J0759408O968318j203797r486791j3351111j2928499j0309793
$$ 103441005 114200413 121168731 119964934 110478143 97127032 84198533 73888740
5907G3888740p293343n023844l252400j840059j118117m96760k19103J11996L09897
$$ 73888740 66595397 61571553 58319153 56479094 55360977 54864217 54645114 54757110 55067007
5898E5067007N6711k87580j73950N9594M29118L79523N37044O25028R52197K437064
$$ 55067007 55123718 54836138 54662188 54721782 55150900 55530423 56067467 56692495 57644692 60081756
5888F0081756L598766M724887M739391J530643k659452n866688o976870o352368
$$ 60081756 63680522 68405409 73144800 74675443 72015991 66149303 59172433 52820065
5880E2820065m743096l226903j954170j134091n84777Q7323J31678K01021J039114
$$ 52820065 48076969 44850066 42895896 41761805 41177028 41264351 41396029 41597050 42636164
5871D2636164J031178J13953j486734l185396l667068l292825k913953k519680
$$ 42636164 43667342 43781295 42294561 39109165 35442097 32149272 29235319 26715639
5863B6715639k110758j497746j342681q62297n52195n42696n01041l74757l99807
$$ 26715639 24604881 23107135 21764454 20902157 20349962 19807266 19306225 18931468 18531661
5854A8531661l47982k15735j28999K5859O00211N13023K36952N86510N35815O30387
$$ 18531661 18183679 17967944 17838945 17864804 18465015 18978038 19214990 19801500 20337315 20967702
5844B0967702Q16841N04619k3556p09012j287138j747857j511425r32035p90036
$$ 20967702 21784543 22289162 22265606 21556594 20269456 18521599 17010174 16078139 15288103
5835A5288103o71772q46932j093544r66683o65764p93896m42515l10976m01304
$$ 15288103 14616331 13769399 12675855 11709172 11043408 10249512 9806997 9496021 9094717
5826I094717n74897m0559j74388l05441k24090j08111q1626k53565M7309k18552
$$ 9094717 8519820 8479261 8304873 7999432 7775342 7667231 7585605 7332040 7379349 7160797
5816G160797j25325L28803J17149k23827j94780J69872j61620L66190j94521l9623
$$ 7160797 7035472 7364275 7481424 7257597 7062817 7232689 7071069 7437259 7242738 7203115
5806G203115K12596M1436j69042m47606m30171n79972m11008n9006j04253l00112
$$ 7203115 7415711 7457147 7288105 6840499 6410328 5830356 5419348 5360342 5256089 4955977
5796D955977j72387k26849J59675j86030j26135j72422o7471J63318m9669k05316
$$ 4955977 4783590 4556741 4716416 4530386 4404251 4231829 4164358 4327676 4278007 4072691
5786D072691j5503j90368k87509J56462j22841j88657j05570J21178o4259k19613
$$ 4072691 4057188 3866820 3579311 3735773 3612932 3424275 3318705 3439883 3375624 3156011
5776C156011m5948k67769L6065M0531m3095j39207K94781j94368M492L1768J45083
$$ 3156011 3110063 2842294 2878359 2918890 2875795 2736588 3031369 2837001 2841493 2873261 3018344
5765C018344p2349k39968R75l0497j36084j23364L57750K35922k99069M2169j29132
$$ 3018344 2945995 2706027 2707002 2676505 2540421 2417057 2774807 3010729 2711660 2753829 2624697
5754B624697j81315M36385R2279k2099j77433J8880O4448j35669k20910J11872
$$ 2624697 2443382 2879767 2972046 2949947 2772514 2791394 2855842 2720173 2499263 2611135
5744B611135K187J31358M15037j4725L8690l3460j46014J24916j81719r0135Q9222
$$ 2611135 2613322 2744680 3159717 3144992 3183682 3150222 3004208 3129124 2947405 2857270 2946492
5733B946492k56961p8608K85718K3563k0099n2809k67098J09152J93811R4309
$$ 2946492 2689531 2610923 2896641 2920204 2900105 2847296 2580198 2689350 2883161 2977470
5723B977470j24281J21822J34491q9903l5102r0923K7633K18461M51475J50444
$$ 2977470 2853189 2975011 3109502 3019599 2984497 2893574 2921207 3139668 3591143 3741587
5713C741587K1534l48553j85220k12898m0024j80839J72458J2388k14800j17347
$$ 3741587 3763121 3414568 3229348 3016450 2976426 2795587 2968045 2980433 2765633 2648286
5703B648286K3282J3067k55979o311K11110L4989q8289j95123J38310l3926M5419
$$ 2648286 2671568 2684635 2428656 2422345 2633455 2668444 2580155 2385032 2523342 2489416 2534835
5692B534835J03918k7490J59921k92707M68904P3601k06772n3220J51326P8676
$$ 2534835 2638753 2611263 2771184 2478477 2947381 3020982 2814210 2760990 2912316 2990992
5682B990992m4713J28028R2351k85299j32875j32204j08187P086m9653N3803K38923
$$ 2990992 2946279 3074307 3166658 2881359 2748484 2616280 2508093 2515179 2465526 2519329 2758252
5671B758252O4919M1672l08791j34007j29739J58679J59414k5497r2545o7292
$$ 2758252 2823171 2864843 2556052 2422045 2292306 2450985 2610399 2584902 2492357 2425065
5661B425065M3174M3598j6566j22799J6836L4394J1035K47087J36572q3539J05479
$$ 2425065 2468239 2511837 2495271 2372472 2389308 2423702 2434737 2681824 2818396 2734857 2840336
5650B840336J71323J20980j94350P7691l41609Q6237N0334L82432j53625Q8164
$$ 2840336 3011659 3132639 2938289 3015980 2674371 2760608 2810942 3193374 3039749 3127913
5640C127913R4700j80220M04995j01982n1803R4060J71104J65127j9154M7740
$$ 3127913 3222613 3042393 3447388 3345406 3293603 3387663 3558767 3723894 3704740 3752480
5630C752480L387l176N4729J17539N7484j2267L07040J08522J06674j11256R975
$$ 3752480 3755867 3752691 3807420 3924959 3982443 3970176 4277216 4385738 4492412 4381156 4391131
5619D391131K15403p5025J68773Q6474K22876J71221o8277J76017L46526J30654
$$ 4391131 4606534 4531509 4700282 4786756 5009632 5180853 5112576 5288593 5635119 5765773
5609E765773o947j2139K1965J79698P0687J48058L59710K9981p9489K13818J45217
$$ 5765773 5758826 5746687 5768652 5948350 6019037 6167095 6526805 6556786 6477297 6691115 6836332
5598F836332K45221r263K38020K45974M42298l7449L43538L90857K24214M71149
$$ 6836332 7081553 7072290 7310310 7556284 7998582 7961133 8304671 8695528 8919742 9390891
5588I390891L01247J92210N49855N91040K52247M08377N53714N31356N18949K93845
$$ 9390891 9692138 9884348 10434203 11025243 11277490 11685867 12239581 12770937 13289886 13583731
5578A3583731O42027N08642O12061R11621Q19537Q94151R68704R98500J168459
$$ 13583731 14225758 14734400 15346461 16258082 17077619 17971770 18940474 19938974 21107433
5569B1107433J366428J276026J470418J548224J994259J665148J647717J660723
$$ 21107433 22473861 23749887 25220305 26768529 28762788 30427936 32075653 33736376
5561C3736376J647076J637138J634359J142045J098662O93900L40988m06506m87379
$$ 33736376 35383452 37020590 38654949 39796994 40895656 41589556 41930544 41524038 41036659
5552D1036659p04736m29025j88971p9510l31990J6071N01117N61375P55414R61467
$$ 41036659 40331923 39902898 39713927 39634417 39302427 39318498 39819615 40380990 41136404 42097871
5542D2097871J302752J582403J775292J585278J812404K279339K154287K140736
$$ 42097871 43400623 44983026 46758318 48343596 50156000 52435339 54589626 56730362
5534E6730362K070543J815907J341734P08122L50445p2826j030173j168337j384085
$$ 56730362 58800905 60616812 61958546 62666668 63017113 62944287 61914114 60745777 59361692
5525E9361692k120852k347778k284446k397719k006078j773203j850561j592912
$$ 59361692 57240840 54893062 52608616 50210897 48204819 46431616 44581055 42988143
5517D2988143j532601o92175o54804n25699l03559o8424J97163m4081J78164O21349
$$ 42988143 41455542 40763367 40108563 39582864 39279305 39210881 39408044 39363963 39542127 40163476
5507D0163476J26718K98536K48411J96841m41986q01001r80889j143785j355716
$$ 40163476 40290194 40588730 40837141 41033982 40591996 39790995 38810106 37666321 36310605
5498C6310605j400922j679423j978546j872275j663926j296674j341416j780009
$$ 36310605 34909683 33230260 31251714 29379439 27715513 26418839 25077423 23297414
5490B3297414j687853j168273q07151j047197p76776j006851j086397q31831n55503
$$ 23297414 21609561 20441288 19634137 18586940 17810164 16803313 15716916 14885085 14329582
5481A4329582o94322p25360l86301m54746n10211o06632n76944l64565j40469
$$ 14329582 13635260 12909900 12523599 12068853 11558642 10952010 10375066 10010501 9870032
5472I870032m35849k42593k84755n34790n8117l42104j10552k52720m07327m9184
$$ 9870032 9434183 9191590 8906835 8372045 8313928 7971824 7861272 7608552 7201225 7152041
5462G152041l55960j63565m28593P750r0858r6342N682j53437p5466k85373P209
$$ 7152041 6796081 6632516 6203923 6211673 6120815 6024473 6030155 5876718 5801252 5515879 5523088
5451E523088j6674j86973k54853n4138J29276k4885r336k03837N2J33141J57269
$$ 5523088 5506414 5319441 5064588 5010450 5139726 5114841 5105505 4901668 4901720 5034861 5192130
5440E192130q8274k79712J34333j28669j88944p4620k27874j85965O498j22514
$$ 5192130 5103856 4824144 4958477 4829808 4640864 4566244 4338370 4152405 4158903 4036389
5430D036389k45374j83982j16306J04332k24256K09619k8244j03677J13299m4785
$$ 4036389 3791015 3607033 3490727 3595059 3370803 3580422 3552178 3448501 3561800 3517015
5420C517015R0593q1040J22204j97262M3352J01874j67039j79616l1334j11571
$$ 3517015 3607608 3526568 3648772 3451510 3494862 3596736 3429697 3250081 3218747 3107176
5410C107176J17948j8131j92850j3605j4630J47579j37641J53248q4831Q1107
$$ 3107176 3225124 3206993 3014143 3000538 2985908 3133487 2995846 3149094 3064263 3145370
5400C145370J03235K7244K31490K84355R0188L24177J49868K37313J42983J033
$$ 3145370 3248605 3275849 3507339 3791694 3881882 4206059 4355927 4593240 4736223 4737256
5390D737256K79589j39925k31567l47745k64743l56855p0932j01771Q213K40263
$$ 4737256 5016845 4876920 4645353 4297608 4032865 3676010 3605078 3503307 3511520 3751783
5380C751783k37603O7579J67176l0105J90594k13566j74536M30609L41749J21302
$$ 3751783 3514180 3581759 3748935 3718830 3909424 3695858 3521322 3951931 4293680 4414982
5370D414982K24613K29169M11650M50994N20145K75280K88434K81153O7366k71650
$$ 4414982 4639595 4868764 5280414 5731408 6251553 6526833 6815267 7096420 7163786 6892136
5360F892136k30364q0726l57780j88299p9006j69127l63335m31372k24604j48778
$$ 6892136 6661772 6581046 6223266 6034967 5955961 5786834 5423499 4992127 4767523 4618745
5350D618745j31466j27879K62861L74481K84039L52739N7672K84009O0910M15918
$$ 4618745 4487279 4359400 4622261 4996742 5280781 5633520 5691192 5975201 6036111 6452029
5340F452029L77802M35645K48470J23617N4850l81521q3K9090R067L50673J1039
$$ 6452029 6829831 7265476 7513946 7637563 7692413 7310892 7310809 7339899 7348966 7699639 7710678
5329G710678j22532k59682m65370n40924o81839l2154m0058P7529J15707k13197
$$ 7710678 7588146 7328464 6863094 6322170 5640331 5608177 5568119 5645648 5761355 5548158
5319E548158K58319p0576j74722J84472O00942Q5208K611J05864O5377l485L41728
$$ 5548158 5806477 5735901 5561179 5745651 6346593 6431801 6434412 6540276 6605653 6602168 6943896
5308F943896M1229k99983m0600k1744P6733j76117j18040j38114n29129k02699
$$ 6943896 6985125 6685142 6644542 6622798 6699531 6523414 6405374 6267260 5738131 5535432
5298E535432p2937m74211r2972N2647m6175J18007J24732K03457k5286J4987K46572
$$ 5535432 5462495 4988284 4895312 4947959 4901784 5019791 5144523 5347980 5322694 5337681 5584253
5287E584253K75385K38068K94122P4901J21470K03664n08827j34663k65203k71328
$$ 5584253 5859638 6097706 6391828 6466729 6588199 6791863 6283036 6148373 5883170 5611842
5277E611842O233j42596l33367k02760j64419l95813k04763j06583j64283L5434
$$ 5611842 5618075 5475479 5142112 4939352 4774933 4379120 4174357 4067774 3903491 3938925
5267C938925K36320N1653l43549j40107J40412L02102m2288J53875J6662M76204
$$ 3938925 4175245 4226898 3883349 3743242 3883654 4185756 4143468 4297343 4314005 4790209
5257D790209J56318J79663L08827M03538P967l02725j60869l42416o60095n4629
$$ 4790209 4946527 5126190 5435017 5838555 5846522 5543797 5382928 5040512 4380417 4325788
5247D325788M6968J70118L1896J71925k71779m82508j40154l04557J3715N06958
$$ 4325788 4372756 4542874 4574770 4746695 4474916 3992408 3852254 3547697 3561412 4068370
5237D068370J98022j86537l31970K609Q3306K1946P7349K4148L66098K54844K53816
$$ 4068370 4266392 4079855 3747885 3750494 3833800 3855746 3933095 3957243 4323341 4578185 4832001
5226D832001K07782K58442M06051M21014M09332M49273L43398M11318L30444K82102
$$ 4832001 5039783 5298225 5704276 6125290 6534622 6983895 7327293 7738611 8069055 8351157
5216H351157j3785J30490n37536p60395j032450o00062q38602o30376j59417l83314
$$ 8351157 8337372 8467862 7930326 7169931 6137481 5537419 4698817 4068441 3909024 3525710
5206C525710k55840m53426q8072k20805q6191j09572j34138k6306j15277J66154
$$ 3525710 3269870 2816444 2728372 2507567 2421376 2311804 2177666 2151360 2036083 2202237
5196B202237k35967k75686o9657J20398o1931l11683J61259j41914j2738J32323
$$ 2202237 1966270 1690584 1620927 1741325 1679394 1367711 1528970 1387056 1374318 1506641
5186A506641j15681j51374R7567p8074l81434J44656M8510J66279k52876O060
$$ 1506641 1390960 1239586 1337153 1259079 877645 1022301 1070811 1237090 984214 990274
5176I90274J4219j8227j00440j22551J00066J05023l03575K8277L17840r8641
$$ 990274 1004493 986266 885826 763275 863341 968364 664789 693066 1010906 912265
5166I12265j18550L38034n29287j7807P7657q390J1734j07574K1008J24880N5771
$$ 912265 793715 1131749 602462 584655 662312 653922 665656 558082 579090 703970 759741
5155G59741n45K22320n1911j03718o7089M6931Q8719n5937k59687j13167K16576
$$ 759741 759196 981516 929605 825887 758798 805729 894448 838511 578824 465657 682233
5144F82233k7514N1228j1986k23545J57766o4573k21100J86228J48546l2463q6084
$$ 682233 654719 705947 693961 470416 628182 563609 342509 528737 677283 644820 558736
5133E58736j13168k555P8174j97255k13933K55251j13926n1499K9329k9433n8264
$$ 558736 445568 443013 521187 323932 109999 365250 251324 199825 229154 199721 141457
5122A41457J63997n0641k06798N2945n7732N5305J91309j5744M2049J30319j01260
$$ 141457 305454 254813 48015 100960 43228 98533 289842 274098 316147 446466 345206
5111C45206l0994K2238k44101j8664J84572J65786N3224o5202j57314R9209K360
$$ 345206 314212 336450 92349 73685 258257 424043 477267 412065 254751 353960 356320
5100C56320j71319p6712j59320J56632J08932j17253P2560j25738K18928r9622
$$ 356320 185001 108289 -51031 105601 214533 97280 169840 44102 263030 163408
5090A63408J05513r4773o9225q0075N6096j36583K2716J71039J43383K00656j34888
$$ 163408 268921 174148 104923 24848 80944 -55639 -32923 138116 281499 482155 347267
5079C47267r9626J27575j14748N7101K5716P8721p2435j80583l3007r8097n5708
$$ 347267 247641 375216 260468 317569 343285 422006 349571 168988 135981 37884 -17824
5068a7824l6617J26368J48727k18403l3896p1000L8065J3921K37601P756J05544
$$ -17824 -54441 71927 220654 2251 -31645 -102645 -64580 -50659 186942 194698 300242
5057C00242K08107j01978l22671J63603J4737j82772J18202l93997J48111j0585
$$ 300242 508349 406371 83700 247303 262040 79268 197470 -196527 -48416 -59001
5047e9001L37277n2917k04748q4355j1371j17940j09261J33999J45086J74001
$$ -59001 278276 225359 20611 -63744 -75115 -193055 -302316 -168317 -23231 150770
5037A50770j01479r833n0696O965K7754J77662j9558L7979j6606k47047J83294
$$ 150770 49291 39458 -11238 -4273 23481 201143 181585 219564 202958 -44089 139205
5026A39205j37594n9767O6181J63568J84643o8517j29460j19523j04082J31325
$$ 139205 1611 -58156 8025 171593 356236 287719 158259 38736 -65346 65979
5016F5979l74167L4658O5624J63192K29720M9679J20186m13379k54194K54946
$$ 65979 -308188 -273530 -207906 -44714 185006 234685 354871 -58508 -312702 -57756
5006e7756J26220j7216Q707m6329Q5526L23901k1611j29549k36208J33490P6974
$$ -57756 68464 51248 59955 13626 99152 423053 401442 271893 35685 169175 246149
4995B46149n0236P9131o0202k44162O2196O8573q8211J2211j44796r064J49615
$$ 246149 195913 275044 214842 -29320 32876 101449 13238 25449 -119347 -128411 21204
4984B1204j9009m5614j74218J17533J20556J32847K6151l6707j31843M4785o0640
$$ 21204 2195 -43419 -217637 -100104 20452 153299 179450 142743 10900 55685 -4955
4973d955j28431L4589O3212Q7743o8771R5819J10857m2432J97089j40502j45854
$$ -4955 -133386 -98797 -35585 52158 -16613 79206 190063 147631 344720 204218 58364
4962E8364j05235K09740J05009l0409K1034r6650J69515o069J51551j54149J81894
$$ 58364 -46871 162869 267878 237469 258503 161853 331368 325299 476850 322701 504595
4951E04595j86077q2687j98456J38425J54524J06817j38034m9414n195J15127
$$ 504595 318518 235831 37375 175800 330324 437141 299107 249693 244498 359625
4941C59625P3980k61786l0309J23761M4540O962j88963J92836J1479j75297j04892
$$ 359625 433605 171819 141510 265271 309811 316773 127810 320646 332125 156828 51936
4930E1936J78829o8150j2813j9035j103J92901Q5627j28317M4186j24399k47018
$$ 51936 230765 162615 149802 130767 129664 322565 408192 279875 324061 199662 -47356
4919d7356K29064j01640K8034k8629O3397L52185J04800j42390j66090O1785Q5736
$$ -47356 181708 80068 108102 79473 142870 495055 599855 457465 291375 353160 438896
4908D38896j78676k3956j86275P7455o2445O618J8107l5416J06819K70243k77422
$$ 438896 260220 236264 49989 127444 64999 71617 89724 54308 161127 431370 153948
4897A53948J04215k36948N8873J46148j45475r7633L1524O3309k5422l02485L68812
$$ 153948 258163 21215 80088 226236 80761 -16872 14652 77961 52539 -249946 118866
4886A18866p3059j76805L93361o9166l0696j9927J55906p6939J44025j51152J1057
$$ 118866 45807 -130998 262363 193197 162501 142574 298480 221541 365566 214414 225471
4875B25471j38193J22654o4544R9649j4329j80839K42705j05817j67653r3373
$$ 225471 87278 209932 145388 245037 230708 49869 292574 186757 19104 -74269
4865g4269q1260L28594r1972j98417m4584M2184q384K99139N7028n7243q8659
$$ -74269 -155529 173065 81093 -117324 -161908 -119724 -128108 171031 228059 170816 82157
4854H2157M9000J16654R7361J34479M6200m3338k46998j54653o1979M2434m7013
$$ 82157 131157 247811 345172 479651 525851 482513 235515 80862 18883 61317 14304
4843A4304L02151J7843p876l6433j8330L2195j20324j63952J46087j66590j04343
$$ 14304 316455 334298 326422 289989 271659 303854 183530 19578 165665 -925 -105268
4832a05268J10798J02670J13468j62507Q7060J50623J10912j1121j14038J91929
$$ -105268 5530 108200 221668 59161 146221 296844 407756 396635 282597 474526
4822D74526k15929r848o3867j6219R1485l8870q6487N9516l9985k46936J74024
$$ 474526 258597 248749 184882 168663 260148 221278 134791 194307 154322 -92614 81410
4811H1410M5009n5295J18615n1610q7312K17761Q2752k7448j83066m1847q7657
$$ 81410 126419 71124 189739 138129 50817 268578 351330 323882 140816 98969 11312
4800A1312K60976j7677J09902J60646k11429k39086R6901K82508J36477j63412
$$ 11312 272288 254611 364513 525159 313730 74644 171545 454053 590530 427118
4790D27118N491N5059M1429j06298J31148K61399R9785J29366N6815J28824P1589
$$ 427118 432609 487668 529097 422799 553947 815346 915131 1044497 1101312 1230136 1301725
4779A301725j14874L0175k45400j74074k55286q279K2800j6779q537l36367L3213
$$ 1301725 1186851 1217026 971626 797552 542266 533987 556787 540008 531471 195104 228317
4768B28317J22605n3121M3425k5830j94615L27276k73219P2633j20455J66808
$$ 228317 350922 297801 341226 315396 120781 448057 174838 247471 127016 293824
4758B93824R5617j75482M8887J75956j76519p382J54144l5514j63554j85086L48750
$$ 293824 389441 213959 262846 438802 262283 254901 409045 373531 209977 24891 373641
4747C73641l6983r4997o0638Q4755k6430J26191Q8955J98415J10418l88224P493
$$ 373641 336658 241661 181023 265778 239348 365539 454494 652909 763327 375103 382596
4736C82596q3755J80919L2609J52381m8101k52068O1237N8821Q3299j25914J07685
$$ 382596 298841 479760 512369 664750 616649 364581 425818 484639 567938 442024 549709
4725E49709J85213j13249J7135J2925l9688Q2645q1386j30180J81600M14208L02293
$$ 549709 734922 621673 638808 651733 612045 694690 613304 483124 664724 1078932 1381225
4714A381225l8799o2793o0373m6232j41557k96607j27370m2069L860J85074j66226
$$ 1381225 1342426 1279633 1219260 1173028 1031471 734864 607494 565425 569285 754359 588133
4703E88133p2666k04874o150Q3366r9854j94426J31039K47114j20584n5432Q2262
$$ 588133 515467 310593 304443 387809 287955 93529 224568 471682 351098 295666 377928
4692C77928J80164N6968o7351m46388j7148l457k11834K07059r0483O3572J39032
$$ 377928 558092 615060 547709 101321 84173 80716 -131118 75941 -14542 49030 188062
4681A88062J885J53018j24451j96479j69639O8043R8213R5909o5933L01326Q8548
$$ 188062 189947 342965 218514 22035 -147604 -79561 18652 114561 48628 349954 438502
4670D38502o0297j23107r7695J07062P5989K57764O2252j17031N1089j86826P8916
$$ 438502 378205 255098 157403 264465 340454 598218 660470 543439 594528 407702 486618
4659D86618j1685K27m3190P1377P865j12859j05765J1250P3640J42462j63545
$$ 486618 474933 475160 431970 503347 511212 398353 292588 303838 377478 519940 356395
4648C56395L5834j2786J23314J63947l00240m5012P1753J43130k2476k4771P0331
$$ 356395 392229 379443 502757 666704 366464 321452 393205 536335 513859 489088 559419
4637E59419j93192l14146K20367j9686o7464K93444j07680m4962k2630K3319M1721
$$ 559419 366227 52081 272448 252762 185298 478742 371062 326100 303470 326789 368510
4626C68510k02312j7210j61351J04725J02818K36498j21637o2681l8607Q6925
$$ 368510 166198 148988 -12363 92362 195180 431678 310041 247360 208753 295678
4616B95678J59926j22773N4826k28488R5026J15485j11749P1720J56086J66465
$$ 295678 455604 332831 387657 159169 254195 369680 257931 329651 485737 652202
4606F52202k9034l8203k86015k55598K21934K26318k21949j93818K92470K3407
$$ 652202 623168 584965 298950 43352 265286 491604 269655 75837 368307 391714
4596C91714K11887K5839J76475L4286o3018j42543j91785O5134K11280m7431m8997
$$ 391714 603601 629440 805915 840201 777183 634640 442855 507989 719269 671838 622841
4585F22841J30513j57471n1816k9732j68834j26931M15268K55875Q4870k02112
$$ 622841 753354 595883 544067 514335 345501 218570 633838 889713 974583 772471
4575G72471k5225J23931j01725l42619J0148l8864L6932K13056N5110k17625j00169
$$ 772471 747246 871177 769452 426833 436981 398117 435049 648105 703215 485590 385421
4564C85421J42309J34262r99P6562J34976J5592k67387R2106j15370j3778l9359
$$ 385421 527730 661992 660993 737555 872531 888123 620736 712842 597472 583694 544335
4553E44335l2771J36748J04672K39662j62939j73620j41313Q1043J78175r653
$$ 544335 511564 648312 752984 992646 829707 656087 514774 595817 773992 764339
4543G64339r8551k4599k1216J79337j66241J2168P2005O9820K22965R0161M3373
$$ 764339 665788 641189 619973 799310 633069 645237 717242 787062 1010027 1100188 1143561
4532A143561k9205j35762o0968p2116J08488K861Q060P9589j3010K22359J61983
$$ 1143561 1114356 978594 917626 845510 953998 956859 964919 1044508 1031498 1253857 1415840
4521A415840j47305J62668R7722K823K36776J05508L53837r2044m99644p7290
$$ 1415840 1268535 1431203 1528925 1531748 1768524 1874032 2227869 2135825 1636181 1558891
4511A558891J26739m04807j00986k338J77521m50k72287j52251j7193O1432O3809
$$ 1558891 1685630 1280823 1179837 1177499 1355020 1354570 1082283 930032 912839 974271 1038080
4500A038080J6480J77142O2060k01439P8306J12733J00336q1445j91399J15341
$$ 1038080 1054560 1231702 1293762 1092323 1170629 1283362 1383698 1302253 1110854 1226195
4490A226195r0817l7825m6069J9885M9909J30324K06032l9511O1364L8909K08492
$$ 1226195 1135378 1097553 1051484 1071369 1121278 1251602 1457634 1418123 1479487 1518396 1726888
4479A726888k69262n7590P3408J51245o6235k52300J3514J86522j59695Q2474
$$ 1726888 1457626 1400036 1473444 1624689 1558454 1306154 1319668 1506190 1346495 1428969
4469A428969o9989J69723p2900L7354M4643j57937l5469M5542L46612R6067l33643
$$ 1428969 1358980 1528703 1455803 1493157 1537800 1379863 1344394 1389936 1736548 1832615 1498972
4458A498972J4210r9643j80467L20346N5090o7757K30768J29301K63429k6184
$$ 1498972 1513182 1413539 1233072 1553418 1608508 1540751 1771519 1900820 2164249 2138065
4448B138065Q4333o2020j12923K10944R6619L39443L18022N4988L19471L74707
$$ 2138065 2222398 2160378 2047455 2258399 2355018 2694461 3012483 3067471 3386942 3761649
4438C761649L2772j62687m63023l75091k18061J78186m7216j35377k93650P61
$$ 3761649 3794421 3631734 3168711 2793620 2575559 2753745 2706529 2571152 2277502 2278263
4428B278263M7590k60239J85593J31980l8703L2269R4248q4447O7587R6998j73117
$$ 2278263 2325853 2065614 2251207 2383187 2344484 2376753 2471001 2386554 2454141 2551139 2378022
4417B378022K31647j99874P6462N1283K80598R3175j68324J14144K88123P5414
$$ 2378022 2609669 2409795 2486257 2537540 2818138 2911313 2742989 2857133 3145256 3220670
4407C220670l2909K52193K55855N834J36433J23912L16193m3712J45886J83510
$$ 3220670 3187761 3439954 3695809 3701643 3838076 3961988 4278181 4234469 4380355 4563865
4397D563865L01316J3763L27232N57696Q80676L98182J40179k82851n40377k11424
$$ 4563865 4865181 4878944 5206176 5763872 6644548 7042730 7182909 6900058 6359681 6148257
4387F148257l95221l05902k32162p0608j53903K12148n8995j21903k5832m1182
$$ 6148257 5753036 5447134 5214972 5144364 4990461 5202609 5143614 5021711 4995879 4954697
4377D954697k9927J64059L5414K54856P0283L2634K7657K59737L3775k28551j97606
$$ 4954697 4924770 5088829 5124243 5379099 5449382 5482016 5509673 5769410 5803185 5574634 5377028
4366E377028k25616l34396M5415J03236k97552j925K06166k6450l72984J84422
$$ 5377028 5151412 4817016 4862431 4965667 4668115 4666190 4872356 4845906 4472922 4657344
4356D657344L73256j80434J14180j15508J35114L15749J44441K7235n63L35603
$$ 4657344 5030600 4850166 4964346 4848838 4983952 5299701 5444142 5471377 5470814 5806417
4346E806417Q6846K54507p399O0019Q0344k81768j56519j94400J2612o5002P6404
$$ 5806417 5893263 6147770 6140371 6200390 6280734 5998966 5842447 5648047 5660659 5595657 5672061
4335E672061j87508k7176l547K43873J8142m4776J62725M22510L10472N29152
$$ 5672061 5484553 5457377 5453830 5697703 5715845 5671069 5833794 6256304 6566776 7095928
4325G095928N25845N62557P49030O92551O22749M58383o9340l89017n95176j20826
$$ 7095928 7621773 8184330 8933360 9625911 10248660 10707043 10637703 10248686 9653510 9532684
4315I532684p11369m04789k92683q1687k02906m64746j49281m48271j35397k15336
$$ 9532684 8821315 8416526 8123843 8042156 7839250 7374504 7225223 6776952 6641555 6426219
4305F426219j87870p8451J57823k76243q3189Q6862O5026M52509K20622j11110
$$ 6426219 6238349 6159898 6317721 6041478 5958289 6045151 6110177 6562686 6783308 6672198
4295F672198J73678K71184O17232M11072M08143M75482K12233r4563m13518p84771
$$ 6672198 6845876 7117060 7734292 8145364 8553507 9028989 9241222 9146659 8733141 7948370
4285G948370n07733o03156k96816R26j56023j12194j58492K34001R4743p6003
$$ 7948370 7440637 6837481 6540665 6541591 6385568 6273374 6114882 6348883 6443626 6367623
4275F367623p5868J9472M94652j78186J09084J59144O7465L7071J84252J99661
$$ 6367623 6291755 6311227 6805879 6627693 6736777 6895921 6963386 7000457 7184709 7384370
4265G384370L23636K47000N29332L84030N08198R09310J270219Q29457L04560
$$ 7384370 7708006 7955006 8484338 8868368 9376566 10285876 11556095 12385552 12690112
4256A2690112n91108o62490o98872o55465l47935n33969n2927k09500k6257q5
$$ 12690112 12099004 11436514 10737642 10082177 9734242 9200273 9147346 8937846 8911589 8911504
4246H911504k6533J39590P3714j63059l3744N9296J76972o3j3967J78878M31289
$$ 8911504 8884971 9024561 9098275 8935216 8901472 8960768 9137740 9137677 9123710 9302588 9733877
4235I733877L04419o1393Q7407K96901K25290L63281L04829J77255J86772J69696
$$ 9733877 10038296 9976903 10064310 10361211 10586501 10949782 11254611 11431866 11618638 11788334
4225A1788334K33703L15092K94535M76702L35651L55127N98903L43734j16824
$$ 11788334 12022037 12337129 12631664 13108366 13444017 13799144 14398047 14741781 14624957
4216A4624957r6387J60348k1489M59191M48141K54314j1922K27564M78332N35450
$$ 14624957 14528570 14688918 14667429 15126620 15574761 15829075 15817153 16044717 16523049 17058499
4206A7058499L89976K92823L67580K03149K91544K17880L64998M56609L70261
$$ 17058499 17448475 17741298 18108878 18312027 18603571 18821451 19186449 19643058 20013319
4197B0013319L53794L99971K73931O80369O42631P52031Q05818P02373Q51053
$$ 20013319 20367113 20767084 21041015 21721384 22364015 23116046 23921864 24624237 25475290
4188B5475290R04147R25608J442041R72564Q90887J242440J029371J196556J341772
$$ 25475290 26379437 27305045 28747086 29719650 30610537 31852977 32882348 34078904 35420676
4179C5420676J277278J540692J223839J381731K031588K050048J537877K222730
$$ 35420676 36697954 38238646 39462485 40844216 42875804 44925852 46463729 48686459
4171D8686459K741983K838239L214425L722381M302227N034245N560411O625488
$$ 48686459 51428442 54266681 57481106 61203487 65505714 70539959 76100370 82725858
4163H2725858P941582R469126J1221008J3508716J5597622J8746041K3728630
$$ 82725858 90667440 100136566 111357574 124866290 140463912 159209953 182938583
4156A82938583L0280957L6957675M2617712M4281861L9216880J8031912j4416268
$$ 182938583 213219540 250177215 292794927 337076788 376293668 394325580 379909312
4149C79909312m2231473n5075775m8699586l8068031k8891923k3466857j9812537
$$ 379909312 337677839 282602064 233902478 195834447 166942524 143475667 123663130
4142A23663130j5919501j2618269j0113390p723611o098302n112963m357923l840757
$$ 123663130 107743629 95125360 85011970 77288359 71190057 66077094 61719171 57878414
4134E7878414l418766l115086k394114k299030k371587j851321j678799j766943
$$ 57878414 54459648 51344562 48950448 46651418 44279831 42428510 40749711 38982768
4126C8982768j593427j428932r83547j188066q03487l98214j27823p6971j74364
$$ 38982768 37389341 35960409 34976862 33788796 32985309 32587095 32459272 32382301 32207937
4117C2207937L4139l67504q64982j349243j303244r96979o84569m84467k46695
$$ 32207937 32242076 31874572 31009590 29660347 28357103 27360124 26675555 26191088 25944393
4108B5944393j88376q1142p141l55662L2365M86893N86854J446945J615301J885708
$$ 25944393 25756017 25674875 25667734 25312072 25344437 25831330 26418184 27865129 29480430 31366138
4098C1366138J633722O38125k08311j004527j647699j682182j636650j644370
$$ 31366138 32999860 33637985 33429674 32425147 30777448 29095266 27458616 25814246
4090B5814246j152523j376278j447421j354997j116057p45792n27895k70263l07174
$$ 25814246 24661723 23285445 21838024 20483027 19366970 18621178 18093283 17823020 17515846
4081A7515846J41320l53681j34449k03818m71068k06897k49523l37299l87392
$$ 17515846 17657166 17303485 17169036 16965218 16494150 16287253 16037730 15700431 15313039
4072A5313039J93208Q3798j30031K13528N75469M95828Q71318R21045J105237
$$ 15313039 15506247 15590045 15460014 15673542 16249011 16744839 17616157 18537202 19642439
4063A9642439J009794N14912k16150q78582j059287j205397q05855q16154o78878
$$ 19642439 20652233 21167145 20950995 20072413 19013126 17807729 17001874 16185720 15506842
4054A5506842k68257r5435K22396j28720k39036N5697J31373K59399K01983K26747
$$ 15506842 15238585 15143150 15365546 15236826 14997790 15053487 15184860 15444259 15646242 15872989
4044A5872989L99090L73791N11397L81772O60826R98453J171531J602881J668694
$$ 15872989 16272079 16645870 17157267 17539039 18199865 19198318 20369849 21972730 23641424
4035B3641424J666101Q92051l73431j134400j520990j548226j389400p39552p40073
$$ 23641424 25307525 26199576 25826145 24691745 23170755 21622529 20233129 19493577 18753504
4026A8753504l01316o06305l57875L28081j18207R5603J96205M51373M15920K89995
$$ 18753504 18452188 17845883 17488008 17816089 17697882 17793485 17989690 18441063 18856983 19146978
4016A9146978K86712M39218L72057O30598N44056P81750Q50537J177465J012633
$$ 19146978 19433690 19872908 20244965 20875563 21419619 22201369 23051906 24229371 25242004
4007B5242004J238515J031181L33759J155n07374n53829j96960L97919K48937
$$ 25242004 26480519 27511700 27845459 27846614 27339240 26785411 26588451 26986370 27235307
3998B7235307P70448J183348J696975K152491J989941J395460O98218J14648l76877
$$ 27235307 28005755 29189103 30886078 33038569 35028510 36423970 37122188 37236836 36859959
3989C6859959p7088M05618L77877l05361p87978n40994k59259L33448R63503J592974
$$ 36859959 36782871 37188489 37566366 37261005 36473027 35932033 35672774 36006222 36969725 38562699
3979C8562699J822404J129286K58213K646O62063J337616J878863K568552K853703
$$ 38562699 40385103 41514389 41772602 41775248 42437311 43774927 45653790 48222342 51076045
3970E1076045M323194N463651O302552O651482N463395K472989j167551l606729
$$ 51076045 55399239 60862890 67165442 73816924 79280319 81753308 80585757 76979028
3962G6979028l809531l011505j506071P26775L157908O043226Q458498J0187452
$$ 76979028 73169497 70157992 68651921 69378696 72536604 78579830 87038328 97225780
3954I7225780P661000r30791r682580j0989211q300259n585504l908133k343043
$$ 97225780 104886780 103955989 94273409 83284198 74983939 69398435 65490302 63147259
3946F3147259j251176M4924J416203K735062M726728O255730O896272O115339
$$ 63147259 61896083 61941007 63357210 66092272 70819000 77074730 83971002 90086341
3938I0086341L127984k098243o668579q809600q980029p698384n719757m609620
$$ 90086341 93214325 91116082 84447503 75637903 66657874 58959490 53239733 48630113
3930D8630113l248686k318406j944186j714529q87618p21516o10117K3916J34928
$$ 48630113 45381427 43063021 41118835 39404306 38516688 37795172 37185055 37208971 37343899
3921C7343899L93867R17755Q57740J360397J833199K455972L052957L945600M767127
$$ 37343899 37737766 38655521 39513261 40873658 42706857 45162829 48215786 52161386 56928513
3912E6928513M905250L134349J28708k782072n345514n662125n053202m328873
$$ 56928513 61833763 64968112 65096820 62314748 56969234 51307109 46253907 41925034
3904D1925034l274808k384687j740834r53646r31244q88462n15423k22153k41441
$$ 41925034 38650226 36265539 34524705 33571059 32639815 31751353 31235930 31013777 30772336
3895C0772336J92782l9240M16152K32675K09868P40351O21447R88032R23102J229565
$$ 30772336 30965118 30925878 31342030 31574705 31784573 32524924 33146371 34134403 35057505 36287070
3885C6287070J354509J422964L36757m99332q28847j404558j276017j095438o68710
$$ 36287070 37641579 39064543 39401300 38901968 38073121 36668563 35392546 34297108 33628398
3876C3628398m85523n40792n29606l5220l87281m02709K6557k83582k54028r1411
$$ 33628398 33142875 32602083 32072477 32037257 31649976 31247267 31273824 30990242 30736214 30644803
3866C0644803k53028m3821j94463l8959k78331o62483j41309n44048m93498n54863
$$ 30644803 30391775 30347954 30153491 30114532 29836201 29173718 29032409 28488361 27994863 27440000
3856B7440000p81278m98908l79253o94784o60019l32266n33825l12451k59596
$$ 27440000 26658722 26159814 25780561 25085777 24425758 24093492 23559667 23247216 22987620
3847B2987620n44868o01603l23264n04132m78418m24954m04742k59374k16677
$$ 22987620 22442752 21841149 21517885 21013753 20535335 20110381 19705639 19446265 19229588
3838A9229588j95603m07439m16488m61730n24509j59333m15940m43255l87550
$$ 19229588 19033985 18626546 18210058 17748328 17223819 17064486 16648546 16205291 15817741
3829A5817741n11613Q7931k56517j53007j06675j7923k44384m9000j12344q2404
$$ 15817741 15306128 15394059 15137542 14984535 14877860 14859937 14615553 14566553 14454209 14371805
3819A4371805k23545k80145j16601k01332k9720l50183k03335Q0342K25841m7761
$$ 14371805 14148260 13868115 13751514 13550182 13520462 13170279 12966944 13047286 13273127 13225366
3809A3225366P1940K62426Q7777M7140o0162J50213J66901j88106k24604k27218
$$ 13225366 13297306 13559732 13647509 13694649 13634487 13784700 13951601 13763495 13538891 13311673
3799A3311673J57300j89366j18722k37399j69757j54245r5228j95703k64613j64734
$$ 13311673 13468973 13279607 13160885 12923486 12753729 12599484 12504256 12308553 12043940 11879206
3789A1879206k46317J46458N8264o7290k13974J21700L23278K38153O4085K49250
$$ 11879206 11632889 11779347 11837611 11770321 11556347 11678047 12001325 12239478 12303563 12552813
3779A2552813L52842L31307K50463k81812l31700J37619j73532k63027k83823
$$ 12552813 12905655 13236962 13487425 13205613 12873913 13011532 12838000 12574973 12291150
3770A2291150n1632J45631J95798K92854q7644l46648j12085q1495J63503K59631
$$ 12291150 12239518 12385149 12580947 12873801 12786157 12439509 12327424 12245929 12409432 12669063
3760A2669063J91681J37768R691N41616J04701M29602M64195L18447L16044K63250
$$ 12669063 12860744 12998512 13008203 13549819 13654520 14084122 14548317 14866764 15182808 15446058
3750A5446058J44117o6820M9077Q794k10964r5340M7227J77725K13636m1306o0650
$$ 15446058 15590175 15523355 15572432 15581226 15370262 15274922 15322149 15499874 15713510 15672204 15611554
3739A5611554J07803L24286K27725l10732J09134L03322n570K18513m5190R44
$$ 15611554 15719357 16043643 16271368 15960636 16069770 16373092 16367522 16586035 16540845 16541789
3729A6541789K92999K25155K74454J23956k10026m49380k21332k74521m11583
$$ 16541789 16834788 17059943 17334397 17458353 17248327 16798947 16577615 16303094 15891511
3720A5891511l83102n48148n15906m01136j44054n02075n29708m97653k07628
$$ 15891511 15508409 14960261 14444355 14043219 13899165 13397090 12867382 12369729 12162101
3711A2162101j50369n05679l83872j09306k66125j56206l89752l34717m12408
$$ 12162101 12011732 11506053 11122181 11012875 10746750 10590544 10200792 9866075 9453667
3702I453667k40197p0604k76393j36759j07057l36969l19424l64145n57179j09091
$$ 9453667 9213470 9142866 8866473 8729714 8622657 8285688 7966264 7602119 7044940 6935849
3692F935849j66280n14676k34450Q8979j09092k40943K1807j59368l50792j48364
$$ 6935849 6769569 6254893 6020443 6109422 6000330 5759387 5781194 5621826 5271034 5122670
3682E122670m849N3078k17249q4093l36795k19618J20605k83801r6430r4919q8242
$$ 5122670 5117821 5170899 4953650 4869557 4532762 4313144 4433749 4149948 4053518 3958599 3870357
3671C870357n0685j59713j7255M5649l99962R1212Q8178Q5351l47942n2094P7738
$$ 3870357 3819672 3659959 3642704 3688353 3288391 3379603 3467781 3553132 3205190 3153096 3230834
3660C230834j03780O0278J31296N1133k55946o7374n7277m6662k6850j17368J15465
$$ 3230834 3127054 3187332 3318628 3369761 3113815 3046441 2989164 2942502 2915652 2798284 2913749
3649B913749K9552l16514J95169q4523j33042K9826J40819k49075J29139j1798
$$ 2913749 2943301 2626787 2821956 2737433 2604391 2634217 2775036 2525961 2655100 2643302
3639B643302k77191j11959l20724k70182Q4830J56332K56501k16727k42884q3671
$$ 2643302 2366111 2254152 1933428 1663246 1748076 1904408 2160909 1944182 1701298 1617627
3629A617627l059P9005l670N3009N5785k42843P637J10967k51369J57038P9802
$$ 1617627 1614568 1693573 1689903 1742912 1798697 1555854 1563491 1674458 1423089 1580127 1659929
3618A659929k08160J403j33992R9621j02337j66643r1813L0780o3674j01286n8331
$$ 1659929 1451769 1453172 1319180 1418801 1316464 1149821 1058008 1088788 1025114 923828 865497
3607H65497J46596L92611j03405j23665j68600k8558J09152K728j74498P5120
$$ 865497 1012093 1404704 1301299 1177634 1009034 980476 1089628 1092356 917858 992978
3597I92978J97058k60446j43837k3203j86271J86022J84584l8179j43200N391
$$ 992978 1190036 929590 785753 762550 576279 762301 946885 908706 765506 770897
3587G70897j91935l0257O6273p5496J25113K13439J21835j7567j33337O6476J18951
$$ 770897 578962 548705 614978 539482 664595 878034 999869 982302 848965 915441 1034392
3576A034392q0714J19755K9376j5397L5306l6605K10627o2411m2835r5239j71715
$$ 1034392 953678 1073433 1102809 1087412 1122718 1086113 1296740 1234329 1191494 1096255 924540
3565I24540k11919K0189K85464J48341p8222l17844J56790J31990L092J85048
$$ 924540 712621 732810 1018274 1166615 1088393 770549 927339 1059329 1062421 1247469
3555A247469k75674r2156j03342M0608J44595l75815K07574n4771k8560K85865
$$ 1247469 971795 879639 776297 816905 961500 585685 793259 738488 709928 995793
3545I95793j12387O8529k63681r9055J86451J20805J78042j79162O5152J33974
$$ 995793 883406 951935 688254 589199 775650 896455 1074497 895335 960487 1094461
3535A094461k36351J79288M1293m3088P5186L0170l7816K79054k93426k86690
$$ 1094461 858110 1037398 1078691 1035603 1110789 1140959 1103143 1382197 1088771 802081
3525H02081J63864p4513p6070K99234K44204r1736K4771R7514j38008k99855k04089
$$ 802081 965945 891432 815362 1114596 1358800 1267064 1291835 1389349 1251341 951486 747397
3514G47397K9438K24211j34131j0827k59697k50460J82042L13956k89599l24044
$$ 747397 776835 1001046 866915 856088 596391 345931 527973 841929 552330 228286
3504B28286R0205K63568K80605K61332j79872j92129J50651J4533l10151M3330
$$ 228286 318491 582059 862664 1123996 944124 751995 902646 917179 607028 650358
3494F50358j59030J70362L85027k08571j59820R9306k7365J03881k1205j15908
$$ 650358 491328 661690 1046717 838146 678326 777632 750267 854148 832943 717035
3484G17035k05955J81066K66892N1786k99118m3347J5585r6946J07874p7912Q5832
$$ 717035 511080 692146 959038 1010824 711706 668359 683944 586998 694872 616960 702792
3473G02792j10441Q5805K6398J61730j22759J24738J3444r7190M37820q6630l45561
$$ 702792 592351 678156 704554 866284 743525 868263 881707 784517 1222337 1135707 790146
3462G90146k10603R4020P1655O8450J40384l82862p19K44652J49574K01230K9324
$$ 790146 579543 673563 745218 813668 954052 571190 570471 815123 964697 1165927 1195251
3451A195251j34921k82118K34364M6397j86892N5204L06076j9672j31623K04482
$$ 1195251 1060330 778212 1012576 1058973 872081 927285 1233361 1213689 1082066 1286548
3441A286548K42844j12726L1692K48339L04896L03389L22895N10815J14922P1877
$$ 1286548 1529392 1416666 1448358 1696697 2001593 2304982 2627877 3138692 3253614 3325491
3431C325491o37926l04570n36108j53287k06488Q3102m56467R6925K30141o8775
$$ 3325491 2687565 2382995 1846887 1693600 1487112 1570214 1113747 1210672 1440813 1372038
3421A372038K3942l019p7113L1738q1304p1227K67253k35703P5878K64958J09425
$$ 1372038 1395980 1392961 1315848 1347586 1266282 1195055 1462308 1226605 1302483 1567441 1676866
3410A676866J61561K46505K22540M59883K55503N32655Q00381O65782P14427J17146
$$ 1676866 1838427 2084932 2307472 2767355 3022858 3555513 4355894 5021676 5736103 5853249
3400E853249n87092o51621p00010l80336n39750l88708k10118r3956k69477m5481
$$ 5853249 5266157 4614536 3914526 3534190 2994440 2605732 2395614 2301658 2032181 1986700
3390A986700J26046J05636j58558k79815j05846k7952k8053k36432K07909L10154
$$ 1986700 2112746 2218382 2059824 1780009 1674163 1646211 1618158 1381726 1589635 1899789
3380A899789J82390k298O0297J04534j12475L69106K56348K92458J62535L51808
$$ 1899789 2082179 2079881 2140178 2244712 2132237 2501343 2757691 3050149 3212684 3564492
3370C564492N13723j9879m51096k80175l80897n59577j20862q4973K58015j43839
$$ 3564492 4078215 4058336 3607240 3327065 2946168 2386591 2265729 2180756 2438771 2294932
3360B294932M8729J17096l57152J02147j88804l458M7468J8528k02027j90346
$$ 2294932 2343661 2460757 2103605 2205752 2016948 2013490 2060958 2079486 1877459 1687113
3350A687113K34334J01913j53755k00931K4531P3622r9998Q6236j44034k0286
$$ 1687113 1921447 2023360 1869605 1668674 1693205 1766827 1666829 1753065 1609031 1588745
3340A588745O6754K60264j68775K32131J49469r8242j55120L9057J66852J01445
$$ 1588745 1655499 1915763 1746988 1979119 2128588 2030346 1875226 1914283 2081135 2182580
3330B182580L3340k34019j6282l2881Q0742p6025j12417R5716J31595L73019k74187
$$ 2182580 2215920 1981901 1965619 1932738 2013480 1937455 1825038 1920754 2052349 2425368 2151181
3319B151181P7987r2244L53813L03344k55476J84404J63973K49835j77646J14853
$$ 2151181 2229168 2136924 2490737 2794081 2538605 2723009 2886982 3136817 2959171 3074024
3309C074024J36140r204K93368L73837J56621K06738K89623P413m49614l36841
$$ 3074024 3210164 3200960 3494328 3868165 4024786 4231524 4521147 4528560 4078946 3742105
3299C742105l01955q3210j81158J66542j64070k13763J06927M8937p8596J03670
$$ 3742105 3440150 3356940 3175782 3342324 3178254 2964491 3071418 3120355 3041759 3145429
3289C145429k24772M9785K54386Q9449n6510l8229m6523K59388M04634N1736K11491
$$ 3145429 2920657 2970442 3224828 3314277 3257767 3219538 3173015 3432403 3837037 3888773 4100264
3278D100264J120j43941K70046J34432l0306K47359M52455L36981l628j03027
$$ 4100264 4101384 3957443 4227489 4361921 4331615 4578974 5031429 5368410 5364782 5261755
3268E261755l55794l90257m4754k78407j92588o8270j7046M0017p8964j7026J36772
$$ 5261755 4905961 4515704 4470950 4192543 3999955 3931685 3914639 3954656 3875692 3858666 3995438
3257C995438J22341K65458n5369K93390K43837O875K00716K05392J44434L15364
$$ 3995438 4117779 4383237 4327868 4621258 4865095 4871970 5072686 5278078 5422512 5737876
3247E737876N9621L39223K53517J48507o4292k4371L60201k37567l8650L31467
$$ 5737876 5797497 6136720 6390237 6538744 6474452 6450081 6810282 6572715 6534065 6865532
3237F865532m32187n91993m64985m80989k73663o23379j34242l18957k90186m1057
$$ 6865532 6433345 5841352 5376367 4895378 4621715 3998336 3864094 3545137 3254951 3213894
3227C213894k87419k42278M9669J04572k27066m8526j40186J88708l3443j91084
$$ 3213894 2926475 2684197 2733866 2838438 2611372 2562846 2422660 2611368 2577925 2386841
3217B386841p8407m3526K0952j86863j22430j11336M1069l7237m8853j98661n849
$$ 2386841 2308434 2264908 2285860 2098997 1976567 1865231 1906300 1869063 1820210 1621549 1615700
3206A615700j71313J71673N5508j78737r5297j73954J59894J10789J0130q4606
$$ 1615700 1444387 1616060 1671568 1492831 1397534 1223580 1383474 1494263 1504393 1419787
3196A419787M468O708j57174J25383k57860J138J14081j69630n4259J28791k17663
$$ 1419787 1424255 1430963 1273789 1399172 1141312 1142450 1256531 1086901 1032642 1161433 943770
3185I43770Q0798M0317o8192R1202j56445j58047K08964j11167l52528K34976
$$ 943770 1024568 1064885 996693 1087895 931450 773403 982367 871200 518672 753648
3175G53648K46802j22727j40540n1631N6293m1811L1036N475J72566k7286r4016
$$ 753648 1000450 877723 737183 685552 741845 700034 731070 736545 909111 881825 787809
3164G87809j35364n4325J08885j86403k4111r5867K167L27698k8161P7982k65381
$$ 787809 652445 598120 707005 520602 496491 400624 402791 730489 702328 780310 514929
3153E14929j19293r8973M007r5970N4799L43052L3645O8368L1436j11640m2417
$$ 514929 395636 296663 300670 204700 259499 602551 636196 704564 736000 624360 581943
3142E81943r8074j18423l2771Q2908J39436k31269r3743Q3730K24769k46873M9992
$$ 581943 483869 365446 332675 415583 555019 323750 230007 313737 538506 291633 341625
3131C41625Q5730k28314J30355O8371j2415q3037m1140N3208l47571J65458K18152
$$ 341625 427355 199041 329396 397767 385352 302315 261175 314383 -33188 132270 350422
3120C50422l084J57755n5267j91405j36813J9377Q5942Q1454J89655j5272k96990
$$ 350422 347338 505093 449826 258421 121608 140985 226927 308381 498036 482764 185774
3109A85774j24209n0507o3464Q1987R9787K51846j46877k22353j51378K02247
$$ 185774 61565 11058 -52406 29581 129368 381214 234337 11984 -139394 62853
3099F2853r7067K54836j5143M9185J39331r9362m7467j61263l5051R2320M3806
$$ 62853 -34214 220622 205479 254664 393995 294633 247166 85903 50852 143172 186978
3088A86978l83093N0551M21700l3596j49304M9451j206Q2519L1368k8913l1644
$$ 186978 -196115 -145564 276136 242540 93236 142687 141481 224000 255368 226455 194811
3077A94811j18140P9705j19959R8539K11391M8173m0905l1103j18685J9412Q3407
$$ 194811 76671 156376 36417 134956 346347 394520 353615 322512 203827 223239 306646
3066C06646k445r0949j84722j21398J99767q4617o1622K21171r6797m2722j11474
$$ 306646 304201 213252 28530 -92868 106899 22282 -39340 181831 85034 42312 -69162
3055f9162L361Q9904Q1860n9265R93n8674n7928K62854J33135p9571j4597L3691
$$ -69162 -65801 24103 105963 46698 47691 -10983 -68911 193943 327078 247507 232910 266601
3043B66601J13665j48350m2955N4217j28555M6445K6535j65195L00016P2018n5013
$$ 266601 380266 231916 188961 243178 114623 161068 187603 22408 322424 394442 339429
3032C39429k67457K86855j22239M705K87503j64669l66866Q6490J26439j93296
$$ 339429 71972 358827 236588 241293 528796 364127 -2739 83751 210190 16894
3022A6894k3310l9460J38949k3105o52P4037J7826J20540j86870j19376K35491
$$ 16894 -6416 -45876 93073 69968 69316 143353 161179 281719 94849 -24527 210964
3011B10964k6213M0593J12869o9423K80359R9998r2313o2655k57009l50218L25036
$$ 210964 184751 225344 338213 268790 549149 649147 556834 494179 237170 -113048 211988
3000B11988L16840m4595j40414J6086p5834j60160J20393J36561j0909J02515
$$ 211988 528828 484233 343819 359905 284071 123911 244304 380865 369956 472471
2990D72471J86524k66475J34245q9018k7538J03869N5415K30779k24372k48730
$$ 472471 658995 392520 526765 437747 410209 514078 569493 800272 575900 327170
2980C27170N218K3368O6924L9716j2427r9183J19176Q6003O7318l552K9112r0540
$$ 327170 332388 355756 422680 462396 449969 350786 469962 555965 623283 619731 648843 558303
2968E58303O1531j08371K93419J02065j82741N456J75411p1940j4914j43969K6412
$$ 558303 619834 511463 804882 906947 724206 729662 905073 833133 818219 674250 700662
2957G00662l0305M4706J31293k07530j2733p917J4261q0689N4498p6810K15149
$$ 700662 670357 715063 846356 638826 626093 618176 632437 551748 606246 529436 744585
2946G44585J6041j98051j4016K59971N4308j30095K65444J46691j29594p4013
$$ 744585 760626 562575 548559 808530 862838 732743 998187 1144878 1015284 941271
2936I41271j07290L0227J33077k0777j32662K5614K69982j01636j100J69963r0912
$$ 941271 833981 864208 997285 976508 843846 869460 1139442 1037806 1036706 1206669 1115757
2925A115757L0941J24193j40870j18978P58k27277Q3457J91718j92369J05225
$$ 1115757 1146698 1270891 1130021 1011043 1011801 784524 867981 1059699 867330 972555
2915I72555J10202M5972O1783J3545l68871l6538L69232J44031M9204n6754J21803
$$ 972555 1082757 1128729 1190512 1204057 835186 798648 1167880 1311911 1361115 1304361 1426164
2904A426164m1057j97937L47248M6217l01753K49072m4151l5362j85887k24063
$$ 1426164 1385107 1187170 1534418 1580635 1278882 1527954 1483803 1448441 1262554 1038491
2894A038491J5054R3238n3974r9124L5355J52496J03042j50873q7766m3910L1896
$$ 1038491 1053545 1146783 1092809 993685 1029040 1181536 1284578 1133705 1045939 1002029 1033925
2883A033925J2008P4315j9272n8541M7494Q5133j06529k20335L49561j07635J33909
$$ 1033925 1045933 1120248 1100976 1042435 1089929 1175062 1068533 848198 1197759 1090124 1224033
2872A224033j34396p3193P4113J34566q5093k45981j52726j1505j72271K1816
$$ 1224033 1089637 1016444 1090557 1225123 1140030 894049 741323 729818 557547 579363
2862E79363N1946J45697N7023k61672K8747J50021J85579O5721n4915k58773K41116
$$ 579363 631309 777006 834029 572357 601104 751125 936704 1002425 947510 688737 929853
2851I29853k4059k91313Q5583j90147R925J37896l12237l9302j50039n1425K77348
$$ 929853 905794 614481 700064 509917 519842 657738 345501 306199 156160 104735 382083
2840C82083R1135N6655l02668j96662L17583j27700J21370j15857q4368j85116
$$ 382083 473218 529873 227205 30543 348126 220426 341796 225939 141571 -43545
2830d3545j34253Q2769m06J10539J29442P8822n8005K76870k37007j16414K18676
$$ -43545 -177798 -95029 -95435 15104 144546 223368 165363 442233 205226 88812 307488
2819C07488j13105K0780K20361p0637k07433K719k39426J68100j7746q3172N0962
$$ 307488 194383 215163 435524 364887 157454 160173 -79253 88847 71101 -12071 38891
2808C8891m1071k17257J23355Q6152j6552L5149j39975J15885J49751o0760l897
$$ 38891 -2180 -219437 -96082 -9930 -26482 8667 -131308 -15423 134328 73568 69671
2797F9671j74180o3570l8490K3842L18190O9239k00117p703K48677P9586k8992
$$ 69671 -104509 -168079 -206569 -182727 135463 204702 4585 -3118 245559 325145 296153
2786B96153j92807j04155Q3192K6489J28400M3838j23536p6078J04799N8396j31779
$$ 296153 103346 -809 82383 108872 237272 281110 157574 81496 186295 244691 112912
2775A12912k15049q8239m6416J17806N643J58697j43706o7109M0235L2009j18685
$$ 112912 -102137 -190376 -236792 -118986 -113343 45354 -98352 -165461 -125226 -93217 -211902
2764b11902R5047K01584l16126j08063J41497J55164o1629j92900J18094Q5183
$$ -211902 -116855 84729 -231397 -339460 -197963 -42799 -104428 -297328 -179234 -94051
2754i4051k70711J96723K16605Q0958q1389j35684l2252J02182j96705J52506
$$ -94051 -364762 -168039 48566 129524 48135 -87549 -119801 -17619 -214324 -61818
2744f1818n6883N6518j05565n0955m1557J7616P5625J11054R3333j8646K2005
$$ -61818 -118701 -62183 -167748 -218703 -260260 -242644 -167019 -55965 37368 18722 40727
2733D0727k38124j60041K39665K21023M4710l7936m34201O0401J05298j76840
$$ 40727 -197397 -357438 -117773 103250 147960 110024 -324177 -263776 -158478 -335318
2723c35318O2888M1564N5226k8929R8687j37950q1225K72001K4584q0170J31785
$$ -335318 -272430 -230866 -175640 -204569 -105882 -243832 -325057 -53056 -28472 -108642 23143
2712B3143j88926j29852J22405O9351K9691j25101J8453J44245L1105p3513J42336
$$ 23143 -165783 -295635 -173230 -103879 -74188 -199289 -180836 -36591 -5486 -78999 63337
2701F3337p0620r0856k77443R3536K55952j8248j64860o6473J75267R3428q1339
$$ 63337 -7283 -98139 -375582 -282046 -26094 -44342 -209202 -275675 -100408 -6980 -88319
2690h8319N8532j6552j68073K9249j44595j49365J4520J82337J71032L204J72605
$$ -88319 -29787 -46339 -214412 -185163 -329758 -479123 -464603 -282266 -111234 -108030 64575
2679F4575q8347P310j35681m2810m1057Q2127j36774j00563K44845N6959j01590
$$ 64575 -23772 -16462 -152143 -194953 -236010 -153883 -290657 -391220 -146375 -89416 -191006
2668a91006p6880K60609k08993R8354n6256q4810L35104k50367l01019N2544k82365
$$ -191006 -267886 -7277 -216270 -117916 -174172 -258982 76122 -174245 -475264 -422720 -705085
2657g05085O1172J04715J54766Q2934J92104M3805j72450J93962j25773J8307
$$ -705085 -643913 -539198 -384432 -301498 -109394 -65589 -238039 -44077 -169850 -151543
2647a51543N3545J33963L6798o3991L9723j48454n2826M9549K80464m8259M5659
$$ -151543 -97998 35965 72763 8772 48495 -99959 -152785 -103236 177228 128969 174628
2636A74628k38756N8259L7803m9399J37476j23294k83616j691K12212Q430O0122
$$ 174628 -64128 -5869 31934 -17465 120011 -3283 -286899 -288590 -76378 -67948 -7826
2625g826j28791j81323q4704J06178K59671o996j7364J51452L5142k42473j30343
$$ -7826 -136617 -317940 -402644 -296466 -36795 -43791 -61155 90297 125439 -117034 -247377
2614b47377L61232J98888j48796j02470N1281K7631k4540q7014j45860L3185J51468
$$ -247377 113855 312743 163947 61477 112758 140389 115849 28835 -117025 -83840 67628
2603F7628j6439p6612q4172J1327j02553J11717j9276J55830J00998p0635q3230
$$ 67628 51189 -25423 -109595 -98268 -200821 -89104 -108380 47450 148448 77813 -5417
2592e417r1558K8073J72034l06036N0095Q1081P9813N365K10670n9057l4214q3628
$$ -5417 -96975 -68902 103132 -202904 -152809 -71728 8085 13450 224120 165063 130849 47221
2580D7221R6247o2151k94147R7568o0668K32238M7150j26375K5999k1177k37540
$$ 47221 143468 81317 -212830 -115262 -175930 56308 103458 -22917 3082 -18095 -255635
2569b55635O9180J46903k1567J65416l9845j93510K5535j05344p9556J18117j116
$$ -255635 -186455 -39552 -61119 104297 64452 -129058 -103523 -208867 -288423 -170306 -171422
2558a71422O35O4038K60111R923j9174j3886k69181o2826j23745K07299q7923
$$ -171422 -170787 -106749 153362 163285 144111 130225 -138956 -201782 -325527 -118228 -206151
2547b06151Q9372j08772q4593L12964O3072m2028M7343J5537N8415q8683O671
$$ -206151 -116779 -225551 -310144 2820 65892 23864 71207 86744 145159 56476 63147
2536F3147K8130j76653k8124Q2549j06286j49627O3496L736J84595L2438L9088
$$ 63147 91277 -85376 -113500 -30951 -137237 -286864 -223368 -219632 -35037 -2599 36489
2525C6489j87044j69873k893J2439J5794J75336Q4556j4991P0703p460K0250k67189
$$ 36489 -150555 -320428 -323321 -310882 -295088 -119752 -35196 -50187 20516 13056 33306 -233883
2513b33883j52767K16812p0333o8116K04900j90429j96535J60177K76420R3408
$$ -233883 -386650 -169838 -240171 -308287 -103387 -293816 -490351 -330174 -53754 39654
2503C9654M4287m17004J81772P0284N767m1271j10666M0375Q1054j26971R2796
$$ 39654 83941 -333063 -151291 -81007 -75240 -116511 -227177 -186802 -105748 -232719 -139923
2492a39923j07464Q045Q0202j79683J46380K08003k1592m2366P2338L3437K63176
$$ -139923 -247387 -239342 -159140 -338823 -192443 15560 -6032 -48398 23940 57377 320553
2481C20553l43781p213J39934l9873r6964p93K41810k01819j68048O3004l8168
$$ 320553 -23228 -30441 109493 69620 -27344 -28137 213673 11854 -156194 -93190 -131358
2470a31358J61534q3617j04832J86851j23405j43805o9851K89050k02106k05922
$$ -131358 30176 -53441 -158273 28578 -94827 -238632 -308483 -19433 -221539 -427461
2460d27461L6933j09348J09783J9405p7890r0537J43794J23378J01222Q1932J7069
$$ -427461 -390528 -499876 -390093 -370688 -448578 -539115 -395321 -271943 -170721 -88789 -71720
2449g1720j02510M0087n590K78076k49107j4930k2022j35730K52585N0733N9089
$$ -71720 -174230 -134143 -139733 138343 -110764 -125694 -147716 -283446 -30861 19872 78961
2438G8961j28472M10J34860k39452J71304n7817j19843j22870J02970m9705j00395
$$ 78961 -49511 -49101 85759 -153693 17611 -40206 -160049 -282919 -179949 -229654 -330049
2427c30049m7241M4698K95564Q1774m1326k48495J28324M3841K1170O4013K43071
$$ -330049 -377290 -332592 -37028 44746 3420 -245075 -116751 -72910 -51740 12273 255344
2416B55344j13369j00653j86699K09146O4702k86461Q5412J06039N3771O1523
$$ 255344 141975 41322 -145377 63769 128471 -157990 -72578 33461 87232 148755
2406A48755l30488k8042j51460K89556K69269k83734j81497j1445R1457P9461
$$ 148755 -181733 -209775 -361235 -71679 197590 -86144 -267641 -279086 -187629 -108168
2396a08168k41529J78081k462j53193J30976p6781J99763j04971j47064M0970
$$ -108168 -349697 -171616 -174078 -327271 -196295 -273076 -73313 -178284 -325348 -284378
2386b84378Q5200J18540j352J21530o1231j11807q3990L1418K23035j60130J15221
$$ -284378 -199178 -80638 -81990 39540 -21691 -133498 -217488 -186070 36965 -123165 -7944
2375g944k9479K05957M9560J03213J16731K21629l7408j66686j89688P0424M8268
$$ -7944 -37423 168534 218094 321307 438038 659667 622259 455573 265885 336309 384577
2364C84577O9624n5294k27625R698R9758q568l6009k2494J01676j85148k16402
$$ 384577 454201 398907 171282 180980 280738 272170 236161 213667 315343 130195 -86207
2353h6207k16036L03806J14466l56277R2925M151O014K36915J01451L5314j11544
$$ -86207 -302243 1563 116029 -240248 -147323 -143172 -137158 99757 201208 236522 124978
2342A24978N5758k68345j70528L99386N899j8857q5352k7550j46600N7217K58507
$$ 124978 180736 -87609 -258137 141249 147148 128291 42939 15389 -131211 -73994 184513
2331A84513j2996k13169o9490O1686J26832j03732J80349J04221p4151k6998K00748
$$ 184513 171517 -41652 -111142 -49456 77376 -26356 153993 258214 184063 157065 357813
2320C57813n2447k24119O6040m8430R331O9437j71031k6704R4064m5687q8775
$$ 357813 305366 81247 147287 98857 108188 177625 6594 -20110 73954 28267 -60508
2309f0508j8659K75227j40850m3211J16234m18196j3905L24271J14929Q6927K1963
$$ -60508 -79167 196060 55210 11999 128233 -289963 -303868 20403 135332 222259 244222
2298B44222K92262k35580j91884J02774j96217K67425L7644j17047q2272M190
$$ 244222 536484 300904 109020 211794 15577 283002 320646 203599 121327 125517
2288A25517K40752r1523r8801P1328o4350K22169j05155Q6873L0175o9880P9103
$$ 125517 366269 274746 175945 247273 182923 405092 299937 386810 416985 347105 426208
2277D26208K8813k83703j20451j09270J32341K61599q8933M5206r6064K7514Q3417
$$ 426208 455021 171318 50867 -58403 73938 335537 246604 291810 195746 223260 306677
2266C06677J4107k209N406J12680k10679J03115P1785n6834p1968k59543k8071
$$ 306677 320784 318575 323981 436661 225982 329097 400882 344048 272080 12537 -15534
2255a5534J73462J85910n9541j38465j44565J51017L27121q1049Q9637N7762k6127
$$ -15534 157928 343838 284297 145832 1267 152284 479405 398356 487993 545755 519628
2244E19628l4836j08168n3431N1236J00498l2762p6702K4146J99431J49313j16975
$$ 519628 484792 376624 323193 374429 474927 442165 365463 389609 589040 738353 621378
2233F21378M7894j12183J3001J42346k09062Q2239j6495l760J21541J46687j22174
$$ 621378 669272 557089 570090 712436 503374 585613 569118 565358 686899 833586 711412
2222G11412n8497p0021K3541J48426j44919j82223j27029K97662Q671J31629J81430
$$ 711412 652915 582894 606435 754861 609942 427719 300690 598352 607023 738652 920082
2211I20082J2792N3510Q3879k03837k57995M16560J20454k11009m2429N8921j11117
$$ 920082 932874 986384 1070263 866426 608431 1024991 1145445 934436 892007 950928 839811
2200H39811Q9743J91669J7324R2028K03492k41028o0101N4342O0270J6833K0128
$$ 839811 929554 1121223 1138547 1230575 1434067 1193039 1132938 1187280 1247550 1264383 1284511
2189A284511L244J54630Q4878K33118R8988j15357P375l9193J47303K58453j36066
$$ 1284511 1287755 1442385 1527263 1760381 1859369 1744012 1751387 1712194 1859497 2117950 1981884
2178A981884N3687N4946J7178J50798p1387n9930K19513O2324P4368m1976K14469
$$ 1981884 2035571 2090517 2107695 2258493 2187106 2127176 2346689 2409013 2483381 2441405 2655874
2167B655874r5594p4160l4868R7327j35035J58499K65211K19138L2981N931q0704
$$ 2655874 2560280 2486120 2451252 2548579 2413544 2572043 2837254 3056392 3089373 3095304 3014600
2156C014600J30464L08009K06870J0965q868M577j65243p4565J3621L07684L15810
$$ 3014600 3145064 3453073 3659943 3670908 3662040 3666617 3501374 3426809 3440430 3748114 4063924
2145D063924J57750K45052J00756J71028J66415K14265K04177K18542N56471n0408
$$ 4063924 4221674 4466726 4567482 4738510 4904925 5119190 5323367 5541909 6098380 6047972
2135F047972J43548N24804L89309J67476L50354L24388M78255K36924M68093N38383
$$ 6047972 6191520 6716324 7105633 7273109 7623463 7947851 8426106 8663030 9131123 9669506
2125I669506O01507N12700P83194R39770R59604J241540J350972J064935J263663
$$ 9669506 10271013 10783713 11566907 12506677 13466281 14707821 16058793 17123728 18387391
2116A8387391Q65383J048191J583759K814016L023385L472722L638068M656263
$$ 18387391 19252774 20300965 21884724 24698740 27722125 31194847 34832915 39489178
2108C9489178O781973R489232J2984951J7832058J9740701J4573313q975769k4629838
$$ 39489178 46271151 55760383 68745334 86577392 106318093 120891406 111915637 87285799
2100H7285799k0252229j4806274r951449p350930n195376m300812l423171k458783
$$ 87285799 67033570 52227296 42275847 34924917 29729541 25428729 22005558 19546775
2092A9546775j692544j167359p12979r61288k19219q93106j562367j441078j040466
$$ 19546775 17854231 16686872 15973893 15012605 14793386 13900280 12337913 10896835 9856369
2083I856369m57362l76836q74514k18151k83452o06423n63612l60814k10817J6706
$$ 9856369 9399007 9022171 8147657 7929506 7646054 7039631 6476019 6115205 5904388 5921094
2073E921094j74440l83713l53722j75136l71273j64486l27469j75949k90871j12537
$$ 5921094 5746654 5362941 5009219 4834083 4462810 4298324 3970855 3794906 3504035 3391498
2063C391498J35935r9182m38370q6918J26033j13351k45412r2501k6131l59540
$$ 3391498 3527433 3428251 2989881 2902963 3028996 2915645 2670233 2577732 2551601 2192061
2053B192061R0988r2937m17813L3580K50139k9464k03851q7379P4368J2210J76116
$$ 2192061 2283049 2190112 1772299 1805879 2056018 2026554 1822703 1735324 1809692 1821902 1998018
2042A998018k33057l96403j59666J46811L3057j93319l08729P1749J81052J10181
$$ 1998018 1764961 1368558 1208892 1355703 1388760 1195441 886712 958461 1139513 1249694
2032A249694Q8388j31556k72j36019K9245J07486L3265j80101n6253j69303q7719
$$ 1249694 1338082 1206526 1206254 1070235 1099480 1206966 1240231 1060130 1003877 834574 746855
2021G46855P4339j10700J06230P2579j80925k22805k19107J62194J62823l0111
$$ 746855 821194 710494 816724 889303 708378 485573 266466 428660 591483 561372
2011E61372R8477j36135m6751j24576J9039j98038j74965J67769K20580n5985
$$ 561372 659849 523714 476963 352387 371426 173388 -1577 166192 386772 330787
2001C30787k19245R9156J27883L08915O9587k86922l6545M6207p6739k63492l3414
$$ 330787 111542 210698 338581 647496 717083 430161 393616 439823 363084 99592 66178
1990F6178K71242n856L9031j14896N3226J45534n554j10958j70864N6279j8329
$$ 66178 337420 331564 370595 255699 308925 454459 448905 337947 167083 223362 205033
1979B05033l40372K62821R2064k48349l9745J25604J11377M2986J64257l13618
$$ 205033 -135339 127482 219546 -28803 -68548 57056 168433 211419 375676 62058
1969F2058j30805J21322J27171r287p7248j04173p7911q4211k0097j9604J70622
$$ 62058 -68747 52575 179746 170459 93211 -10962 -88873 -173084 -193181 -212785 -42163
1958d2163l7802J17559P8579k73921R4202L12108k260p7339k35581j07700L5736
$$ -42163 -79965 37594 116173 -157748 -63546 248562 246302 168963 -66618 -174318 -138582
1947a38582J03224N6379L3618L2676k9095m0969M5166j04276k07474J25048m1038
$$ -138582 -35358 21021 54639 87315 58220 17251 62417 -41859 -249333 -124285 -165323
1936a65323J03702J30162n7157N6599J5763j65133m0275K7999K11928Q8416m14528
$$ -165323 -61621 68541 11384 67983 83746 -81387 -121662 -93663 118265 206681 -207847
1925b07847J3050K32654N6776n5805r7962m8812l7838Q2477p3574K1221J05655
$$ -207847 -194797 37857 94633 38828 -59134 -107946 -145784 -63307 -136881 -115660 -10005
1914a0005K471o5620p0620r7241K0529J34523J59416O1395j95749p2056o0612
$$ -10005 -7534 -73154 -143774 -241015 -220486 -85963 73453 134848 -60901 -132957 -193569
1903a93569l8353L90623k7649k62030K14598Q3239j4338j10018k59974k1249O6548
$$ -193569 -231922 158701 131052 -130978 83620 166859 152521 42503 -217471 -238720 -172172
1892a72172J32101J05192j37730j30213J73880N7702n6210r6388N4489n2035p8502
$$ -172172 -40071 65121 -72609 -202822 -28942 28760 -27450 -123838 -69349 -121384 -199886
1881a99886K09634J20620j72845J13379k046K9684J12830n8761j24442k10420
$$ -199886 9748 130368 -42477 70902 68856 98540 211370 152609 28167 -182253
1871a82253o9192P9495J29682J08111J0386j10324J31763j82930K4295N0926j99315
$$ -182253 -251445 -171950 -42268 65843 76229 -34095 97668 -85262 -60967 -10041 -209356
1860b09356k0832n0684O8826J5998R9840k2934k8740J19220J31801j23485j00757
$$ -209356 -230188 -280872 -212046 -196048 -96208 -119142 -147882 -28662 103139 -20346 -121103
1849a21103J79581j9608R5147m2967J00549M0102o2217J71338Q2392n2522p9488
$$ -121103 58478 38870 134017 91050 191599 231701 169484 340822 423214 370692 291204
1838B91204k34631J13856L8395K14153J37799j10205O481m6774k74430J33413
$$ 291204 56573 170429 208824 422977 560776 450571 457052 410278 135848 269261
1828B69261o656k1582N5720j86937j88422l2721K80268K8905j35883k9835m2864
$$ 269261 262605 241023 296743 109806 -78616 -111337 168931 197836 61953 32118 -10746
1817a0746k71047Q272p0611Q1677q711K11949K83178O1988l08879n5979k9717
$$ -10746 -281793 -273521 -344132 -262455 -271166 -59217 223961 285949 -22930 -78909 -108626
1806a08626j69478j15918O7967J71896j48565n7008L23231J4897o1834J08842
$$ -108626 -278104 -394022 -326055 -154159 -302724 -359732 -36501 -21604 -83438 25404
1796B5404j30192j71457M0333k0480J5163K12199J05363j33615j75543J87511
$$ 25404 -104788 -276245 -235912 -256392 -241229 -29030 76333 -57282 -232825 -45314
1786d5314j24547J8637L966K00944Q161p4723J67216j08791j04889j08282k07897
$$ -45314 -169861 -151224 -147258 53686 61847 -12876 154340 45549 -59340 -167622 -375519
1775c75519N6913K55562j87604j72768Q9065K57905R2727j86350l6914j40933
$$ -375519 -318606 -63044 -250648 -423416 -334351 -76446 16281 -170069 -206983 -347916
1765c47916j7662j28939L75836n46j28836K88292P5592M4154l28431j14430J1623
$$ -347916 -365578 -494517 -118681 -119227 -248063 40229 115821 159975 -168456 -282886 -271263
1754b71263J09789J36713j22177J32250j77145P5687K75740K1534k69959q2577
$$ -271263 -161474 -24761 -146938 -14688 -191833 -116146 159594 181128 -88831 -171408
1744a71408L7338j12264J07934o6019K72033k8763j25893k50291K8436K7787J48409
$$ -171408 -134070 -246334 -138400 -204419 67614 38851 -87042 -337333 -308897 -281110 -132701
1733a32701o0674J11065k7148j64303j43133K34250M6892k70494J06275J46242
$$ -132701 -193375 -82310 -109458 -273761 -416894 -182644 -135752 -406246 -299971 -153729
1723a53729J68073k1200J84128j09243k38252j460J0142J6329O6016L4107J66089
$$ -153729 14344 -6856 177272 68029 -170223 -171683 -161541 -145212 -79196 -45089 121000
1712A21000l1989j89688j69033j46114q825K34139K70188k86904K679K0077J44100
$$ 121000 89011 -100677 -269710 -415824 -424649 -190510 79678 -207226 -204547 -184470 -40370
1701d0370L0975L85j38301j62840j06265J01573J52071N9772J59228N3569J4538
$$ -40370 -9395 -9010 -147311 -310151 -416416 -314843 -162772 -103000 56228 109797 124335
1690A24335O7846k8428m28028j41851K19053J94699j55831L0280j27885P034j94108
$$ 124335 192181 163753 -264275 -406126 -187073 7626 -148205 -117925 -245810 -238776 -432884
1679d32884K00448J76644j28410k8395q8785L1654L9368N6544J46912j78528q883
$$ -432884 -232436 -55792 -184202 -212597 -301382 -269728 -230360 -173816 -26904 -205432 -214315
1668b14315R3750R626n4181J50677Q4102J08574R8958O5391j63132k1007q6769
$$ -214315 -120565 -110939 -165120 -14443 69659 178233 277191 342582 179450 158443 71674
1657G1674P4388q7508J55j43700J53976K18900k83833j32337J16168O6313j07749
$$ 71674 146062 58554 58709 -84991 68985 287885 4052 -128285 -12117 54196 -53553
1646e3553R2930q5607O5920j69100R8894K79831L4219j59017n7657J31652l0053
$$ -53553 39377 -46230 19690 -149410 -50516 229315 263534 104517 46860 178512 148459
1635A48459j91488k04084K432Q1104J63791k82879L770m6220M705K67232j46290
$$ 148459 -43029 -247113 -244681 -163577 214 -282665 -278895 -325115 -320410 -53178 -199468
1624a99468J63180M2327n4990k37294K1085o2888M58541l1869k5953j32360N5855
$$ -199468 -36288 6039 -48951 -286245 -265160 -328048 130493 98624 72671 -59689 -3834
1613c834J09694k4008k0989p45j88231r1673K11219m02441n0045J62543n2841
$$ -3834 105860 81852 60863 60118 -128113 -219786 -8567 -411008 -461053 -298510 -351351
1602c51351K55301N2422j52361o1973R4146q4919j22824J06021k20392K35570
$$ -351351 -96050 -43628 -195989 -257962 -163816 -248735 -371559 -265538 -485930 -250360
1592b50360P6168j17576K83934j53122l6809R6108K1585J63305j38356l7848J75862
$$ -250360 -174192 -291768 -7834 -160956 -197765 -101657 -80072 83233 -55123 -92971 82891
1581H2891J10963l20266j7193L5182Q3468r4778J04035k18443J5212J43196P4500
$$ 82891 193854 -126412 -143605 -108423 -24955 -119733 -15698 -234141 -218929 -75733 -1233
1570a233j6245M6388p8203j83938j2436J34043M4012k19003J70148J40003J20008
$$ -1233 -17478 28910 -49293 -233231 -245667 -111624 -67612 -286615 -116467 23536 143544
1559A43544j66300K091J52966j26252k32517O919Q7759K3532L6115J66618k1798
$$ 143544 -22756 -20665 132301 6049 -226468 -219549 -131790 -108258 -72143 94475 72677
1548G2677M9270m82255k33746K20741J16258P4536J16232m8409j79233l82718
$$ 72677 121947 -360308 -594054 -373313 -257055 -182519 -66287 -114696 -293929 -676647
1538f76647K85558J20691M0593K05875j70552Q8229r2255Q2681O2565j56184K02363
$$ -676647 -391089 -270398 -229805 -23930 -194482 -106253 -198508 -115827 -53262 -209446 -7083
1527g083o3752l61054l0744O6445O5399J05687J32026M3709Q6401k22813j74697
$$ -7083 -70835 -431889 -462633 -396188 -330789 -225102 -93076 -49367 37034 -185779 -360476
1516c60476K27082P2990k4527M0867k06586p1380K19243n7841j02833Q145R9036
$$ -360476 -133394 -60404 -84931 -44064 -250650 -322030 -102787 -160628 -263461 -255316 -156280
1505a56280P839K62741j5999J7669l28513K5701K69216k27233J41481k9378L3715
$$ -156280 -148441 114300 98301 115970 -212543 -186842 82374 -144859 -3378 -32756 959
1494I59j02254J91764q1246k50457M3834Q0840K34804j0088j03541J27506j6369
$$ 959 -101295 90469 9223 -241234 -197400 -116560 118244 108156 4615 132121 115752
1483A15752j97743j38709R0164P9602q9926n3118K98460k05532j6489m4367k6205
$$ 115752 -81991 -220700 -130536 -50934 -140860 -193978 104482 -101050 -117539 -161906 -188111
1472a88111o2439J25386P139n3847J62647K4322n3942J18708l58658J1905m9761
$$ -188111 -250550 -125164 -118025 -171872 -9225 15097 -38845 79863 -278795 -266890 -316651
1461c16651l0644L19266j43141K06160J0619j78536Q6755j02656m7664Q2655j73685
$$ -316651 -347295 -28029 -171170 34990 45609 -132927 -46172 -148828 -196492 -113837 -287522
1450b87522L6747J21595Q7042k62203Q388J52049j6441K3131N9911R5253r738
$$ -287522 -250775 -129180 -42138 -304341 -295953 -143904 -160345 -137214 -77303 17950 8212
1439H212j19606N771r9792J33246j93378j08505P6660J33837K2697j36524O3651
$$ 8212 -111394 -105623 -205415 -72169 -265547 -374052 -297392 -163555 -140858 -277382 -213731
1428b13731J36815m5317o8956L53593j03036J3760k1305k06084J50064j28652
$$ -213731 -76916 -122233 -191189 162404 59368 73128 51823 -154261 -4197 -132849
1418a32849q4042j38558J52086L4585Q9381K6787j39436R2514M8641J29381r6385
$$ -132849 -216891 -355449 -203363 -168778 -79397 -52610 -192046 -99532 -50891 78490 -17895
1407a7895k4713k3987l4889N1633l4890j81077K80439k21846m5161K96769n8466
$$ -17895 -42608 -66595 -101484 -49851 -84741 -265818 14621 -207225 -252386 44383 -14083
1396a4083l5470J0929q0588P9219J71589k0801j01714L769j37004k56074K06722
$$ -14083 -49553 -38624 -119212 -39993 131596 110795 9081 12850 -124154 -380228 -173506
1385a73506L05237j85530o9309j07475n633K75807J2931K02130q7600j91832O2631
$$ -173506 131731 -53799 -123108 -230583 -236216 39591 52522 254652 167052 -24780 37851
1374C7851N4189r8362m9845k04853p5077M29595P5856l25157K31989o8136Q2215
$$ 37851 92040 -6322 -56167 -261020 -336097 93498 169354 -155803 76186 8050 90265
1363I0265k00461r9208k9194J22473O1210K38534J20683q5265J6451j61192J06270
$$ 90265 -110196 -209404 -238598 -116125 -54915 183619 304302 219037 235488 74296 180566
1352A80566k60851l6843j09965J9532J60016j45025O6971l0545P3331J17534L0203
$$ 180566 -80285 -117128 -227093 -207561 -47545 -192570 -125599 -156144 -82813 34721 64924
1341F4924m5176k58738j03057N634J71397K0193m254j86844K21850J76927k23631
$$ 64924 19748 -238990 -342047 -336413 -165016 -144823 -149077 -335921 -114071 62856 -160775
1330a60775m5099Q0708J26956o4470L8668J585j87640J07272J60542o5650J29938
$$ -160775 -205874 -125166 1790 -62680 -24012 -22427 -210067 -102795 57747 -7903 122035
1319A22035l6170j64280l21430l1099Q5768J26543K39948m2047j0300k54153o5549
$$ 122035 85865 -78415 -399845 -430944 -345176 -218633 21315 -20732 -31032 -285185 -350734
1308c50734J01630K9142J23894K6078J01746J2634L453L4431q4675k5467l3871
$$ -350734 -249104 -219962 -96068 -69990 31756 44390 47843 82274 -2401 -27868 -61739
1297f1739N5483L858k7516K18407j18845p7004j21838N582J87765M8943j36211
$$ -61739 -6256 -2398 -29914 188493 69648 -7356 -129194 -123612 64153 113096 -23115
1286b3115j64331O6104K34164J15184j73636K9361r4442j49298O6842K03333P6120
$$ -23115 -187446 -121342 112822 228006 54370 83731 -10711 -160009 -93167 110166 186286
1275A86286j74231o6398M11957j81523j03773j10614O2359J86630l7254K1233
$$ 186286 12055 -54343 357614 176091 72318 -38296 24063 210693 173439 194672
1265A94672J9660k22294M925P6887j32435k0238J10267K16294j28062L9972L4875
$$ 194672 214332 -7962 -3037 73850 -58585 -78823 31444 247738 119676 159648 194523
1254A94523n823R1387O7315k29612k43973N2066n5742J05831P6205j07372j4297
$$ 194523 188700 280087 347402 117790 -126183 -74117 -129859 -24028 52177 -55195 -69492
1243f9492j54131j9269K09543P0389j3341q2180J23957l97371J14987N3136K65915
$$ -69492 -223623 -242892 -33349 37040 23699 -58481 65476 -331895 -216908 -163772 102143
1232A02143R0477k20656J02476j6824q7573k23998K19141l2187J09455l4657k65829
$$ 102143 192620 -28036 74440 57616 -29957 -253955 -34814 -67001 42454 7797 -258032
1221b58032r9190J08953J98852k26510J71864N287J39917J55312k31777J51905
$$ -258032 -357222 -248269 -49417 -275927 -104063 -98776 41141 196453 -35324 116581
1211A16581o5002k15197n1386j2032K04572m9224m6288k5340J41803r831j84048
$$ 116581 51579 -163618 -215004 -227036 -22464 -71688 -117976 -143316 -1513 -11344 -195392
1200a95392K48781j85771Q0777K33800k32278j04805K16438J28306n0760j64122
$$ -195392 53389 -132382 -51605 182195 -50083 -154888 61550 189856 139096 -25026
1190b5026p6182r7139J25348K72873o226l86266J05249K61588j49950k0038K47185
$$ -25026 -101208 -198347 -72999 199874 193648 -192618 -87369 174219 24269 4231 251416
1179B51416j79072O0546R900M0148n3317o6155o4361J19889j25038K729j89299
$$ 251416 72344 132890 142790 182938 129621 63466 -895 118994 -6044 -3315 -192614
1168a92614J14368k7961q4471J94582j39609J38924O5496q9608p2199n7307K38234
$$ -192614 -78246 -106207 -190678 3904 -135705 3219 68715 -20893 -93092 -150399 87835
1157H7835q2440j87513J72139L520j44228J60624j44205j03659K45461K03813
$$ 87835 5395 -182118 -9979 -6459 -150687 9937 -134268 -237927 7534 211347
1147B11347J33116l26908k83038K1333N5028J81429K04809j9098p4459k23008
$$ 211347 344463 17555 -265483 -244150 -189122 -7693 197116 178018 103559 -119449
1137a19449r3628K2652M0565j50420R1835p627J64428J55491o7540k13723J65677
$$ -119449 -213077 -190425 -149860 -300280 -208445 -216072 -51644 103847 36307 -177416 -11739
1126a1739j30725j40313Q9445Q8800K24615M3971N2113l32056L3516J81235K43027
$$ -11739 -142464 -282777 -193332 -104532 120083 164054 216167 -115889 -82373 98862 341889
1115C41889r8671j51124Q4351L273N4099k9632J24934k32870q485l7608m9928
$$ 341889 243218 92094 176445 179718 233817 204185 329119 96249 87764 50156 228
1104B28P996l3116r0493K07931n0817r8986J59876p1224j22354L02820J29553
$$ 228 8224 -24892 -115385 92546 41729 -57257 102619 31395 -90959 211861 341414
$$ [...]
##END NTUPLES=NMR SPECTRUM
##END=
