##TITLE=1H_EC-3281(1-3)
 CDCl3
 8 sc, 
 19.10.2022
##JCAMPDX= 6.0         $$ Bruker NMR JCAMP-DX V2.0
##DATA TYPE= NMR SPECTRUM
##DATA CLASS= NTUPLES
##ORIGIN= UXNMR, Bruker Analytische Messtechnik GmbH
##OWNER= root
$$ XWIN-NMR		Version 3.5
$$ Wed Oct 19 14:12:06 2022 Russian Standard Time (UT+4h)  she@DPX200
##.OBSERVE FREQUENCY= 200.1313499994
##.OBSERVE NUCLEUS= ^1H
##.ACQUISITION MODE= SIMULTANEOUS
##.ACQUISITION SCHEME= undefined
##.AVERAGES= 8
##.DIGITISER RES= 18
##SPECTROMETER/DATA SYSTEM= spect
##.PULSE SEQUENCE= zg30
##.SOLVENT NAME= CDCl3
##.SHIFT REFERENCE= (INTERNAL, CDCl3, 0, 15.7381)
##AUDIT TRAIL= $$ (NUMBER, WHEN, WHO, WHERE, WHAT)
$$ ##TITLE= Audit trail, XWIN-NMR		Version 3.5
$$ ##JCAMPDX= 5.01
$$ ##ORIGIN= Bruker BioSpin GmbH
$$ ##OWNER= she
$$ F:/spectra/data/she/nmr/H-F/1/pdata/1/auditp.txt
$$ ##AUDIT TRAIL=  $$ (NUMBER, WHEN, WHO, WHERE, WHAT)
(   1,<2022-10-19 14:10:18.06 +0400>,<she>,<DPX200>,
      <created by zg, POWCHK disabled, PULCHK disabled
       configuration hash MD5:
       00 E9 B6 7A A2 85 ED C7 34 08 36 98 17 FE 4E 26
       data hash MD5: 16K
       85 5F 21 B3 49 19 ED AE 04 E8 83 0C 98 9F B4 26>)
(   2,<2022-10-19 14:10:20.45 +0400>,<she>,<DPX200>,
      <Start of raw data processing
       efp BC_mod = 2 LB = 0.24 FT_mod = 6 PKNL = 1 PHC0 = -18033.64 PHC1 = 11.6007 SI = 16K 
       data hash MD5: 16K
       FB D9 56 1A F2 F3 1C F9 5C 73 71 0D 06 85 56 82>)
(   3,<2022-10-19 14:10:36.03 +0400>,<she>,<DPX200>,
      <pk PHC0 = -1.888906 PHC1 = -1.490116e-08 
       data hash MD5: 16K
       76 8B 0B A3 13 52 EA 4E D2 09 F4 20 1F EF C3 B0>)
(   4,<2022-10-19 14:10:39.59 +0400>,<she>,<DPX200>,
      <abs ABSG = 5 
       data hash MD5: 16K
       54 74 74 DF 02 B1 46 55 B1 E5 C3 62 BE EE 7E 76>)
$$ ##END=
$$ 
$$ hash MD5
$$ 90 20 4A 83 84 0D 10 DD 10 8F 72 AA A8 5F A9 08
##$RELAX= 
##$RELAX= 
##$RELAX= 
##$RELAX= 
##$RELAX= 
##$RELAX= 
$$ Bruker specific parameters
$$ --------------------------
##$DU= <F:/spectra>
##$EXPNO= 1
##$NAME= <H-F>
##$PROCNO= 1
##$TYPE= <nmr>
##$USER= <she>
##$AMP= (0..31)
100 100 100 100 100 100 100 100 100 100 100 100 100 100 100 100 100 100 
100 100 100 100 100 100 100 100 100 100 100 100 100 100 
##$AQSEQ= 0
##$AQ_mod= 1
##$AUNM= <au_zg>
##$AUTOPOS= <>
##$BF1= 200.13
##$BF2= 200.13
##$BF3= 200.13
##$BF4= 200.13
##$BF5= 200.13
##$BF6= 200.13
##$BF7= 200.13
##$BF8= 200.13
##$BYTORDA= 1
##$CFDGTYP= 0
##$CFRGTYP= 5
##$CHEMSTR= <none>
##$CNST= (0..31)
1 1 145 1 1 1 1 1 1 1 1 1 1 1 1 1 1 1 1 1 1 1 1 1 1 1 1 1 1 1 1 1 
##$CPDPRG= <>
##$CPDPRG1= <>
##$CPDPRG2= <>
##$CPDPRG3= <>
##$CPDPRG4= <mlev>
##$CPDPRG5= <mlev>
##$CPDPRG6= <mlev>
##$CPDPRG7= <mlev>
##$CPDPRG8= <mlev>
##$CPDPRGB= <>
##$CPDPRGT= <>
##$D= (0..31)
0 1.2 0 0 0 0 0 0 0 0.06 0 0.03 0 0 0 0 0.0002 0 0 0 0 0 0 0 0 0 0 0 0 
0 0 0 
##$DATE= 1666174217
##$DBL= (0..7)
120 120 120 120 120 120 120 120 
##$DBP= (0..7)
150 150 150 150 150 150 150 150 
##$DBP07= 0
##$DBPNAM0= <>
##$DBPNAM1= <>
##$DBPNAM2= <>
##$DBPNAM3= <>
$$ [...]
##$SUBNAM3= <"">
##$SUBNAM4= <"">
##$SUBNAM5= <"">
##$SUBNAM6= <"">
##$SUBNAM7= <"">
##$SUBNAM8= <"">
##$SUBNAM9= <"">
##$SW= 18.0517283424941
##$SWIBOX= (0..15)
0 0 2 0 0 0 0 0 0 0 0 0 0 0 0 0 
##$SW_h= 3612.71676300578
##$TD= 16384
##$TD0= 1
##$TE= 0
##$TE2= 300
##$TE3= 300
##$TEG= 300
##$TL= (0..7)
0 120 120 120 120 120 120 120 
##$TP= (0..7)
150 150 150 150 150 150 150 150 
##$TP07= 0
##$TPNAME0= <>
##$TPNAME1= <>
##$TPNAME2= <>
##$TPNAME3= <>
##$TPNAME4= <>
##$TPNAME5= <>
##$TPNAME6= <>
##$TPNAME7= <>
##$TPOAL= (0..7)
0.5 0.5 0.5 0.5 0.5 0.5 0.5 0.5 
##$TPOFFS= (0..7)
0 0 0 0 0 0 0 0 
##$TUNHIN= 0
##$TUNHOUT= 0
##$TUNXOUT= 0
##$USERA1= <user>
##$USERA2= <user>
##$USERA3= <user>
##$USERA4= <user>
##$USERA5= <user>
##$V9= 5
##$VALIST= <valist>
##$VCLIST= <CCCCCCCCCCCCCCC>
##$VD= 0
##$VDLIST= <DDDDDDDDDDDDDDD>
##$VPLIST= <PPPPPPPPPPPPPPP>
##$VTLIST= <TTTTTTTTTTTTTTT>
##$WBST= 1024
##$WBSW= 4
##$XGAIN= (0..3)
0 0 0 0 
##$XL= 0
##$YL= 0
##$YMAX_a= 163419
##$YMIN_a= -246504
##$ZGOPTNS= <>
##$ZL1= 120
##$ZL2= 120
##$ZL3= 120
##$ZL4= 120
##$ABSF1= 15.74248
##$ABSF2= -2.309369
##$ABSG= 5
##$ABSL= 3
##$ALPHA= 0
##$AQORDER= 0
##$ASSFAC= 0
##$ASSFACI= 0
##$ASSFACX= 0
##$ASSWID= 0
##$AUNMP= <proc_1d>
##$AZFE= 0.1
##$AZFW= 0.1
##$BCFW= 0
##$BC_mod= 2
##$BYTORDP= 0
##$COROFFS= 0
##$CY= -3
##$DATMOD= 1
##$DC= 0
##$DFILT= <>
##$DTYPP= 0
##$F1P= 0
##$F2P= 0
##$FCOR= 1
##$FTSIZE= 16384
##$FT_mod= 6
##$GAMMA= 0
##$GB= 0
##$INTBC= 1
##$INTSCL= 3.70164e-10
##$ISEN= 128
##$LB= 0.24
##$LEV0= 0
##$LPBIN= 0
##$MAXI= 10000
##$MC2= 0
##$MEAN= 0
##$ME_mod= 0
##$MI= 1.114404
##$NCOEF= 0
##$NC_proc= -6
##$NLEV= 6
##$NOISF1= 3.799351
##$NOISF2= 2.8
##$NSP= 0
##$NTH_PI= 0
##$NZP= 0
##$OFFSET= 15.73808
##$PC= 1
##$PHC0= -18035.53
##$PHC1= 11.6007
##$PH_mod= 1
##$PKNL= yes
##$PPARMOD= 0
##$PSCAL= 0
##$PSIGN= 0
##$REVERSE= no
##$SF= 200.130006695916
##$SI= 16384
##$SIGF1= 3
##$SIGF2= 2
##$SINO= 5.538805
##$SIOLD= 16384
##$SREGLST= <1H.CDCl3>
##$SSB= 0
##$STSI= 16384
##$STSR= 0
##$SW_p= 3612.71676300578
##$SYMM= 0
##$S_DEV= 0
##$TDeff= 16384
##$TDoff= 0
##$TI= <>
##$TILT= no
##$TM1= 0
##$TM2= 0
##$TOPLEV= 0
##$USERP1= <user>
##$USERP2= <user>
##$USERP3= <user>
##$USERP4= <user>
##$USERP5= <user>
##$WDW= 1
##$XDIM= 16384
##$YMAX_p= 310916104
##$YMIN_p= -394337
$$ End of Bruker specific parameters
$$ ---------------------------------
##NTUPLES= NMR SPECTRUM
##VAR_NAME=  FREQUENCY,     SPECTRUM/REAL,   SPECTRUM/IMAG
##SYMBOL=    X,             R,               I
##VAR_TYPE=  INDEPENDENT,   DEPENDENT,       DEPENDENT
##VAR_FORM=  AFFN,          ASDF,            ASDF
##VAR_DIM=   16384,         16384,           16384
##UNITS=     HZ,            ARBITRARY UNITS, ARBITRARY UNITS
##FACTOR=    0.220516191357247, 1,           1
##FIRST=     3149.66206072792, 0,            0
##LAST=      -463.054702277857, 0,           0
##MIN=       -463.054702277857, -394337,     0
##MAX=       3149.66206072792, 310916104,    0
$$ Real data points
##PAGE= N=1
##DATA TABLE= (X++(R..R)), XYDATA
$$ [...]
7234A06480M1113K11509j17368J26578J3676j01980L8718o7592Q0096k2931O3433
7223C71732N1799q7266m6210J07755O3715j13660J50807K4656l1856j78351Q5369
7212C98490R9192k2139N7546n0880l4743k4083J14799o3568J29198o3262k3136
7201E17414J43493p7405M3874N8327j4350J3137N1240K9136n235o3017K5558N5292
7189G77464k7764n593l4362N5091P419K9485L5022J62831p8004l4660j126o3602
7177H22201o9665J12938N8319j02312k3281J25875m6251k6354J07945J06940O565
7166A072920K1891R9542L898J10838r8305O5689J07869J04349J50480l1935M8721
7155A655957j18928R8265J52681J08387M2518k6326L0250J35805o828j26063K34085
$$ plain form
7234 106480 147593 359102 241734 368312 381988 280008 318726 251134 331230 308299 371732
7223 371732 423531 336265 290055 397810 461525 347865 498672 523328 491472 313121 398490
7212 398490 497682 475543 533089 482209 447466 423383 538182 474614 603812 540550 517414
7201 517414 660907 583502 627376 685703 671353 684490 735730 764866 759631 696614 722172 777464
7189 777464 749700 744107 709745 764836 772255 801740 836762 999593 921589 886929 885803 822201
7177 822201 752536 865474 923793 821481 798200 924075 877824 851470 959415 1066355 1072920
7166 1072920 1094811 1194353 1198251 1309089 1210784 1276473 1384342 1488691 1639171 1607236 1655957
7155 1655957 1537029 1635294 1787975 1896362 1938880 1912554 1942804 2078609 2071781 1945718 2179803
7144B179803J31321M1537k7800K1625L6647L7122K11513N7763o5295L4313Q0597
7133B739146r568P7529M6060o1682K03257J75859R4533J42293J66582j35118J21208
7122C560099J16245P2031J12333J72385R3728K23426J24313L8193K49410J88224
7112D950387P9814K63493J43916J90071J54119K33124K23168K44588L26934L26646
7102G136260M18184K09338L78868M93410M34838M56534N11187N03022M14921O31472
7092A1588034O61260P92170R83576R09219J184255J432376J813831J941428K258722
7083B3564871K779612L344952L470947L769654L881395M361215N826988P847714
7075E8847348R545157J0394053Q732489L732881l095180q829377j2209617j2362526
$$ plain form
7144 2179803 2311124 2352661 2324861 2346486 2383133 2420255 2631768 2689531 2624236 2658549 2739146
7133 2739146 2729578 2807107 2853167 2791485 2994742 3170601 3265134 3407427 3574009 3438891 3560099
7122 3560099 3676344 3748375 3860708 4033093 4126821 4350247 4474560 4512753 4762163 4950387
7112 4950387 5030201 5293694 5437610 5627681 5781800 6014924 6238092 6482680 6809614 7136260
7102 7136260 7554444 7763782 8142650 8636060 9070898 9527432 10038619 10541641 10956562 11588034
7092 11588034 12249294 13041464 14025040 14934259 16118514 17550890 19364721 21306149 23564871
7083 23564871 26344483 29689435 33160382 36930036 40811431 45172646 50999634 58847348
7075 58847348 68392505 78786558 87519047 91251928 88156748 79327371 67117754 54755228
7067E4755228j0568135q132708n902570m434734l202102k469697k091000j628482
7059A6325800j376072j304806r95845r68015q60401n78743n70703o11019m45151
7050H615045m46982m07913k81181m52415l71451j74493k79419l61848l33017k05363
7040E300963l54053j31777j48985k48552j77704j55773k41551r0399k55262k06138
7030C290769n0660j25076j20981j3611r3885j19584r1216j56100p2886K0390K236
7019B469396l785r0313q5842N0310L6283l4819j7950k7298M5446o378j20934n7034
7007B157082m9536n7854L104j53556j77258M395M5958o210j2081Q2164m7827m3689
6995A744692l0433o8709r2253q4996p9964j03075P4203M8618j91273j2831Q3834
$$ plain form
7067 54755228 44187093 36054385 30151815 25717081 22514979 20045282 17954282 16325800
7059 16325800 14949728 13644922 12649077 11681062 10820661 10241918 9671215 9060196 8615045
7050 8615045 8168063 7760150 7478969 7026554 6655103 6480610 6201191 5839343 5506326 5300963
7040 5300963 4946910 4815133 4666148 4417596 4239892 4084119 3842568 3752169 3496907 3290769
7030 3290769 3240109 3115033 2994052 2980441 2886556 2766972 2675756 2519656 2446770 2467160 2469396
7019 2469396 2465611 2375298 2289456 2339766 2376049 2341230 2323280 2295982 2341428 2335050 2214116 2157082
7007 2157082 2107546 2049692 2052796 1899240 1721982 1726377 1772335 1766125 1754044 1836208 1788381 1744692
6995 1744692 1714259 1645550 1553297 1468301 1388337 1285262 1359465 1408083 1216810 1203979 1287813
6984A287813J926J21775J01403j7914K1294R1898K5771k42237l07940l1676L8343
6973A090456j79711j5518n2245l4463K0749J04968q4734j31278j60811N8283J3877
6962F29573L9593J20968K1731o171M9562l0078j10100Q1383J60454Q476m8767
6951I16624L2644p7137J01006P345l4836J7566j09534j07723L4648P082q3796
6940G03889m7243k7399K2774r9753p7458K007j09705N2861L9043J37943P4616
6929F71575r1293l3605p4395P2893O3232j63402m768J5409J1574n743o3108K0285
6917D18654Q8802o3919p5639L487K8230P066k6385j1969l1284m3443l8602r1914
6905A63084J89847p645O0334N6879n2758n184j60445Q095K0510n107M9544j35640
$$ plain form
6984 1287813 1289739 1411514 1512917 1495003 1516297 1608195 1633966 1391729 1083789 1052113 1090456
6973 1090456 910745 895227 842982 808519 829268 934236 849502 718224 557413 615696 629573
6962 629573 669166 790134 811865 805694 855256 825178 715078 796461 956915 965391 916624
6951 916624 949268 872131 973137 980482 945646 963212 853678 745955 780603 787685 703889
6940 703889 656646 629247 652021 552268 474810 476817 367112 419973 459016 596959 671575
6929 671575 580282 546677 472282 545175 608407 445005 440237 455646 467220 461477 398369 418654
6917 418654 507456 443537 367898 371385 399615 406681 380296 368327 337043 293600 254998 163084
6905 163084 352931 345286 405620 462499 409741 404557 244112 252207 272717 267610 317154 181514
6893A81514j4369n3054J28093P073j52906R0245j10063n5810Q9946J50649R764
6882B71082j50068j05437J29806J43946N617l3949q9753O9382p2393n1226k9166
6871H7841m2737j18876l7275J56360R8899Q7599q8995l4557j76124j5793Q145
6860g5513J93120j18539k3933J9758n3630L4565J42490m6253o7685q8539r953
6849i4112J28735K1038O0562l349j21596P3958P1509K8379p7446r1926q3838R8605
6837A0519M4202p5991L1768J1818m2195o3996J51571r6932m6470r0777k3954J08708
6825h1729J04584O8076J13780m2767j7412L9317j70786o8532P0437j23374M1383
6814f7023R0380n3409N0386j5265P4597k2274P961O9248o8564Q0150P814P7765
$$ plain form
6893 181514 167145 114091 242184 249257 96351 186596 76533 20723 110669 261318 271082
6882 271082 121014 15577 145383 289329 294946 260997 171244 240626 168233 117007 87841
6871 87841 45104 -73772 -111047 45313 144212 231811 142816 108259 -67865 -83658 -75513
6860 -75513 117607 -932 -24865 -5107 -58737 -24172 118318 72065 4380 -84159 -94112
6849 -94112 34623 55661 116223 112874 -8722 65236 136745 165124 87678 -4248 -88086 10519
6837 10519 54721 -21270 10498 22316 -19879 -83875 67696 -29236 -75706 -166483 -190437 -81729
6825 -81729 22855 90931 204711 161944 144532 183849 13063 -55469 14968 -108406 -67023
6814 -67023 23357 -30052 20334 5069 79666 57392 65353 134601 66037 146187 154001 231766
6802B31766j02039J243N3891M1441q5877j3457q6331p8046K0879N7090O8109m0279
6790F8390N8989p069q1942k79M8028p4049M6700m633M631n6545r492J22806J16316
6777B31851O327j88683m5475M6028k8694j77394J50123n4027J3568m8687N6547
6766c8516M6990m6140J32985J3976l3652j19328J8560n015M6208m809R2343M5175
6754A48777N3846j51646j9173R9514l4187p6611R5473N8379l3971o6193o4224
6743I984k9050n7055J04059l779r372N0631n4791o9764m8008R934R9825m167q8552
6730i0105R8366J85261o1798j30840l4205J38188J75713j93844o8915o2105M3025
6719a259O7471P4695l3451p7061Q0430k8180Q3198m6778k2176l6794l2922m1843
$$ plain form
6802 231766 129727 130970 184861 226302 140425 126968 40637 -37409 -16530 40560 108669 68390
6790 68390 127379 120310 38368 38089 86117 12068 58768 54135 58766 2221 -7271 115535 231851
6777 231851 238178 49495 4020 50048 21354 -156040 -5917 -59944 -46376 -95063 -38516
6766 -38516 8474 -37666 95319 109295 75643 -43685 -25125 -30140 16068 11259 103602 148777
6754 148777 202623 50977 31804 131318 97131 20520 115993 174372 140401 74208 9984
6743 9984 -19066 -76121 27938 24159 14787 65418 10627 -59137 -107145 -97211 2614 -1553 -90105
6730 -90105 8261 193522 131724 884 -33321 104867 280580 86736 17821 -44284 -1259
6719 -1259 66212 140907 107456 30395 110825 82645 165843 119065 96889 60095 27173 -14670
6707a4670M9320l4751M9346N5831o4896n6368O9087m1245k1165R6625j12956q414
6695c4256q9992j3280J88442K7308k5265r665P1668N8161j38176k5235L6626M195
6683E0531M2545N9566J430l1999l1849k6603Q244L19552l2797L0032j2149N8524
6671D35027K8716o8929p880l3754J4364j56613k25025M4765O5704l3313L0319
6660I3381P7842j152l0629l5435m0349r525J6480N6318j1705R948o5747m9096
6648A0331J0413L695N1121r8540O658J18116P8619n2533p4781J19037p207o5983
6636I8946o5896k2923R1227k1454J9104n4616l3268P7621p1041K8577R2397N0973
6624A89647j72565J8099o0729K46J43971O6931j11369k8633l8131o6564J28095
$$ plain form
6707 -14670 34650 -101 49245 105076 40180 -16188 52899 11654 -9511 87114 -25842 -34256
6695 -34256 -124248 -137528 50914 78222 52957 43292 114960 173121 34945 9710 46336 50531
6683 50531 93076 152642 154072 122073 90224 63621 71865 391417 358620 388652 376503 435027
6671 435027 463743 394814 386934 353180 367544 210931 -14094 30671 96375 63062 93381
6660 93381 171223 170071 139442 104007 63658 54133 70613 126931 115226 125174 59427 10331
6648 10331 20744 24439 75560 -22980 -16322 101794 180413 127880 53099 172136 164929 98946
6636 98946 33050 10127 101354 79900 99004 44388 11120 88741 17700 46277 138674 189647
6624 189647 17082 35181 -25548 -25302 118669 185600 74231 45598 7467 -59097 68998
6613F8998J13077l4341j24941q291O9864j00479Q3701m314k6789q0253l5660p1817
6601a51245P0756R2206m2091q5730N9687j7888K6312l9070K989O2822L8186N4033
6589G0967q6245Q5749l4341p5929L9560M9639j3924K1745r7921K751J19942q473
6577G3520k1770p5941J2754M4356m9931N0858k280m0078L8649J1730M2872n267
6565G9472o498M2811M552p1186j05540M0235l5409j1019L2982m384J27083Q9663
6553A82762j79128o6483O4826N4676p1808M4044q4075M8433N0420n2363J47637
6542A38941m7621j47318O5469O0318K7123m8804R4731j29699r4165J29932Q6622
6531A35529k4416k06717O6887m8353n1664j8057J06018N7131R7265L2174n6538
$$ plain form
6613 68998 182075 147734 22793 14502 84366 -16113 67588 63274 36485 -43768 -79428 -151245
6601 -151245 -80489 11717 -30374 -116104 -56417 -74305 -47993 -87063 -84074 -21252 16934 70967
6589 70967 -15278 70471 36130 -39799 -239 49400 35476 57221 -40700 -37949 81993 73520
6577 73520 51750 -24191 -11437 32919 -17012 33846 31566 -8512 30137 41867 84739 79472
6565 79472 72974 115785 120337 49151 -56389 -16154 -51563 -62582 -29600 -33984 93099 182762
6553 182762 3634 -62849 1977 56653 -15155 28889 -55186 -6753 43667 -8696 138941
6542 138941 91320 -55998 9471 69789 96912 48108 142839 13140 -81025 48907 135529
6531 135529 111113 -95604 -28717 -77070 -128734 -146791 -40773 16358 113623 145797 89259
6520H9259r4430P8627J07441r797J4195r5867n6951k664J00045J5331r8660L435
6508D9964K6985q0172J00440K1770q6734J15452l0841l1552K4287j60058P1482
6497B1023n5826J3423n7042j0243J31587n439o6753o4103K10513L8423j16892
6486C8671L5028M9117j07712L7739R3111j1560M9127j76981k2630k5136j17029
6475a58255J9955j450j42603M0731R8941J54916n6132J54060k9217o0339K6649
6464D7256P6394O4271q8749o4729j6796P6448p144m491m4683M355j59601K4811
6452i2658J13222o6735j0270J33823l9280M664J49002j55895K7429R2323k55550
6441i9925J64971O6216j51620l4733J43361m5742j20682m0300j6987P4277P5266
$$ plain form
6520 89259 -5171 73456 180897 171100 185295 89428 32477 29813 129858 145189 46529 49964
6508 49964 76949 -3223 97217 118987 32253 147705 116864 85312 109599 -50459 21023
6497 21023 -34803 -21380 -78422 -88665 42922 37483 -29270 -93373 117140 155563 38671
6486 38671 73699 122816 15104 52843 145954 134394 183521 6540 -16090 -41226 -158255
6475 -158255 -138300 -139750 -282353 -241622 -142681 12235 -43897 110163 80946 20607 47256
6464 47256 123650 187921 99172 34443 17647 94095 86951 82460 37777 42132 -117469 -92658
6452 -92658 20564 -46171 -56441 77382 38102 42766 191768 35873 63302 155625 -99925
6441 -99925 65046 131262 -20358 -55091 88270 42528 -78154 -118454 -135441 -61164 14102
6430A4102O5781K5985O8767j15058j32375Q0526K8340j17176R150J12755m7053
6419f256l8359J6204O7543M340J0662l3046R3898j00399M302p4429R493J45849
6407I9802m5707j27K1994n19R2905N2180j01255o5953O134J49599K4566j54485
6395G9134M1146j00476n6991R7754n7820P7086m5654O9160n063o3125L3821L8746
6383A07718p326j8590q073k1621n6321K5487J41144j1991l1240o3861J2952j6282
6371E1996M5838P1811j29136q2267P2966L9680p4590j0265N0313j5499K1656l8969
6359C534N4613R4564O124o2904N4631q7616j5086P3849N3186j0704r4184J6401
6347H6408M611j8942j47350P4959J80562r1374o2304J35066k5615q9659N9125
$$ plain form
6430 14102 79883 105868 174635 59577 -72798 7728 36068 -81108 -71958 40797 -6256
6419 -6256 -44615 -28411 39132 43472 54134 21088 114986 14587 18889 -55540 -46047 99802
6407 99802 54095 53968 75962 75443 168348 220528 119273 53320 59454 209053 233619 79134
6395 79134 120280 19804 -37187 60567 2747 79833 34179 103339 98276 35151 68972 107718
6383 107718 100392 81802 73729 52108 -4213 21274 162418 150427 119187 55326 68278 51996
6371 51996 97834 169645 40509 -41758 31208 70888 -3702 -13967 36346 20847 42503 3534
6359 3534 58147 152711 158835 95931 150562 62946 47860 121709 174895 164191 70007 86408
6347 86408 91019 72077 -75273 -314 180248 88874 26570 161636 136021 46362 105487
6336A05487P5607j1204m9632M2490K7643j5744k4659k86k3056O6325l3315n1830
6324A07826R7570J04991j43935j48237O6632R4215m2851k322J32041j30859M9883
6313A84954J00L640k29146p3386R4883L7370P5174J00702j045j29115o391J50106
6301B07846K3924N3501M1533j34665J4503k4164L7262N6111j12283Q7075l3616
6290B17027R5307J03826p8963p9860n722M9202m793j0098N7036K4638O6579r8325
6278C35854n6829M1448K7063N9432p4442k05921K2019J48436P1713K2998L5551
6267D27322k1622J2746P92n4509p129O3558O557j36411J61681K859j38944K0369
6255C37269Q2315J55465L1211j38422J15228j7241j64046M8895j4614o9184n5893
$$ plain form
6336 105487 181094 169890 120258 162748 190391 174647 149988 149702 126646 192971 159656 107826
6324 107826 205396 310387 166452 18215 84847 179062 136211 133889 265930 135071 184954
6313 184954 185054 188694 -40452 -113838 -18955 18415 93589 194291 193246 64131 57740 207846
6301 207846 231770 285271 326804 192139 206642 182478 219740 275851 163568 250643 217027
6290 217027 312334 416160 337197 257337 251615 300817 296024 285926 342962 367600 434179 335854
6278 335854 279025 320473 347536 406968 332526 126605 148624 297060 368773 391771 427322
6267 427322 405700 418446 419238 364729 357600 421158 427715 291304 452985 455844 316900 337269
6255 337269 419584 575049 606260 467838 583066 565825 401779 450674 436060 366876 310983
6244C10983n5290L2952J1081k6369n490R6291J18731n0821j26528O7215j7425
6233C55330J9660Q6381l794O5305m9213l1508N5295Q0046R0462L6538K8744r9522
6221F33724j561k0146m6819O3631j62836j11989p9289J9250J01292o558m4651
6210C44048n6958L8690P5575l1468j0987L7884j84034J65646m7991l636R1762
6199D18531N0621R9513N6038O5385m2359j11871p5128K1515k1699m1203j07508
6188C11835J9689O6591j26228P6847r3109N02n9851L3142j7842N7933J05897K5147
6176D00553j05177J57329j2527q7050j1366K8172J424K5384j8141K3635l6322
6165C65914q5707M1317k1492O1945j17349L5994l1492L3368m1967P531r2491R0542
$$ plain form
6244 310983 255693 288645 299726 273357 267867 364158 482889 432068 305540 372755 355330
6233 355330 374990 461371 457577 522882 473669 442161 497456 577502 667964 704502 733246 633724
6221 633724 632163 612017 565198 628829 465993 354004 274715 293965 395257 388699 344048
6210 344048 287090 325780 401355 369887 358900 396784 212750 378396 330405 326769 418531
6199 418531 469152 568665 624703 690088 647729 535858 460730 482245 460546 419343 311835
6188 311835 331524 398115 271887 348734 255625 256127 196276 229418 211576 269509 375406 400553
6176 400553 295376 452705 440178 353128 341762 369934 371358 396742 378601 402236 365914
6165 365914 280207 321524 300032 361977 244628 280622 249130 282498 240531 248062 155571 246113
6153B46113M6960J31449k8427K0597O9770n6211J4988J19745j41910J3090N290
6142D41454P1629j3970p224j2783m8525P4324P8340j05722l3994q0991K8114R4486
6130D85138O133o8118M477J68664J0502r8292p9424L5018k8636j1468K7394Q544
6118D59932o2556J28960J06447j44699J1108R8198M5943p0765O3654j2094j51678
6107D72450J09492J6208l0122p9370O8533Q4285M5352L2693k3711m6945m7719
6096F01146n2318M5587m0967k0957P8116M2903j4614P0374O571n7814n8231K9439
6084F29235J09166M116R907L1041o781j45060J5256O8664R1970L921J31670m7805
6072H95300n7203j7234j28269J14028l3791J9761j8461J27832M1709r6044O881
$$ plain form
6153 246113 293073 424522 396095 416692 486462 430251 445239 564984 423074 436164 441454
6142 441454 513083 499113 491889 479106 430581 504905 583245 477523 443529 362538 390652 485138
6130 485138 491271 423153 427630 596294 606796 508504 429080 464098 435462 423994 451388 459932
6118 459932 397376 526336 632783 488084 499192 597390 643333 572568 636222 624128 472450
6107 472450 581942 598150 568028 488658 557191 641476 686828 719521 695810 648865 601146
6096 601146 548828 594415 553448 532491 610607 653510 638896 709270 715841 658027 599796 629235
6084 629235 738401 742517 752424 783465 776684 631624 646880 715544 807514 811435 943105 895300
6072 895300 838097 820863 692594 806622 772831 792592 774131 901963 943672 847628 854509
6061H54509O0012J4170k4174M1292M4203j43039Q7658P5695r4626m808Q0234p3396
6049I17730R1919m7719j3657M5319M1147J23184m7513j275J3137r2807n4187J44751
6037A120029n4024L910P6921O886M1949o3123l2722N3566N3298Q9349l5424R3589
6025A354204R2321j25231J07808K6324o3580l7387J5096P3097J29360M8585K6832
6014A647429J65472n6260J38338P6262l1270k8447p551p9621J72507J50171Q1778
6003B228808O855K3183J1014K6648O0084J3209O4770J16973L8511k9434O9385
5992B630006Q6499J4490K0335L6505J17408L5085J22108M8625Q6316J46405k6497
5981C317285k5249J28125J01998J24352L09954R9597J21360Q0967J16072R7764
$$ plain form
6061 854509 914521 928691 904517 945809 990012 846973 934631 1010326 915700 910892 991126 917730
6049 917730 1009649 961930 948273 993592 1034739 1157923 1110410 1109135 1122272 1029465 975278 1120029
6037 1120029 1066005 1069915 1146836 1153722 1195671 1132548 1099826 1153392 1206690 1296039 1260615 1354204
6025 1354204 1446525 1321294 1429102 1455426 1391846 1354459 1369555 1442652 1572012 1620597 1647429
6014 1647429 1812901 1756641 1894979 1971241 1939971 1911524 1903973 1824352 1996859 2147030 2228808
6003 2228808 2235663 2258846 2269860 2296508 2356592 2369801 2434571 2551544 2590055 2560621 2630006
5992 2630006 2716505 2730995 2751330 2787835 2905243 2940328 3062436 3111061 3197377 3343782 3317285
5981 3317285 3292036 3420161 3522159 3646511 3956465 4056062 4177422 4258389 4374461 4472225
5971D472225R1032J26003J10J26254J62165J07598J29327N5566K21770P8502K40948
5960E811500K39480K05999J96698J66757J88325J79718J95064L06968L12787K70802
5950H074098L11050L03937L94465L34011L88493L33486J59977L69746L57649M43900
5940A1470812N62008O36220N44252O91083Q38320Q55428J149389J291321J359373
5931A9398206J806564K087810K498812K847156L578332M340412N136550N388100
5923D7081942M358826J588208j767843m319459n122204m201693l695833k616174
5915C1305770j781252j230899p75081l37120k05192K14952N92909R74274J273968
5906C0032329J662419K011866K542380L250479L941742M428144N454990P025119
$$ plain form
5971 4472225 4563257 4689260 4689370 4815624 4977789 5085387 5214714 5270280 5492050 5570552 5811500
5960 5811500 6050980 6256979 6453677 6620434 6808759 6988477 7183541 7490509 7803296 8074098
5950 8074098 8385148 8689085 9083550 9417561 9806054 10139540 10299517 10669263 11026912 11470812
5940 11470812 12032820 12669040 13213292 13904375 14742695 15598123 16747512 18038833 19398206
5931 19398206 21204770 23292580 25791392 28638548 32216880 36557292 41693842 47081942
5923 47081942 51440768 53028976 51261133 46941674 41819470 37617777 33921944 31305770
5915 31305770 29524518 28293619 27518538 27181418 26976226 27191178 27784087 28758361 30032329
5906 30032329 31694748 33706614 36248994 39499473 43441215 47869359 53324349 60349468
5898F0349468R028750J0582940J0450991P017691O00714o817973j1621210j1880346
5890F7711025j0155885p785251n946312m394470l368894k571375j925831j561170
5882C0001837j234214q60914l67875o3889K63713O15929R38891J471206J753581
5873C2518265K225640K876395L672022M642581N416684M780757K645543r43980
5865E7833907m533775o536372o652370n707541m618446l673642k867024k165656
5857B1079081j799561j493552j458412r41497q72915p99604o73166o37866n20450
5848A1882058l71136l87581m42816k41714j58585m4558j84875J34104J21084K6494
5838A0332475Q2514J7523k59241n37465n39404m79892m73010m71010m38814k27675
$$ plain form
5898 60349468 69378218 79961158 90412149 97429840 98030554 91212581 79591371 67711025
5890 67711025 57555140 49769889 43823577 39429107 36060213 33488838 31563007 30001837
5882 30001837 28767623 27906709 27538834 27474945 27738658 28354587 29293478 30764684 32518265
5873 32518265 34743905 37620300 41292322 45934903 51351587 56132344 58777887 57833907
5865 57833907 53300132 46763760 40111390 34403849 29785403 26111761 23244737 21079081
5857 21079081 19279520 17785968 16327556 15386059 14513144 13713540 13040374 12402508 11882058
5848 11882058 11510922 11123341 10680525 10438811 10280226 10235668 10050793 10184897 10305981 10332475
5838 10332475 10414989 10432512 10173271 9635806 9096402 8616510 8143500 7672490 7233676 7006001
5828G006001j74675j32069m23136j99047j84679j62093l9700k14865k05380j11435
5818E158922n6448k13110p7990j26503p2843j78433K2617l8925j60124j55295
5808D101868J3408J92002J57926M9942N15J27359K03048K83818Q4932n8708l58401
5797D797709m99780l38488l02490j16797j32068j10606j94298j14711O487l334
5787B991624P7602m073p9349n5610l2126O6768j21608m4949j16929o7044l6498
5776B577808j28140N4373M5679p109M2124M1579k6845k04747k0490k5074j38459
5765B210699O0176P61Q986M0139n9006m8154o2112l9910Q6349l882J8326Q110
5753B220482k1212p0201J3650K45589o2085j34400J17931k8567O64M6302O5559
$$ plain form
5828 7006001 6831326 6699257 6276121 6077074 5892395 5730302 5690602 5475737 5270357 5158922
5818 5158922 5102474 4889364 4811374 4684871 4612028 4433595 4456212 4417287 4257163 4101868
5808 4101868 4115276 4307278 4465204 4515146 4515661 4643020 4846068 5129886 5214818 5156110 4797709
5797 4797709 4297929 3959441 3656951 3540154 3408086 3297480 3103182 2988471 2994958 2991624
5787 2991624 3069226 3065153 2985804 2930194 2898068 2964836 2843228 2798279 2681350 2614306 2577808
5776 2577808 2449668 2504041 2549720 2542611 2584735 2626314 2599469 2394722 2374232 2349158 2210699
5765 2210699 2270875 2271636 2280622 2320761 2261755 2213601 2151489 2111579 2197928 2194046 2212372 2220482
5753 2220482 2199270 2129069 2142719 2388308 2326223 2191823 2309754 2281187 2281851 2328153 2393712
5742B393712j9833o4753J9305M4637R0910o2068n9668M2065j7115k16398o0563
5731B090231J43640J94287L9810r3996J17921j27589j2456J7132M8530L9744J65978
5720B623232J50882K4253j5162J11131o1225r382K5550m8771j13388l4498m6666
5709B605956j23292L0457P6753j01583j16096L9325m3568q6009R1840O9362l6889
5698B406256j7985J18108N9333j15576p440K20718k3036k06380P6556M7511j6091
5687B541974n4181L0265n3920M1963o9180J23466p1955P9125j01377L4301m8938
5676B451543J07529J80783o3172J9438J66267J22433k00962M9216M2625k7917
5666B847783j28216k3338m6091j83932j5402K7304o5264Q6370m0085K7818J33766
$$ plain form
5742 2393712 2373879 2309126 2328431 2373068 2463978 2401910 2342242 2384307 2367192 2150794 2090231
5731 2090231 2233871 2428158 2467968 2373972 2491893 2364304 2351848 2368980 2417510 2457254 2623232
5720 2623232 2774114 2798367 2783205 2894336 2833111 2823729 2849279 2800508 2687120 2652622 2605956
5709 2605956 2482664 2513121 2589874 2488291 2372195 2411520 2367952 2281943 2373783 2443145 2406256
5698 2406256 2388271 2506379 2565712 2450136 2442696 2663414 2640378 2433998 2510554 2558065 2541974
5687 2541974 2487793 2518058 2464138 2506101 2436921 2560387 2488432 2567557 2466180 2500481 2451543
5676 2451543 2559072 2739855 2676683 2696121 2862388 2984821 2783859 2833075 2875700 2847783
5666 2847783 2719567 2696229 2650138 2466206 2450804 2478108 2412844 2499214 2459129 2486947 2620713
5655B620713j44039j77115P4851J15717l9800j2536J20385N4091L8686j5237l9928
5644B595788L5687J05142K4494r7264L2549Q5781j10713j7686J38441N7457o2069
5633B787607Q2386J10412J03298p3943k622J42942J87211J48039M3362q6366P6405
5622C518731M1341l8226J24563k6726l4233o211J5065k3336L2563K0214N8978
5611C682723r6070K7348O3077P0001K06156J84778J57365l6321N5255k9517N6167
5600D340962J45691J18196O0241k8836J14903J7904R0048O3253J18600J59069
5590E200031O9550J29453k401J88761J64569M1619K9078N4581K8089K4520J74707
5579F102557K02050K00363N2890K30213Q1904J76990J58509J4453K54439J70218
$$ plain form
5655 2620713 2476674 2299559 2374410 2490127 2450327 2437791 2558176 2612267 2650953 2635716 2595788
5644 2595788 2631475 2736617 2761111 2663847 2696396 2782177 2671464 2653778 2792219 2849676 2787607
5633 2787607 2869993 2980405 3083703 3009760 3007138 3150080 3337291 3485330 3528692 3442326 3518731
5622 3518731 3560072 3521846 3646409 3619683 3585450 3579239 3594304 3570968 3603531 3623745 3682723
5611 3682723 3586653 3614001 3677078 3747079 3953235 4138013 4295378 4259057 4314312 4284795 4340962
5600 4340962 4486653 4604849 4665090 4636254 4751157 4769061 4859109 4922362 5040962 5200031
5590 5200031 5269581 5399034 5396633 5585394 5749963 5791582 5820660 5875241 5903330 5927850 6102557
5579 6102557 6304607 6504970 6557860 6788073 6869977 7046967 7205476 7219929 7474368 7644586
5569G644586K70083M64154L58137K17343J52195K76689L59112M62925M28499M43474
5559A1077197M42631L68812L50249M66765L94181O64893Q08139Q23898J047938
5550A6444703J008740R83482N44403N53975P73104J181544J303695J655393K040829
5541B6489868K445296K850252L508839M061422M156311L616289K093452p2182
5533D9149547k092940l293101l575789l069295k419587j773962j134097p53093
5525C1037683l54594p6367Q9631N17902Q70213J280647J729117K112044K568037
5516C9774313L154163L584328M199343N002756N805974O743409P535917O628142
5508H2428345M149409K6786m472459p607970q510997q165039o802297n336946
$$ plain form
5569 7644586 7914669 8378823 8736960 8954303 9106498 9383187 9742299 10205224 10633723 11077197
5559 11077197 11519828 11888640 12238889 12705654 13099835 13764728 14572867 15396765 16444703
5550 16444703 17453443 18436925 18981328 19535303 20308407 21489951 22793646 24449039 26489868
5541 26489868 28935164 31785416 35294255 39355677 43511988 47128277 49221729 49149547
5533 49149547 47056607 43763506 40187717 37118422 34698835 32924873 31790776 31037683
5525 31037683 30683089 30606722 30696353 31214255 32084468 33365115 35094232 37206276 39774313
5516 39774313 42928476 46512804 50712147 55714903 61520877 68264286 75800203 82428345
5508 82428345 86577754 86604540 82132081 74524111 66013114 57848075 51045778 45708832
5500D5708832m059603l080891k376482j618876j305249p74692m05258m1127M45973
5491C2492627P38218Q63165J105853J361964J361551J582896K037139K352468
5483D3895881K837403K962994J819027j77493k416260m362370m952461m610122
5475C4996599m085687l397029k745293k129880j626885j240513j023122r02965
5467A7845225p02337o34100n89366n96085m25401m79843n94323o81692o80581
5458A2461497o21390p53781o76552n26846m60497l72960l12376k76142k06615
5449H254338k63967l46358q3151j42069m01499j35522l2655n6617j41142k27158
5439F424200o3477J01708J40862K1161r5513j82720j50536l44509j30235j64453
$$ plain form
5500 45708832 41649229 38568338 36191856 34572980 33267731 32493039 32087781 32046654 32492627
5491 32492627 33230845 34094010 35199863 36561827 37923378 39506274 41543413 43895881
5483 43895881 46733284 49696278 51515305 51337812 48921552 44559182 39606721 34996599
5475 34996599 30910912 27513883 24768590 22638710 21011825 19771312 18748190 17845225
5467 17845225 17142888 16508788 15919422 15323337 14897936 14418093 13823770 13142078 12461497
5458 12461497 11840107 11086326 10409774 9882928 9422431 9049471 8737095 8460953 8254338
5449 8254338 7990371 7644013 7560862 7418793 7017294 6881772 6849117 6792500 6651358 6424200
5439 6424200 6360723 6462431 6603293 6624454 6528941 6346221 6195685 5851176 5720941 5556488
5429E556488j56855o2705J6728n2797Q0229j2574j46263P1498j2891p2723j76647
5418E031488n6641L4323p6665p8570q6299k05429l3340K9816N6218N1596j01743
5407D564754j7392L868J00145J95741r0447j17244O3364L6993J3887q4131k349
5396D667189J59028Q0684J38018M8359K20250R3928m0313P6520O0431J28332N2259
5385E684685J66362M226K41171L82423K04890J37845M05058N26648k8557l15290
5375G409461n31786l93147k42812k13657k08346j45262m5048l551K89655J24478
5365F039985q6327N7912J62760J60580K00909L12717L59867L84881L21622M57120
5355H372026N46024Q77386R24513P90674N10012j28480k42960m75626o20400o69406
$$ plain form
5429 5556488 5399633 5336928 5353656 5300859 5381088 5368514 5222251 5293749 5280858 5208135 5031488
5418 5031488 4974847 5009170 4932505 4853935 4767636 4562207 4528867 4558683 4614901 4666497 4564754
5407 4564754 4547362 4551230 4651375 4847116 4756669 4639425 4702789 4739782 4753669 4669538 4667189
5396 4667189 4826217 4906901 5044919 5093278 5313528 5407456 5367143 5443663 5504094 5632426 5684685
5385 5684685 5851047 5855273 6096444 6478867 6683757 6821602 7226660 7753308 7724751 7409461
5375 7409461 6877675 6484528 6241716 6028059 5819713 5674451 5629403 5625852 5915507 6039985
5365 6039985 5953658 6011570 6174330 6334910 6535819 6848536 7208403 7593284 7914906 8372026
5355 8372026 8918050 9795436 10719949 11510623 12020635 11892155 11649195 11173569 10553169 9883763
5345I883763o04878o63772n55735m80340m61421l38502l57529q1633p0995N269
5335F274227M9904J116n8199J43497K90774L41747M47264N63701N17649P45929
5325I317609O05447L54482J06623J14222J31338J52845K61871k53952o99083q72901
5315I218501j039319r50555p25284n00776n42331k17878j12900l34420j26494
5306D668544q0475r7044j25154O0040l456o3465k240Q9660L59274Q3469J08662
5295D997815K21974M60120K99183K31496k9318k04187l64428o03806l89105l08142
5285D311602l18656k63594k10232j22750n9569k08230k5102k35187j80875l3048
5275B654359K5877j73427l2331l8063N5046J0537k3118k4804o2714J4226O8459
$$ plain form
5345 9883763 9278885 8615113 8059378 7579038 7117617 6779115 6421586 6339953 6268958 6274227
5335 6274227 6324131 6325247 6267048 6410545 6701319 7043066 7490330 8054031 8571680 9317609
5325 9317609 9923056 10277538 10384161 10498383 10629721 10782566 11044437 10790485 10091402 9218501
5315 9218501 8179182 7228627 6503343 6002567 5460236 5242358 5129458 4795038 4668544
5306 4668544 4588069 4491025 4365871 4425911 4422455 4358990 4356750 4446410 4805684 4889153 4997815
5295 4997815 5219789 5679909 5979092 6210588 6181270 5977083 5612655 5008849 4619744 4311602
5285 4311602 3992946 3729352 3519120 3396370 3336801 3128571 3103469 2868282 2687407 2654359
5275 2654359 2680236 2506809 2474478 2436415 2491461 2501998 2478880 2454076 2391362 2405588 2474047
5264B474047m9233M1201p0091j18154m4528P486m8954K3781Q1834m5331j17869
5253B134189K8222k1596j19765l9022O2162j38755j40558j7602K7836m6498q8017
5242A640596J51719Q215n890o7599J02645M9945m3035M4646j8479P0051l3680
5231A899134l0423J39642J14618m7249l3190p0880q8251q821n4859J02116j57713
5220A764124j56018q1317L1177o0828M0207L435L2909J46735m7909J0792R8594
5209A781901j23700j46589K0685J4815J8266j34638l6513r8764n3568K7970K2872
5198A292737r5568M8560K1651O5426O6474j28669p8168L4243R7374O513M0535
5187A371108m6109M2439J620K0501P0637j0814o1876O7972j17430o1681O8062
$$ plain form
5264 2474047 2424814 2466015 2395924 2277770 2233242 2240728 2191774 2215555 2297389 2252058 2134189
5253 2134189 2162411 2140815 2021050 1982028 2044190 1905435 1764877 1747275 1775111 1728613 1640596
5242 1640596 1792315 1800530 1794640 1727041 1829686 1879631 1836596 1881242 1862763 1932814 1899134
5231 1899134 1868711 2008353 2122971 2075722 2042532 1971652 1883401 1874580 1819721 1921837 1764124
5220 1764124 1608106 1526789 1557966 1497138 1537345 1540780 1573689 1720424 1672515 1683307 1781901
5209 1781901 1658201 1511612 1532297 1547112 1565378 1430740 1394227 1295463 1241895 1269865 1292737
5198 1292737 1197169 1245729 1267380 1332806 1399280 1270611 1192443 1226686 1324060 1330573 1371108
5187 1371108 1324999 1367438 1369058 1389559 1460196 1449382 1387506 1455478 1338048 1276367 1344429
5176A344429l6382o5682j45320q5134k6987Q547N3718J60384r277j50056n5378
5165I92862M6548R7582j46874Q477R5748R006M7011M222L3575R465J6593k3672
5153A190543p6858o8609K7976n3107j64113l409J02544p267m6647l1213j0599
5142H59241P1357K823j96577L5283k0582n3838J1482k0221O2631J35825l230k17845
5130F66349J1035P5841R4553N4400O2370M5039o0908n474J2628J1022r4938m1189
5118H30728o0826O9272n2544n3585q0849M085J42771N8526Q6388j23161r2478
5107G28327j6648J31464P3182Q2804r0392k01269J11903R3772p5056k6711k4218
5096G87158N7194j815r8771j54289J28111O8459q9986Q1995n972P2151O8942l7839
$$ plain form
5176 1344429 1308047 1242365 1097045 1011911 984924 993471 1047189 1207573 1198296 1048240 992862
5165 992862 1039410 1136992 990118 998595 1094343 1103349 1150360 1154582 1188157 1197622 1214215 1190543
5153 1190543 1113685 1045076 1073052 1019945 855832 852423 954967 947700 901053 869840 859241
5142 859241 930598 933421 736844 772127 751545 697707 709189 688968 751599 887424 884194 666349
5130 666349 677384 753225 847778 902178 964548 1009587 948679 943205 955833 966855 871917 830728
5118 830728 769902 839174 786630 733045 652196 656281 799052 857578 943966 820805 728327
5107 728327 711679 843143 916325 999129 908737 707468 819371 913143 838087 811376 787158
5096 787158 844352 842537 743766 589477 717588 786047 696061 778056 772084 844235 913177 875338
5084H75338o6593q5386j9054M332J00377R4530o4557j21022N5020n3623O4468
5073G83830r6763N3044Q1205o4832k7915j89749J14504m6560m6344N2145R3805
5062G06370M1262r4217J01624j00949j39999P027K6178P2002K8969m1050n6561
5051E50656J45581j35437Q0514L5249j10967m6530M7340M0338o9390l2652K7473
5040E32175l3988K3964L4995Q1559k0062j00809N1776K5917R324p5312N6650j301
5028E84888k3561l7242Q3878k6034p7236M8120k3341K1860M9143m5581j04221
5017D50673j769M704O7546Q3087M2681j9299l9267m9157O2472K0451M8432k1733
5005F48821J7976R7442q9480j04648j69658K7293Q7993O25j9373N5252q417N4286
$$ plain form
5084 875338 808745 723359 704305 708637 809014 903544 838987 717965 772985 719362 783830
5073 783830 687067 740111 821316 756484 728569 538820 653324 606764 560420 612565 706370
5062 706370 747632 653415 755039 654090 514091 521118 547296 619298 648267 607217 550656
5051 550656 696237 560800 641314 676563 565596 519066 566406 606744 537354 504702 532175
5040 532175 498187 522151 557146 638705 618643 517834 569610 595527 604851 529539 586189 584888
5028 584888 561327 524085 607963 581929 504693 552813 529472 551332 600475 554894 450673
5017 450673 448904 453608 521154 604241 646922 627623 588356 539199 601671 622122 670554 648821
5005 648821 666797 764239 674759 570111 400453 427746 515739 516364 496991 552243 543826 598112
4993E98112N6854j35993L9336o1727k06113O3143P9925R5806M1703J2815j50209
4982D33652n843J08672L1801k0177q0499j2004Q7338O2237J4184k4606K2993L939
4970F21687j21416j23409J1287Q2419q815J05081l0317o2625Q732Q1817m1471
4959E22970M0631p7138J1448N3008Q192o7471N3217l1974j19760J21939J88193
4948G03255p422n5311k5486m842j27089K3853K30686j165j43298J16153K08164
4937I17498p1518r2700n2557K3007j68919L3663q4262m2131J39592k7425o0874
4926E13374O224K1947n1305m9245J03663K5873j27646j649J77330j8369p1352
4915E28845L7840p341n4938k8876K1890R5912L8922q0445L6698O9756n2379Q8863
$$ plain form
4993 598112 654966 518973 558309 496582 290469 353612 433537 529343 571046 583861 433652
4982 433652 427809 536481 568282 548105 467606 455602 542940 605177 619361 594755 617748 621687
4970 621687 500271 376862 388149 470568 461753 566834 536517 473892 482624 564441 522970
4959 522970 563601 486463 497911 550919 559111 491640 544857 512883 393123 515062 703255
4948 703255 695833 640522 615036 610194 483105 506958 737644 736479 593181 709334 917498
4937 917498 845980 753280 700723 723730 554811 588474 504212 462081 601673 574248 513374
4926 513374 519598 541545 490240 440995 544658 570531 442885 441236 618566 600197 528845
4915 528845 566685 559344 504406 475530 497420 593332 632254 551809 588507 658263 605884 694747
4903F94747k0884p1198N1636r096K380Q8669j23747j28849J13480L1348j29773
4892D98713J14008N4940k7656l9146J01117P3819k1335N3466j0593l3285K5876
4881G89924Q3426o5710P9429j30303J63559r2143o4375K2753l3272J06631k6831
4870H33088k7044L1003j1832n9179L7316N8550J5657P7062l6390j06114J25555
4859I37672n8130k4941L4163Q5122O2899j0817K2718K9409k0334J29901j1168
4848A176494p9711l1922M3765k4122Q0021J17667p563K7325l4702k7990O8828
4837A308090J51848j15353j42742R8664J25409M7182K2677J523p7161J21420m371
4826A537186N988M5141Q1322l2753P7777R7081m2393J65443N4693n048k7659N2520
$$ plain form
4903 694747 673863 602665 654301 645205 647585 736254 612507 483658 597138 628486 498713
4892 498713 612721 667661 640005 600859 701976 775795 754460 807926 797333 764048 789924
4881 789924 873350 807640 887069 756766 920325 828182 763807 786560 753288 859919 833088
4870 833088 806044 837047 825215 766036 803352 861902 877559 954621 918231 812117 937672
4859 937672 879542 854601 888764 973886 1036785 1025968 1048686 1078095 1057761 1187662 1176494
4848 1176494 1096783 1064861 1108626 1084504 1164525 1282192 1274629 1301954 1267252 1239262 1308090
4837 1308090 1459938 1344585 1201843 1300507 1425916 1473098 1495775 1497298 1420137 1541557 1537186
4826 1537186 1543174 1588315 1669637 1636884 1714661 1811742 1769349 1934792 1989485 1984437 1956778 2009298
4814B009298l5747R5926o865j1429P6077M8312P6695n3742O0557K06160J56701
4803B621943M7498J5556J42431K2313J53478K13933J80682J53553J93934l1568
4793C713753J63261K77334k7986K04691K11336R7866K23287K24441L52341J83335
4783E623659L42032N21353M76780M72529O47316R04567R90976J085977J290147
4774A2355336J582700J868485K606337L549878M578990M959185M162592J747662
4766C7411165j565900m173304n520079n165399l934646k898079k063947j550210
4758A0539601j079755r39719p23462n41791n56766m64690k84474l25333k37366
4749E386245k64688j79469j91576j17560j43143j40182j14911j65554J27167R6861
$$ plain form
4814 2009298 1973551 2069477 2062612 2051183 2127260 2175572 2252267 2198525 2259082 2465242 2621943
4803 2621943 2669441 2684997 2827428 2849741 3003219 3217152 3397834 3551387 3745321 3713753
4793 3713753 3877014 4154348 4126362 4331053 4542389 4640255 4863542 5087983 5440324 5623659
4783 5623659 5965691 6487044 6963824 7436353 8083669 8988236 9979212 11065189 12355336
4774 12355336 13938036 15806521 18412858 21962736 26541726 31500911 35663503 37411165
4766 37411165 35845265 31671961 26151882 20986483 17051837 14153758 12089811 10539601
4758 10539601 9459846 8520127 7796665 7254874 6698108 6233418 5948944 5623611 5386245
4749 5386245 5121557 4942088 4750512 4632952 4489809 4349627 4234716 4069162 4196329 4293190
4739D293190j99220p5772j39680k5993l5622j6484L1321O4842K1234O2375N5572
4728D035763Q4060K1031p9022J21566R3367K56383Q5582J43931J68959J55603
4718E087223P3549k5188J95936K06767J87843L03314L91493N11316M59844M70875
4708G862972O66604R61818R53008J272119J356566J769611K315690K992282L949977
4699B4100647M324118L897531K523804M3480k141782l736249m998975m749190
4691A9263384l556480k614372j889693j575723r83555q33171p88578p15293n09342
4682E797177m11586l13090l47488k43295r1859m78877k17589N011k24711j81435
4672C292258q8063l2383Q078j58882j41037l6235j96307j40036j53411j87018
$$ plain form
4739 4293190 4093970 4018198 3878518 3852525 3816903 3800419 3831740 3896582 3917816 3980191 4035763
4728 4035763 4119823 4140854 4061832 4183398 4276765 4533148 4618730 4762661 4931620 5087223
4718 5087223 5160772 5135584 5331520 5538287 5726130 6029444 6420937 6932253 7392097 7862972
4708 7862972 8529576 9491394 10444402 11716521 13073087 14842698 17158388 20150670 24100647
4699 24100647 28424765 32322296 34846100 34889580 32747798 29011549 24012574 19263384
4691 19263384 15706904 13092532 11202839 9627116 8643561 7810390 7021812 6306519 5797177
4682 5797177 5385591 5072501 4725013 4481718 4389859 3910982 3693393 3698404 3473693 3292258
4672 3292258 3204195 3171812 3179890 3021008 2879971 2843736 2647429 2507393 2353982 2166964
4662B166964L3231k8232J6984k04007N6912N8370q6115J0851k2359l9530n349
4651A957720j6087j53070p5446J0941j1590j22765N0459J28722p3938o1654q4844
4640A548448l2087p187L977j58343J61862p1795l9732o3920P3578J7189r789r3713
4628A328488n7573M1526n9854m1071N3115O8008j1765m660q6810n639L4720L8049
4616A296534m5768o0941K1630p5030L6020O9834p3639l3263J20508n5504j36571
4605A063810O2968R9190r090o6002J547q905j4666p023J11422j11409n1882j7444
4593A052516J63956l6086q5676R2596Q388N805j36815m2345L025L9578O0815R458
4581A135215L6788Q975N473j9254j19785J16843N3953L3277Q601j01913j5915
$$ plain form
4662 2166964 2200195 2171963 2188947 1984940 2041852 2100222 2014107 2024958 2002599 1963069 1957720
4651 1957720 1941633 1788563 1713117 1724058 1712468 1589703 1640162 1768884 1694946 1633292 1548448
4640 1548448 1516361 1509174 1513151 1354808 1516670 1444875 1405143 1341223 1414801 1431990 1422201 1328488
4628 1328488 1270915 1312441 1252587 1211516 1264631 1332639 1320874 1316214 1229404 1223765 1258485 1296534
4616 1296534 1250766 1189825 1211455 1136425 1172445 1242279 1168640 1135377 1255885 1200381 1063810
4605 1063810 1126778 1225968 1216878 1150876 1152423 1143518 1128852 1121829 1233251 1121842 1069960 1052516
4593 1052516 1216472 1180386 1094710 1187306 1195694 1201499 1064684 1022339 1025364 1064942 1125757 1135215
4581 1135215 1172003 1180978 1186451 1167197 1047412 1164255 1218208 1251485 1260086 1158173 1142258
4570A142258M5608m3870o9290O9184P0372O4286j92371K3132j7165J578K7629
4559A121351L2673L0549R1270q9649j06855j19231J98146R1382J9163j8130r9180
4548A151489q2397k5307M7921l0845J14581J35928n5131o2199P1921k46m0731
4537A224984j25855r5864J32890J77869n6616j7721M841Q3629o3705j01976j4482
4526A147994J07941J18786p4063M94M7585K7583o066m9877p9800N9351O8189p2578
4514A295539R8304O4957l3438K3821n2155P5528N7417o7442M2893m534L0085K6229
4502A557204m3150r8345J7843K1063J67209K2904L6674j28734j93739P4284J23263
4491A556476R6760j04194l4921p56J12361R5752J5332j31614L0576k028q3576
$$ plain form
4570 1142258 1187866 1143996 1074706 1143890 1214262 1278548 1086177 1109309 1092144 1093722 1121351
4559 1121351 1154024 1184573 1275843 1186194 1079339 960108 1158254 1249636 1268799 1250669 1151489
4548 1151489 1069092 1043785 1091706 1060861 1175442 1311370 1256239 1194040 1265961 1265715 1224984
4537 1224984 1099129 1003265 1136155 1314024 1257408 1239687 1244528 1328157 1264452 1162476 1147994
4526 1147994 1255935 1374721 1300658 1301152 1348737 1376320 1370254 1320377 1240577 1299928 1368117 1295539
4514 1295539 1393843 1458800 1425362 1449183 1397028 1472556 1529973 1462531 1505424 1500890 1530975 1557204
4502 1557204 1514054 1415709 1433552 1454615 1621824 1644728 1681402 1552668 1358929 1433213 1556476
4491 1556476 1653236 1549042 1514121 1513365 1625726 1721478 1736810 1605196 1635772 1633744 1550168
4480A550168N7618M0287m1021r5741Q0711J31460m7799o693M4908j4019R8323
4469A798202Q6452l7578n16j32143l7018Q4162J00451N4110M5605J36337K9516
4458B127580m1637K7444P6805J9743J28528R65q01m4450J60962R5284j77741q5216
4446B287466M3112N5789M3910K7638r8241J1231L0555R0048l1117Q9694M5747
4435B595832O3244J93064K9172K06444J23540J48474J78483R2275J85604N8454
4425C874586j52202k35999l21918j37451j79394N2755n7972o7012l7534j45637
4415B592222J33251M1623M1718J5644j3136j540M5050J39179r6805Q6244K1355
4404C004805j66173j1101P5992K7740m3678L168Q6366j5490o1413J09891J72325
$$ plain form
4480 1550168 1607786 1648073 1607052 1511311 1592022 1723482 1675683 1668990 1713898 1699879 1798202
4469 1798202 1884654 1847076 1846560 1714417 1677399 1761561 1862012 1916122 1961727 2098064 2127580
4458 2127580 2085943 2113387 2190192 2209935 2338463 2339428 2338627 2294177 2455139 2550423 2372682 2287466
4446 2287466 2330578 2386367 2430277 2457915 2359674 2370905 2401460 2491508 2460391 2550085 2595832
4435 2595832 2659076 2852140 2881312 3087756 3211296 3359770 3538253 3630528 3816132 3874586
4425 3874586 3722384 3486385 3164467 3027016 2847622 2900377 2842405 2775393 2737859 2592222
4415 2592222 2725473 2767096 2808814 2824458 2811322 2809782 2854832 2994011 2897206 2983450 3004805
4404 3004805 2838632 2827531 2903523 2931263 2887585 2890753 2977119 2961629 2900216 3010107 3182432
4393C182432l4403r7469Q8297m6907Q0902R8397P1829j2728m4096P4155o723J02409
4381C456095J12644n151l0761J68945k2577j07989O3683l7805J5064N4455P8782
4370C745385Q0361j3531l7633P401M7332j9142k1535P1938k2670o9235K31869
4359D000540J67232J8110K9039k13820O3769R4400J17803j604K3545J01815p7546
4348D323283J19881j3744Q4474J35820J55495J03762Q5756R1133K14865J18419
4338E419144O8992L39354R360r3159l7755l9172j29483q5372j00376l9624p7464
4327E234445M4894r3776j67452J2506O1557Q2714p2204K5954O9337J95702K801
4316E396478J4120L5190r444o99r9009l813j00637p4015J88904L0823O5139J58956
$$ plain form
4393 3182432 3148029 3050560 3138857 3091950 3172852 3271249 3343078 3330350 3286254 3360409 3353686 3456095
4381 3456095 3568739 3563588 3532827 3701772 3679195 3571206 3634889 3597084 3612148 3666603 3745385
4370 3745385 3825746 3812215 3774582 3781983 3829315 3810173 3788638 3860576 3837906 3768671 4000540
4359 4000540 4167772 4185882 4214921 4001101 4064870 4159270 4277073 4275469 4299014 4400829 4323283
4348 4323283 4443164 4429420 4513894 4649714 4805209 4908971 4994727 5085860 5300725 5419144
4338 5419144 5488136 5827490 5836850 5743691 5705936 5666764 5537281 5451909 5351533 5311909 5234445
4327 5234445 5279339 5185563 5018111 5030617 5092174 5174888 5102684 5128638 5197975 5393677 5396478
4316 5396478 5410598 5445788 5436344 5435645 5336636 5332823 5232186 5158171 5347075 5377898 5443037 5601993
4304E601993n3960O428P6103n2586K4995Q5612O640M7112R9120J25248q8955O1716
4292E939466q2602R9728J44207P3278P644O1597J24749N8347K4497J27590J13136
4281F691637J30577j21801O5103P3531N6068R5505J2985j6930N7888J56130n2546
4270G148147j10583O208Q3274J55395O9937j6162P9632J78839J50536K1807m6455
4259G720575J25051K36202J6676P0820Q4711J88815o6314J52796k6202Q342R1397
4248H602869J69378j169p72J41673L8768J65320Q8770R1253J47900J94019R3345
4237I731354J26764N040J62085J07655N6894J75717J66972R9928O0808J82683
4227A0875900J66715K74199J51660O2178J70596K82830K22528L29252J54062J08436
$$ plain form
4304 5601993 5548033 5554461 5630564 5577978 5602973 5688585 5695225 5742337 5841457 5966705 5877750 5939466
4292 5939466 5856864 5956592 6100799 6174077 6181721 6243318 6368067 6426414 6450911 6578501 6691637
4281 6691637 6822214 6700413 6765516 6839047 6895115 6990620 7003605 6986675 7044563 7200693 7148147
4270 7148147 7037564 7043772 7127046 7282441 7352378 7336216 7415848 7594687 7745223 7767030 7720575
4259 7720575 7845626 8081828 8098504 8169324 8254035 8442850 8376536 8529332 8503130 8511472 8602869
4248 8602869 8772247 8771078 8770306 8911979 8950747 9116067 9204837 9296090 9443990 9638009 9731354
4237 9731354 9858118 9863158 10025243 10132898 10189792 10365509 10532481 10632409 10693217 10875900
4227 10875900 11042615 11316814 11468474 11530652 11701248 11984078 12206606 12535858 12689920 12798356
4217A2798356J04469R5932K10853K20249K63420J93530J76718J33261J60188K14763
4207A4571739J81048L25458L34424K14951K18850L97408J06728J04158K15813
4198A6670577K61800M10271L01658L01443K48531K57047L54115K47331L21044
4189A9373817L04918L71909L09436L54806K51164M95386N56376L35411N10152
4180B2863375N59616O56740M74938O94536R40952O59485O04441O71782R22469
4171B9048334Q72360Q77132J145781J132190J220428J353529J352101J241020
4163C8242875J178007J276762J270896J588014J984234K339793K574084K969665
4155E3424330L427360L813588M238273M927597N815770P126289Q379255J0002135
$$ plain form
4217 12798356 12902825 12998757 13209610 13429859 13693279 13886809 14063527 14196788 14356976 14571739
4207 14571739 14752787 15078245 15412669 15627620 15846470 16243878 16350606 16454764 16670577
4198 16670577 16932377 17342648 17644306 17945749 18194280 18451327 18805442 19052773 19373817
4189 19373817 19678735 20050644 20360080 20714886 20966050 21461436 22017812 22353223 22863375
4180 22863375 23422991 24079731 24554669 25249205 26190157 26849642 27454083 28125865 29048334
4171 29048334 29920694 30797826 31943607 33075797 34296225 35649754 37001855 38242875
4163 38242875 39420882 40697644 41968540 43556554 45540788 47880581 50454665 53424330
4155 53424330 56851690 60665278 64903551 69831148 75646918 82773207 91152462 101154597
4147A01154597J1571598J3908368J7224242K2959522L0709756L8252942L9610440
4140B75391465K9544805N979834k2066342m0658366m5551272l7775587k8413956
4133A36450581k0427191j5083444j1232514q842095p246104o054605m904817m152347
4125E8507464l577232k871802k608014k437544k333638k175640j960204j818032
4117C8725358j422413j207708r94885p30755m60587o41441p17003p46765q80732
4108C0923069r68130r24848j044601j151439r67713j043340q24676o12310o70419
4099B2715593n89421o29918n19131n03927m04066m94038m34201n26132o43920
4090A7970839m86677l90485m76744k04861m4810l79961q0391k12939k37082j75802
$$ plain form
4147 101154597 112726195 126634563 143858805 166818327 197528083 235781025 275391465
4140 275391465 304936270 310916104 288849762 248191396 202640124 164864537 136450581
4133 136450581 116023390 100939946 89707432 80865337 73619233 67564628 62659811 58507464
4125 58507464 54930232 52058430 49450416 47012872 44679234 42503594 40543390 38725358
4117 38725358 37302945 36095237 35100352 34369597 33909010 33267569 32550566 31803801 30923069
4108 30923069 29954939 29030091 27985490 26834051 25866338 24822998 23998322 23386012 22715593
4099 22715593 22126172 21496254 20977123 20473196 20069130 19575092 19140891 18614759 17970839
4090 17970839 17484162 17093677 16616933 16412072 16367262 15987301 15906910 15693971 15456889 15281087
4080A5281087j6762j98000r5950n2016Q262N0992k3785m3374j41124m54126l89303
4069A3925901m80280m05733l39789m34508m94047k83619k02966j39610j04965
4060A1040384j80779k32426P4166j22888j10603o6271j25949q4550k8547O4870
4050A0227407j06493o3950r8851l2688K7022Q8727O8477N3993O382M7306K04127
4039A0421459J51005K75396P0555K59884K00788J2820L21511L54452L76703N49207
4029A2993780L44171J45414j44318l22505l07904k33130n5037q6071R4681N149
4019A2434230l2630q8419j02600j14215K0074O8772K88192K10693P3319R2699
4009A2850115m0183q5467k54586k67590k99580k6595Q9072o591Q5992Q6225P8532
$$ plain form
4080 15281087 15264325 15066325 14970375 14918359 14926621 14977613 14953828 14910454 14769330 14315204 13925901
4069 13925901 13445621 13039888 12700099 12265591 11771544 11487925 11284959 11145349 11040384
4060 11040384 10859605 10627179 10701345 10578457 10467854 10401583 10275634 10191084 10162537 10227407
4050 10227407 10120914 10056964 9958113 9925425 9952447 10041174 10109651 10163644 10170026 10217332 10421459
4039 10421459 10572464 10847860 10918415 11178299 11379087 11391907 11713418 12067870 12444573 12993780
4029 12993780 13337951 13483365 13339047 13016542 12708638 12475508 12420471 12334400 12429081 12434230
4019 12434230 12401600 12313181 12210581 12096366 12116440 12185212 12473404 12684097 12757416 12850115
4009 12850115 12809932 12724465 12469879 12202289 11902709 11876114 11965186 11958595 12044587 12130812 12209344
3998A2209344L8360K30956J50592J41648K30948J62723K94094M27830M29064M04975
3988A4720534M95305M75048N25930O49275Q36245Q25760Q90841R78218O69320
3979B1066476N31604Q68593R01731J120650R47382M50022j96698p36351j125517
3970B3827892j004815o24047m28780l85864r8134J02903J56115N21580O36545
3961B2703395P12672R74065J220028J483475J693910K021804K289788K327578
3953C5426715K381142K416993L096027L618494M343764M324876K940517J66467
3945E8714995k537782m581509m880181m036983l332493k488492j636942j224470
3937C3996143r19606m76836j67432J80162N37507O09062Q63533J293478J499144
$$ plain form
3998 12209344 12247704 12478660 12629252 12770900 13001848 13164571 13458665 13886495 14315559 14720534
3988 14720534 15215839 15690887 16216817 16866092 17702337 18528097 19418938 20397156 21066476
3979 21066476 21598080 22466673 23368404 24489054 25436436 25886458 25689760 24953409 23827892
3970 23827892 22823077 22199030 21770250 21384386 21286252 21389155 21545270 22066850 22703395
3961 22703395 23416067 24390132 25610160 27093635 28787545 30809349 33099137 35426715
3953 35426715 37807857 40224850 43320877 46939371 51283135 55608011 58548528 58714995
3945 58714995 56177213 51595704 46715523 42678540 39346047 36857555 35220613 33996143
3937 33996143 33076537 32599701 32432269 32612431 33149938 33759000 34622533 35916011 37415155
3928C7415155J898923K517458K998800L697521M282237N103772O078678O209393
3920G0201937N135410J992941j904262n119387p084638o946994n915568m822384
3912D5537055l827041k992675k536833j967765j669452j388417r49278o61823
3904B9543771l78774K237K10632N35963P59318J224160J528502J915025K656710
3895C7997544L244362L529294L429669K114788o55887l048754m828529n208925
3887C6573562m597407l782461k922149k225326j827384j395245j221945r83855
3879A7617790q20548p87730m04497k56206k55583j48170j47182k5619J38516J94875
3869A5105646K00517N60901P22797P28184L57562J37906n27318j014911j394204
$$ plain form
3928 37415155 39314078 41831536 44830336 48527857 52810094 57913866 63992544 70201937
3920 70201937 75337347 77330288 75426026 70306639 63222001 56275007 50359439 45537055
3912 45537055 41710014 38717339 36180506 34212741 32543289 31154872 30205594 29543771
3904 29543771 29164997 29167234 29377866 29913829 30673147 31897307 33425809 35340834 37997544
3895 37997544 41241906 44771200 48200869 50315657 49659770 46611016 41782487 36573562
3887 36573562 31976155 28193694 25271545 23046219 21218835 19823590 18601645 17617790
3879 17617790 16797242 16009512 15605015 15348809 15093226 14945056 14797874 14772255 14910771 15105646
3869 15105646 15306163 15867064 16589861 17318045 17675607 17813513 17286195 16271284 14877080
3860A4877080j493967j141376p72425o23271m64948n78593k11513j94408k21414
3851I175165j4155o6811k19472l06807k71588n37628l11593l33889l30130j78583
3841F604509k35348q4466l8493j55512p7661r8561k74870p6635O0544m9400m760
3830E569347m6963p9116K8060L7914o7841k38360O0682L2043o4837J19397j78760
3819E171566N8354n482o9343l1393O6958J44208M8300r095l4863j5073J76614
3808E500751K02818K7386K08448L20451K63610L28150L87592N64877N87689N62189
3798H953961O10995Q31193P03902M95950L9801n36994o42143r24123q96980p06894
3788G928668n51514m72806m67718j75036l65083j99003o2036j14931j0560k8285
$$ plain form
3860 14877080 13383113 12241737 11469312 10846041 10381093 9802500 9590987 9396579 9175165
3851 9175165 9161010 9094199 8874727 8567920 8296332 7758704 7447111 7113222 6783092 6604509
3841 6604509 6369161 6284695 6246202 6090690 6013029 5914468 5639598 5562963 5623507 5574107 5569347
3830 5569347 5522384 5443268 5471328 5509242 5441401 5203041 5263723 5295766 5230929 5350326 5171566
3819 5171566 5229920 5224438 5155095 5123702 5190660 5334868 5383168 5374073 5339210 5324137 5500751
3808 5500751 5703569 5730955 5939403 6259854 6523464 6851614 7239206 7804083 8391772 8953961
3798 8953961 9564956 10396149 11100051 11596001 11635802 11098808 10456665 9532542 8635562 7928668
3788 7928668 7377154 6904348 6436630 6261594 5896511 5697508 5635472 5520541 5509981 5481696
3778E481696R3226n7753j2797M9253P6135J12831K63591J78634J63167L08152
3768F656135K16302K64708Q577o115k83037m77210l84985l21159k16699k20497
3758E236020j81174m0618n75o0695R0414p7008K6565K24814J16494J05396K72887
3747E712520K51810K20434L22518K52647L59557L61951K52676N2874j62050j85438
3737G439499n45826m70577n00853m17600k51701l57583j22820j67340j03019p9908
3727D422272N7655m6428J99075J37845l4470k7411P7302J87062J23282O2414K81860
3716E440458L91182J40846J62036j7067j61394m82284m94552m05324k86583k5550
3706D261768k14947j25351j12921q1934j04939r2415J2397p5486j71008P5637
$$ plain form
3778 5481696 5574922 5517169 5504372 5553625 5629760 5742591 6006182 6184816 6347983 6656135
3768 6656135 6872437 7137145 7145722 7139607 6856570 6379360 5994375 5673216 5456517 5236020
3758 5236020 5054846 5014228 5013653 4952958 5043372 4966364 4992929 5217743 5334237 5439633 5712520
3747 5712520 5964330 6184764 6507282 6759929 7119486 7481437 7734113 7786987 7624937 7439499
3737 7439499 6893673 6423096 5922243 5504643 5252942 4895359 4772539 4605199 4502180 4422272
3727 4422272 4479927 4433499 4632574 4770419 4735949 4708538 4785840 4972902 5096184 5158598 5440458
3716 5440458 5831640 5972486 6134522 6117455 5956061 5473777 4979225 4573901 4287318 4261768
3706 4261768 4046821 3921470 3808549 3726615 3621676 3529261 3541658 3466172 3295164 3370801
3696C370801R7155k2250R3835L3788M0764L6299J77978L7512O2539j97912j55695
3685C574814j07194p3997q337j04756n6499k3925m5468p9061j25431m0186k6171
3674B883789o7971M1012J18964j66471q3858K1994j7528J7932K980K0694K909
3663B774446m2998r4698l4054J14769K6273O7172K6833m6300M840l9213j27684
3652B629386p8566p6593K4565O1114j675j20555o956O0376q7709o6787j16822
3641B219778l0731p589J87875J01942p4524j32586q8040p8247N3151k2537Q3561
3630B212053Q9517j19159k5137j27738J66468r776l1312q7797k04751j0829O8334
3619A919873q6289l8750j3548j22475k6283J01596l5360r9111m6087j6940R7999
$$ plain form
3696 3370801 3467956 3445706 3539541 3573329 3614093 3650392 3828370 3865882 3928421 3730509 3574814
3685 3574814 3467620 3393623 3385286 3280530 3224031 3200106 3154638 3075577 2950146 2909960 2883789
3674 2883789 2815818 2856830 2975794 2809323 2725465 2747459 2729931 2747863 2750843 2771537 2774446
3663 2774446 2731448 2636750 2602696 2717465 2743738 2810910 2837743 2791443 2796283 2757070 2629386
3652 2629386 2550820 2474227 2498792 2559906 2558231 2437676 2430720 2491096 2403387 2336600 2219778
3641 2219778 2189047 2181458 2369333 2471275 2396751 2264165 2176125 2097878 2151029 2128492 2212053
3630 2212053 2301570 2182411 2157274 2029536 2196004 2186228 2154916 2067119 1862368 1851539 1919873
3619 1919873 1833584 1794834 1781286 1658811 1632528 1734124 1698764 1599653 1553566 1536626 1634625
3608A634625j33823m1935P9205m2523n2186J51074r3748j2742l9049k9486j75231
3597A244181M0912Q3753r2416r092K0845j08491m4951N7587r1781l239k9534Q8950
3585A156724k2880n4272N3852k1948n2430M427P1351l0734J4445P5899R0416o2461
3573A222389j05313N113J68431j18976l2827J3426M0735L798K7501J6143p4016
3562A166404J5368O1943K7887n9361M0944J33123N6432p0297J5804Q5193R9285
3551A572725L207p0633m0219L4755j49473j61471j04882N8983l2786r6548l9339
3540I74319N9932q2845j24801J15876M9485O7017k4517K1938P4235J0607n4672
3529A086574K9279Q3432n9729K3337n004K7096J37581m2312O6940J58834K4951
$$ plain form
3608 1634625 1500802 1458867 1538072 1495549 1443363 1594437 1500689 1487947 1448898 1419412 1244181
3597 1244181 1285093 1368846 1276430 1267338 1288183 1179692 1134741 1192328 1100547 1097308 1067774 1156724
3585 1156724 1133844 1079572 1133424 1111476 1059046 1063473 1134824 1104090 1118535 1194434 1284850 1222389
3573 1222389 1117076 1122189 1290620 1171644 1138817 1152243 1192978 1196776 1224277 1240420 1166404
3562 1166404 1181772 1243715 1271602 1212241 1253185 1386308 1442740 1372443 1388247 1473440 1572725
3551 1572725 1575932 1505299 1465080 1499835 1350362 1188891 1084009 1142992 1110206 1013658 974319
3540 974319 1034251 951406 826605 942481 991966 1058983 1034466 1056404 1130639 1141246 1086574
3529 1086574 1115853 1199285 1139556 1162893 1157889 1184985 1322566 1280254 1347194 1506028 1530979
3518A530979N570j9877j18770n1560J4304p5835n2999o2789n1769L6976j1813
3507A142417P1690J35712o9184q9725j04320l8790K8766n850q6380O336r0195
3496I00477J14723n5652l0071j3405M4864P7094j51992O1142l7030K1272J01914
3485A033336p0375k9065j2563j37967j2734N5923l0919o9043l0010J61524M1506
3474H99613P3857p7046j61456o1034O6637J75009n5205j8805K9344j23464P7473
3463H24923Q554q020l8692j6869O7282n3879j4943o6521L6848P9710k2963j79688
3451F15742m816J09141o4444M1856L5571M9840m7710j30579o6125K3053N38Q00
3439E62867j4584n1542M7532O4404J00813P444j20719L6197j2899L7435M8045
$$ plain form
3518 1530979 1536549 1516672 1397902 1346342 1360646 1284811 1231812 1169023 1117254 1154230 1142417
3507 1142417 1214107 1349819 1280635 1190910 1086590 1047800 1076566 1070716 984336 990672 900477
3496 900477 1015200 959548 929477 916072 960936 1038030 886038 947180 910150 931422 1033336
3485 1033336 962961 933896 921333 783366 770632 826555 795636 726593 696583 858107 899613
3474 899613 973470 896424 734968 673934 740571 915580 860375 841570 870914 747450 824923
3463 824923 833477 825457 786765 769896 837178 783299 768356 701835 738683 818393 795430 615742
3451 615742 610926 720067 655623 697479 733050 782890 735180 604601 538476 561529 562067 562867
3439 562867 548283 496741 544273 608677 709490 716934 596215 632412 619513 656948 704993
3428G04993N0408P2382j99471r637Q6736j20666r2640r9531n697R5142l5419P8469
3416E25069J50505j0802L8879j91289K6473J23036k09907l4243J13205L9930j24691
3405D46165P018r963J87627o2732J217j2040Q6482p964j61802O9010J5119q8980
3393D69157M0863Q7293k437j31469Q3708J11156L7206j00062J4321n2126Q177
3382E65787M3730l2047j41074K865R5904M9863J2885j39891k8844R0581l3068
3371D86691o4087J05756m0647N0458J93200j1729o6033P1991N5739n6699o7550
3360F57090J28012q5968m6935M6262J27041p2990p432q843K8000k539Q856l2756
3348G37798p1644J02482L4260n8304J082m6190k7579J18045O3297j9713r6904
$$ plain form
3428 704993 755401 827783 628312 618675 705411 584745 492105 392574 386877 482019 446600 525069
3416 525069 675574 664772 703651 512362 538835 661871 451964 417721 530926 570856 446165
3405 446165 453183 443220 630847 568115 569332 557292 643774 635810 474008 543018 558137 469157
3393 469157 510020 597313 594876 463407 547115 658271 695477 595415 609736 557610 565787
3382 565787 609517 577470 436396 439261 535165 585028 597913 458022 429178 519759 486691
3371 486691 422604 528360 487713 538171 731371 719642 653609 725600 781339 724640 657090
3360 657090 785102 699134 652199 698461 825502 752512 745080 736237 764237 761698 770554 737798
3348 737798 666154 768636 802896 744592 745674 699484 671905 789950 853247 833534 736630
3337G36630J11655Q0150R8137j4045o0974L3873p8951l7501L1465Q0212p4561
3326I06090K9552Q4759k00963O2863Q603m3190J8681J0669J83881M8N1737j02876
3314A009854o1393R5804P1290m4515J25535M159j21847J16186N0633j5549J04610
3303A334767L4027q9174M1559J3908k9256N1851l221n5638O2455J04099K2454
3292A487831l0560J55468L3875l519P1889o9160O4474M6614j06893j9233k4788
3281A605998o2117r5813j5274J0211O8947R5648J10707J36629m0338m5376N767
3270A774989K1591J58673o877J5297L7952j1030J96924j41325O3287N7990J1659
3259B179130J6313J18301J63337J84937Q4033J19021l0494r9194j57732r0244
$$ plain form
3337 736630 848285 928435 1026572 1012527 951553 985426 906475 868974 900439 980651 906090
3326 906090 935642 1020401 819438 882301 890904 847714 866395 877064 1060945 1060993 1112730 1009854
3314 1009854 948461 1044265 1115555 1071040 1196575 1200734 1078887 1195073 1245706 1230157 1334767
3303 1334767 1368794 1279620 1321179 1335087 1305831 1357682 1354461 1298823 1361278 1465377 1487831
3292 1487831 1457271 1612739 1646614 1643095 1714984 1645824 1710298 1756912 1650019 1630786 1605998
3281 1605998 1543881 1448068 1432794 1443005 1511952 1607600 1718307 1854936 1814598 1769222 1774989
3270 1774989 1796580 1955253 1948376 1963673 2001625 1990595 2187519 2046194 2109481 2167471 2179130
3259 2179130 2195443 2313744 2477081 2662018 2746051 2865072 2834578 2735384 2577652 2487408
3249B487408M8377L1229P4551M4351J71395O6385P5264K18999K74422K20022L36630
3238D049033J62232L6797l09403l81832l11943k61802k16423j65796m6258k27987
3228B326618j04326n509O705o966o2480k7819l8279m5770j52287Q8447J8001o3547
3216A932788j56622n4277N4775J23056J38681J47146K00169J58721K07568M51524
3206C203529L31106Q8698m52286n12134l43444l26653k14348j75810n7741K6552
3196A567469k0343q0436J2849j8840K3379j20041k2593O0968n7068j29754k4268
3185A191322p2933m2604m8072J75429J67913m623M3204n871N8539K17664K24772
3174A904740K18474l0129k71472j89324j85117j75143j38228p4187O3731O1196
$$ plain form
3249 2487408 2535785 2567014 2641565 2685916 2857311 2923696 2998960 3217959 3492381 3712403 4049033
3238 4049033 4211265 4248062 3938659 3556827 3244884 2983082 2766659 2600863 2554605 2326618
3228 2326618 2222292 2216783 2223488 2216522 2154042 2126223 2087944 2042174 1889887 1978334 1996335 1932788
3216 1932788 1776166 1721889 1776664 1899720 2038401 2185547 2385716 2544437 2752005 3203529
3206 3203529 3534635 3623333 3171047 2658913 2315469 1988816 1774468 1598658 1540917 1567469
3196 1567469 1547126 1466690 1479539 1460699 1484078 1364037 1341444 1402412 1345344 1215590 1191322
3185 1191322 1118389 1075785 1027713 1203142 1371055 1366432 1409636 1403765 1462304 1679968 1904740
3174 1904740 2123214 2093085 1821613 1632289 1447172 1272029 1133801 1059614 1123345 1184541
3164A184541R3659r6064L6120O5703j07216p8952n3688l4074l5177m2186p9570
3153H53096q370n0119k68480J1262l1900l1210J09151o8619k9991j1839j7637
3142D55344m054J9317k1867J8552l6760K0853j1510k3458n669O8456K1650M6744
3130E47598P7656l1923j50235K606K9104O6423j01595l4372J6957O7375j65180
3119C24414J3256J03342m0046l5365j04572L8291k5930R6042k1666j9214o9252
3108B59300R109j2906j20932J28646n4300j8341L4425Q500J17770p7362j05184
3097A68725J9183O4212M2574L4145p1591j06233P3243r3756j4503l6150J806M6499
3085A28154l9563M7627K9051l933j0120J4001p0603J5999L0101M7067m7040r5381
$$ plain form
3164 1184541 1278200 1182136 1218256 1283959 1176743 1097791 1044103 1010029 974852 932666 853096
3153 853096 844726 794607 526127 537389 505489 474279 583430 514811 484820 472981 455344
3142 455344 451290 470607 448740 467292 430532 451385 439875 416417 410748 479204 500854 547598
3130 547598 625254 593331 443096 445702 474806 541229 439634 405262 422219 489594 324414
3119 324414 337670 441012 400966 365601 261029 299320 273390 369432 347766 328552 259300
3108 259300 268409 255503 134571 263217 208917 190576 225001 233501 351271 273909 168725
3097 168725 187908 252120 294694 328839 257248 151015 224258 130502 115999 79849 81655 128154
3085 128154 88591 136218 165269 161336 151216 165217 94614 110613 140714 187781 140741 45360
3073D5360K3019J00408j1800l7704J1879J03133K9748j1676p3612p7682o0573
3062D0500j7095M9249J1717M5268q9329j17396Q7709J04457K7370K026K2756k5380
3050A41852m3774l9218N4955N0660j65470l647P9922M6550j38626r1556P5738
3039c2614m1171Q1144O4659m0488n4574Q113j22957N6609k0171R6438R0130L8737
3027A23855q885N3525J1703J3579J8246K3816m6394J98o3738J8459m1562j39803
3015c7001L7833l7469Q0822k1142j10196j1086R6637N940q6057J79464M3029j43976
3003c202M2880K1313N8357j30047Q5961J16576p3248P2315p4684j67583j33217
2992a84579O5429R2097n4117O6928J7565L269O3327J3262L0550J15180N6205k203
$$ plain form
3073 45360 68379 168787 156987 119283 131162 234295 264043 252367 178755 101073 40500
3062 40500 23405 72654 84371 129639 40310 -77086 10623 115080 142450 144476 167232 141852
3050 141852 98078 58860 113815 164475 -995 -4642 75280 121830 -16796 -108352 -32614
3039 -32614 -73785 7359 72018 31530 -23044 -14931 -137888 -81279 -101450 -5012 85118 123855
3027 123855 114970 168495 180198 193777 212023 235839 189445 189643 125905 144364 102802 -37001
3015 -37001 832 -36637 44185 23043 -87153 -98239 -1602 4338 -81719 97745 140774 -3202
3003 -3202 39678 60991 119348 -10699 75262 191838 118590 190905 116221 -51362 -184579
2992 -184579 -119150 -27053 -81170 -14242 3323 6592 69919 83181 113731 228911 285116 282913
2980B82913j21552n2079J3551p9139o4614j9802k1630L3802J46987N9611l0817
2969A47231j01437K8005J65667j02942o7955o184J40879n2759O1849N2888n0499
2958B14743q5222J02698r6959l2897n4490m3287J0592L5370m813r2950J28630
2947H1415K0883j51287j0497N4297n4116K31096j42234N7190Q6764l0353j16912
2936B6246j1560J02163r6611J82364p3614L573O7266o6952l8118L4756J62701
2925B92214j4539L7171j6691j59543n2840j1564J2527J43255O0902M456Q5027
2914C80375k02313q1167N2168N2938m877p6647Q0365k2080j10063K3241N4322
2903A46262J34593o0205n7004O8479j5387j19689P1358J00054j16459j37286J39459
$$ plain form
2980 282913 161361 109282 122833 43694 -20920 -40722 -62352 -28550 118437 178048 147231
2969 147231 45794 73799 239466 136524 68569 62385 203264 150505 212354 265242 214743
2958 214743 129521 232219 135260 102363 47873 4586 15178 50548 45735 -47215 81415
2947 81415 102298 -48989 -59486 -5189 -59305 171791 29557 86747 173511 143158 26246
2936 26246 14686 116849 20238 202602 128988 132561 199827 132875 94757 129513 292214
2925 292214 277675 314846 298155 138612 85772 74208 86735 229990 290892 295348 380375
2914 380375 178062 96895 149063 202001 197124 120477 200842 178762 68699 91940 146262
2903 146262 280855 220650 163646 232125 216738 97049 168407 268461 152002 14716 154175
2892A54175K080j06916J61780j9001N8915n1128m9101j92192R5674R0488L7051
2881A81825j42401L7720O3100K6205R879j54542r1694M7587L7000m946P7386o387
2869H0732m9700l5083Q7103M2410j8363J0791M2973p7059n9395j18613k7822p522
2857a29548R8105m141R4784J63327n35J1860j16160l8380N4790J13146j12181
2846A35067o8935L3017N091J1974P850q1883r2152J30366M3412j01188L3372p1955
2834a5964O2228l8577K0324m7240p2162J24291m828Q2773j18695k1287J27477
2823I8340M8816k33769K179L1757N290k6940l435N2110k0845n7961k692n4256
2811a61406K1964J93250p1830k2348R3740J1205m3516m7273j42534J53301J15703
$$ plain form
2892 154175 156255 49339 211119 192118 251033 199905 150804 -41388 54286 144774 181825
2881 181825 39424 77144 140244 166449 176328 21786 -69908 -22321 14679 9733 87119 80732
2869 80732 31032 -4051 83052 125462 107099 117890 160863 83804 24409 -94204 -122026 -129548
2857 -129548 -31443 -35584 59200 222527 221992 233852 117692 79312 134102 247248 135067
2846 135067 66132 99149 104240 116214 124064 42181 -49971 80395 123807 22619 55991 -15964
2834 -15964 46264 7687 28011 -19229 -91391 32900 28072 110845 -7850 -29137 98340
2823 98340 147156 -86613 -84434 -52677 -47387 -74327 -77762 -25652 -46497 -104458 -107150 -161406
2811 -161406 -139442 53808 -18022 -40370 53370 64575 21059 -26214 -168748 -15447 100256
2800A00256K5375O9574m0699k4791n1712m3615j93153Q4188P2866k1978m2161
2789f5850l763N3249N7620l1154r2090L0874M3202L3812o7058J6566P572R77k8480
2776d4523N3335J1490O2017k5735L4011k7843j65766K267L0930P5259K1621q0059
2764e2996o1925P2379n856r7591L7848N2836j2039k9944m1041L4763J48804m1661
2752C577k3503k7350J01247j9333j3903N1899j18932j6271O2135J15580m7298
2741F7848p2762M6011J6357N459K4345q4155K3980L0299k7779J0449m5128o6241
2729g1317K5284L3502r8007N7793P0072q550j1853j23980J14695N7334K1838M0196
2717A07007M8738j61588j06835k9993l2450J2087N0013J47814L7524j47748j25502
$$ plain form
2800 100256 125631 195205 154506 129715 78003 34388 -158765 -74577 -1711 -23689 -65850
2789 -65850 -69613 -16364 41256 10102 -81988 -51114 -7912 25900 -41158 -24592 -17020 -16043 -44523
2776 -44523 8812 20302 82319 56584 90595 62752 -103014 -100747 -69817 5442 27063 -52996
2764 -52996 -114921 -42542 -48398 -145989 -108141 -55305 -67344 -97288 -138329 -103566 45238 3577
2752 3577 -19926 -47276 53971 34638 20735 72634 -46298 -62569 -434 115146 67848
2741 67848 -4914 41097 57454 62913 87258 3103 27083 57382 29603 40052 -5076 -71317
2729 -71317 -46033 -12531 -110538 -52745 17327 8777 -3076 -127056 -12361 44973 66811 107007
2717 107007 155745 -5843 -112678 -142671 -175121 -163034 -113021 34793 72317 -75431 -200933
2706b00933j8275J24525Q4989P490n8567N449P7958J2894L556j6182M1036l4062
2694B9878k629j10921o6530O6161j2609Q7087P9444j16042p2790Q5364J3753L8129
2682A8295m3963M030M5678r298J1434j3500q4440l4379K9664l1939R7178N7714
2670D6474n457j5285K4972N9178m5364j06343p7047K6025N4623p7578N0458N8117
2658g227Q2785M2906l6151o0632k07882L1323J4977J51188j10117L3584J70733
2647A05487k8k8151j22609o4182j1149M1544L7276M7789m1494J7933j6626N6373
2635B2163r1037Q8930n891K8419o2659j04190j10059J72314N9012m5589j27894
2624a76481k304J18866l4087j8172J12463M6906q7185M7693J0529l2200l1808
$$ plain form
2706 -200933 -219208 -94683 -9694 -2204 -60771 -55322 22636 35530 39086 22904 63940 29878
2694 29878 27249 -83672 -150202 -84041 -96650 -9563 69881 -46161 -118951 -33587 -19834 18295
2682 18295 -25668 -21638 24040 14742 26176 12676 -71764 -106143 -76479 -108418 -11240 46474
2670 46474 41017 25732 50704 109882 64518 -41825 -118872 -92847 -38224 -115802 -65344 -7227
2658 -7227 75558 118464 82313 21681 -186201 -154878 -139901 11287 -98830 -65246 105487
2647 105487 105459 77308 -45301 -109483 -120632 -79088 -41812 5977 -35517 -17584 -34210 22163
2635 22163 -68874 20056 14165 42584 -20075 -124265 -234324 -62010 -2998 -48587 -176481
2624 -176481 -178785 -59919 -94006 -112178 285 47191 -39994 7699 18228 -13972 -45780
2613d5780m4889J07483l7129j12076K8759p3645m3830P0168m3032k0478J51924
2602f2525J1582K8981j027M4393K8784j4794p8852j3780O134N1973o9105K5061
2590d3175k9646J02884O6732N370n5111j05491K1879j5054J24364p0317q4957
2579h2522O0736O9838j5415l8640O020J3460Q5885p5013N4680j14022R9542p5435
2567a0886p8195J14745o1845M1971n8985j04253Q2486K5636M7830L2248o0459
2556b9707q0084j1846L580o9187N7767n6940J18021j6772q1501P2251k6880p2737
2544a94035k1303J11391M2096p1179J12989J16740j45068j25320L8961j2427n3365
2533b00520M5209R0603J26853k126n4107M285k502J07459j9262j97325O6718N8352
$$ plain form
2613 -45780 -90669 16814 -20315 -132391 -103632 -177277 -221107 -150939 -193971 -214449 -62525
2602 -62525 -50943 -21962 -22989 21404 50188 35394 -43458 -57238 -51104 869 -68236 -43175
2590 -43175 -72821 30063 96795 102165 47054 -58437 -36558 -51612 72752 2435 -82522
2579 -82522 -21786 48052 32637 -6003 17 13477 99362 24349 79029 -34993 64549 -10886
2567 -10886 -89081 25664 -36181 5790 -53195 -157448 -74962 -49326 -1496 30752 -29707
2556 -29707 -109791 -121637 -118057 -187244 -129477 -186417 -68396 -85168 -166669 -94418 -121298 -194035
2544 -194035 -215338 -103947 -61851 -133030 -20041 96699 -48369 -173689 -134728 -147155 -200520
2533 -200520 -155311 -64708 62145 60019 5912 10197 7695 115154 95892 -101433 -34715 23637
2521B3637p7256M548J1182K6440o7132L949l4163J5941l8222j2115J11678N5522
2509B4009L6132o0623q60k5647M6696l9830o7013O0870N9806j3317k7945R596
2497A874m3127J0770q5429J01226l2368N4544m8814M2760M6150P5731J8619j33995
2485G941K1036N5397r285J16553q9311j22128j41626L0224J00167q4802o036p2828
2473a94698J9699Q2015N0760Q6978J25871L50j48275q2953N7576L4271n0801k4450
2461d3657j37818O2024J33392J16494L9498j82828L3671n4613M7663K5241p7012
2450c7945m3574r9119J10499J01422N5854j17425J50019n648m9219M8422j07954
2439E332M6127j97747K5674N5169O4708r4887R0165M6380n2360j10637P2961m4366
$$ plain form
2521 23637 -53619 -49071 -37889 -11449 -78581 -74632 -108795 -92854 -131076 -143191 -31513 24009
2509 24009 60141 -482 -1342 -26989 19707 -20123 -87136 -26266 33540 20223 -7722 1874
2497 1874 -41253 -30483 -115912 -14686 -47054 7490 -41324 1436 47586 123317 141936 7941
2485 7941 28977 84374 75089 191642 102331 -19797 -161423 -131199 -31032 -115834 -121870 -194698
2473 -194698 -174999 -92984 -42224 44754 170625 170975 22700 -60253 -2677 31594 -19207 -43657
2461 -43657 -181475 -119451 13941 130435 169933 -12895 20776 -33837 13826 39067 -37945
2450 -37945 -81519 -180638 -70139 31283 87137 -30288 119731 114083 64864 113286 5332
2439 5332 51459 -146288 -120614 -65445 -737 -95624 -5459 40921 -11439 -122076 -49115 -93481
2427i3481M3362n2393Q7364m3189J6317N2922J01557j24742k4963K8081q0621
2416h9786R6836o813p3160n4746J00162M9688M7272L8303R0375l2726n2641l1318
2404H1446P48j9271j14826Q4773K4128J1010j9978k032O4397P5246r4080q1887
2392I674r4551J6289K3419N2016P1607p5571j5367m9743J34031J6754k25651P3983
2380f3110J81887l3549j8468J42189R979j64338N7964o0226M9265R1431j2307
2369A80717j18628J22236l5738M0738n5942M8180J04978m7790j72158O6664J7266
2358A50523j1585j5597o5034p4178J18599p0615J1366j19164J25477M1771j74697
2347h3134j2094l2040Q7211Q1879n7681J03041Q8318l3649L465j10734P672M8650
$$ plain form
2427 -93481 -50119 -102512 -15148 -58337 -42020 10902 112459 -12283 -37246 -9165 -89786
2416 -89786 7050 237 -72923 -127669 -27507 22181 69453 107756 198131 165405 112764 81446
2404 81446 82194 62923 -51903 32870 56998 68008 48030 45998 110395 185641 91561 9674
2392 9674 -84877 -68588 -45169 6847 78454 2883 -12484 -62227 71804 88558 -137093 -63110
2380 -63110 118777 85228 66760 208949 218928 54590 112554 52328 101593 193024 180717
2369 180717 62089 184325 148587 189325 133383 181563 286541 238751 66593 133257 150523
2358 150523 138938 123341 58307 -15871 102728 32113 43479 -75685 49792 91563 -83134
2347 -83134 -95228 -127268 -40057 41822 -15859 87182 175500 141851 145316 34582 42254 90904
2335I0904o2234q8467K4083Q7826k010q0620Q1695r831J2153m2540Q3594M8378
2323A42931p4111m186K8177o6141m4655k2771K5939J47558j6596m5518j2373N8549
2311A16803N8809m1597R4220k1219l9422J4907k0016j9350m0994j32021J2204
2300a7676L2560J9112J01975l0878j16354p5525J263Q1494m977N8022R4554j7852
2288A25718n6407q5217J9750J16228m663R518l1046L1100M9333q01m4584n1642
2276G7287n418R720J2675R8494n3633Q3744n0525l2467J2130q6367N4734L5049
2264A55423l3916m8495Q0675J9067r665J9116k5791m3006J13953n8656j6862K6189
2252A78032j0613j14404n629Q3514m2764Q1261j14950J8880M1534k4447O436J71607
$$ plain form
2335 90904 28670 -59797 -35714 52112 50102 -30518 51177 41346 53499 10959 94553 142931
2323 142931 68820 64634 92811 26670 -17985 -40756 -14817 132741 116145 70627 58254 116803
2311 116803 175612 134015 228235 207016 167594 182501 162485 143135 102141 -29880 -17676
2300 -17676 14884 33996 135971 105093 -11261 -86786 -85523 -4029 -9006 49016 143570 125718
2288 125718 69311 -15906 3844 120072 115409 124927 93881 124981 174314 173513 128929 77287
2276 77287 71869 81589 94264 192758 139125 222869 172344 139877 152007 65640 120374 155423
2264 155423 121507 73012 153687 172754 163089 182205 156414 113408 227361 168705 151843 178032
2252 178032 167419 53015 47386 130900 88136 169397 54447 73327 114861 90414 96850 268457
2240B68457L7892j07571p7053K1569M1249l6560J9571N1610k5598k2976j6018
2229A54572N4541K1607o0477K2146k4201Q6643r322P385O573j59437O3755k748
2217A61037Q5722P0098K1949l6684O4153L6627M9197l0777l7634P1371l5288j11187
2205C08584L7760R7398o8751J15955n5946Q655r0802J38030J92204j15081o066
2194E61940K0665m952n5989n666M5553J17977M3160N0247R4557K4541l9636j4526
2182H37871N6767l3758J03159P8091n8936l3854J45943J1761o1655L3817M3823
2171A123029M9290J03859k891K6824K1282Q484o3926j531M5852n5116n6477J76772
2159A375451K1181p454Q4917L0479P5136P8043L1090O5284M6463J00253o4419
$$ plain form
2240 268457 306349 198778 121725 143294 184543 147983 167554 219164 193566 170590 154572
2229 154572 209113 230720 170243 192389 168188 254831 245509 252894 259467 100030 163785 161037
2217 161037 246759 316857 338806 302122 366275 402902 452099 421322 383688 455059 419771 308584
2205 308584 346344 443742 374991 490946 435000 443655 352853 490883 683087 568006 561940
2194 561940 582605 577653 521664 515998 561551 679528 722688 772935 867492 892033 852397 837871
2182 837871 894638 860880 964039 1042130 983194 949340 1095283 1107044 1045389 1079206 1123029
2171 1123029 1172319 1276178 1273287 1300111 1321393 1329877 1265951 1264420 1310272 1255156 1198679 1375451
2159 1375451 1396632 1389178 1474095 1504574 1579710 1657753 1688843 1754127 1800590 1900843 1836424
2148A836424L2491J31903M9419n9460P9801p60K11256J11230R4106j7720M3167
2137B511857K77382M1988Q7374J50218K01622R0747J13013K64529K53382J45483
2127D137595R0609J85251L53751J99250K34241K23021K89882L62038N01343N21879
2117G098860N53705P74825O32418N96927L48866O02528Q73674J059631J549675
2108A4091109J769177K169060K554283L047915M209277O504921Q410572R484328
2100E2240642O073665l94042r172886j1347939q260988n986761m078541l034768
2092A6038382k131305j718762j217459j082264p63156o17269l73524l14125n14754
2083G305764o70645n21956n59666l42241k76298k69422k99285l05068l39969k07099
$$ plain form
2148 1836424 1868915 2000818 2050237 1990777 2070578 2069818 2281074 2392304 2486410 2468690 2511857
2137 2511857 2789239 2831227 2918601 3068819 3270441 3361188 3474201 3738730 3992112 4137595
2127 4137595 4228204 4413455 4767206 4966456 5200697 5423718 5713600 6075638 6576981 7098860
2117 7098860 7652565 8427390 9059808 9656735 10005601 10608129 11481803 12541434 14091109
2108 14091109 15860286 18029346 20583629 23631544 27840821 34345742 42756314 52240642
2100 52240642 58314307 57920265 48747379 37399440 29138452 23151691 19073150 16038382
2092 16038382 13907077 12188315 10970856 9888592 9125436 8508167 8134643 7820518 7305764
2083 7305764 6635119 6113163 5553497 5211256 4934958 4665536 4366251 4061183 3721214 3514115
2073C514115j20864k03638j31015j07839o2393j26397j60964j54812o2514n4916
2063B328763j69828l6243m8243j18516j51002j10198r9581n2550r369J4207j83851
2052A363589n8425l2102K8856j38977o177L0261L5071j43417O3198r2038j00828
2041I49011P2300J03530j01123j47252M3895j08094j1819J0165M2815j09394m5148
2030F98886m912k38j0867l0832N1827r0887j3949l7665j47759k1902P7725j3490
2018D55937j767n7431n9399R3097j3334o249k7699j08109M0871O8819n3401J31151
2006D62486n2840J6256P4133n8898n3925o1461k4493L7036Q2868o946k8423j08118
1994B77675k5399N1804r2559L215q8818m0632Q4878J08413L6366j14259j30861
$$ plain form
2073 3514115 3393251 3189613 3058598 2950759 2888366 2761969 2601005 2446193 2383679 2328763
2063 2328763 2158935 2122692 2074449 1955933 1804931 1694733 1595152 1542602 1533233 1547440 1363589
2052 1363589 1305164 1273062 1301918 1162941 1156764 1187025 1222096 1078679 1141877 1049839 949011
2041 949011 1021311 1124841 1023718 876466 920361 812267 800448 810613 853428 744034 698886
2030 698886 693974 693736 682869 652037 703864 612977 599028 561363 413604 391702 469427 455937
2018 455937 454170 396739 337340 430437 417103 410854 383155 275046 315917 384736 331335 462486
2006 462486 409646 425902 500035 441137 387212 325751 301258 338294 421162 414216 385793 277675
1994 277675 252276 304080 211521 214736 125918 85286 170164 278577 314943 200684 69823
1983F9823q4375J9554J10620N1654M4459N455p4528l2984K09933J3721o3958j1560
1971B57814o2444o2590k7349j06052R3946k3054q6503P5258J66643K2955p6316
1960A72308r5324O7383N0977J1720o913J09952l5818j6888o507J5232J07519k3914
1948C49727J7544j72574j60501J8466Q9540N8653r7901M7857Q067q6382R4056
1937A66552K4475j09899k3838m0700o2628P1511q8472j2272J10267Q3138q5693
1926C2441J175l1401M2548j50757J13520o4552J13586l3371n8646L3450J35622
1915A33615L44p9506j44308q324J42900l6092j00855R1972Q7853l7224N9490j19483
1903i618Q5805q1026l53L311n4834q8079P2916J7985K9492J17597m1384j32594
$$ plain form
1983 69823 -14552 5002 115622 167276 211735 217190 142662 109678 319611 333332 269374 257814
1971 257814 195370 132780 105431 -621 93325 70271 -16232 59026 225669 248624 172308
1960 172308 76984 144367 195344 207064 200151 310103 274285 257397 250890 266122 373641 349727
1948 349727 367271 194697 34196 52662 142202 200855 102954 150811 158878 72496 166552
1937 166552 191027 81128 57290 16590 -46038 25473 -62999 -75271 34996 118134 32441
1926 32441 33616 2215 44763 -105994 7526 -57026 56560 23189 -35457 -2007 133615
1915 133615 133959 54453 -89855 -98179 44721 8629 -92226 -254 87599 50375 109865 -9618
1903 -9618 76187 -4839 -5192 -1881 -56715 -144794 -71878 -53893 -24401 93196 51812 -80782
1891h0782m0861J34093N3271M359j14112j3857l4594Q0726J21980j5532L94j16437
1879b1352J01573o2975r2865n6610Q9425N3210Q2970k6746Q666J1670q8300J12635
1867A11301l3484q3687J44158n3911j41820M4662l9091k5822K4354N0444p9507
1856h2403m8013O5704R5450P0862n0991O319K3817k8351O5478l8769M4336j38930
1844a5491j9280J67879P632j19233Q6869J6091k4869J62829o376l2666K4442O212
1832B54039K5670M849n9156l112n3218L8875l443J5099l6407k05936O6776K7438
1820G1474R7953P5870j28844l608M6911m1615j08853K4820J1178k0032j13667
1809h8413K8259J16289L2586j18397r1327r105J7350R5295j03003k2151J30306
$$ plain form
1891 -80782 -121643 12450 65721 70080 -44032 -57889 -92483 -11757 110223 94691 95085 -21352
1879 -21352 80221 17246 -75619 -132229 -42804 10406 93376 66630 75296 86966 -1334 111301
1867 111301 77817 -5870 138288 84377 -57443 -12781 -51872 -77694 -53340 -2896 -82403
1856 -82403 -130416 -64712 30738 101600 50609 56928 80745 52394 117872 79103 123439 -15491
1844 -15491 -34771 133108 140740 21507 108376 124467 99598 262427 256051 223385 247827 254039
1832 254039 279709 284558 225402 222290 169072 207947 204504 219603 183196 -22740 44036 71474
1820 71474 169427 245297 116453 112845 159756 118141 9288 34108 45286 25254 -88413
1809 -88413 -60154 56135 88721 -29676 -121003 -130108 -112758 -17463 -120466 -142617 -12311
1798a2311M3867M2339n4806n1990r1435N1166R3435J5605q7723N6391l913j04705
1786a04080K8272K4767K6519q2612M3062j08981k6602O8524N8388Q7662J32069
1775A46988m5135l1423j08418J9046J21136l6481k01909P72J61534r8771O0287
1764a2374J1527K4841k4513k4282l1145q1131K02730J27800r7693n1444l5454
1753H862l429P2036m6722q4414p9085Q8496P2654j33343m317R8397l7784j37890
1741a86539J5725J2845k0823K2638k463N6150J1027J1287M6894n9350J13327j09585
1729h8867l0838L1205k7399O5726j9560J3256R9352j04620K5392o7513m6393J25218
1717b5041K6583o7576n7373N9006n3520J4548Q3281p5711m9405J6477L3968k9400
$$ plain form
1798 -12311 31556 73895 19089 -32901 -124336 -73170 20265 35870 -51853 4538 625 -104080
1786 -104080 -75808 -51041 -24522 -107134 -64072 -173053 -199655 -131131 -72743 14919 146988
1775 146988 101853 70430 -37988 -18942 102194 65713 -136196 -135424 26110 -72661 -12374
1764 -12374 -847 23994 -519 -24801 -55946 -137077 65653 193453 95760 44316 8862
1753 8862 5433 77469 30747 -53667 -132752 -44256 28398 -104945 -109262 -10865 -48649 -186539
1741 -186539 -170814 -157969 -178792 -156154 -158617 -102467 -91440 -80153 -33259 -92609 20718 -88867
1729 -88867 -119705 -88500 -115899 -50173 -69733 -56477 42875 -61745 -36353 -103866 -150259 -25041
1717 -25041 1542 -66034 -123407 -64401 -117921 -103373 -20092 -95803 -145208 -128731 -94763 -124163
1705a24163Q4657J88619K5891j77215K2867J6887k1015L8103K1486k5720q6061
1694c5664N0864L8563N8770n3911n3168R001m969M0596j43114o2728L6107K02345
1682H2692p0467j13471M3096N414N0043L697j8136n2549N1728j4390m1480K7688
1670d6135J8417L2301j0203K3084j613o4592J239j20614J50935J82387L5213j86932
1658A3487O5384m6126J35841j9980j87490q2370l6415J53013j1432l5950K4993
1647b7045r7630Q8196M8401o5691L388o4081k7918K8570j8733N0344P5529J0417
1635C747k8809k3286k7092J60316p7196n1040N2161k0451K3892m9461q3060Q2669
1623c7610o5082N8263R3771k7468R540j26266K9165J38586j13574l887m419j167
$$ plain form
1705 -124163 -39506 149113 175004 -2211 20656 37543 16528 54631 76117 50397 -35664
1694 -35664 15200 53763 112533 58622 5454 14455 9486 50082 -93032 -155760 -119653 82692
1682 82692 12225 -101246 -58150 -52736 -2693 1004 -17132 -69681 -17953 -32343 -73823 -46135
1670 -46135 -27718 4583 -5620 17464 15851 -48741 -47502 -168116 -17181 165206 200419 13487
1658 13487 78871 32745 168586 148606 -38884 -121254 -157669 -4656 -16088 -52038 -27045
1647 -27045 -124675 -36479 11922 -53769 -50381 -114462 -142380 -113810 -132543 -82199 -6670 3747
1635 3747 -25062 -48348 -75440 84876 7680 -43360 8801 -11650 12242 -37219 -120279 -37610
1623 -37610 -102692 -44429 49342 21874 31414 -94852 -65687 72899 -40675 -44562 -48981 -50148
1611e0148O1032j48325m407J01140J53080k1679o6344p0492r7315p739J54863
1600C666J5285p0704j39417L4833Q2604l1166M4469k3957J37122q2847L041J22145
1588I5074p1920J38o7414n3707l1855M9929Q444M3447J23835k6292p8847r499
1576a8667J9478M3325K4678j6184p4169J84056r3144k8258o4880j9117O9730L6728
1564F3576j01183j0715M3065j04274l1027J57398k9391k312k1871R8915O1677
1553A23858l5731o5677K4662J0843j2648m1605N620r497o2065K8113n8263J01260
1541H870n7393K3457J3573j05714j673P3561m0337p1662N9683Q5952M8171j2677
1529B3811k6860K6874K5636K1238p4964P3884N6238r9198J11857p7727j64953
$$ plain form
1611 -50148 10884 -137441 -141848 -40708 112372 90693 24349 -46143 -143458 -151197 3666
1600 3666 18951 -51753 -191170 -156337 -73733 -104899 -60430 -84387 52735 -30112 -27071 95074
1588 95074 23154 23292 -44122 -97829 -129684 -79755 -71311 -27864 95971 69679 -9168 -18667
1576 -18667 811 44136 68814 52630 -21539 162517 69373 41115 -23765 -42882 26848 63576
1564 63576 -37607 -48322 -5257 -109531 -140558 16840 -12551 -14863 -36734 62181 123858
1553 123858 88127 22450 47112 57955 45307 3702 9322 -175 -62240 -34127 -92390 8870
1541 8870 -48523 -25066 -11493 -117207 -118880 -45319 -85656 -157318 -97635 -11683 36488 23811
1529 23811 -3049 23825 49461 70699 -4265 69619 125857 26659 138516 60789 -104164
1518a04164K6285L4367L1002r0321L6414R015N4723N9982J582J04363j15289j42143
1506i4184n6445P2573p5065n2510J83636Q5138N453k4345J5672o7862o9662K8886
1494d8715P5361q2626j8072l8057o7723L1369L005M6616q108l4688J6129p789
1482a33298P1131K2415J7152j04177n761J9645J40983M0697q5843R1767O575n0739
1470C0547r5423k6293M2284o0556n4332J2105J14677O6775j44188N0915k0357
1459h3846N0756J53578R18r9196l6990J1681o1272J2073J22132P9474j14910M668
1447C9066j6949q0937N8660J13605Q2892m6888j33399R6848j22639l3709J03565
1436F0115K7684o6923k9964J5384N6135l9230j17059k6876Q0086N7605p5540j32397
$$ plain form
1518 -104164 -77879 -43512 -12510 -102831 -66417 -57402 -2679 57303 58885 163248 47959 -94184
1506 -94184 -150629 -78056 -153121 -205631 -21995 63143 68596 44251 59923 -7939 -77601 -48715
1494 -48715 26646 -55980 -74052 -112109 -179832 -148463 -145458 -98842 -106950 -141638 -125509 -133298
1482 -133298 -62167 -39752 -22600 -126777 -132538 -112893 28090 68787 -17056 74711 81286 30547
1470 30547 -64876 -91169 -48885 -109441 -163773 -151668 -36991 29784 -114404 -63489 -83846
1459 -83846 -33090 120488 121406 22210 -14780 -3099 -64371 -52298 69834 149308 34398 39066
1447 39066 22117 -58820 -160 113445 196337 149449 16050 112898 -9741 -43450 60115
1436 60115 87799 20876 -9088 6296 62431 23201 -93858 -120734 -40648 16957 -58583 -190980
1424a90980R1639k9906K1185M6545l94O1453M0515K098j26353p673L4432j5006
1412g2445m8951L9550J43108M7206n16j07553m7322n6551n43Q5442j26289K8893
1400a15971R9397k6481M489R2983J7203j5613L6704p9618r3619p777P5304n0986
1388f3985m0114K06919l6917q1601m5409P0461p9757L678M3079p9589P3883P3744
1376D4392p1917J0620P0212N5720j35456R4503Q7563p7069K2915j52326j26874
1365a77717O5830P0881l8335j42498J94456O6482j05242k2642L6870l9002K3333
1354f7584k9885j9490j7602M847J21589n2479P517R847k5435R2468J6183j1117
1342B8859n0849L2005K9859j1919k9258m1784Q510k9081k740j2698J590P2315
$$ plain form
1424 -190980 -99341 -129247 -108062 -61517 -61911 -458 40057 42155 -84198 -91871 -57439 -72445
1412 -72445 -121396 -81846 61262 108468 107952 399 -46923 -103474 -104017 -18575 -144864 -115971
1400 -115971 -16574 -43055 -38566 54417 71620 56007 92711 13093 -80526 -88303 -12999 -63985
1388 -63985 -104099 102820 65903 -15698 -61107 9354 -70403 -66725 -23646 -103235 -29352 44392
1376 44392 -27525 -16905 53307 109027 -26429 68074 155637 78568 101483 -50843 -177717
1365 -177717 -111887 -41006 -79341 -221839 -27383 39099 -66143 -88785 -51915 -90917 -67584
1354 -67584 -97469 -116959 -134561 -129714 -8125 -60604 -53087 -43240 -68675 23793 39976 28859
1342 28859 -21990 10015 39874 27955 -1303 -43087 -34577 -63658 -66398 -79096 -77506 -5191
1330e191Q7014O274q8185O0767K6959j17683J8519P6013j37708n2880J3938M2693
1318f9470P0407j2217K405j60181Q6942N0176K5935K7285Q2785n0180n6491k5549
1306b8153j8662j69p624M1216j6478J8292r0834j7224K6151M9290M4463n2853
1294e2585M4082N7893m8538o1556M7683N4854L9577m7421j2394o2713K3018j503
1282a9603j6105L3796K8794M0714N2706Q3001q1935k6825m6884o9731l3312Q0957
1270B5573M099p5499k5157l2162n2574M9704j5751m2449J22213n8588k7552O2418
1258f5725R8334R893m2322p9116L8571p5781k522j08664K74633P8484o1583l4481
1246B9721j34605O0885J18837N1308r1714M962k065K512k6205L1543o4009p6226
$$ plain form
1330 -5191 81823 88097 -88 60679 87638 -30045 -11526 64487 -73221 -126101 -112163 -69470
1318 -69470 937 -11280 -8875 -169056 -82114 -31938 -6003 21282 104067 53887 -2604 -28153
1306 -28153 -46815 -46984 -54608 -13392 -29870 -11578 -102412 -119636 -93485 -44195 268 -52585
1294 -52585 -8503 49390 852 -60704 -13021 41833 81410 33989 21595 -41118 -18100 -19603
1282 -19603 -35708 -1912 26882 67596 120302 203303 121368 94543 47659 -22072 -55384 25573
1270 25573 29672 -45827 -70984 -103146 -155720 -106016 -121767 -164216 -42003 -100591 -128143 -65725
1258 -65725 32609 42502 180 -78936 -40365 -116146 -118668 -227332 47301 125785 64202 29721
1246 29721 -104884 -43999 74838 126146 34432 39394 37329 39841 13636 45179 -18830 -95056
1234i5056J40961P2611r1713K4739n107j22200L8903Q144j87420J89205J01942
1223G5009N1243L3053l5065q6543M8170q8877l9809K550q0548N1262L9428J3141
1211a6986L0452J9236P1986O7145r4871o0878l9721l8891P6135l2551P4530J0141
1199F5727Q0129r70n1559k8807o9554j30051J29685O6729o9671J08244l1615l9704
1187B8583n5230m7044J5290J10689r4939O2054j09780j3276j1463J31056m1490
1176b5550p4759R2493J09718k9102q7543K9327J02106L1295j58247o8825J2743
1165f6344o4065o9948M1070O7680j6430L5577O5355l6820P9713l259J5087K3185
1153G0801j54467k6488L7088J1767P4801j19827K3071Q339J13032r5873P9103
$$ plain form
1234 -95056 45905 118516 26803 51542 46435 -75765 -36862 -28718 -216138 -26933 75009
1223 75009 126252 159305 124240 37697 85867 -3010 -42819 -40269 -120817 -69555 -30127 -16986
1211 -16986 13466 32702 104688 171833 76962 16084 -23637 -62528 13607 -18944 55586 65727
1199 65727 145856 144886 93327 64520 -5034 -135085 -5400 61329 -8342 99902 68287 28583
1187 28583 -26647 -73691 -58401 52288 -42651 19403 -90377 -103653 -115116 15940 -25550
1176 -25550 -100309 -7816 101902 72800 -14743 14584 116690 147985 -10262 -79087 -66344
1165 -66344 -130409 -200357 -159287 -91607 -108037 -72460 -7105 -43925 35788 32529 47616 70801
1153 70801 -83666 -110154 -73066 -61299 13502 -106325 -83254 -74915 38117 -57756 21347
1142B1347M8178L0452j02923l5269k4739P209R8135R302M8362j32581n7031J14052
1130B4494J02421r9370N2637q2389m1835O4634q132K997J75498J7792k06293Q0228
1118H2682j9459k6702N8721r8786n1760q8636k5325O4325J9366j51467K0621J21869
1106i4551P4189Q2239p5248j25363J56727n5679L4772N3780n1722j4615j3771
1095b9242P6877N5987j9283k6378r4695L0641K6768o6061l1212J8654N709L083
1083d9152M8262o3594l6621j1010J06180o2723J9712N531j5165P7324K7543R648
1071E5935m4479j0123Q0633m0319m2904O8166L3516j29733K9416j03588O4088
1060c9392J9316o7054O3342M4070L9487q293J09759j12992m0882O2856j7946O3355
$$ plain form
1142 21347 69525 99977 -2946 -38215 -62954 -55745 42390 51692 100054 -32527 -89558 24494
1130 24494 126915 27545 80182 -2207 -44042 20592 12460 15457 190955 208747 2454 82682
1118 82682 63223 36521 95242 -3544 -55304 -143940 -169265 -104940 -85574 -237041 -216420 -94551
1106 -94551 -20362 61877 -13371 -138734 17993 -37686 -2914 50866 -856 -15471 -29242
1095 -29242 47635 103622 84339 57961 -36734 -6093 20675 -45386 -76598 -57944 -52235 -49152
1083 -49152 -890 -64484 -101105 -112115 -5935 -68658 -48946 -43415 -58580 18744 46287 55935
1071 55935 11456 1333 81966 41647 -1257 66909 100425 -29308 108 -103480 -39392
1060 -39392 -20076 -87130 -23788 20282 59769 51476 161235 48243 7361 70217 52271 115626
1048A15626o4995j38393p2599J07100Q4766r9813l1601j7597Q7439j3225K7108
1037a6184L7208j1314O2218q938j8372J9017l6892r6643j2309J55385r6678n1471
1025g4973M2770L6408l2434n6509J14458m8591P3335l5669k5008l4080P9766L0210
1013F9683q3567k3883P0908K6126r7187M2348l6159J9559j44J791N0622p6769
1001c6672K2503J10192k6960k7470m6702j21753O3933J30515p541J4504P5204
990A49753q1320j38096Q928M652M8512j1476j6693P0259r100M559J00894j18691
978A2181n8250J00901k1509n6429L6961m0379n3272j6041N6458r4371J00591K5322
966g837j0416o6110J829N1878L1090J3498p4185M1428J33462O2853j4385r7097
$$ plain form
1048 115626 50631 -87762 -160361 -53261 31505 -68308 -99909 -117506 -30067 -43292 -16184
1037 -16184 21024 9710 71928 62990 44618 63635 26743 -69900 -82209 73176 -23502 -74973
1025 -74973 -32203 4205 -28229 -84738 29720 -18871 54464 18795 -6213 -40293 39473 69683
1013 69683 -13884 -37767 33141 59267 -37920 4428 -31731 -12172 -12316 -10525 40097 -36672
1001 -36672 -14169 96023 69063 41593 -5109 -126862 -62929 67586 60045 74549 149753
990 149753 68433 -69663 -60735 -56083 -7571 -19047 -35740 34519 25419 29978 130872 12181
978 12181 -46069 54832 33323 -23106 13855 -26524 -79796 -95837 -39379 -133750 -33159 -7837
966 -7837 -18253 -84363 -82534 -30656 434 13932 -60253 -18825 114637 177490 163105 66008
954F6008j15644L0683O0865K6365p5506K9568J30352o8641j28383n4471N1481
943d7323J19637M0208j49791M8492N6301K8822J4348k17988n5891M8244N7805
932e7136o5883Q897m8113R4067J00909j7041M3568j9120L76j4903p7843j1496
$$ plain form
954 66008 -49636 -18953 41912 68277 -7229 22339 152691 84050 -44333 -98804 -47323
943 -47323 72314 112522 -37269 11223 67524 96346 110694 -107294 -163185 -114941 -57136
932 -57136 -123019 -114122 -162235 -68168 32741 15700 59268 40148 40524 25621 -52222 -63718
$$ [...]
##END NTUPLES=NMR SPECTRUM
##END=
