##TITLE=1H_EC-3281(1-2)
 CDCl3
 8 sc, 
 19.10.2022
##JCAMPDX= 6.0         $$ Bruker NMR JCAMP-DX V2.0
##DATA TYPE= NMR SPECTRUM
##DATA CLASS= NTUPLES
##ORIGIN= UXNMR, Bruker Analytische Messtechnik GmbH
##OWNER= root
$$ XWIN-NMR		Version 3.5
$$ Wed Oct 19 14:16:58 2022 Russian Standard Time (UT+4h)  she@DPX200
##.OBSERVE FREQUENCY= 200.1313499994
##.OBSERVE NUCLEUS= ^1H
##.ACQUISITION MODE= SIMULTANEOUS
##.ACQUISITION SCHEME= undefined
##.AVERAGES= 8
##.DIGITISER RES= 18
##SPECTROMETER/DATA SYSTEM= spect
##.PULSE SEQUENCE= zg30
##.SOLVENT NAME= CDCl3
##.SHIFT REFERENCE= (INTERNAL, CDCl3, 0, 15.7392)
##AUDIT TRAIL= $$ (NUMBER, WHEN, WHO, WHERE, WHAT)
$$ ##TITLE= Audit trail, XWIN-NMR		Version 3.5
$$ ##JCAMPDX= 5.01
$$ ##ORIGIN= Bruker BioSpin GmbH
$$ ##OWNER= she
$$ F:/spectra/data/she/nmr/H-F/1/pdata/1/auditp.txt
$$ ##AUDIT TRAIL=  $$ (NUMBER, WHEN, WHO, WHERE, WHAT)
(   1,<2022-10-19 14:15:28.25 +0400>,<she>,<DPX200>,
      <created by zg, POWCHK disabled, PULCHK disabled
       configuration hash MD5:
       00 E9 B6 7A A2 85 ED C7 34 08 36 98 17 FE 4E 26
       data hash MD5: 16K
       89 5A 21 2F 34 73 37 C3 BD 0B 96 54 16 18 B7 1B>)
(   2,<2022-10-19 14:15:31.92 +0400>,<she>,<DPX200>,
      <Start of raw data processing
       efp BC_mod = 2 LB = 0.24 FT_mod = 6 PKNL = 1 PHC0 = -18035.53 PHC1 = 11.6007 SI = 16K 
       data hash MD5: 16K
       C5 A7 67 09 EE 11 F3 EA 72 94 05 2A F4 3B 64 43>)
(   3,<2022-10-19 14:15:49.35 +0400>,<she>,<DPX200>,
      <pk PHC0 = 1.003002 PHC1 = -1 
       data hash MD5: 16K
       2D EC EE 18 8D BC 86 1A 5D 43 A5 03 A3 F4 7C 3C>)
(   4,<2022-10-19 14:15:52.82 +0400>,<she>,<DPX200>,
      <abs ABSG = 5 
       data hash MD5: 16K
       9D 4D DC E7 28 F5 94 8C 03 3A 45 EA 03 7C 92 B3>)
$$ ##END=
$$ 
$$ hash MD5
$$ E5 C1 F4 0A C2 13 14 61 0A A3 55 98 3F EB E4 79
##$RELAX= 
##$RELAX= 
##$RELAX= 
##$RELAX= 
##$RELAX= 
##$RELAX= 
$$ Bruker specific parameters
$$ --------------------------
##$DU= <F:/spectra>
##$EXPNO= 1
##$NAME= <H-F>
##$PROCNO= 1
##$TYPE= <nmr>
##$USER= <she>
##$AMP= (0..31)
100 100 100 100 100 100 100 100 100 100 100 100 100 100 100 100 100 100 
100 100 100 100 100 100 100 100 100 100 100 100 100 100 
##$AQSEQ= 0
##$AQ_mod= 1
##$AUNM= <au_zg>
##$AUTOPOS= <>
##$BF1= 200.13
##$BF2= 200.13
##$BF3= 200.13
##$BF4= 200.13
##$BF5= 200.13
##$BF6= 200.13
##$BF7= 200.13
##$BF8= 200.13
##$BYTORDA= 1
##$CFDGTYP= 0
##$CFRGTYP= 5
##$CHEMSTR= <none>
##$CNST= (0..31)
1 1 145 1 1 1 1 1 1 1 1 1 1 1 1 1 1 1 1 1 1 1 1 1 1 1 1 1 1 1 1 1 
##$CPDPRG= <>
##$CPDPRG1= <>
##$CPDPRG2= <>
##$CPDPRG3= <>
##$CPDPRG4= <mlev>
##$CPDPRG5= <mlev>
##$CPDPRG6= <mlev>
##$CPDPRG7= <mlev>
##$CPDPRG8= <mlev>
##$CPDPRGB= <>
##$CPDPRGT= <>
##$D= (0..31)
0 1.2 0 0 0 0 0 0 0 0.06 0 0.03 0 0 0 0 0.0002 0 0 0 0 0 0 0 0 0 0 0 0 
0 0 0 
##$DATE= 1666174527
##$DBL= (0..7)
120 120 120 120 120 120 120 120 
##$DBP= (0..7)
150 150 150 150 150 150 150 150 
##$DBP07= 0
##$DBPNAM0= <>
##$DBPNAM1= <>
##$DBPNAM2= <>
##$DBPNAM3= <>
##$DBPNAM4= <>
$$ [...]
##$SUBNAM3= <"">
##$SUBNAM4= <"">
##$SUBNAM5= <"">
##$SUBNAM6= <"">
##$SUBNAM7= <"">
##$SUBNAM8= <"">
##$SUBNAM9= <"">
##$SW= 18.0517283424941
##$SWIBOX= (0..15)
0 0 2 0 0 0 0 0 0 0 0 0 0 0 0 0 
##$SW_h= 3612.71676300578
##$TD= 16384
##$TD0= 1
##$TE= 0
##$TE2= 300
##$TE3= 300
##$TEG= 300
##$TL= (0..7)
0 120 120 120 120 120 120 120 
##$TP= (0..7)
150 150 150 150 150 150 150 150 
##$TP07= 0
##$TPNAME0= <>
##$TPNAME1= <>
##$TPNAME2= <>
##$TPNAME3= <>
##$TPNAME4= <>
##$TPNAME5= <>
##$TPNAME6= <>
##$TPNAME7= <>
##$TPOAL= (0..7)
0.5 0.5 0.5 0.5 0.5 0.5 0.5 0.5 
##$TPOFFS= (0..7)
0 0 0 0 0 0 0 0 
##$TUNHIN= 0
##$TUNHOUT= 0
##$TUNXOUT= 0
##$USERA1= <user>
##$USERA2= <user>
##$USERA3= <user>
##$USERA4= <user>
##$USERA5= <user>
##$V9= 5
##$VALIST= <valist>
##$VCLIST= <CCCCCCCCCCCCCCC>
##$VD= 0
##$VDLIST= <DDDDDDDDDDDDDDD>
##$VPLIST= <PPPPPPPPPPPPPPP>
##$VTLIST= <TTTTTTTTTTTTTTT>
##$WBST= 1024
##$WBSW= 4
##$XGAIN= (0..3)
0 0 0 0 
##$XL= 0
##$YL= 0
##$YMAX_a= 207119
##$YMIN_a= -264275
##$ZGOPTNS= <>
##$ZL1= 120
##$ZL2= 120
##$ZL3= 120
##$ZL4= 120
##$ABSF1= 15.73808
##$ABSF2= -2.313769
##$ABSG= 5
##$ABSL= 3
##$ALPHA= 0
##$AQORDER= 0
##$ASSFAC= 0
##$ASSFACI= 0
##$ASSFACX= 0
##$ASSWID= 0
##$AUNMP= <proc_1d>
##$AZFE= 0.1
##$AZFW= 0.1
##$BCFW= 0
##$BC_mod= 2
##$BYTORDP= 0
##$COROFFS= 0
##$CY= -3
##$DATMOD= 1
##$DC= 0
##$DFILT= <>
##$DTYPP= 0
##$F1P= 0
##$F2P= 0
##$FCOR= 1
##$FTSIZE= 16384
##$FT_mod= 6
##$GAMMA= 0
##$GB= 0
##$INTBC= 1
##$INTSCL= 3.70164e-10
##$ISEN= 128
##$LB= 0.24
##$LEV0= 0
##$LPBIN= 0
##$MAXI= 10000
##$MC2= 0
##$MEAN= 0
##$ME_mod= 0
##$MI= 1.114404
##$NCOEF= 0
##$NC_proc= -6
##$NLEV= 6
##$NOISF1= 3.799351
##$NOISF2= 2.8
##$NSP= 0
##$NTH_PI= 0
##$NZP= 0
##$OFFSET= 15.73918
##$PC= 1
##$PHC0= -18034.53
##$PHC1= 10.6007
##$PH_mod= 1
##$PKNL= yes
##$PPARMOD= 0
##$PSCAL= 0
##$PSIGN= 0
##$REVERSE= no
##$SF= 200.130006476448
##$SI= 16384
##$SIGF1= 3
##$SIGF2= 2
##$SINO= 5.538805
##$SIOLD= 16384
##$SREGLST= <1H.CDCl3>
##$SSB= 0
##$STSI= 16384
##$STSR= 0
##$SW_p= 3612.71676300578
##$SYMM= 0
##$S_DEV= 0
##$TDeff= 16384
##$TDoff= 0
##$TI= <>
##$TILT= no
##$TM1= 0
##$TM2= 0
##$TOPLEV= 0
##$USERP1= <user>
##$USERP2= <user>
##$USERP3= <user>
##$USERP4= <user>
##$USERP5= <user>
##$WDW= 1
##$XDIM= 16384
##$YMAX_p= 360012086
##$YMIN_p= -378224
$$ End of Bruker specific parameters
$$ ---------------------------------
##NTUPLES= NMR SPECTRUM
##VAR_NAME=  FREQUENCY,     SPECTRUM/REAL,   SPECTRUM/IMAG
##SYMBOL=    X,             R,               I
##VAR_TYPE=  INDEPENDENT,   DEPENDENT,       DEPENDENT
##VAR_FORM=  AFFN,          ASDF,            ASDF
##VAR_DIM=   16384,         16384,           16384
##UNITS=     HZ,            ARBITRARY UNITS, ARBITRARY UNITS
##FACTOR=    0.220516191357247, 1,           1
##FIRST=     3149.88211752465, 0,            0
##LAST=      -462.834645481134, 0,           0
##MIN=       -462.834645481134, -378224,     0
##MAX=       3149.88211752465, 360012086,    0
$$ Real data points
##PAGE= N=1
##DATA TABLE= (X++(R..R)), XYDATA
$$ [...]
7265D12786j1208N2270Q3492j22450q5968J00797k0225J08740n1471n2704p660
7254D06399J8512J3803P3409L8750L8742j1025n8715k2545R6370o331J74467K7106
7242G88942j29104L3891j2401L9437J7441O7740j09036P0437m5401R6031m3991
7231G73986k8343k1186N5790L1440j03960R3724m5617O9635P7716k4275O1912
7220I40822m7745j22253j0862L9133p8386N8472P6761K934O0661J8288j0481j20378
7208H06966J15250l6675l9441R155O0466J16402o9566q673M542P4597l259R5830
7196A125594k8787o7978L7568N6983j8085k0807P0636m7297M7642l395K1231R6011
7184A269316J28949L1139l4947j4145n0820l2096J83298j439J21118j7153J31451
$$ plain form
7265 412786 401578 453848 537340 414890 328922 429719 409494 518234 466763 414059 406399
7254 406399 424911 438714 512123 550873 589615 578590 519875 497330 593700 587369 761836 788942
7242 788942 659838 693729 681328 720765 738206 805946 696910 767347 721946 817977 773986
7231 773986 745643 724457 780247 811687 707727 801451 755834 825469 903185 878910 940822
7220 940822 893077 770824 759962 799095 720709 779181 855942 858876 919537 937825 927344 806966
7208 806966 922216 885541 846100 855255 915721 1032123 962557 953884 958426 1033023 1029764 1125594
7196 1125594 1096807 1028829 1066397 1123380 1105295 1084488 1155124 1107827 1155469 1152074 1173305 1269316
7184 1269316 1398265 1429404 1394457 1380312 1329492 1297396 1480694 1479255 1600373 1583220 1714671
7173A714671K2127m5873q7444L9527K28582l6701J69855J46493k9814J71530J28200
7162B421153q4684r521L336J03349P4572m6163N037J15180J03048J07008l2551
7151B759764n1054j00528R2262K24598J31900K8411M1009M3070L258p3662R6451
7140C195479J33855N5180j9591J11218N8503J13981L1928l7612N1062Q7397K6609
7129C808009o36J11568J00848J82548J45055L6894J10993K69034K80466K23096
7119E267875Q9429Q5561K43071K61891R0200K00906K53646L26843K26172K99730
7109G345324M02408M10979L85118K85262L91836M50972L83175M09831N07857M27396
7099A1400158L81405N13808N18490M49843N16081P87410O84630Q13082J001839
$$ plain form
7173 1714671 1736798 1690925 1603481 1643008 1871590 1834889 2004744 2151237 2121423 2292953 2421153
7162 2421153 2336469 2326948 2330284 2433633 2508205 2462042 2467079 2582259 2685307 2792315 2759764
7151 2759764 2708710 2608182 2700444 2925042 3056942 3085353 3126362 3169432 3172690 3099028 3195479
7140 3195479 3329334 3384514 3364923 3476141 3534644 3648625 3680553 3642941 3694003 3781400 3808009
7129 3808009 3807373 3918941 4019789 4202337 4347392 4384286 4495279 4764313 5044779 5267875
7119 5267875 5357304 5442865 5685936 5947827 6038027 6238933 6492579 6819422 7045594 7345324
7109 7345324 7747732 8158711 8543829 8829091 9220927 9671899 10055074 10464905 10972762 11400158
7099 11400158 11781563 12295371 12813861 13263704 13779785 14567195 15251825 16064907 17066746
7090A7066746J152119J154498J192783J451200J746011J923702K282630K775121
7082C0744810K882173L214986L335564L769057M337155N172821O132645P218861
7074F6808072Q510489R719188J0149964R099496N031587j791868r085875j4377175
7066H4063878j5865266j3981424j0753613p856094n621381m149347l244379k629561
7058A9962813k092026j740805j250523j166227j053403r60276q19908q27772p69402
7049I282471n70079m40203l63917m90637m32189l25261l11949m19297l19653l64446
7039E244840k90942j45794n0859j30079r3685p8241j88307l9538j19206j64051
7029C944138k51999j17865k27576k75051k60672k34412J10867M3953m0862j13246
$$ plain form
7090 17066746 18218865 19373363 20566146 22017346 23763357 25687059 27969689 30744810
7082 30744810 33626983 36841969 40177533 43946590 48283745 53456566 59589211 66808072
7074 66808072 75318561 85037749 95187713 104287209 109318796 107526928 98441053 84063878
7066 84063878 68198612 54217188 43463575 35607481 29986100 25836753 22592374 19962813
7058 19962813 17870787 16129982 14879459 13713232 12659829 11699553 10879645 10051873 9282471
7049 9282471 8712392 8272189 7908272 7417635 6985446 6660185 6348236 5928939 5609286 5244840
7039 5244840 4953898 4808104 4757245 4627166 4533481 4455240 4266933 4227395 4108189 3944138
7029 3944138 3692139 3574274 3346698 3071647 2810975 2576563 2687430 2731383 2690521 2577275
7019B577275j94456R7065k0001p2356j17314l7384o6900m1662M6782j48045k05264
7008A817740r7422Q1404j1244k04160q1841j13735j39974R1223M2487o2046j20162
6997A202270L0879L2402p517j50402j10139l8013R1804j9905r5846m0614o5972
6986H28947p7125o6997J16822j09232J18705J13912M3251r4275k4744n2573o8062
6975G28629k923j39418P0807K2291o470q2009m8966j8224L8914m3255q2933j23337
6963C13106O1543J2381Q8364n9782K360N128j07123l7129M3340N5583R818p526
6951C80063R8899j37860j31786J22726J0297P2855m5010j5739L2786J0670J0j10308
6939B87603o520P65q5154p3678J25019n8116N9511P2819j91907n2054m4455N0410
$$ plain form
7019 2577275 2382819 2479884 2459883 2387527 2270213 2232829 2165929 2124267 2171049 2023004 1817740
7008 1817740 1720318 1801722 1790478 1586318 1504477 1390742 1250768 1341991 1384478 1322432 1202270
6997 1202270 1233149 1265551 1258034 1107632 997493 959480 1051284 1031379 935533 894919 828947
6986 828947 751822 684825 801647 692415 811120 925032 968283 874008 849264 796691 728629
6975 728629 725706 586288 657095 679386 672916 590907 541941 523717 562631 519376 436443 313106
6963 313106 374649 387030 475394 415612 417972 423100 315977 278848 322188 377771 387589 380063
6951 380063 478962 341102 209316 332042 342339 415194 370184 354445 387231 397901 397911 287603
6939 287603 281083 281848 196694 123016 248035 189919 249430 322249 130342 78288 33833 84243
6927H4243j6209J01824L1963j21330J46808q570j62630L0486K0892k155J02997
6916B08319j7551j5382q8209L2000M8951l1216o7635p8552p5030R1543P4062j06822
6904b5522N1803l4201J2440n7915j848p2585J25712P8537q6963Q5279L8248j52977
6892c9992m4075J19789M8552m55J9787J42558j6889j38335J5842l8818j55501
6881h7537R8912K11029n5447o4657o1215J24443j4669P4368j27371k1731M9945
6870A26070N6981p6957j5701R8782R161k6985q4812L5111O4778N2419p0914j23955
6858D3978m5862J07718L8626j01076N984r8148M1250O2173k6331K2038J09481
6847A59831r255m3668J08253j53383k2740j17442M9775R7682n7078J08587j02506
$$ plain form
6927 84243 68034 169858 201821 80491 227299 218729 56099 86585 107477 105322 208319
6916 208319 190768 175386 87177 119177 168128 136912 69277 -9275 -84305 7238 81300 -25522
6904 -25522 26281 -7920 4520 -53395 -55243 -127828 -2116 76421 -10542 74737 112985 -39992
6892 -39992 -84067 35722 84274 83819 103606 246164 229275 90940 106782 67964 -87537
6881 -87537 11375 222404 166957 102300 41085 165528 150859 225227 97856 76125 126070
6870 126070 183051 106094 90393 189175 198336 171351 86539 121650 186428 238847 167933 43978
6858 43978 -1884 105834 144460 43384 49368 -48780 -7530 54643 28312 50350 159831
6847 159831 150576 106908 215161 61778 39038 -78404 -28629 69053 11975 120562 18056
6836A8056j82283O0329J30776l9414j9919J02092l8927P1428J6956j10493k1847
6825a3246K32159k5565j53863j54110Q6303P2531K257J1835l5997o9684M9521
6814B141J0729J4891L5331R2550n9941j23482k1529R734O0721o9241J409k9688
6802g6375P016k5593Q309P8257O9401O0314M014K4867k8899r9667K7079M6389
6790I5112p6970j52487L8713r156R2552M484n1195P4208Q7923N67n6762p6610
6778b9621n7934r2195O2816R0943m4016k8517m5028J25041M4490L993k0045R080
6766A9007O3908p760n0925n9473J01868J7275p3067p6160J353J4809r5461l3032
6754a77658J80057J6586J4984j12935j15223J74113J5353J7112L8561O225j05974
$$ plain form
6836 18056 -164227 -103898 26878 -12536 -32455 69637 30710 102138 119094 8601 -13246
6825 -13246 218913 193348 39485 -114625 -28322 44209 46466 58301 22304 -47380 2141
6814 2141 12870 27761 63092 155642 95701 -27781 -49310 -39576 21145 -48096 -46687 -76375
6802 -76375 -69359 -94952 -86643 -8386 61015 121329 125343 150210 121311 21644 48723 95112
6790 95112 18142 -134345 -95632 -104788 -12236 -7752 -58947 15261 103184 103751 46989 -29621
6778 -29621 -87555 -179750 -116934 -25991 -70007 -98524 -143552 -18511 25979 29972 9927 19007
6766 19007 82915 75155 24230 -35243 66625 83900 10833 -65327 -63974 -49165 -144626 -177658
6754 -177658 2399 18985 33969 -78966 -194189 -20076 -4723 12389 50950 57175 -48799
6743d8799P1642k6099l1934l7418k6815K7136j3712J8894N7379N3284K4439J08912
6731A76909p4154j01338j01304p2648J13023L4764L6963M4282R5365q840o4030
6720G8992j37583J7224M7497p652o1563M4346Q6463m3629P3967j84114l3919O6220
6708e3751J4913r6672J7944J18722O542N3918M6858m2424j14514N6254O746Q55
6696A5391j5331n4443j0936j5424Q6824M3488j06426Q2741Q2690N1052K7378m6114
6684A40890K8010R817o133o0353p2497O5343J52222K5014n1052l8797R2513L7358
6672C22335N7772K9588J91090M1610m5694j0934K9100k24888k43651L8834k3173
6661A61989j1750j03475K2199l1788J04899l419j01613O9197q7446N8887J6230
$$ plain form
6743 -48799 22843 -3256 -35190 -72608 -99423 -72287 -85999 -67105 -9726 43558 67997 176909
6731 176909 102755 1417 -99887 -172535 -59512 -24748 12215 56497 151862 143022 78992
6720 78992 -58591 -41367 6130 -1522 -63085 -18739 67724 24095 98062 -86052 -119971 -53751
6708 -53751 -38838 -135510 -117566 1156 7698 61616 108474 66050 -48464 7790 14536 15391
6696 15391 60 -54383 -65319 -80743 6081 49569 -56857 25884 108574 159626 187004 140890
6684 140890 168900 178717 172584 112231 39734 105077 257299 282313 231261 192464 284977 322335
6672 322335 380107 409695 600785 642395 596701 585767 614867 389979 146328 185162 161989
6661 161989 150239 46764 68963 37175 142074 138655 37042 106239 18793 77680 93910
6650I3910l9491K8520o0091L126N0760q6246k1206L6649m3698O8123L5723r9660
6638c3581P4563M2706j9120L5825J42828p7885j43967K1077o2094R808q4055N407
6626h8488R4212N2227M2780J9249j04872j12804o9860P8798L0359L7739p9749
6615a00409j7711K8180K4610P9425q6832k9100q433l9033J56464K5445l7062j00431
6603a04887P635J63441q0918n758j57138Q0893P4449L0762N2137j23185o9086
6592a31655q292R1239j8240R3575o0434L7838q2873k3316J30939P040J13769M358
6580A53948r5104k669J28278j17292k7786m1812M4984O0416q0748Q4519l0645
6569G6089q1287K9843m7392M631m2579Q8898K6105p6976p5183L7261q3896Q1682
$$ plain form
6650 93910 54419 82939 22848 25974 76734 -9512 -30718 5931 -37767 30356 66079 -33581
6638 -33581 40982 83688 64568 100393 243221 165336 21369 42446 -19648 -9840 -93895 -88488
6626 -88488 5724 57951 100731 119980 15108 -97696 -167556 -88758 -58399 -20660 -100409
6615 -100409 -118120 -89940 -65330 14095 -72737 -101837 -110270 -149303 7161 32606 -4456 -104887
6603 -104887 -97252 66189 -14729 -20487 -177625 -96732 -22283 8479 60616 -62569 -131655
6592 -131655 -139947 -48708 -66948 26627 -33807 4031 -78842 -102158 28781 35821 149590 153948
6580 153948 58844 56175 184453 67161 39375 -2437 42547 102963 22215 106734 76089
6569 76089 -5198 24645 -22747 -18116 -60695 28203 54308 -22668 -97851 -60590 -144486 -62804
6557f2804Q5432N2521O5310j40228l3131q6607M9782J55536O885k8210M4920j49660
6545d0254N8400N2917j24509J605m432O0278L1231N0353j45844q7604J34455N7311
6533D3907k079L7132r6359R810J79j56178J36379J951J4585P2131l8231N4142
6521G7369q7589j24014K8145Q0971o2417J1072J05565q2464K2221P5202q4284
6510d0223R9159N6480n9134K8556N4304r2670j15160J71634j6206k4771j4092
6499D7877m998k0121K6120p8553M1357M4768K75n5561Q8432m4093k0230k4888
6487C85P7373K5628r4052K2760J03743j06682j8714J07463p001l9318m2746j27421
6475i8582m9664J41545n7188L7647J60951P1576p4903o3642J01600j1321k0793
$$ plain form
6557 -62804 22628 75149 140459 231 -32900 -119507 -69725 85811 92696 64486 109406 -40254
6545 -40254 18146 71063 -53446 -51841 -56273 4005 35236 85589 -60255 -147859 -13404 43907
6533 43907 41828 78960 -17399 -7589 -7410 -163588 -27209 -25258 -10673 61458 23227 77369
6521 77369 -10220 -134234 -106089 -25118 -87535 -76463 29102 -53362 -31141 44061 -40223
6510 -40223 58936 115416 56282 84838 139142 46472 -68688 102946 86740 61969 47877
6499 47877 42879 22758 48878 -29675 11682 56450 56725 1164 89596 45503 25273 385
6487 385 77758 103386 9334 32094 135837 29155 10441 117904 110903 71585 28839 -98582
6475 -98582 -148246 -6701 -63889 -26242 134709 206285 131382 67740 169340 158019 137226
6464A37226j4490j30780O1058m5973Q0466M8294j9070j51669m2031O1608J17660
6453A02299J09118j20905k11001J4209Q967N5095m3438J23228J03605j85217l3255
6442g7295j7551J1954J02977k7610J03644m475N6638j1968n4991L5894P7719p2345
6430A22591n309n5664K4180l6021J6689O5677j4266n6549r3395K39031M6236j6548
6418B36652j03537K0247o210o9196O7755J0884j61405P1187n7465P5395K6819
6407A11126k1373J1509M8567j2493L0403K7374l6149K5625r0644j0253L7058j837
6395A18913p064j4915M9095j31038m8574J55664m8490N2050k5057l4507k6416
6384C9661Q6846p2607p8674J7355l4062j571N2338L1201P6285M9194K4777K3247
$$ plain form
6464 137226 122736 -8044 53014 7041 87507 135801 116731 -34938 -76969 -15361 102299
6453 102299 211417 90512 -120489 -106280 -97313 -42218 -85656 37572 141177 -44040 -77295
6442 -77295 -94846 -82892 20085 -7525 96119 91644 148282 136314 81323 117217 194936 122591
6430 122591 117282 61618 85798 49777 66466 132143 117877 61328 -32067 206964 253200 236652
6418 236652 133115 153362 147152 77956 145711 156595 -4810 66377 8912 84307 111126
6407 111126 89753 101262 149829 137336 167739 195113 158964 184589 93945 83692 120750 118913
6395 118913 111849 96934 146029 14991 -33583 122081 73591 125641 100584 66077 39661
6384 39661 126507 53900 -24774 -7419 -41481 -43052 9286 40487 116772 165966 190743 213990
6372B13990p0345M1627m3743J30769J9502m9595J4739o5832j55473J6240k9657
6361B2222M0520O1431j6645P1044p4399J13832k7876j03115J09255N2872O9083
6350C18224J1980p6961o176l6176L7551q6358l7922J26734j11037N4112R2079
6339B86050j71595L2345O6475Q0013j81479J6484j24501N8366J30242R5619Q1350
6328C69369j66474k2453J36776J8436j00155l8478O3446r871j39378m4358l4132
6317C2728q151J27857M5652k6032J43162r2906j05659m9834J56898l6956m2104
6306A44655M1596J12016l3486r5626K3480j6642K9509J5714M1024L66K0090p18
6294B81978n2555J40171j41802m388K5111L4499o5943k6595N7860J10192r207
$$ plain form
6372 213990 143645 185272 141529 272298 291800 242205 256944 191112 35639 51879 22222
6361 22222 62742 124173 107528 178572 104173 218005 190129 87014 196269 249141 318224
6350 318224 330204 253243 247067 210891 248442 162084 124162 250896 139859 193971 286050
6339 286050 114455 146800 213275 293288 111809 128293 3792 62158 192400 288019 369369
6328 369369 202895 180442 317218 335654 235499 197021 260467 250596 111218 66860 32728
6317 32728 24577 152434 198086 172054 315216 222310 116651 66817 223715 186759 144655
6306 144655 186251 298267 264781 169155 192635 175993 205502 221216 262240 262606 282696 281978
6294 281978 229423 369594 227792 223404 248515 283014 217071 190476 248336 358528 349321
6283C49321o6881m0030n4600R5153m492J4768o5589K1943m147p8063R7671J63705
6271D28759k3259k5188l2544k709R1198P6058j40012q6158m060R1027L6530k5228
6259C84414P5154Q3900n5978o2571l4028Q5374N3485k4228J21229r2193k6876
6248E07682Q8788k7761n4483o5312m7203M4203J6275M394N4141M4741n0179j20125
6236C95161k93K7701R9300M3493M7354j04990j52866J290J61930J41468r850O3852
6224G13550l8076J3030N2191L0647J40536P388j78707j3391P5026o0536j5073
6213G26585o0296q2729k884Q03k8767J6929j20376N2543J31541o915O0999j2871
6201F74562n3550q192L9014k3488o5728r546l719J7457J14005P0716K204q8013
$$ plain form
6283 349321 282440 242410 187810 282963 278471 293239 227650 249593 245446 167383 265054 428759
6271 428759 405500 380312 347768 345059 436257 512315 372303 286145 282085 373112 409642 384414
6259 384414 459568 543468 487490 424919 390891 476265 529750 505522 626751 534558 507682
6248 507682 596470 568709 514226 448914 401711 445914 462189 466583 520724 565465 515286 395161
6236 395161 394868 422569 521869 565362 612716 507726 354860 356150 518080 659548 649698 713550
6224 713550 675474 688504 740695 771342 911878 919266 740559 727168 802194 741658 726585
6213 726585 666289 583560 580676 581479 552712 569641 449265 501808 633349 626434 687433 674562
6201 674562 621012 612820 651834 628346 562618 553072 549353 566810 680815 751531 753735 665722
6189F65722j19118k2750N2147R057k1049P6061j27174l7660R8856J6480o4754
6178E25818k2255N5066P7453j6580N4902l1599j48340K2241p8377n3012O6001
6167D51318K7510J21330L2363j19964Q1848k3313J3776r4672N2789P3282q2921
6156E33346M8638n4880R030J22575o5509j00983N0345M6005M337Q239O9657k9671
6144F41129r1978k7367O0625J18467k7223p4091M6032l67J3513j1334J0213Q6129
6132G43748J9801p4428r2702J05008J8354K4954Q8100o0666J8755l9782O5392
6121H16534p2716n6627N3256J15502J04415n3553M4650q8305k0927N8353L61k3892
6109H77051K4243N0594j5596n1415J25819N6149m0172j06042K2699J4137J0448
$$ plain form
6189 665722 546604 523854 576001 585058 564009 640070 512896 475236 574092 590572 525818
6178 525818 503563 558629 636082 619502 674404 642805 494465 516706 438329 385317 451318
6167 451318 478828 600158 632521 512557 594405 571092 584868 490196 542985 616267 533346
6156 533346 581984 527104 536134 658709 593200 492217 542562 588567 592904 601143 670800 641129
6144 641129 549151 521784 582409 700876 673653 599562 645594 645227 658740 647406 657619 743748
6132 743748 763549 689121 596419 701427 719781 744735 832835 772169 790924 751142 816534
6121 816534 743818 687191 740447 855949 960364 906811 951461 863156 842229 900582 900943 877051
6109 877051 901294 951888 936292 884877 1010696 1066845 1026673 920631 943330 957467 967915
6098I67915L5501P9817k9730Q2116Q0946j6944J11463j41124j80735n5514P2826
6087A006537K8020M0232J6172L9086R7256J480k861m2835Q898K6426j02331N0444
6075A166524l608p0156M0003N1483J43804P0355n8148J99356L3963j9866J14101
6064A667811r0969j3927L6303Q8169J82551k7471j51585n9228j9999N436k9911
6053A587180K3943n9731j8964O8263O7330O0119o4304R9079j8145J8901N0438
6042A814109J7189L488m7064k9383J32266J11890P1237r331M0108J9317L7167
6031B160993m9089J02177k3331p3783J36907O0412M1378Q4059L7032l0094l2334
6020B414327N2662K5183k141K00970J9362K89J30012M4584j22087J61582O2478
$$ plain form
6098 967915 1003416 1083233 1053503 1135619 1216565 1199621 1311084 1169960 989225 933711 1006537
6087 1006537 1034557 1074789 1090961 1130047 1227303 1228783 1225922 1183087 1191985 1218411 1116080 1166524
6075 1166524 1162916 1092760 1132763 1184246 1328050 1398405 1340257 1539613 1573576 1553710 1667811
6064 1667811 1576842 1562915 1599218 1687387 1869938 1842467 1690882 1631654 1611655 1617091 1587180
6053 1587180 1611123 1551392 1532428 1600691 1668021 1728140 1663836 1762915 1744770 1763671 1814109
6042 1814109 1831298 1834786 1787722 1758339 1890605 2002495 2073732 2064401 2104509 2123826 2160993
6031 2160993 2111904 2214081 2190750 2116967 2253874 2314286 2355664 2439723 2476755 2446661 2414327
6020 2414327 2466989 2492172 2490031 2691001 2710363 2710652 2840664 2885248 2763161 2924743 2987221
6009B987221L4672O3057Q5904M8323J573K48374J26952q2362L5189R2173J50190
5998C791266p8525J04888Q9699N6201j1993Q1136N7419J43542J29315N7419J2843
5987D433210J86349K09527J5627M8317P7688K41512O0143o2330J64236K23091
5977E597370N2050m8142K8904K67314J58048J28464J92082Q5947J18396M7821
5967F628254J38506K48455J05883L23855K52493Q0544K24219K74393K14790K11098
5957H702490K40936K36111K39753K84441L37301L51419L08260K08832K58234L66875
5947A1534652K80458L33125L58237N02559M41891N46015N11971O16857O46228
5938A5771993O60502P02837P93680Q04835R92286J281310J389910J476298J910221
$$ plain form
6009 2987221 3021893 3084950 3170854 3219177 3220750 3469124 3596076 3513714 3548903 3641076 3791266
5998 3791266 3712741 3817629 3907328 3963529 3951536 4032672 4090091 4233633 4362948 4420367 4433210
5987 4433210 4619559 4829086 4844713 4893030 4970718 5212230 5272373 5210043 5374279 5597370
5977 5597370 5649420 5601278 5630182 5897496 6055544 6184008 6376090 6462037 6580433 6628254
5967 6628254 6766760 7015215 7121098 7444953 7697446 7777990 8002209 8276602 8491392 8702490
5957 8702490 8943426 9179537 9419290 9703731 10041032 10392451 10700711 10909543 11167777 11534652
5947 11534652 11815110 12148235 12506472 13009031 13450922 13996937 14508908 15125765 15771993
5938 15771993 16432495 17135332 17929012 18733847 19726133 21007443 22397353 23873651 25783872
5929B5783872K132473K403932K701661L036311L632285L846034M124344M532703
5921E2193615M939423N146176L939603J048963k845023n772777o440412n320431
5913D6889137m030185k903863j646666j039698n75163j07056K58047Q99255J258244
5904C9002052J784309K308751K808439L471336M142837N211952N828110O554148
5896G1111934P290117P873382Q730132R479841Q908069N506720j718064r975097
5888A07207034j4864498j4855263j2192042q985704o704772m827036l433684k658252
5880C8685783k016371j407569r05644k94716O8048N50511R08144J356195J758596
5871C8702977K249759K924003L307584L653919L872094M242608M057128L120873
$$ plain form
5929 25783872 27916345 30320277 33021938 36058249 39690534 43536568 47660912 52193615
5921 52193615 57133038 62279214 66218817 67267780 64422757 58649980 52209568 46889137
5913 46889137 42858952 39955089 38308423 37268725 36693562 36586506 36844553 37743808 39002052
5904 39002052 40786361 43095112 45903551 49374887 53517724 58729676 64557786 71111934
5896 71111934 78402051 86275433 95005565 104485406 113393475 118900195 117182131 107207034
5888 107207034 92342536 77487273 65295231 56309527 49604755 44777719 41344035 38685783
5880 38685783 36669412 35261843 34356199 34061483 34129531 34680042 35588186 36944381 38702977
5871 38702977 40952736 43876739 47184323 50838242 54710336 58952944 63010072 66130945
5863F6130945N88028l363118p023113q498160p687564o201350m746329l644394
5855B5554945k757998k237709j752904j315019j336335j088182r99792p40408
5847A3326598o46838m48611m01117k85486k89565m23452j85749j23849r5821j3240
5837A0412870k90641m28658m17853n05426o16197l79949l58652l03796l52891
5828F758807k96963k00933k24010k15475k16488q6069j58022j83451k77095j84139
5818D716162j68537R9337o8633j82767j00235N4944o2767p4373j82841o8486P7847
5807D039651k1145Q121j8119l6048l2474j140J60326Q9166p727j07614q9973k82668
5795C700356k89664j26075j67167j26716j95328o0535Q424j13318j27907O1331
$$ plain form
5863 66130945 66718973 63355855 56332742 47834582 40147018 33945668 29199339 25554945
5855 25554945 22796947 20559238 18806334 17491315 16154980 15066798 14067006 13326598
5847 13326598 12679760 12231149 11830032 11544546 11254981 10831529 10645780 10521931 10426110 10412870
5837 10412870 10122229 9693571 9275718 8770292 8154095 7774146 7415494 7111698 6758807
5828 6758807 6461844 6260911 6036901 5821426 5604938 5518869 5360847 5177396 4900301 4716162
5818 4716162 4547625 4646962 4578329 4395562 4295327 4350271 4287504 4213131 4030290 3961804 4039651
5807 4039651 4018506 4026627 4008508 3972460 3939986 3938846 4099172 4188338 4180611 4072997 3983024 3700356
5795 3700356 3410692 3284617 3117450 2990734 2795406 2734871 2743295 2629977 2502070 2563401
5785B563401q5781j02780m9935O0764o604j29333j07181q295l5289M6463j7142
5774B128288L1524j1001q3112j0064k0348l2113q5584n0269r3908k6309l8666
5763A708438n565k9611k6212Q1704N5078j60419k4443k219J08944r4942j90271
5752A420482M2985J98263L6829j43630r5804n2862J19498R9801k5775k0453J52075
5741A731409J7362l7759j86992m4672J74844l3806m6547N9593o5066o5955P6108
5730A578519M1955P125r8582k8787J16241l2554O6829L4705m0074J3971Q8335
5719A747683O075p005l5008L1253k5772n8200Q9282o5428m5558R9886p1516K1966
5707A687658Q1064K3076l6302M5858K2527Q0569p4443p7450M2504K9396K3975
$$ plain form
5785 2563401 2477620 2374840 2324905 2385669 2379065 2249732 2142551 2134256 2098967 2145430 2128288
5774 2128288 2159812 2148811 2065699 2055635 2035287 2003174 1917590 1867321 1773413 1747104 1708438
5763 1708438 1702873 1673262 1647050 1728754 1783832 1623413 1598970 1596751 1705695 1610753 1420482
5752 1420482 1463467 1661730 1698559 1554929 1459125 1406263 1525761 1625562 1599787 1579334 1731409
5741 1731409 1748771 1711012 1524020 1479348 1654192 1620386 1573839 1633432 1568366 1502411 1578519
5730 1578519 1620474 1627599 1529017 1500230 1616471 1583917 1650746 1685451 1645377 1659348 1747683
5719 1747683 1753758 1746753 1711745 1742998 1717226 1659026 1748308 1682880 1637322 1737208 1665692 1687658
5707 1687658 1768722 1791798 1755496 1801354 1823881 1904450 1830007 1752557 1795061 1824457 1848432
5696A848432N0491L9291Q790O9429l2461O8839k6621M8314l9877M0672j1535o7925
5684A995839L79j56465k8447J92576N1838J02880p8m5252K687R7135N5684j00126
5672B168650J24824O4913O165L7636Q602M8692K4222O4475j7088j22310J0745
5661B419526r7527q0524O6750o4352Q1351J14434M887q7018q5715L743l1412P5413
5649B319556P5451O3469L1217L9561K6760P0742M9397N4557J06024M1659j37273
5638B741120J00002J44987J00709o2462o0371l8131j7515O4149P6025o3490N4939
5627C039962n5619J17071O2436O5180J01873J05049J90804p0014J1817o1354O3205
5616C570410J42675P8844m4210K17804Q2301j6413K8283J93183K0432k7311L5765
$$ plain form
5696 1848432 1898923 1938214 1947004 2016433 1983972 2052811 2026190 2074504 2034627 2075299 2063764 1995839
5684 1995839 1996218 1839753 1811306 2003882 2055720 2158600 2158522 2113270 2115957 2213092 2268776 2168650
5672 2168650 2293474 2358387 2364552 2402188 2410790 2459482 2483704 2548179 2531091 2408781 2419526
5661 2419526 2321999 2241475 2308225 2243873 2325224 2439658 2444545 2357527 2271812 2275555 2244143 2319556
5649 2319556 2395007 2458476 2489693 2529254 2556014 2626756 2676153 2730710 2836734 2878393 2741120
5638 2741120 2841122 2986109 3086818 3024356 2963985 2925854 2908339 2972488 3048513 2985023 3039962
5627 3039962 2984343 3101414 3163850 3229030 3330903 3435952 3626756 3556742 3568559 3507205 3570410
5616 3570410 3713085 3791929 3747719 3965523 4047824 4031411 4059694 4252877 4273309 4245998 4281763
5605D281763L6951l839L08915J94472p8499N3148J97812J55530Q6732j2172R8884
5594E319697R8880J03119J46171J30631Q3502J06703K28033K06085J52506Q1609
5584F656936J02791J56504J07983K75729R1455R1040J68980J50156L02075J38647
5574H242296L35350J66937J38917K37089L30819K92628K94396K90910M03341L44613
5564A1077296K75852L57994M06043M95591N38143O18196N25797O98182O14613
5555A5607707O95710Q30363O98675Q06331R26608J241434J242983J185593J175941
5546B4411345Q45530J038658J185782J343448J451363J423980J392730J386219
5538C4479055J155281J116469J080885R74087R47231Q52549O76289O97268Q53691
$$ plain form
5605 4281763 4318714 4314875 4623790 4818262 4739763 4792911 4990723 5146253 5232985 5220813 5319697
5594 5319697 5418577 5521696 5667867 5798498 5882000 5988703 6216736 6422821 6575327 6656936
5584 6656936 6759727 6916231 7024214 7299943 7391398 7482438 7651418 7801574 8103649 8242296
5574 8242296 8577646 8744583 8883500 9120589 9451408 9744036 10038432 10329342 10732683 11077296
5564 11077296 11353148 11711142 12117185 12612776 13150919 13769115 14294912 14993094 15607707
5555 15607707 16303417 17133780 17832455 18638786 19565394 20806828 22049811 23235404 24411345
5546 24411345 25256875 26295533 27481315 28824763 30276126 31700106 33092836 34479055
5538 34479055 35634336 36750805 37831690 38805777 39753008 40605557 41281846 41979114 42832805
5529D2832805Q12329J021176Q74519R90660R62536R55994J073147J166823J153719
5520E1843708J044277J019270J212841J172188J087791J146519J178470J232826
5512F0937890J125590R58295P36977M52551L84120J99524n7014r5567k57311j57399
5502F4227656P9890o5915R2141P641k03591j62366l47617o47894p40366q35688
5492F1403891j201390j306898j617705j681409j567524j507891j407077j176482
5484D9937515r83391j151780j048945j087028j038552j153484r79218q66830r92868
5475D0635419q68483r27120r53570p04397r23199r44960q91710j133920j167754
5466C2120306j355727j445307j539304j704306j643757j590177j531253j553304
$$ plain form
5529 42832805 43645134 44666310 45540829 46531489 47494025 48450019 49523166 50689989 51843708
5520 51843708 52887985 53907255 55120096 56292284 57380075 58526594 59705064 60937890
5512 60937890 62063480 63021775 63758752 64211303 64595423 64794947 64737933 64642366 64385055 64227656
5502 64227656 64307546 64241631 64333772 64341413 64137822 63975456 63627839 62979945 62239579 61403891
5492 61403891 60202501 58895603 57277898 55596489 54028965 52521074 51113997 49937515
5484 49937515 48954124 47802344 46753399 45666371 44627819 43474335 42495117 41628287 40635419
5475 40635419 39766936 38839816 37886246 37181849 36258650 35313690 34421980 33288060 32120306
5466 32120306 30764579 29319272 27779968 26075662 24431905 22841728 21310475 19757171
5458A9757171j481858j205660j190439r31585q76829r14180n86545p59250n87904
5449A1222921o92145o09277m35244l95623m39040m76079m15929m15131k58572
5440G085881l60186j86537k38913j31899l25440k16673k72046j32107j19985r3685
5430E008410o9105j45323j57917p5161M3898k37594j32429k4833q7952l378j88742
5419C929874j3070p1917k39938j2408M0639q4727j36650J1142O9863m8238l5993
5408C408577K2287k10938J08808J03153r9646j06934j22485J2261R3904r4734
5398C114253r255J20323r5638l3059M0432j5666m6950O468P5008J27346P1432
5387C354694m4321J39299J86068J09272J04437K00998J87103J30950K96181L03206
$$ plain form
5458 19757171 18275313 17069653 15879214 14947629 14070800 13156620 12570075 11810825 11222921
5449 11222921 10530776 9921499 9486255 9090632 8651592 8175513 7759584 7344453 7085881
5440 7085881 6725695 6539158 6300245 6168346 5842906 5626233 5354187 5222080 5102095 5008410
5430 5008410 4939305 4793982 4636065 4560904 4604802 4367208 4234779 4209946 4121994 4118616 3929874
5419 3929874 3916804 3844887 3604949 3592541 3633180 3548453 3411803 3422945 3492808 3444570 3408577
5408 3408577 3430864 3219926 3328734 3431887 3332241 3225307 3102822 3115083 3208987 3114253
5398 3114253 3104998 3225321 3129683 3096624 3137056 3121390 3074440 3080908 3155916 3283262 3354694
5387 3354694 3310373 3449672 3635740 3745012 3849449 4050447 4237550 4368500 4664681 4967887
5377D967887J36836J33337J964k93155m17824k67370j96168j37996j28978j00442
5367C698091j41089P9753Q5779M9893J70231P5187J51215K86810L64547K56805
5357E077222K37873K15834N14266N52942L97158O48732O05760K75965J95340j06669
5347H614423m50589n71397m63713o64552o87278m66003k88256k72399j11541j77665
5337D461030j80556j00074O8785N6689R606K57506K13476j2725M02375J94640
5327E370752L47389M14392L12021M86330M98907M06881K4107q2098j12970k42611
5317G423100m04069o29061o83532o85847m90030n20472l32311j90171j82150j40474
5307C164983j54058o2200p7026o9663P668O5519q3104J24961K12858J60395l4242
$$ plain form
5377 4967887 5104723 5238060 5240024 4946869 4529045 4261675 4065507 3927511 3798533 3698091
5367 3698091 3557002 3636755 3722534 3772427 3942658 4017845 4169060 4455870 4820417 5077222
5357 5077222 5315095 5530929 6045195 6598137 6995295 7644027 8249787 8525752 8721092 8614423
5347 8614423 8163834 7592437 7128724 6464172 5776894 5310891 5022635 4750236 4638695 4461030
5337 4461030 4280474 4180400 4249185 4305874 4315480 4572986 4786462 4773737 5176112 5370752
5327 5370752 5718141 6132533 6444554 6930884 7429791 7836672 7860779 7778681 7665711 7423100
5317 7423100 7019031 6389970 5706438 5020591 4530561 4010089 3677778 3487607 3305457 3164983
5307 3164983 3010925 2948725 2871699 2802036 2809704 2875223 2792119 2917080 3129938 3290333 3256091
5296C256091J44597J85408J42383J93867R1329j14581l5202l81041l36560l53329
5286B792962l10611k84515j65858m9178Q884j98854n9652p7970N9576l032k29830
5275A481922j31012Q4920L0320l1706k2931M8740q5064O2264M5947K00691j41660
5264A542431r4977j01485m6887N231q0518k5452j13372j1422K100L7958K6720
5253A140327l2739n9340J5309p1869o1664M4347L3165n5089j2915k7110J0475
5242I22897j29356N3025p2744J55847J09002j26015p4432M8185K0336K0646o4020
5231H63371O8745R4800J02642n9551j75820m9366m9288K8370O6942j11240L9296
5220H18901j68007K1494L4355l2750l7879p1853P9649O3585n348Q6664k8799N3113
$$ plain form
5296 3256091 3400688 3586096 3728479 3922346 4013675 3899094 3863892 3482851 3146291 2792962
5286 2792962 2482351 2197836 2031978 1982800 1991684 1792830 1733178 1655208 1714784 1711752 1481922
5275 1481922 1350910 1435830 1466150 1434444 1411513 1460253 1375189 1437453 1483400 1684091 1542431
5264 1542431 1447454 1345969 1299082 1304313 1223795 1198343 1084971 1073549 1075649 1113607 1140327
5253 1140327 1107588 1048248 1063557 991688 930024 974371 1007536 952447 939532 912422 922897
5242 922897 793541 846566 773822 929669 1038671 912656 838224 886409 906745 927391 863371
5231 863371 932116 1026916 1129558 1070007 894187 844821 795533 823903 890845 779605 818901
5220 818901 650894 672388 706743 673993 636114 564261 643910 707495 702147 788811 760012 813125
5208H13125n9142k0179k8842r956K2103k5880M650m6885L3002N7043l3068r4068
5196F11903P3643p4593m9836J38275K5234q4287K1543o838J06428k7019J5597
5185G50050o2942q6707L8850j6476K2176Q3719n6734j67858p6750J54915J17241
5174F99484N1174j376m7224r8626q1075M2803j03163Q6434m2345m8018Q9237J14766
5162F62071j47447M407l4235j00924j8598J83572J80633r5753k7680r9185q693
5151D98168k6586J3478r3048k01146N4436J64760j08438l935j5224k2549M4133
5140C04049l2125M238O555O3182M7232j08j18907p0920J2866J18395O9790k8958
5128C75289j909r7857j857o1595Q8411k2842j47594M1442Q889j8219l4505J30427
$$ plain form
5208 813125 753983 733804 704962 695006 717109 691229 695879 648994 681996 739039 705971 611903
5196 611903 685546 610953 561117 699392 724626 640339 661882 655044 761472 734453 750050
5185 750050 687108 600401 639251 622775 644951 728670 671936 504078 427328 582243 699484
5174 699484 750658 749282 702058 603432 522357 565160 461997 548431 506086 458068 547305 662071
5162 662071 514624 519031 484796 383872 365274 548846 729479 633726 606046 506861 498168
5151 498168 471582 485060 392012 190866 245302 410062 301624 297689 282465 259916 304049
5140 304049 271924 276162 282717 345899 393131 393023 274116 203196 216062 334457 404247 375289
5128 375289 373380 275523 273666 212071 300482 277640 130046 171488 180377 162158 127653 258080
5116B58080j7587q2840m3209N3346J13790j7165j37131j4007j4505l1647K5379
5105I2504K7014R9824m2120q0862n6802J9660L5815O8254n1321Q2843N1819m1482
5093B05146l8761k4593P1203p0083k7918J21636L2085j3086k7377J0654q6029
5082A52877j1555J64620J7787N0945q5610m0063r938p4447K7009j27025J01554
5071A66154p092q5786N3241K7665J0753R0377O5225M7663j01106m6461J2291r4389
5059A38535q8006M1192N1110j5169n5347J18428n873o7250K475J9930J32671N2503
5047C25199k18959O1510N8902m3779K3717L7007m6211n3028j0910J97549m0064
5036B90933N159K8012r9291k2630q0184M5445q3177R82o6025J66784O3587k3791
$$ plain form
5116 258080 240493 157653 114444 167790 281580 264415 127284 113277 98772 67125 92504
5105 92504 119518 219342 177222 96360 39558 59218 95033 163287 111966 194809 246628 205146
5093 205146 166385 141792 212995 142912 114994 236630 268715 255629 228252 238906 152877
5082 152877 141322 305942 323729 374674 289064 249001 239063 164616 191625 64600 166154
5071 166154 159062 73276 126517 154182 164935 255312 320537 368200 267094 220633 232924 138535
5059 138535 50529 91721 142831 127662 72315 190743 184870 117620 120095 140025 272696 325199
5047 325199 106240 167750 226652 182873 206590 243597 197386 144358 133448 330997 290933
5036 290933 296092 324104 224813 202183 121999 167444 84267 85249 19224 186008 249595 225804
5024B25804p2618N1077j3609m4797J0487L4388q846l4031q0996m6011M803L0520
5012E6171r0162Q6759R6616o5087q0567M441J27776m494p0802p6831K0112N8295
5000F2227j7904K2050M0641L8619J7409p6142j4394r3878L9811L3005q8260q5519
4988a22335R8050K03634j7457l1277p0950K4457K9600L8197q425p0409J6410o13
4976H8882L4782k0788l3580J5084l4505n4279j01233N1554J50484P8739j5330
4965A59810m6690r13j01503Q6460J85520k02515K3655J34648L9388q6434j14888
4954G6538j61814K5844Q1866J61312L8561o5067k0019q399J3067M407J06887j4394
4942B38789p5114L2219L0183N5494j01209m1358j28J4O0895j3872j7009k7747
$$ plain form
5024 225804 153186 204263 190654 145857 156344 190732 181886 147855 66859 20848 25651 56171
5012 56171 -33991 52768 149384 84297 3730 8171 135947 131453 60651 -16180 3932 62227
5000 62227 44323 66373 107014 145633 163042 86900 72506 -21372 18439 51444 -36816 -122335
4988 -122335 -24285 179349 161892 130615 59665 84122 113722 151919 143494 73085 89495 88882
4976 88882 123664 102876 69296 84380 49875 -4404 -105637 -54083 96401 175140 159810
4965 159810 113120 112207 10704 97164 282684 80169 103824 238472 277860 191426 76538
4954 76538 -85276 -59432 22434 183746 222307 157240 137221 128822 141889 146296 253183 238789
4942 238789 163675 195894 226077 281571 180362 139004 138876 138890 199785 185913 168904 141157
4930A41157K218N3374K6006J8057j8447m3383R0944N5847m6952p7897M4115q3050
4918A61989o3131R5784L7400K527m9106J1183N4891m9349m7131L9914o7383j9629
4906A07959L9512n9373K610m2425j4703L8772R6013J7333j35693K3437R7330k919
4894A67853J8236p0109n1195J47678o296r5114N7674j14246J28250O5477m265
4883B43943r402O3887l5909k4970j8550J71081j4812j73658N4899j3779J24086
4872C66816o8824p7154J26530j6452O8393L8582j0623q1437M8512n793l1971L2440
4860C89019l6280q9135J3461p0717m0660j2337J32398P8222j7592n6306o5546
4849B24527j4928O3732O8042j5975L2922M0992q0906q722M1929L7058P7287m4160
$$ plain form
4930 141157 143375 196749 222755 240812 222365 178982 269926 325773 278821 200924 245039 161989
4918 161989 98858 194642 232042 234569 185463 196646 251537 202188 155057 194971 127588 107959
4906 107959 147471 88098 90708 48283 33580 72352 168365 185698 50005 73442 170772 167853
4894 167853 186089 115980 64785 212463 206167 111053 168727 54481 182731 248208 243943
4883 243943 234541 298428 262519 237549 218999 390080 375268 201610 256509 242730 366816
4872 366816 297992 220838 347368 330916 399309 437891 427268 345831 394343 388550 356579 389019
4860 389019 352739 263604 277065 206348 165688 153351 285749 363971 346379 290073 224527
4849 224527 209599 273331 341373 325398 358320 399312 318406 309684 351613 388671 465958 421798
4837D21798J03501K0299j13532n8270k1738J7757L7088M1831N1707J4223l6479
4826D78185j56132j3182N6262n394L8142J43702n8789j1685o630P735j3452N9153
4814E17915K7626L9141P3124n0567r4415J02028J74459j5638j30211Q9782J47473
4803H80717j974N3878N1967P3839M1769Q1331P2710L1132q0795M0812K7994J60895
4791A434275J25343j9720Q6991J52802N1831O45J9099n1032L20089K35208J65171
4780B520702J32200K46013M17205L79973M54890O61269N36920O11477Q09305Q92522
4770G662476R29182J016010L59892l68793r38659j498789j452689j274400p68084
4761C666146m85018m76022k67240k11576k46034j71902j22332k08567n6451K0849
$$ plain form
4837 421798 525299 545598 432066 373796 352058 369815 406903 448734 500441 514664 478185
4826 478185 322053 308871 365133 359739 397881 541583 482794 471109 464479 472214 458762 517915
4814 517915 545541 584682 657806 607239 512824 614852 789311 773673 643462 733244 880717
4803 880717 878743 932621 984588 1058427 1100196 1181527 1254237 1285369 1204574 1245386 1273380 1434275
4791 1434275 1559618 1539898 1626889 1779691 1831522 1832167 1851266 1800234 2120323 2355531 2520702
4780 2520702 2652902 2898915 3316120 3696093 4150983 4812252 5349172 5960649 6769954 7662476
4770 7662476 8591658 9607668 9967560 9598767 8660108 7161319 5708630 4434230 3666146
4761 3666146 3181128 2705106 2437866 2226290 1980256 1808354 1686022 1477455 1421004 1441853
4751A441853j12296k2230m7775K9585k7042Q70N5358j37360j32680L3401J41622
4740A223306j21086j9403N355P9540J00653k827n3309m5318M6250Q0753J4866
4729A308780R1532L489J9223R037o6100n6263O2676J68464J85827M7619m2111
4718A732173J11447J5741J36166J81289J08950O8424L25500L61725L25379L13646
4708C680440K93463N49889O92108P23197O37823R03052R52555O74513J32544l70652
4698H868932o91406j209497j372186j216847q98343o34103k85425k83726k38512
4689B038887k86746q9992j77746p0683j38264j15727j40007J4465m7792j11010
4679H75385n577j42386j56495Q4420N7303R939M3665p8904m1931n269l5097n3676
$$ plain form
4751 1441853 1329557 1307327 1259552 1289137 1262095 1262965 1318323 1180963 1048283 1081684 1223306
4740 1223306 1102220 1082817 1088172 1167712 1268365 1265538 1212229 1166911 1213161 1293914 1308780
4729 1308780 1400312 1403801 1423024 1432061 1365961 1309698 1372374 1540838 1726665 1774284 1732173
4718 1732173 1843620 1859361 1995527 2176816 2285766 2354190 2679690 3041415 3366794 3680440
4708 3680440 3973903 4523792 5215900 5939097 6576920 7479972 8432527 9107040 9239584 8868932
4698 8868932 8177526 6968029 5595843 4378996 3480653 2846550 2561125 2277399 2038887
4689 2038887 1752141 1662149 1484403 1413720 1275456 1159729 1019722 1034187 986395 875385
4679 875385 869808 727422 570927 655347 712650 722589 766254 687350 645419 640150 605053 551377
4667E51377N4608r6012M1491J18400j222j92701Q4751M4689r9003K3267m3153
4656D86492n2744o6583r825j6446N2803N5275l0733K7379r0100K1945P2197l920
4644D45740J00927l6760p3510j3167O6415J7591j04241l1893M0135K9786N3385
4633D94408m1461m4554m6745R6300K1580p9777l8779K3563j05867K7107O0501
4622C66276o1534R7588J0158j6390K0011p9878N216P7716r2376l851K6122P4442
4610D23500r677l766m4168L8342O4555j62993j03443J08840p4734k8829O458Q6117
4598C00202J10993J1597q9206j11343R702P9166R2978n3551P8058L6488j49021
4587C16063q5734J38365n1571m6346K1892o9649K0543m9081n667J19156J16996
$$ plain form
4667 551377 605985 509973 551464 669864 668642 475941 560692 605381 506378 529645 486492
4656 486492 433748 367165 357340 340894 393697 448972 418239 445618 355518 377463 449660 445740
4644 445740 546667 509907 436397 423230 489645 507236 402995 371102 411237 441023 494408
4633 494408 452947 408393 361648 457948 479528 399751 360972 384535 278668 305775 366276
4622 366276 304742 402330 412488 396098 416109 336231 341447 419163 326787 322936 349058 423500
4610 423500 413823 410057 365889 404231 468786 305793 202350 311190 236456 207627 214085 300202
4598 300202 411195 422792 333586 222243 231945 311111 404089 350538 428596 465084 316063
4587 316063 230329 368694 317123 270777 292669 223020 243563 194482 188815 307971 424967
4576D24967J35551L5718j75806r6358N0098R5826n138j1474N2933k1677k903j0453
4564D71284l1774J8553P2763M1885P7442J0716r2073n9350N4305n3008m6367k4831
4552D39545k0748K0206O8203n8928J15626P226p6647P3317O2616j35106r863J45527
4540F30974M5851K0610m4566k2814j98401Q9826J15297r2200L474J84973j02587
4529F30437j6640n3150j5949l488P2631L1523M7906N150k2457l6583M3654j29792
4517E53242J6998J30297n104O3290O7869m9583l2259R0282r4019m8177Q9622n001
4505G77457r5789k1353L659O0836O9833n4987l1901R2966J28079l9558n9102q6351
4493G43789J18830L261p1350J3949R3366j2638L1518j2300j27549N9933r0701
$$ plain form
4576 424967 560518 596236 420430 324072 374170 469996 464858 453384 506317 484640 481737 471284
4564 471284 439510 458063 530826 572711 650153 660869 568796 509446 563751 510743 464376 439545
4552 439545 418797 439003 507206 448278 563904 571130 494483 567800 630416 495310 485447 630974
4540 630974 676825 697435 652869 630055 431654 521480 636777 544577 548051 733024 630437
4529 630437 613797 560647 544698 541210 613841 645364 693270 698420 675963 639380 683034 553242
4517 553242 570240 700537 695433 758723 826592 777009 744750 835032 741013 692836 782458 777457
4505 777457 681668 660315 663974 724810 794643 739656 707755 800721 928800 889242 830140 743789
4493 743789 862619 865880 794530 808479 901845 889207 920725 908425 780876 840809 750108
4482G50108O918J37599J5776N0953m2158j2684J47228p7211m1860J5693l2794
4471I17568P3798O4388r089o329R0458Q109j4012N1123j0769J21936r5145j3199
4459A178837M0913J13657N3179Q5902M30k3414q4982J08645j27619J4080M7659
4448A407287L9314j3922O8276O4059M308J14697L3864j391n6292P6488J45852
4437A882540Q9911J37234J13292J19158J87148J15538K43689J97410Q6460m97
4427C171883J9542j95579l51721k19232k35354r4542j26537m5641o2587o5816
4417A794416J16475m4378o5795Q2469k0717N1198o1758O2294J22115p6271p1551
4406A888497o4868J23799J77040Q2451m6597L8739P3467J7847l3772j01617R438
$$ plain form
4482 750108 757026 894625 910401 961354 919196 906512 1053740 976529 934669 950362 917568
4471 917568 991366 1055754 1046665 1040336 1130794 1138903 1124891 1176014 1165245 1287181 1192036 1178837
4459 1178837 1219750 1333407 1386586 1472488 1472918 1449504 1364522 1473167 1345548 1359628 1407287
4448 1407287 1446601 1432679 1500955 1565014 1569322 1684019 1717883 1716492 1660200 1736688 1882540
4437 1882540 1972451 2109685 2222977 2342135 2529283 2644821 2888510 3085920 3172380 3171883
4427 3171883 3191425 2995846 2644125 2424893 2189539 2094997 1968460 1922819 1860232 1794416
4417 1794416 1910891 1866513 1800718 1883187 1862470 1913668 1851910 1914204 2036319 1960048 1888497
4406 1888497 1823629 1947428 2124468 2206919 2160322 2199061 2272528 2290375 2256603 2154986 2164424
4395B164424J87660j20680K2865R4068o7787J02355Q1259K7589n760J7650o4682
4384B438961J03631m598R4472J54013K7570k8521O7664N037J03982k8902q1467
4373B851842J52049J2752j2400l6584Q0201m4068M4836M8502N7368k8313m4029
4362C082156K347J36090R4853k8113Q1129q0563J00738P3775l6066l9212P1427
4351C458561J01896Q8823K14251r6264O6593J28098O92j1887O8424m0243J34688
4340D113632P1282L2806l7151J08772P8051R3955j03321Q2668P7823O4543k6503
4329D556557P9698L2759O2158P8835J10769J84487J47709L6102p7223J09001J00177
4318E421029J19106m6867K4794J94113R2653q1798N8204R7760O8678N2686q2085
$$ plain form
4395 2164424 2352084 2231404 2254269 2348337 2280550 2382905 2464164 2491753 2485993 2503643 2438961
4384 2438961 2542592 2537994 2632466 2786479 2814049 2785528 2853192 2858229 2962211 2933309 2851842
4373 2851842 3003891 3016643 3004243 2967659 3047860 3003792 3048628 3097130 3154498 3126185 3082156
4362 3082156 3084503 3220593 3315446 3287333 3368462 3287899 3388637 3462412 3426346 3387134 3458561
4351 3458561 3560457 3649280 3863531 3767267 3833860 3961958 3962650 3950763 4019187 3978944 4113632
4340 4113632 4184914 4217720 4180569 4289341 4367392 4461347 4358026 4440694 4518517 4583060 4556557
4329 4556557 4636255 4669014 4731172 4810007 4920776 5105263 5252972 5289074 5211851 5320852 5421029
4318 5421029 5540135 5493268 5518062 5712175 5804828 5723030 5781234 5878994 5947672 6000358 5918273
4307E918273J7102K8739l2824Q2488J25054R0052q8332k6369Q6676J58486J0143
4296F369488p791Q2086L0786m4494N4530J43178K3490l3191M976N8571J53115
4285F834744J01562J02629M0095R7903J5102J65114J79788R8568Q3890O951P7602
4274G803948J90033J41742R9138J09541J76245J63561J90865J04835K43004J20420
4264I343332K94203K86001R0045K09429K39108L56622L55503K99272L05361K63165
4254A2042041M29620M17464K16248L68771N39094L61934M18106N34692M84886
4245A5812856O69495N72457N63161O57959P56633Q30566Q23295J007907Q29229
4236B2523558Q63109J028221Q51931R33730R63114R56431Q70320R84135Q53382
$$ plain form
4307 5918273 5935375 5964114 5931290 6013778 6138832 6228884 6140552 6114183 6200859 6359345 6369488
4296 6369488 6361697 6443783 6474569 6430075 6484605 6627783 6651273 6618082 6623058 6681629 6834744
4285 6834744 6936306 7038935 7079030 7176933 7192035 7357149 7536937 7635505 7719395 7726346 7803948
4274 7803948 7993981 8135723 8234861 8344402 8520647 8684208 8875073 8979908 9222912 9343332
4264 9343332 9637535 9923536 10013581 10223010 10462118 10818740 11174243 11473515 11778876 12042041
4254 12042041 12471661 12889125 13105373 13474144 14013238 14375172 14793278 15327970 15812856
4245 15812856 16482351 17054808 17617969 18275928 19032561 19863127 20686422 21694329 22523558
4236 22523558 23386667 24414888 25266819 26200549 27163663 28120094 28990414 29974549 30827931
4227C0827931Q40054P08037P37821P25789O43684N83381O22111P72390P63464
4218C7224662P55309O71351O65225Q46639R36210O99710Q80158R28995P95625
4209D4403884O83843N13496L68364L73961P4530j26162k08581m00656n68793p21553
4199D4392333p48266n48615o95392q74054o32040l89262l04951k60389k01817
4190C9737547j68227m9180L454j72128Q6617J87984K72377J38618J59202K69024
4180D0465288M52138N04637M83142M96218M82662N64354P61849O14110M98165
4171D5322563O50054O37996Q52757Q70266Q86884J216433J470746J552697J941014
4162E5401410K255890K519848K789594L116666L536158M121689M712456N549019
$$ plain form
4227 30827931 31667985 32376022 33113843 33839632 34483316 35066697 35688808 36461198 37224662
4218 37224662 37979971 38651322 39316547 40163186 41099396 41799106 42679264 43608259 44403884
4209 44403884 45087727 45601223 45969587 46343548 46418078 46291916 46083335 45682679 45113886 44392333
4199 44392333 43644067 43095452 42400060 41526006 40893966 40504704 40199753 39939364 39737547
4190 39737547 39569320 39520140 39523594 39351466 39438083 39626067 39898444 40037062 40196264 40465288
4180 40465288 40917426 41422063 41905205 42401423 42884085 43448439 44210288 44824398 45322563
4171 45322563 45972617 46610613 47463370 48333636 49220520 50436953 51907699 53460396 55401410
4162 55401410 57657300 60177148 62966742 66083408 69619566 73741255 78453711 84002730
4154H4002730O381447P593125R091609J0916973J3524139J6563708J9430942K1395761
4146A88900434K3318077K6262708L0643955L4552631L4668762K1665519n557751
4139C54454335l5008256n4340429n4259862m3259458l1408847k2160480j6111431
4132I7905572j2165457r704979p963322o630429n281319m214687l483193k796923
4124D5665263k758676k841165k629570k407990k174713j759270j643668j500975
4116B7949236j261066j075573j022672r62279q70621q54848q70267p92306p02726
4107A9536878m52237n26341p50876n36412o03162n18740n58816o07744n31864
4098A4450686m99453l62062l03905l61759k78124l73239l44481j63917j16885
$$ plain form
4154 84002730 90384177 97977302 107068911 117985884 131510023 148073731 167504673 188900434
4146 188900434 212218511 238481219 269125174 303677805 338346567 360012086 354454335
4139 354454335 319446079 265105650 210845788 167586330 136177483 114017003 97905572
4132 97905572 85740115 76035136 68071814 61441385 56160066 51945379 48462186 45665263
4124 45665263 42906587 40065422 37435852 35027862 32853149 31093879 29450211 27949236
4116 27949236 26688170 25612597 24589925 23627646 22757025 21902177 21031910 20239604 19536878
4107 19536878 19084641 18558300 17807424 17271012 16667850 16149110 15590294 14982550 14450686
4098 14450686 13951233 13589171 13285266 12923507 12645383 12272144 11927663 11763746 11646861
4089A1646861j07176j61667k34487j89567j62761j41509k72536k47418k45867
4080I883873l36632j54785j83758r7133j96562j55711l9440J33911o364k3506
4070H823893M0355m0581j46875k34332j27190k29024j58246p2896k20873j55597
4060G478634k6975j15270o2708j02257p2469j01749n9113k9786m2433m4423j73898
4049F647553j15332O9330r566j2642j7340j08253p8368J15535J4700j8238J48568
4038F635947N4440m9425N9144N1213n7267N0000j45911J02238J94428N5169J03214
4027G053190P9479o1081Q9710J27325k2289K29109J06381J59463K8321J92901
4017G982509K11289L01843J55262J92385m5771M5851J05043j44757J42459o177
$$ plain form
4089 11646861 11539685 11378018 11143531 10953964 10791203 10649694 10377158 10129740 9883873
4080 9883873 9547241 9392456 9208698 9111565 8915003 8759292 8719852 8853763 8847399 8823893
4070 8823893 8864248 8823667 8676792 8442460 8315270 8086246 7928000 7855104 7634231 7478634
4060 7478634 7451659 7336389 7273681 7171424 7098955 6997206 6938093 6908307 6865874 6821451 6647553
4049 6647553 6532221 6601551 6591985 6579343 6562003 6453750 6375382 6490917 6505617 6487379 6635947
4038 6635947 6690387 6640962 6700106 6751319 6694052 6744052 6598141 6700379 6894807 6949976 7053190
4027 7053190 7132669 7071588 7161298 7288623 7266334 7495443 7601824 7761287 7789608 7982509
4017 7982509 8193798 8495641 8650903 8843288 8797517 8843368 8948411 8803654 8946113 8939936
4007H939936k3840K59951P6648J8524O9481K3194R0260L80597K56889K6916K45948
3996A0364504K97901K58036K87490J39778R4572L84932M13386L07066M11699M89762
3986A3449126N84626O70922O34765O64308Q13424Q33121O76748N17596N73939
3977A9418575O63108P67144Q25451J066627J243820J345441J421778J171684N81917
3968B8505545k92405j014215j124518q65756m65721k32662k2855L18224N98874
3959B5404511O22194Q24095R71394J186551J498764J589178J794182J918409K101887
3950C7911165K319005K810128L211951L560948M005406M539556M732749M279917
3942F7370825K430069j051147m539352o178862n961868m748817l558913k443800
$$ plain form
4007 8939936 8916096 9176047 9252695 9271219 9340700 9363894 9454154 9834751 10091640 10118556 10364504
3996 10364504 10662405 10920441 11207931 11347709 11442281 11827213 12240599 12547665 12959364 13449126
3986 13449126 14033752 14704674 15339439 16003747 16817171 17650292 18327040 18844636 19418575
3977 19418575 20081683 20848827 21674278 22740905 23984725 25330166 26751944 27923628 28505545
3968 28505545 28213140 27198925 26074407 25208651 24742930 24510268 24487413 24805637 25404511
3959 25404511 26026705 26850800 27822194 29008745 30507509 32096687 33890869 35809278 37911165
3950 37911165 40230170 43040298 46252249 49813197 53818603 58358159 63090908 67370825
3942 67370825 69800894 68749747 64210395 58031533 52069665 47320848 43761935 41318135
3934D1318135j572212r71338n35152R34K05086M59990R91321J293554J772882
3925D2963200K181771K502370K942304L499689M101539M430187N111015N649288
3917G3381363O108357N699124L850613J94477m185722q041865r445982q429495
3909E9130870o888469n271292l656919k663185k007620j355656r25372n82414
3901C5779943j52068P9836M96732R58479J206174J479113J900708K158130K447005
3892D6354052L047099L367942L543010L641954L140411J275188j783685m490683
3884E8095288o259085o363163n255617m126209l105911k350195j878013j459267
3876B7297828j108861j103774r58390p35793n82907n12758l32390j78171k0725
$$ plain form
3934 41318135 39745923 38774585 38239433 38240367 38445453 38905443 39896764 41190318 42963200
3925 42963200 45144971 47647341 50589645 54089334 58190873 62621060 67732075 73381363
3917 73381363 79489720 85188844 89039457 89233934 85048212 77006347 67560365 59130870
3909 59130870 52242401 46971109 43314190 40651005 38643385 37287729 36362357 35779943
3901 35779943 35627875 35707711 36204443 37162922 38369096 39848209 41748917 43907047 46354052
3892 46354052 49401151 52769093 56312103 59954057 63094468 64369656 62585971 58095288
3884 58095288 51836203 45473040 40217423 36091214 32985303 30635108 28757095 27297828
3876 27297828 26188967 25085193 24126803 23391010 22808103 22295345 21962955 21784784 21764059
3867B1764059P7863k1548J53940K81957L22709M71399M88492J85759m86713j100838
3857B2137079j756711j885339j637225j318354j032804p13981n37201p10416p59126
3848A1785922p51491p28251o76405p07575m35431k99093l73223n31175l26596
3839F956682k15398k28713j95995r9094k53811j09475j63751n8696j09359k98322
3829E224068j3735m0980k54610j55123j08215j39885l6262j57455j36599j24795
3819D056409m3679o8628j73227p7253j03787k1810q0037l2830r6807p680l04R7149
3807C447516n2080j57551m531K2277p7960n1141Q1275J5913p3332m0362l238L3134
3795C139920O942o5199J24278J41733P5042n1402j69729j26486K1415j5855j59043
$$ plain form
3867 21764059 21841922 21820374 21974314 22256271 22578980 23050379 23538871 23724630 23237917 22137079
3857 22137079 20380368 18495029 16857804 15539450 14506646 13792665 13255464 12545048 11785922
3848 11785922 11034431 10306180 9629775 8922200 8486769 8187676 7814453 7283278 6956682
3839 6956682 6741284 6512571 6316576 6217482 5963671 5854196 5690445 5631749 5522390 5224068
3829 5224068 5210333 5169353 4914743 4759620 4651405 4511520 4475258 4317803 4181204 4056409
3819 4056409 4012730 3944102 3770875 3693622 3589835 3568025 3487988 3455158 3358351 3350671 3350367 3447516
3807 3447516 3395436 3237885 3233354 3255631 3177671 3126530 3207805 3223718 3150386 3110024 3106786 3139920
3795 3139920 3146862 3081663 3205941 3347674 3422716 3371314 3201585 3075099 3096514 3080659 2921616
3784B921616J44568J5221p4030K2407L8036K979j00735M4418P2337P7289n5704
3773C108402J22965J53588O1181J81805K22018J7477K63092K65128P2148j45273
3763D322531o5154l28563k71290k24649k31161j88245l6788r9244Q7876m4383
3753B920930q9243N5742K4641J31580J36442J90618k9462J77453J61585J29060
3743C809346K52605L30126R8583L03611R8122o7046p9356k69830l91026m93403
3733C591732k56420j85065l45971j93916m1086k7344n1488j00192n2669N2234
3723B389815o9615K40634J24990K1872K1324m4081J37032J64290P2410J68820
3713C227491K49423K0047j41660j79931j74295k77163k66315j63371r5073j69721
$$ plain form
3784 2921616 3066184 3081405 3007375 3029782 3067818 3070797 2970062 3014480 3086817 3164106 3108402
3773 3108402 3231367 3384955 3446136 3627941 3849959 3867436 4130528 4395656 4467804 4322531
3763 4322531 4257377 3928814 3657524 3432875 3201714 3013469 2976681 2877437 2965313 2920930
3753 2920930 2831687 2887429 2912070 3043650 3180092 3370710 3341248 3518701 3680286 3809346
3743 3809346 4061951 4392077 4490660 4794271 4892393 4825347 4745991 4476161 4085135 3591732
3733 3591732 3335312 3150247 2804276 2610360 2569274 2541930 2490442 2390250 2337581 2389815
3723 2389815 2320200 2560834 2685824 2707696 2729020 2684939 2821971 2986261 3058671 3227491
3713 3227491 3476914 3496961 3355301 3175370 3001075 2723912 2457597 2294226 2199153 2029432
3703B029432j23641n1502j1927O3j68737p9867L3515j56849l0251K7695n258m7583
3691A415090J47909J26577o9179o7930M4604k8721P6863o8365n5928l0368m4243
3680A446309p056J5602j30554n4717o9465p4902j19248m9513K5393P092L8705
3669A027646R7837l5821n0947M644R493r9217k24693J33646K3791K2551m4439
3658H64491N3604O9962p7526P4033J15267J897j21130O9037O7973o9610j23057
3647I24941l7762o9702p3713L35j8920O427j5895l2615q8735J2616Q2835J506
3635F91318J01488j3145p3532Q0283L7575Q1175l8692j16847K4323J27815j26627
3624G75134J05588j26232j23984m535j2498l3770J6528o8923q2778L2584j27329
$$ plain form
3703 2029432 1905791 1854289 1842362 1842425 1673688 1593821 1627336 1470487 1440236 1467931 1462673 1415090
3691 1415090 1562999 1689576 1620397 1552467 1597071 1568350 1645213 1576848 1520920 1490552 1446309
3680 1446309 1439253 1454855 1324301 1269584 1200119 1125217 1005969 956456 981849 988941 1027646
3669 1027646 1125483 1089662 1038715 1043359 1052852 953635 728942 862588 886379 908930 864491
3658 864491 918095 988057 910531 984564 1099831 1101728 980598 1049635 1117608 1047998 924941
3647 924941 887179 817477 743764 744099 725179 731606 715711 683096 594361 606977 689812 691318
3635 691318 792806 779661 706129 786412 823987 905162 866470 749623 773946 901761 775134
3624 775134 880722 754490 630506 625971 613473 579703 596231 527308 444530 477114 349785
3613C49785J17065J25231j04832r997j561j418o0991l9891P7621k3614K9953K1080
3601D78431l3028J44716J576j93363P297P0929m7712r6098n326j35630L3694J34778
3589C60264m112N6973m8620L0573o6136J6850J67094m8627j24834r4494J408R015
3577B55354K4871Q6549K8358L7419n1320k9027J6562o3419m1243M6212J4613k3567
3565C01362K1398M1428k3632K3019j0402m248P6746l4835N6203J1553N2160q8334
3553D22418q5902o1596k4043J23717J0902j55958l2233J4190K6013J16542J7820
3542C71870j14828j61854N8118J42269j7832o8061J6134Q7331n4490j2427M3856
3531B90086j60745J52275M108K0558Q8436N6310L810k9435m1160K2144M7903j27155
$$ plain form
3613 349785 466850 592081 487249 477252 475691 474273 413282 373391 451012 427398 457351 478431
3601 478431 445403 590119 591695 398332 405629 476558 428846 332748 327422 191792 225486 360264
3589 360264 356152 413125 364505 395078 328942 345792 512886 464259 339425 244931 246339 255354
3577 255354 280225 366774 395132 432551 381231 352204 368766 305347 264104 310316 324929 301362
3565 301362 322760 364188 340556 363575 353173 348925 425671 390836 447039 458592 510752 422418
3553 422418 336516 274920 250877 374594 385496 229538 197305 211495 237508 354050 371870
3542 371870 257042 95188 153306 295575 277743 209682 225816 313147 258657 246230 290086
3531 290086 129341 281616 285724 306282 394718 451028 454838 425403 384243 406387 454290 327135
3519C27135o0158J5126J10335j67935K5163L9220j52059N5946M3703j76799l7470
3508B2207R5179l0128p9714J31745K34078l1487j55807p4353J9928M3108n3556
3497A21200K7803N1234j29721q3606k7863o9597J41116J24662k4883q0724j2097
3486C7524m431J03658L9378o2975J87654l8969k2306m8604j71326J5338n2505
3475a7564m6570Q4290M7050k9642K7251M9422Q0466r2719p9515Q2882J24374K6534
3463B56259q1954j18203l3611o9569O9820M8304n8945Q897J7123p805Q4617M4673
3451A59606m0194n92j09336j4660J5186J8363K4588Q0106o3211j18241O0817J06765
3439A19197m9792J0735j2422K7633O3342j53402j24731K1800N1426J11110J4622
$$ plain form
3519 327135 266977 282103 392438 224503 249666 288886 136827 192773 236476 59677 22207
3508 22207 117386 87258 7544 139289 373367 341880 186073 111720 131648 174756 121200
3497 121200 149003 200237 70516 -13090 -40953 -110550 30566 155228 130345 49621 37524
3486 37524 33093 136751 176129 113154 300808 261839 239533 190929 19603 34941 -17564
3475 -17564 -64134 20156 67206 37564 64815 114237 194703 101984 22469 105351 229725 256259
3463 256259 174305 56102 22491 -47078 22742 71046 12101 20998 38121 30316 114933 159606
3451 159606 119412 118820 9484 -5176 10010 28373 52961 133067 69856 -48385 12432 119197
3439 119197 69405 80140 67718 95351 158693 5291 -119440 -97640 -46214 64896 79518
3428G9518k5247l1969r2263J11374j9862J2781K2564l1457p073p0109O6380J10360
3416A24997N2391j7061p0425o4545j24530K9379k7499J19015J04207j5858k7776
3405H2295j04905N119k3690p000N5267m8511L4124k1894J3799j4898k0540J41253
3393I0419J1991n9489j26989J00669K0320p5045O3152n3801o9279O6981J64889
3382A33818J2473q8024J05484q5489r349m5899K7477j16493R9724M3729K6863
3371A04314o4754j06601Q7010L573L4000M1666p524j8722J22967j18482r8303
3360b0856q8070N6005j8488J00080L3540J3220J01892l1219p3314k2138R4476
3349A45128L2864j9829m3459o5812k7357J78309L5801M2396n7650L105k3871l1500
$$ plain form
3428 79518 54271 22302 -69961 41413 21551 34332 56896 25439 18366 -51743 14637 124997
3416 124997 177388 160327 89902 25357 -99173 -69794 -97293 21722 125929 110071 82295
3405 82295 -22610 -17491 -41181 -48181 7086 -41425 -7301 -29195 -15396 -30294 -50834 90419
3393 90419 102410 42921 -84068 16601 36921 -38124 25028 -28773 -98052 -31071 133818
3382 133818 146291 58267 163751 78262 68913 23014 50491 -66002 33722 77451 104314
3371 104314 39560 -67041 19969 23542 57542 99208 91684 72962 195929 77447 -20856
3360 -20856 -108926 -52921 -71409 28671 62211 75431 177323 146104 72790 50652 145128
3349 145128 177992 158163 114704 48892 21535 199844 235645 278041 220391 223496 199625 168125
3337A68125m9613Q5273R0829j51611j28656J76607J55443p7584N4165m1836m9490
3326B31652j9581j17587O1592K1191n7686J08377K159M4139j0498j03Q91k6200
3314B38346M0978K0349R5317j17117m837J34567K7130o1737m2144N2493l4709
3303C48636o501k0478q583L3272L0084N2731J22400n8054r1077J9190J2444j08192
3291C25872o9548M1456n9812J1102J21706m8603Q2191k6228R8606R2414p2146
3280D97010n3853m5255p4029J16670R6080p3352K2389j307R0291j19967J15850
3269E70527K31286o5618p0597j75942J56509J01296r9635j84876q643J49612M7214
3258F51133k9844N386j0317r575N8931M4759M4783q6821P8128o4938l3369J73306
$$ plain form
3337 168125 118512 203785 294614 143003 14347 190954 346397 268813 322978 281142 231652
3326 231652 212071 94484 156076 177267 119581 227958 230117 274256 263758 263655 264546 238346
3314 238346 279324 299673 394990 277873 273036 407603 434733 372996 330852 383345 348636
3303 348636 342135 321657 313074 346346 376430 429161 551561 493507 402430 421620 434064 325872
3291 325872 256324 297780 237968 249070 370776 322173 404364 378136 476742 569156 497010
3280 497010 443157 397902 323873 440543 536623 463271 485660 484353 574644 454677 570527
3269 570527 801813 736195 665598 489656 646165 747461 647826 462950 454307 603919 651133
3258 651133 621289 626675 616358 606783 665714 710473 755256 668435 746563 681625 648256 821562
3246H21562o145P0940L2236J21458R7584l6105p9653M3769K18427n7658j60926
3235A065489L7413l4973M4948j83083j67871p5739q3022P4137j04979l8987Q2989
3224F16322j18948j30181K0089q5791L9425N1175P2756J2462j12734O2651J16544
3213E43770j18846K4420n3130M7849N7151l1604j1128J12938J28696J12826n513
3202H07429j51117p1567k51226j90106J60425j0475l4760r5111L8901J61312p8839
3191B84866j46489p7078L0346N1598J45363N2689j46182l2707P392R1576Q7581
3180C48955j1300M0833o3940n4657k1746q8209M9536R0944R0076j19254o2997
3169A98241q8669j16776P4326J14280m688m9281m2331k4781P5061J1473p52p6226
$$ plain form
3246 821562 815417 886357 918593 1040051 1137635 1101530 1021877 1065646 1284073 1226415 1065489
3235 1065489 1102902 1067929 1112877 929794 761923 686184 603162 677299 572320 533333 616322
3224 616322 497374 367193 387282 301491 340916 392091 464847 477309 364575 427226 543770
3213 543770 424924 449344 396214 444063 501214 469610 458482 571420 700116 812942 807429
3202 807429 656312 584745 333519 143413 303838 293363 258603 163492 202393 363705 284866
3191 284866 138377 61299 91645 143243 288606 341295 195113 162406 169798 261374 348955
3180 348955 337655 378488 314548 259891 238145 149936 199472 290416 380492 261238 198241
3169 198241 109572 -7204 67122 181402 176714 127433 85102 60321 135382 146855 146103 69877
3157F9877O3277r638j02912m6824K9624L6090o505k8071k9588n0270J13593m274
3145C4379l7102L5321J34879j01879r3270m6722P4299J05336L4964N0879m4965
3134A46119N3220j64699q2127p726K8437J9451J34520o9623o6504M0782n5945
3123b4095K0883j0884Q0207m3532j31782p4328Q8267K0778M4442Q0407p6372m4926
3111g0935N1047o3777R1359j08375O7437N2075p2896O9057o3834K1870l9414p6975
3099a43361O7625P7422J6171O0443p1845o5255m8180l0818O7726j4153J38636
3088E4411l9512l5827L8819n5754L5750J3845L3444j39585j438Q6281N71j21269
3076a30264o261J72479q4127q2907R6657n9384J27769L0207k3349j23279j31404
$$ plain form
3157 69877 133154 123516 20604 -26220 3404 39494 32989 4918 -24670 -74940 38653 34379
3145 34379 -2723 32598 167477 65598 -27672 -74394 -95 105241 140205 191084 146119
3134 146119 199339 34640 -47487 -55213 -26776 -7325 127195 57572 -8932 31850 -24095
3123 -24095 -3212 -14096 66111 22579 -109203 -183531 -95264 -74486 -30044 50363 -26009 -70935
3111 -70935 -19888 -83665 7694 -100681 -33244 18831 -54065 14992 -48842 -26972 -66386 -143361
3099 -143361 -75736 1686 17857 78300 6455 -58800 -106980 -137798 -70072 -84225 54411
3088 54411 14899 -20928 17891 -37863 -2113 11732 45176 -94409 -95847 -9566 -8995 -130264
3076 -130264 -136525 35954 -48173 -131080 -34423 -93807 33962 64169 40820 -82459 -213863
3065b13863J04874J20377q2558Q3626J05622q0188j35729M9869J23667o2817q2829
3054f9949l674Q7183j5791K28K9209q4768q2356K1017M8157o381p9018q4878Q9383
3041a51638m1851N4577N3352j00184J60504L2362m2338K8347J9796p1800m2488
3030a01361K393K587Q8329j14288M7385j77172l2429J45885N7664J3413n193J33171
3018F0384p7403j27528j36842K1281N2205J03177J82596p3569r9147M8402j5109
3007f1553p8348J5148J20449l3894k7932l9803P7101M3039m7340o3798M5341l5115
2995h6705j3557m1512q299r4452K83497n4538M9674j9642j46450K5632J54754
2984D8402o1089j38333j8682J0618l0586O1810N2376O4397J03282j69138L1619
$$ plain form
3065 -213863 -108989 11388 -71170 12456 118078 37890 -97839 -47970 75697 12880 -69949
3054 -69949 -73623 13560 -2231 -2003 27206 -57562 -139918 -118901 -70744 -77125 -156143 -241021 -151638
3041 -151638 -193489 -138912 -85560 -185744 -25240 7122 -35216 -6869 12927 -58873 -101361
3030 -101361 -98968 -96381 -8052 -122340 -74955 -252127 -284556 -138671 -81007 -67594 -72787 60384
3018 60384 -17019 -144547 -281389 -260108 -207903 -104726 77870 4301 -94846 -46444 -61553
3007 -61553 -139901 -124753 -4304 -38198 -66130 -105933 -28832 14207 -33133 -96931 -51590 -86705
2995 -86705 -100262 -141774 -150073 -244525 38972 -15566 34108 14466 -131984 -106352 48402
2984 48402 -12687 -151020 -169702 -159084 -189670 -127860 -75484 -11087 92195 -76943 -45324
2973d5324J42320l8157j2726M3310R152o1147j17755M9558q5134N3549O4267j6417
2961a4504r7627J85301j36541k5027o8702M0229Q2862O7189n2960r0862P1950
2950c8692K3540n1029L7371n002l3039N3077L2418k5571l6499j1268q3298J18271
2938a9721J30076r0532j47530k2056J43849o9457L1892J9465n9516J12742O0168
2927H9380o5237J1513k1469j06943N1539Q4280M5278O8596j24615o216R371j200
2915C4277j22898j27545K26186N4521o2932R3708n1057p9364J0366J33221K7301
2904A35784R687k4607j06795K0054n7773J44415j4881K4078P1430o1289o2067
2893G8036n5485n7458J23198l9601p6994k5306O0244L8205n91k6913M0542l1886
$$ plain form
2973 -45324 96996 58839 46113 89423 98575 37428 -80327 -30769 -115903 -62354 1913 -14504
2961 -14504 -112131 73170 -63371 -88398 -157100 -116871 -34009 33180 -19780 -110642 -38692
2950 -38692 -15152 -66181 -28810 -33812 -66851 -13774 18644 -6927 -43426 -54694 -137992 -19721
2938 -19721 110355 19823 -127707 -149763 -5914 -75371 -43479 -24014 -83530 29212 89380
2927 89380 24143 35656 14187 -92756 -41217 43063 88341 156937 32322 26106 35477 34277
2915 34277 -88621 -216166 10020 64541 1609 95317 44260 -35104 -24738 108483 135784
2904 135784 145471 120864 14069 34123 -23650 120765 105884 129962 201392 140103 78036
2893 78036 22551 -34907 88291 48690 -28304 -53610 6634 44839 44248 17335 57877 25991
2881B5991O8770K4250M0973J5253j47191L9790O3586P152p113k540n2098O8524
2869A45347m8120j48097J1082J21764l5434N3218M3804n500n3714q5380j07527
2858a08557J20233J41952j28609N7971j19328J5042O4925o6426k869Q4831j30331
2847g1166O6977J7933q6822j0185K9824J11618j13340Q2272J19753k9324j5868
2836A01672r5018j62593j2030l9244K7977J5180j032J14912o6880O3424r2871
2825a46503k0769m1677Q3989Q1542k531O8203l9695k6502K555k1195l4445Q7578
2813i450q1717n0489o4707m2562J04353R8073m6460r7717L5391M4436Q140O3417
2801c9292r1682J21721k2298j05822o4690L718n920M5577J05149M300P345m5488
$$ plain form
2881 25991 94761 119011 159984 175237 28046 67836 131422 138574 131461 128921 76823 145347
2869 145347 97227 -50870 -39788 81976 46542 99760 143564 138064 84350 -1030 -108557
2858 -108557 11676 153628 25019 82990 -36338 -21296 43629 -22797 -25666 59165 -71166
2847 -71166 -4189 13744 -73078 -83263 -53439 58179 -55161 27111 146864 117540 101672
2836 101672 6654 -155939 -167969 -207213 -179236 -164056 -165088 -50176 -117056 -53632 -146503
2825 -146503 -167272 -208949 -124960 -43418 -45949 22254 -17441 -43943 -41388 -62583 -97028 -9450
2813 -9450 -91167 -141656 -206363 -248925 -144572 -46499 -92959 -190676 -155285 -110849 -102709 -39292
2801 -39292 -130974 -9253 -31551 -137373 -202063 -198345 -204265 -158688 -53539 -49239 -41894 -87382
2789h7382j7397j18208K2907R3277j1173M9025j49485q7280R2408J89083r8901
2778a23126k0790m580o9944K8718K1843N8396J59761r4991j23902N223m3375J8218
2766a88549J7188P9699J1285j5842n5719Q6440n3470l0143O5608r254j07640J16759
2754h3638M1624N7964N5751p4134n219p8156j9114N8261m7752J16127R1974j44177
2742c0489k1894Q9965J21054j73321j45441J0214P0809j4352M9282L5953o2064
2731g0284L5039j19283q5738J50529m97L90j1532O3255O8358l9002k2788l5746
2719f7299J37406j55620l9914J3805K884M5624p1555L5727L842N0824j7477l0945
2707i2698Q1592M42o7887m4918O4406O4660N6807j17709r0086M2114R841M0231
$$ plain form
2789 -87382 -104779 -222987 -200080 -106803 -117976 -68951 -218436 -305716 -213308 -24225 -123126
2778 -123126 -143916 -148496 -218440 -189722 -167879 -109483 50278 -44713 -168615 -163392 -206767 -188549
2766 -188549 -171361 -91662 -80377 -96219 -151938 -65498 -118968 -149111 -83503 -92757 -200397 -83638
2754 -83638 -42014 15950 71701 -2433 -7652 -85808 -104922 -46661 -94413 21714 113688 -30489
2742 -30489 -52383 37582 158636 -14685 -160126 -149912 -79103 -93455 -44173 -8220 -70284
2731 -70284 -35245 -154528 -240266 -89737 -90234 -89844 -101376 -38121 30237 -8765 -31553 -67299
2719 -67299 70107 -85513 -125427 -111622 -108738 -63114 -134669 -98942 -95100 -44276 -61753 -92698
2707 -92698 -11106 -10664 -78551 -123469 -59063 5597 62404 -55305 -145391 -103277 -93436 -53205
2695e3205Q6306l866q0218o3400K7686K7004j15203K4965k0442L6679N7677L6237
2683c9780j40762n916O1522J08975N0145j06990P2772N7616n4889m2798N2535
2672A2430p7003n3922P2208l1120l7411J25731P2664q384j10964r7774Q1732J0463
2660d1350R509O2967q6948P2376q0652l1294M959K769l3858R9j04794q407Q9309
2647a45315J40739l8890p3179K8591n2184n388m3876J1457J32470N8333n869j3874
2635f985j34804L1146O1025j2440Q366J9593N0888l729l7716j1324r9478P889
2623a27569j6481l5661J5122m1999l4762L6435n3920O7902J64062L466L1584M829
2611A3008j77030k0578J41694R4638P75j44580k5383K7078M8171n5728L587J13300
$$ plain form
2695 -53205 33101 29235 -50983 -114383 -86697 -59693 -174896 -149931 -170373 -133694 -76017 -39780
2683 -39780 -180542 -186458 -124936 -15961 34184 -72806 -34 57582 2693 -40105 12430
2672 12430 -64573 -118495 -46287 -77407 -114818 10913 83577 75193 -35771 -133545 -51813 -41350
2660 -41350 -31841 31126 -55822 16554 -64098 -95392 -90433 -87664 -121522 -121423 -226217 -234624 -145315
2647 -145315 -4576 -43466 -116645 -88054 -140238 -145626 -189502 -178045 -45575 12758 6889 -6985
2635 -6985 -141789 -110643 -49618 -62058 -53692 -34099 16789 13060 -24656 -35980 -135458 -127569
2623 -127569 -144050 -179711 -164589 -206588 -241350 -204915 -258835 -190933 -26871 -23405 8179 13008
2611 13008 -164022 -184600 -42906 51732 52507 -92073 -117456 -90378 -42207 -97935 -94348 18952
2599A8952o0478m8066P1866J4990K8234M2366j65918N1088j8305Q9416L0611m7263
2587G493Q2109l6358k5695k3569o0285O7867K5126p3499k7895o1014N2409k8496
2575a01807m5645Q6994n0625N9876M8130q4942K446r345l6882R5823l3212o7980
2563a37169J24319O2755K4495j00677m6539O4905M2404r7510K0883N8j60573J11922
2551i0727J2358M5789L3323n9744L0077j23076J5416P6003n7494J3431N3828j27126
2539a77942k8708Q3717o4330J46470p311q9870J16141j4561K2038N2401j36560
2528i8515m266l267J4651P8710k3360n7215j4465j17739J23902O2955M346L690
2516c0573P063P9254m891p4665J1879K8143j05392P9131K5451J7878j20684K3505
$$ plain form
2599 18952 -41526 -89592 -17726 -2736 25498 67864 -98054 -46966 -65271 24145 54756 7493
2587 7493 89602 53244 27549 3980 -56305 11562 36688 -36811 -64706 -125720 -73311 -101807
2575 -101807 -147452 -60458 -111083 -51207 -3077 -88019 -85573 -94918 -131800 -35977 -69189 -137169
2563 -137169 -12850 49905 74400 -26277 -72816 -7911 34493 -63017 -42134 -42076 -202649 -90727
2551 -90727 -78369 -32580 743 -59001 -28924 -152000 -136584 -60581 -118075 -104644 -50816 -177942
2539 -177942 -206650 -122933 -187263 -40793 -48104 -137974 -21833 -36394 -14356 38045 -98515
2528 -98515 -102781 -106048 -91397 -12687 -36047 -93262 -107727 -225466 -101564 -38609 -34263 -30573
2516 -30573 -23510 55744 50853 -23812 -11933 16210 -89182 -10051 15400 33278 -87406 -63901
2504f3901N2229m4762L8929M2298j27765M679j2124j41696Q0016K9015o5196n792
2492b14070N0932j674L1381J44962O6107q2148r447l5887j5233J10510n0208l6680
2480d1455O6135n776o0383K8243R1162j4563p73q5852K9173Q5881q0091q1173
2468f9472j4885O6915k6634K5432K5861J7161n7439j7076N918L0251p5885R2343
2456B490J34803p4638K6727M7534j49125M1232m6065L706q0079L7955J43812N2673
2444A41025l1826J7667j3368R213j05180j8878R5000q7382R6652J2862o5488j5702
2432C4595o1243m0876m487n3624J70583L6199r329m0763j15772J6160R2115P1320
2420I4878o8691j9057k7090l1194N0169M6488L8603n109P6101k4094k4701o2749
$$ plain form
2504 -63901 -11672 -56434 -17505 24793 -102972 -98293 -110417 -252113 -172097 -143082 -208278 -214070
2492 -214070 -163138 -164812 -133431 11531 77638 -4510 -13957 -49844 -65077 45433 -4775 -41455
2480 -41455 24680 18904 -41479 -13236 77926 63363 62590 -23262 5911 91792 11701 -69472
2468 -69472 -84357 -17442 -44076 -18644 7217 24378 -33061 -50137 -44219 -13968 -89853 2490
2456 2490 137293 62655 89382 136916 -12209 29023 -17042 -13336 -93415 -55460 88352 141025
2444 141025 109199 126866 113498 122711 17531 -1347 93653 6271 102923 115785 50297 34595
2432 34595 -26648 -67524 -72011 -125635 44948 81147 71818 31055 -84717 -68557 23558 94878
2420 94878 26187 7130 -19960 -51154 -985 45503 84106 78997 155098 131004 106303 43554
2408D3554p1032M0023Q0877P6308p9387r8217m2352O1744J3368L5825n150Q288
2396F3849j1492L6621P4379l9066j31963O0741J41631j02149j3464N827M193l3477
2384E5630j2842K9381J10973m1841k3219L9349L0393K7932K3183q4779m8589Q1969
2372A87540O3574j05466J0828R6142M851J7488k3900l0598P3870l1662r0728r9401
2360G2538J5860L0345M0087m9186J0293L1717K5057q8126M7156j9584J22783j49339
2348H9601o8907M1905l9970n8828L581n2941L7039J29355l3775J6915O5350k2180
2336A07145m0568k1175J09021j23553r4066J67221N2831K7607J02801j51857m5083
2325I0324o8214j30799J69833R4177k2103l9724N8560j12825R8963j44422N6221
$$ plain form
2408 43554 -27478 12545 93422 169730 90343 -7874 -50226 11518 24886 60711 55561 63849
2396 63849 52357 88978 163357 124291 -7672 53069 194700 92551 79087 84914 89107 55630
2384 55630 42788 72169 183142 141301 118082 157431 187824 215756 238939 154160 105571 187540
2372 187540 251114 145648 156476 252618 257469 274957 251057 220459 294329 262667 171939 72538
2360 72538 88398 118743 158830 109644 119937 151654 176711 88585 135741 116157 238940 89601
2348 89601 20694 62599 22629 -36199 -32618 -85559 -48520 80835 47060 63975 129325 107145
2336 107145 66577 45402 154423 30870 -63196 104025 156856 184463 287264 135407 90324
2325 90324 22110 -108689 61144 155321 133218 93494 152054 39229 138192 -6230 49991
2314D9991n1143R7555P5561o5167K3488N9258J4746j00677j73064P3823L0375
2303C4746Q0241m4814J54707j014j3660q3907m3419L7867p466k6339k4054J6847
2291G9735Q8097N4145p0277n9186O9720P0647M6572m1326j04749p4266O7834l9711
2279H7235O9372L0543l8074P1752n3897J04380L1264o2656L5554N3723l5235R5121
2267C89082j21693M0733j24865k4921l7049N2074O6912K5974J29904M6573o2078
2256C80646j5459j5278j95130M1529K3074k0450l3317n803J7506J7152j1861m1135
2244A41474J26500K9286m7431l573k6877P2784j7260K9711k5867P385N7813P9222
2232D23167j39571q1146J81964N2557Q0415j15245J08040J0734j22943L6179p920
$$ plain form
2314 49991 -1152 96403 171964 106797 130285 189543 204289 103612 -69452 4371 34746
2303 34746 114987 70173 224880 223866 210206 126299 82880 120747 113281 86942 62888 79735
2291 79735 167832 221977 151700 92514 162234 232881 279453 238127 133378 59112 126946 87235
2279 87235 156607 187150 149076 220828 166931 271311 302575 239919 275473 329196 293961 389082
2267 389082 267389 308122 183257 158336 121287 173361 240273 266247 396151 442724 380646
2256 380646 365187 349909 154779 196308 219382 198932 165615 159812 177318 194470 182609 141474
2244 141474 267974 297260 249829 246256 219379 292163 274903 304614 278747 286132 343945 423167
2232 423167 283596 202450 384414 436971 517386 402141 510181 520915 397972 434151 426231
2221D26231j7804L763O1349j33161j5327R6625L2812N5316j03Q1075r4062o9122
2209D27592j2172O2225J03136l3387r8192N1867Q069M2182P4446J02960j3803
2198G14923J28066P3073j02251R0530l7325M5715m975J12026N3952q2489K5043
2187A016288l0131m7075R1974n4732n1129N4177J51980J1631r3546K09076o8949
2176A189564O9335o304p5545J7558Q6221J26444Q472j05222L2357J93706m5917
2165A490669j8351N4976l6975j0805Q1571j6112k886O8266N9442k4244r0431J68924
2153A724044R4781J3765K75933m741n0373M8762R885Q8268J49834J71772o6278
2142B455652J56962J86259P4147J17902K91818P0660N5529R2858K56378L92261
$$ plain form
2221 426231 408427 412190 473539 340378 325051 421676 454488 509804 509701 590776 496714 427592
2209 427592 415420 477645 580781 547394 449202 501069 509138 551320 625766 728726 714923
2198 714923 842989 916062 813811 904341 867016 912731 907756 1019782 1073734 991245 1016288
2187 1016288 986157 939082 1031056 976324 925195 979372 1131352 1142983 1049437 1258513 1189564
2176 1189564 1258899 1252595 1177050 1194608 1280829 1407273 1415745 1310523 1342880 1536586 1490669
2165 1490669 1472318 1527294 1490319 1479514 1561085 1544973 1542087 1610353 1669795 1645551 1555120 1724044
2153 1724044 1818825 1832590 2108523 2103782 2053409 2102171 2112056 2200324 2350158 2521930 2455652
2142 2455652 2612614 2798873 2873020 2990922 3282740 3353400 3408929 3501787 3758165 4150426
2132D150426Q7424M6120J91609J97718J01468J78481L02679L11004K74641K10724
2122F052294J97055M66970L96803L41901M75244O96741O57915P29219P22156N78133
2112A1314431Q05031J120342J225492J544956K066835K849100L253623L007556
2104B7187366L344011L952603N298345O143385N937833J680834p004077j0690381
2096C5849919q826259o122411m094521k754662j967419j694380j198951r78622
2088H212694o93148l89042m85234k38600l05330m40642n94315n81553l30104l24519
2078C830207k60663j77326k24966j96392j96608j35839j40900J0917k55271j22286
2068B130873l2426k46393q377n2473j03699n2896j30840j9775j71305N563L0388
$$ plain form
2132 4150426 4237850 4283970 4475579 4673297 4774765 4953246 5255925 5566929 5841570 6052294
2122 6052294 6249349 6716319 7113122 7455023 7930267 8627008 9284923 10014142 10736298 11314431
2112 11314431 12119462 13239804 14465296 16010252 18077087 20926187 24179810 27187366
2104 27187366 30531377 34483980 39782325 45925710 51863543 53544377 46540300 35849919
2096 35849919 27023660 20901249 16806728 14052066 12084647 10390267 9191316 8212694
2088 8212694 7519546 7130504 6645270 6406670 6101340 5660698 5066383 4484830 4154726 3830207
2078 3830207 3569544 3392218 3167252 2970860 2774252 2638413 2497513 2508430 2253159 2130873
2068 2130873 2098447 1852054 1843677 1791204 1687505 1634609 1503769 1483994 1312689 1318252 1348640
2057A348640p6532l9616j10743p664n2328J5442j3925p0134n2928J56555M5718
2046A142485n6769j28853q4857L7911j19491n0846K8880n4896J7051m1289o2893
2035F26433J18348j06246k53510Q1297P7319n5038m0972o0456L7375l3497K7136
2024D18189N0203j10844L8916q391p732n3489M1333N425L1365k4631j60675R8631
2012C18300Q2392J5250Q978o2441K0189K8548r4329q59k3941n8205J18195o5080
2000B86997j22126j4219l6169L5302J4596k0380O1223L3386k5441q8793p7584
1989D6792o0856P4566J19263j6237m8097J1646n4870m7315j00746Q4225O1635
1978G0006N2751J0916K9397j21954n664N4216r8507O4560l6584k7207k1616M8085
$$ plain form
2057 1348640 1272108 1232492 1121749 1114085 1061757 1077199 1063274 993140 940212 1096767 1142485
2046 1142485 1085716 956863 872006 909917 790426 739580 768460 713564 730615 689326 626433
2035 626433 744781 638535 385025 466322 543641 488603 447631 387175 424550 391053 418189
2024 418189 468392 357548 396464 388073 380341 326852 368185 373610 404975 380344 219669 318300
2012 318300 400692 415942 424920 362479 382668 411216 316887 316028 292087 233882 352077 286997
2000 286997 164871 150652 114483 149785 164381 144001 205224 238610 213169 124376 46792
1989 46792 -14064 60502 179765 163528 115431 127077 72207 24892 -75854 8371 70006
1978 70006 122757 133673 163070 41116 35452 89668 -8839 55721 19137 -8070 -29686 18399
1966A8399R6556k8467p5461P5343p9197k647O406j3083q6820J83011P8612j43572
1954B9080J28868M2019j20794k2139k2119p605R388l8981n8656l4423j7275Q4363
1942b8274Q433m4102L8290O9961K7263j08830R9631j9524r136O0278k1707o4363
1930G920j01382l0643L8759M4903J1024K357P7492K4687j7149M2229q362n1232
1918D0603L2338m35J49095K3748r3436m1471m4611L2290K5984j19303J50558J6361
1906A71721q8788n8186n9555M532J1601Q576m5153J25213L4357K2854o9310j9212
1894C8650J998L8734J1704j54967J01964Q4076R880j71796q431N6780m5109k7819
1882f4336k2912J05909R6735L1183j11794j944k4826k2479m3393o6271O5662L5152
$$ plain form
1966 18399 114955 86488 11027 86370 7173 4526 10932 -2151 -88971 94040 172652 29080
1954 29080 157948 199967 79173 57034 34915 27310 36698 -2283 -60939 -95362 -112637 -28274
1942 -28274 -19841 -63943 -25653 44308 71571 -37259 62372 42848 33712 93990 72283 7920
1930 7920 -93462 -124105 -85346 -40443 -29419 -27062 50430 75117 57968 100197 91835 40603
1918 40603 72941 72506 221601 245349 151913 110442 65831 98121 124105 4802 155360 171721
1906 171721 82933 24747 -34808 -30276 -18675 -10099 -55252 69961 104318 127172 57862 38650
1894 38650 40648 79382 91086 -63881 38083 122159 132039 -39757 -48188 8592 -36517 -64336
1882 -64336 -87248 18661 115396 146579 34785 32841 8015 -14464 -57857 -124128 -58466 -23314
1870b3314M0432q087j19347J09307R3044O122j16575K8964J4734J0116r757j9546
1858F093j3136O8193n3782n4352m2280N6591m0529M153m8927O1437M1513L2343
1846A7317l0439L2846J25612r6473n1629n521O1074M6814Q2841J3922j62299k4376
1834I689J22848n7442Q3306P8261K4774p0411M9168J0360j66923Q1571l9213j03312
1822B2676q822j36715J29252n1572m6174Q2179K7560M3263p992k8725n9550L003
1810c1617j00510N7240O1489K0843n9100N2224K3592j12554J3717P0781p8125
1799h2020n8300Q9509Q5262l7988N0914l3174O6223j0950q177N8046o8910m5587
1787D848n5374R1160N1417L5225n1513L4000j30722j2680O9207L1802m058N9993
$$ plain form
1870 -23314 17118 9031 -110316 -1009 92035 98157 -18418 10546 25280 35396 25639 6093
1858 6093 -7043 61150 7368 -46984 -89264 -32673 -73202 -69049 -117976 -56539 -15026 17317
1846 17317 -13122 19724 145336 48863 -2766 -8287 52787 99601 182442 196364 34065 9689
1834 9689 132537 75095 158401 236662 261436 191025 240193 250553 83630 165201 125988 22676
1822 22676 13854 -122861 6391 -45181 -91355 -9176 18384 61647 53655 24930 -34620 -31617
1810 -31617 -132127 -74887 -13398 7445 -51655 569 24161 -88393 -74676 -3895 -82020
1799 -82020 -140320 -50811 34451 -3537 47377 14203 80426 69476 61299 119345 50435 4848
1787 4848 -50526 40634 92051 127276 75763 109763 -20959 -33639 35568 67370 63312 123305
1775A23305o4971R1101m852m0325r4546K0592J08737j14748K8925K3396q0142
1764c528q982N3323j07671l4510J5495j16056J74848k3705o2637l978Q9910M2218
1752A4727P386L7460j33400M2051J9784k302J22716n8625p8628Q88P7033l7057
1740A2033j134k6476p4887r405J09826Q088o1954n1732l818P3168K3978N5606
1728E3293q1121n4063R8045o5873N9164P2224j23025J78437l6683m8725j172o9123
1716a8622O8529n5130k217J46882j95993o6922K7543k5879j49545K00553K03156
1705A32355J4036l5559r4742k1919K0645k2331j3870P2912k4277J3637j93876
1694a52989P6029O028j587L0875m5193j7501j08882O9943l9643R6638J87456p374
$$ plain form
1775 123305 58334 149435 144583 104258 9712 30304 139041 24293 53218 76614 -3528
1764 -3528 -12510 40813 -66858 -101368 -85873 -201929 -27081 -50786 -113423 -117401 -27491 14727
1752 14727 22113 59573 -73827 -31776 -11992 -14294 108422 49797 -28831 -27943 49090 12033
1740 12033 10899 -15577 -90464 -99869 9957 18045 -43909 -95641 -99459 -26291 -2313 53293
1728 53293 -27828 -81891 16154 -49719 9445 81669 -41356 137081 100398 51673 50501 -18622
1716 -18622 49907 -5223 -7440 139442 -56551 -123473 -95930 -121809 -271354 -70801 132355
1705 132355 146391 110832 16090 -5829 14816 -7515 -21385 51527 27250 40887 -152989
1694 -152989 -76960 -70932 -72519 -41644 -86837 -104338 -213220 -143277 -182920 -86282 101174 93800
1682I3800o9352N6957o3850m013j46076n1638J13727J04030l8293L6300p1847
1671d0255j12666M8337J58828j5531O8199Q0133j02005p1673o0644L6548k4920
1660c5649M8833j15554L614N4849R3365O3447l7375Q1510J2058k6955j67032j01408
1648a26297M7944P3402l6814j90J3356O5425j21581j1122J18966J2056l1663N3796
1636E7278l1735j9741j4501J6580Q0217j7685j8115k8820p0979J570j4446n1265
1624a11642O5679J9075Q5164M7972l2794j7812K4896r922j35443q3302K0616R3647
1612c3866J19930j38274o6840J32518J32194q6508m0320q4874n2294K4466J72391
1601G8523j31311J09730N2572j5226k4986o5155J0200P2390q1459l4681O5992
$$ plain form
1682 93800 24448 81405 17555 13542 -132534 -184172 -70445 33585 -4708 31592 -40255
1671 -40255 -152921 -104584 54244 38713 106912 187045 85040 13367 -47277 -10729 -35649
1660 -35649 13184 -102370 -98756 -43907 49458 112905 75530 157040 169098 142143 -24889 -126297
1648 -126297 -78353 -4951 -41765 -41955 -28599 36826 -84755 -95877 23089 35145 3482 57278
1636 57278 25543 5802 -8699 7881 88098 70413 52298 23478 -47501 -45931 -60377 -111642
1624 -111642 -45963 -26888 58276 106248 73454 55642 80538 70616 -64827 -148129 -127513 -33866
1612 -33866 86064 -52210 -119050 13468 145662 59154 18834 -66040 -118334 -93868 78523
1601 78523 -52788 56942 109514 94288 69302 4147 14347 86737 5278 -29403 36589
1590C6589k9724o8994o074R022M4388l2653j4532L4317J9909o9292K353P5075
1578C84J00786O3576k00937k9385N5962j0295q494R273J41937o2273p4719j6081
1566c0266K1233l8929K8922j30958l5107K03503r4949M3361P851p5558k3758l6240
1554a60895J64854M6725k356J4510j21565L0313j8729Q9309k9490J9505n6264
1543b4083p532o741j9632p7753P9296J2481n8760J06999J7300j26351J01157l5705
1531c9324K3723L1804K9533k5817n2149k7900M5554L4331p4750q3995M8049M7478
1519d3463Q5055K8896q3802O3551p1479j1389O8541p8521n0289K8613k0952P1043
1507a4196K411L1161N2736J1335l5198m3500N2960n8190k9110q936L811j24488
$$ plain form
1590 36589 6865 -62129 -68203 -59181 -14793 -47446 -61978 -27661 -7752 -77044 -74691 384
1578 384 101170 164746 -36191 -65576 -9614 -19909 -28403 -19130 122807 60534 -14185 -30266
1566 -30266 -9033 -47962 -19040 -149998 -185105 18398 -76551 -33190 -25339 -100897 -124655 -160895
1554 -160895 3959 50684 48328 62838 -58727 -28414 -47143 42166 12676 32181 -24083
1543 -24083 -31615 -38356 -57988 -135741 -56445 -43964 -102724 4275 21575 -104776 -3619 -39324
1531 -39324 -15601 16203 45736 19919 -32230 -60130 -14576 19755 -54995 -138990 -90941 -43463
1519 -43463 41592 70488 -13314 50237 -21242 -32631 35910 -42611 -92900 -64287 -85239 -14196
1507 -14196 -11785 19376 72112 83447 48249 4749 57709 -481 -29591 -38527 -34716 -159204
1495a59204N6286L3701r7480J53947l777j56696N095R8787L3501K7015L0040M2524
1483F3739j4950n3531L1602l7666o5984K0874j4197J1135K1059L7401k5654J0599
1471a5573n4789q866K6398J33083p3926j25955j0971p482J21280r4140J4082J05092
1459H233J31434m4027n7514j18784P462r052O6475O656M4727Q5565j00175J16182
1447A37182k08406n4108K515J42047p1091K592k8536q5654J50704O8009q4859
1436b9605J59382r37l8505q3785o2217J1905k7535n3675O8397q520k7046L9891
1424e2250Q624l681q8191K37522p9009L8083K1873o606n931j56048M0729k0176
1412f5061M433O6918m3838j1966Q7178L0569J2006k9647j91810K5680O374Q2095
$$ plain form
1495 -159204 -102918 -69217 -166697 -12750 -16527 -173223 -168128 -69341 -35840 -8825 21215 63739
1483 63739 48789 -4742 26860 -10806 -76790 -55916 -70113 -58978 -37919 -518 -26172 -15573
1471 -15573 -70362 -79228 -52830 80253 6327 -119628 -130599 -138081 -16801 -110941 -96859 8233
1459 8233 139667 95640 38126 -80658 -73196 -82248 -15773 -9117 35610 121175 21000 137182
1447 137182 -71224 -125332 -122817 19230 -51861 -49269 -77805 -163459 -12755 55254 -29605
1436 -29605 129777 128840 90335 6550 -55667 -43762 -71297 -124972 -56575 -65095 -92141 -52250
1424 -52250 -43626 -47307 -135498 102024 23015 61098 82971 76365 70434 -85614 -44885 -65061
1412 -65061 -60628 6290 -37548 -49514 37664 68233 80239 50592 -141218 -115538 -109164 -27069
1400b7069K7005L5916O7707l1732p4259J0634J567r3674j04722m9855K35708l7422
1388d0196j62320P0151M6718k0732L7410K1789q026N3561M2027l0444l4788j23511
1376a48361K49167o0869j47356J96451L0132j04847k8353K2669j6956J1416o0293
1365e7200j4585L437K1896L7881n7010J16776n5234m798J01904j94073J32M7918
1353e2956j857O493L1289k7300O4039n3378N0618P591p6310p8496J70232N7470
1341I7435m6405J0232n3986m2252n0878K8199J6733N6991l4794R9298J0304p6391
1329A4486k8229j2762j3665k9410N1656N6752L0178n7846N9103m4149k4917R506
1317A0703M9226J7809n1244j11107Q877J52812p0883K0868m6991l7921j4950n7253
$$ plain form
1400 -27069 -64 35852 103559 71827 -2432 8202 9769 -83905 -188627 -238482 -2774 -40196
1388 -40196 -202516 -132365 -85647 -106379 -68969 -47180 -55206 -1645 40382 9938 -24850 -148361
1376 -148361 100806 39937 -107419 89032 119164 14317 -14036 8633 -8323 3093 -57200
1365 -57200 -71785 -68348 -46452 -8571 -65581 51195 -4039 -8837 93067 -101006 -100874 -52956
1353 -52956 -54813 -48320 -17031 -44331 19708 -33670 16948 24539 -51771 -130267 39965 97435
1341 97435 51030 61262 7276 -34976 -85854 -57655 -40922 16069 -18725 80573 90877 14486
1329 14486 -13743 -26505 -40170 -69580 -17924 38828 69006 11160 70263 26114 1197 10703
1317 10703 59929 77738 26494 -84613 -75736 77076 6193 27061 -19930 -57851 -72801 -130054
1305a30054J23876l1298j10127O5744O5168R031l0566L4080l1846j748l2252j02424
1293a72416P273N6258P0259P5354j6677n5332j44530J78195K1211j45540J12730
1282a3215P922J5684q5412J38203J063l0284P2203j44603p1868J820O2254K2252
1270b3981n0257Q3927J6716m3377l8392R6304L6039j5923r8828J9790L4908l9265
1258b2339l8123J25562O2150o2572p0584J0668k7345r1068J19825l517j10740
1247a08083n0663Q2072m5801O4741q712M2346K1011P276n9535L1208j17009N8672
1235h2477m5431N4203J01505K4685P142o6214M2105r324r8588J5102R4882K186
1223C9776M141q9988j4874q3499l6401J2649J3318Q4225K2888J30175J24908j42042
$$ plain form
1305 -130054 -6178 -37476 -147603 -81859 -16691 -7660 -38226 -4146 -35992 -37740 -69992 -172416
1293 -172416 -165143 -108885 -38626 36728 20051 -35281 -179811 -1616 19595 -125945 -13215
1282 -13215 -5293 10391 -75021 63182 64245 33961 106164 -38439 -110307 -108487 -46233 -23981
1270 -23981 -74238 9689 26405 -16972 -55364 40940 76979 61056 -37772 -17982 16926 -22339
1258 -22339 -60462 65100 127250 64678 -5906 4762 -22583 -113651 6174 2657 -108083
1247 -108083 -158746 -76674 -122475 -57734 -66446 -24100 -3089 4187 -55348 -24140 -141149 -82477
1235 -82477 -127908 -73705 27800 52485 59627 -6587 35518 26194 -72394 -57292 37590 39776
1223 39776 43917 -46071 -60945 -144444 -180845 -168196 -154878 -70653 -47765 82410 207318 65276
1211F5276o1110l3183k0374j3977j1389N2383L1756M3147J700j18773L6652p7215
1199a05107J49248K148m0959K570J8798J30813m1757r3988k2261L1523n3704o0005
1187h2681m1775M466K1004K705N2784j4008P8887r5295j2388J1783L0718P4327
1175C0527n2273k1845j05253P7965L4438o416n0986J21658J6775P278o8018k9516
1163d5666j23956J2344J40752K0087m664k2234r6368J59553J26858r9007r4352
1152b6653M3975j9358O0414m858n9461J829o1745o328m0296K3075j7126J0168
1140i6364k6339R1974L2231k6344q4225P1635J10566j00044K2219N9773o2452
1129g370k67L8785p4688J05333m641M5444m2845r9593n9221p8875J38068Q0192
$$ plain form
1211 65276 4166 -29017 -49391 -63368 -74757 -22374 9382 52529 54229 -64544 -27892 -105107
1199 -105107 44141 46289 5330 7900 26698 157511 115754 21766 -495 31028 -22676 -82681
1187 -82681 -124456 -119990 -98986 -96281 -43497 -57505 21382 -73913 -86301 -74518 -43800 30527
1175 30527 -21746 -43591 -148844 -70879 -36441 -42857 -93843 27815 44590 51868 -16150 -45666
1163 -45666 -169622 -157278 -16526 3561 -1103 -23337 -119705 39848 166706 67699 -26653
1152 -26653 17322 -2036 58378 53520 -5941 -4112 -65857 -72185 -112481 -89406 -106532 -96364
1140 -96364 -122703 -30729 1502 -24842 -109067 -37432 73134 -26910 -4691 55082 -7370
1129 -7370 -7637 31148 -43540 61793 57152 102596 59751 -39842 -99063 -177938 -39870 40322
1117D0322j4161j09171N6370r1856q8045N1545J71649M5769l9910p2101k0256
1106f9845J7305r84j17701M8489o4253O3377K8710m6425J00663m1225Q7984K6009
1094C2104l2851J1127j0744K3578Q42k2957M6089N3629j70848M1298L0409L6639
1082C8315M9981l9794P784r766j10412k7480J82530m6881q9300k5574Q4528O5807
1070G9738r9115l5284O3174p6605m2278J5927L0717L0689P7133o5803k6986n7117
1058a05810O8412K8385k8273J89732j05335N0979J7640j01757j4881P3170m6898
1047B5364K7943J9767R3364N8744m9408l1865q8286k9293m8863J5184N9374m635
1035D7390M3474J20778q3905l8943n4J7305q1956r7080K6942J00622k5123j19779
$$ plain form
1117 40322 26161 -83010 -26640 -118496 -206541 -154996 16653 62422 22512 -49589 -69845
1106 -69845 -52540 -53524 -171225 -122736 -186989 -123612 -94902 -141327 -40664 -81889 6095 32104
1094 32104 -747 10380 -364 23214 24056 1099 47188 100817 -70031 -28733 1676 38315
1082 38315 88296 48502 56286 46520 -63892 -91372 91158 44277 -45023 -70597 13931 79738
1070 79738 -19377 -54661 8513 -68092 -110370 -94443 -63726 -33037 44096 -21707 -48693 -105810
1058 -105810 -37398 -9013 -37286 152446 47111 98090 115730 13973 -908 72262 25364
1047 25364 53307 73074 166438 225182 175774 143909 55623 26330 -22533 -7349 52025 47390
1035 47390 90864 211642 127737 88794 88740 106045 24089 -72991 -46049 54573 29450 -90329
1023i0329L7839J74754r5220Q1071q1404J39720j15651q8676N333o1216J24833
1012C1054j39967J02753L5372m5282P9951L3704l5408o5077o8000J8300L1935
1001b0665l826k8241J5944q2393P7698N4078M2381J00628m8650k7860N965n0005
989C5054J2214n6298k5915J20744k1285q9131j0426L4332O1660m407l2048j2844
977A1650k1378p9807o6427J16537J08905m9569j6405l9413l7269J10895m5820
966h101O4962j0723j14483K7800l4295j01803L5469N6874O2233k4631J6643M1986
954A1931q097N2058J1955o3670r0485L8066K6719m9758L3730k192J05175p1824
942f392K5335J06408r3634j00652M4667n252r0822J82771J23939j460n5445n1545
$$ plain form
1023 -90329 -52490 122264 27044 108115 26711 166431 50780 -37896 -32563 -93779 31054
1012 31054 -108913 -6160 29212 -16070 63881 97585 62177 -2900 -70900 -52600 -20665
1001 -20665 -24491 -52732 -36788 -119181 -41483 12595 54976 155604 106954 79094 85059 35054
989 35054 47268 -9030 -34945 85799 64514 -24617 -35043 -711 60949 56542 24494 11650
977 11650 -9728 -89535 -155962 -39425 69480 19911 3506 -35907 -73176 37719 -8101
966 -8101 56861 46138 -68345 -40545 -74840 -176643 -141174 -84300 -22067 -46698 -30055 11931
954 11931 3834 55892 67847 4177 -86308 -48242 -21523 -71281 -37551 -39743 65432 -6392
942 -6392 18943 125351 31717 -68935 -24268 -29520 -120342 62429 186368 184908 129463 77918
930G7918m5408L1796k4915j3813j2526K9144R8985r0792L0382O5439j05544j16441
918g5775J7465m6793J02859R2418j23359N0863M1978K3812R781j27626l1829J37096
906G0890k2052r6307J30816r4485p9743J10031k0586J03530j48902k3876P1810
895A126k2145K9832N1042j0491l5229J7967l820l9188L8772m8702K9402M2481
883E1047J25615j81972j17819J08345K2553p4376Q1302K2077q1194r8364L8220
$$ plain form
930 77918 32510 64306 39391 25578 13052 42196 141181 50389 80771 146210 40666 -75775
918 -75775 -58310 -105103 -2244 90174 -33185 17678 59656 83468 93249 -34377 -66206 70890
906 70890 48838 -47469 83347 -11138 -90881 19150 -1436 102094 -46808 -70684 1126
895 1126 -21019 8813 59855 49364 14135 32102 28282 -10906 27866 -20836 8566 51047
883 51047 176662 -5310 -123129 -14784 7769 -66607 14695 36772 -44422 -142786 -104566
$$ [...]
##END NTUPLES=NMR SPECTRUM
##END=
