##TITLE=1H_EC-3281(1-1)
 CDCl3
 8 sc, 
 19.10.2022
##JCAMPDX= 6.0         $$ Bruker NMR JCAMP-DX V2.0
##DATA TYPE= NMR SPECTRUM
##DATA CLASS= NTUPLES
##ORIGIN= UXNMR, Bruker Analytische Messtechnik GmbH
##OWNER= root
$$ XWIN-NMR		Version 3.5
$$ Wed Oct 19 14:23:07 2022 Russian Standard Time (UT+4h)  she@DPX200
##.OBSERVE FREQUENCY= 200.1313499994
##.OBSERVE NUCLEUS= ^1H
##.ACQUISITION MODE= SIMULTANEOUS
##.ACQUISITION SCHEME= undefined
##.AVERAGES= 8
##.DIGITISER RES= 18
##SPECTROMETER/DATA SYSTEM= spect
##.PULSE SEQUENCE= zg30
##.SOLVENT NAME= CDCl3
##.SHIFT REFERENCE= (INTERNAL, CDCl3, 0, 15.7414)
##AUDIT TRAIL= $$ (NUMBER, WHEN, WHO, WHERE, WHAT)
$$ ##TITLE= Audit trail, XWIN-NMR		Version 3.5
$$ ##JCAMPDX= 5.01
$$ ##ORIGIN= Bruker BioSpin GmbH
$$ ##OWNER= she
$$ F:/spectra/data/she/nmr/H-F/1/pdata/1/auditp.txt
$$ ##AUDIT TRAIL=  $$ (NUMBER, WHEN, WHO, WHERE, WHAT)
(   1,<2022-10-19 14:21:39.57 +0400>,<she>,<DPX200>,
      <created by zg, POWCHK disabled, PULCHK disabled
       configuration hash MD5:
       00 E9 B6 7A A2 85 ED C7 34 08 36 98 17 FE 4E 26
       data hash MD5: 16K
       32 01 21 A3 43 D3 BB 6F E8 70 64 F2 5A 7E AE 05>)
(   2,<2022-10-19 14:21:45.00 +0400>,<she>,<DPX200>,
      <Start of raw data processing
       efp BC_mod = 2 LB = 0.24 FT_mod = 6 PKNL = 1 PHC0 = -18034.53 PHC1 = 10.6007 SI = 16K 
       data hash MD5: 16K
       D8 19 D5 D6 FC 33 5A A8 1C E4 BC B3 40 5A 36 C4>)
(   3,<2022-10-19 14:22:01.45 +0400>,<she>,<DPX200>,
      <pk PHC0 = -2.73196 PHC1 = 5.2 
       data hash MD5: 16K
       8A 42 A2 F8 15 FD 6F 4A EB FA 19 44 4D E4 A4 CC>)
(   4,<2022-10-19 14:22:05.10 +0400>,<she>,<DPX200>,
      <abs ABSG = 5 
       data hash MD5: 16K
       12 3E 3D BA C6 F1 C3 9C 2B 0B 97 83 FD CD 77 C8>)
$$ ##END=
$$ 
$$ hash MD5
$$ 9E 4E CD 75 CE C1 F4 B5 B5 0D E9 4E 03 5A 37 D3
##$RELAX= 
##$RELAX= 
##$RELAX= 
##$RELAX= 
##$RELAX= 
##$RELAX= 
$$ Bruker specific parameters
$$ --------------------------
##$DU= <F:/spectra>
##$EXPNO= 1
##$NAME= <H-F>
##$PROCNO= 1
##$TYPE= <nmr>
##$USER= <she>
##$AMP= (0..31)
100 100 100 100 100 100 100 100 100 100 100 100 100 100 100 100 100 100 
100 100 100 100 100 100 100 100 100 100 100 100 100 100 
##$AQSEQ= 0
##$AQ_mod= 1
##$AUNM= <au_zg>
##$AUTOPOS= <>
##$BF1= 200.13
##$BF2= 200.13
##$BF3= 200.13
##$BF4= 200.13
##$BF5= 200.13
##$BF6= 200.13
##$BF7= 200.13
##$BF8= 200.13
##$BYTORDA= 1
##$CFDGTYP= 0
##$CFRGTYP= 5
##$CHEMSTR= <none>
##$CNST= (0..31)
1 1 145 1 1 1 1 1 1 1 1 1 1 1 1 1 1 1 1 1 1 1 1 1 1 1 1 1 1 1 1 1 
##$CPDPRG= <>
##$CPDPRG1= <>
##$CPDPRG2= <>
##$CPDPRG3= <>
##$CPDPRG4= <mlev>
##$CPDPRG5= <mlev>
##$CPDPRG6= <mlev>
##$CPDPRG7= <mlev>
##$CPDPRG8= <mlev>
##$CPDPRGB= <>
##$CPDPRGT= <>
##$D= (0..31)
0 1.2 0 0 0 0 0 0 0 0.06 0 0.03 0 0 0 0 0.0002 0 0 0 0 0 0 0 0 0 0 0 0 
0 0 0 
##$DATE= 1666174898
##$DBL= (0..7)
120 120 120 120 120 120 120 120 
##$DBP= (0..7)
150 150 150 150 150 150 150 150 
##$DBP07= 0
##$DBPNAM0= <>
##$DBPNAM1= <>
##$DBPNAM2= <>
##$DBPNAM3= <>
##$DBPNAM4= <>
$$ [...]
##$SUBNAM3= <"">
##$SUBNAM4= <"">
##$SUBNAM5= <"">
##$SUBNAM6= <"">
##$SUBNAM7= <"">
##$SUBNAM8= <"">
##$SUBNAM9= <"">
##$SW= 18.0517283424941
##$SWIBOX= (0..15)
0 0 2 0 0 0 0 0 0 0 0 0 0 0 0 0 
##$SW_h= 3612.71676300578
##$TD= 16384
##$TD0= 1
##$TE= 0
##$TE2= 300
##$TE3= 300
##$TEG= 300
##$TL= (0..7)
0 120 120 120 120 120 120 120 
##$TP= (0..7)
150 150 150 150 150 150 150 150 
##$TP07= 0
##$TPNAME0= <>
##$TPNAME1= <>
##$TPNAME2= <>
##$TPNAME3= <>
##$TPNAME4= <>
##$TPNAME5= <>
##$TPNAME6= <>
##$TPNAME7= <>
##$TPOAL= (0..7)
0.5 0.5 0.5 0.5 0.5 0.5 0.5 0.5 
##$TPOFFS= (0..7)
0 0 0 0 0 0 0 0 
##$TUNHIN= 0
##$TUNHOUT= 0
##$TUNXOUT= 0
##$USERA1= <user>
##$USERA2= <user>
##$USERA3= <user>
##$USERA4= <user>
##$USERA5= <user>
##$V9= 5
##$VALIST= <valist>
##$VCLIST= <CCCCCCCCCCCCCCC>
##$VD= 0
##$VDLIST= <DDDDDDDDDDDDDDD>
##$VPLIST= <PPPPPPPPPPPPPPP>
##$VTLIST= <TTTTTTTTTTTTTTT>
##$WBST= 1024
##$WBSW= 4
##$XGAIN= (0..3)
0 0 0 0 
##$XL= 0
##$YL= 0
##$YMAX_a= 312906
##$YMIN_a= -455897
##$ZGOPTNS= <>
##$ZL1= 120
##$ZL2= 120
##$ZL3= 120
##$ZL4= 120
##$ABSF1= 15.73918
##$ABSF2= -2.31267
##$ABSG= 5
##$ABSL= 3
##$ALPHA= 0
##$AQORDER= 0
##$ASSFAC= 0
##$ASSFACI= 0
##$ASSFACX= 0
##$ASSWID= 0
##$AUNMP= <proc_1d>
##$AZFE= 0.1
##$AZFW= 0.1
##$BCFW= 0
##$BC_mod= 2
##$BYTORDP= 0
##$COROFFS= 0
##$CY= -3
##$DATMOD= 1
##$DC= 0
##$DFILT= <>
##$DTYPP= 0
##$F1P= 0
##$F2P= 0
##$FCOR= 1
##$FTSIZE= 16384
##$FT_mod= 6
##$GAMMA= 0
##$GB= 0
##$INTBC= 1
##$INTSCL= 3.70164e-10
##$ISEN= 128
##$LB= 0.24
##$LEV0= 0
##$LPBIN= 0
##$MAXI= 10000
##$MC2= 0
##$MEAN= 0
##$ME_mod= 0
##$MI= 1.114404
##$NCOEF= 0
##$NC_proc= -5
##$NLEV= 6
##$NOISF1= 3.799351
##$NOISF2= 2.8
##$NSP= 0
##$NTH_PI= 0
##$NZP= 0
##$OFFSET= 15.74138
##$PC= 1
##$PHC0= -18037.26
##$PHC1= 15.8007
##$PH_mod= 1
##$PKNL= yes
##$PPARMOD= 0
##$PSCAL= 0
##$PSIGN= 0
##$REVERSE= no
##$SF= 200.130006036032
##$SI= 16384
##$SIGF1= 3
##$SIGF2= 2
##$SINO= 5.538805
##$SIOLD= 16384
##$SREGLST= <1H.CDCl3>
##$SSB= 0
##$STSI= 16384
##$STSR= 0
##$SW_p= 3612.71676300578
##$SYMM= 0
##$S_DEV= 0
##$TDeff= 16384
##$TDoff= 0
##$TI= <>
##$TILT= no
##$TM1= 0
##$TM2= 0
##$TOPLEV= 0
##$USERP1= <user>
##$USERP2= <user>
##$USERP3= <user>
##$USERP4= <user>
##$USERP5= <user>
##$WDW= 1
##$XDIM= 16384
##$YMAX_p= 280486167
##$YMIN_p= -200349
$$ End of Bruker specific parameters
$$ ---------------------------------
##NTUPLES= NMR SPECTRUM
##VAR_NAME=  FREQUENCY,     SPECTRUM/REAL,   SPECTRUM/IMAG
##SYMBOL=    X,             R,               I
##VAR_TYPE=  INDEPENDENT,   DEPENDENT,       DEPENDENT
##VAR_FORM=  AFFN,          ASDF,            ASDF
##VAR_DIM=   16384,         16384,           16384
##UNITS=     HZ,            ARBITRARY UNITS, ARBITRARY UNITS
##FACTOR=    0.220516191357247, 1,           1
##FIRST=     3150.32242195219, 0,            0
##LAST=      -462.394341053587, 0,           0
##MIN=       -462.394341053587, -200349,     0
##MAX=       3150.32242195219, 280486167,    0
$$ Real data points
##PAGE= N=1
##DATA TABLE= (X++(R..R)), XYDATA
$$ [...]
9533 233761 174773 163809 180699 173844 198660 181632 165150 151561 188252 203244 206051 205693
9521 205693 175098 168879 149489 184069 240182 263773 228040 234277 260810 235596 206162 204464
9509 204464 214217 199706 251804 199754 179336 167146 214343 190396 195920 257125 208878 125799
9497 125799 88910 133042 172015 160390 168223 180077 203430 178638 187244 167082 171970 235017
9485 235017 195299 175982 169938 164644 204958 208362 214766 247807 273825 296943 217494 200872
9473 200872 245139 242748 185717 189031 209096 206485 219236 204935 234987 259256 260690 276197
9461 276197 262914 202371 203326 196226 211215 254382 271815 296572 320129 309154 330443 348495
9449 348495 337543 374700 340600 326474 313038 312966 316636 328648 311139 359626 384983 343817
9437 343817 370356 373570 362324 337624 269514 321914 321072 319468 254441 237461 293088 366097
9425 366097 385551 358603 360783 327643 362630 308438 329212 355372 331414 351471 357109 383226
9413 383226 425939 371702 382979 333929 358502 321831 341468 379303 392298 373994 380626 413564
9401 413564 400363 480878 523178 503069 506144 508729 516676 552238 579554 626800 656473 716937
9389 716937 740936 724176 683754 648486 635245 629073 581610 617942 632928 578433 567632 588649
9377 588649 633561 642562 610146 635586 672523 608485 572514 596124 560055 541033 562578 578876
9365 578876 560035 578497 625420 661466 614097 597592 591319 628776 620847 626383 675889 669167
9353 669167 703601 683009 680880 662401 618688 653350 667987 584876 562158 555565 602294 608268
9341 608268 646284 615237 634096 648298 626630 651256 700389 727677 709881 691602 657813 730068
9329 730068 746645 710879 708253 687917 612397 654000 723425 716116 645576 654512 671349 687291
9317 687291 693665 686329 728388 728105 675542 743109 762742 777856 765820 803237 784072 729117
9305 729117 734053 735469 716040 765367 819512 765286 742352 726143 777236 808741 884862 858534
9293 858534 826350 807868 854297 885617 899890 988638 959315 947226 967630 1032270 1112419 1096098
9281 1096098 1090485 1075859 1110619 1127638 1195305 1239113 1341783 1396964 1432775 1426831 1342125 1352014
9269 1352014 1347401 1346056 1367963 1371668 1394902 1345936 1381705 1414701 1448011 1547819 1612265 1615151
9257 1615151 1620791 1695858 1815889 1915362 1917176 1903465 1990068 1954968 1871268 1815602 1762538 1812831
9245 1812831 1890643 1941262 1971287 1996803 2024945 1998032 1941522 1957858 1967453 2040730 2016630 2133047
9233 2133047 2259476 2412433 2445035 2486435 2485796 2527132 2638387 2670663 2720523 2778320 2773404
9222 2773404 2764404 2860268 2890488 2866316 2903629 2932225 2905311 2775573 2837552 2932777 2866155
9211 2866155 2856904 2893389 2926675 2936826 2896528 2818058 2841516 2933713 2899907 2838388 2841988 2831062
9199 2831062 2830176 2941950 2990849 2956725 2888809 2846617 2864112 2870304 2866005 2864863 2848617 2913773
9187 2913773 2958463 3018983 3049924 3043234 3008806 2910136 2835569 2767366 2772126 2818604 2886322 2877280
9175 2877280 2892314 2798824 2749374 2783483 2773857 2732691 2632063 2559715 2516425 2557253 2594308
9164 2594308 2714529 2807902 2787321 2836083 2781126 2754091 2740728 2698386 2731037 2746877 2641538
9153 2641538 2478803 2304749 2212276 2097668 2145126 2116350 2127591 2089150 2107862 2126131 2100026
9142 2100026 2101940 2109683 2058545 1977787 1963535 1946104 1964641 1954285 2002103 1992245 2001622 1989370
9130 1989370 1999558 2020729 2013443 2008299 2044517 2080117 2087809 2151733 2174236 2196171 2238558 2217908
9118 2217908 2259471 2331010 2335310 2360200 2420515 2451259 2442665 2407029 2379827 2427402 2473535 2561344
9106 2561344 2565225 2680452 2703549 2740621 2826731 2786820 2818480 2945886 2976128 3042685 3144891
9095 3144891 3176777 3229136 3316394 3383368 3431624 3510460 3574924 3698213 3822460 3983088 4090759
9084 4090759 4302346 4549180 4911630 5179534 5446146 5530092 5376245 5303235 5224840 5242981
9074 5242981 5237924 5271533 5351922 5493547 5610826 5723503 5798518 5964523 6056457 6121324 6293694
9063 6293694 6530835 6748300 7038408 7440117 7868657 8262552 8601236 8828354 9017331 9298007
9053 9298007 9627867 9800946 9859763 9930855 9855458 9852855 9960446 10036161 10128207 10420584 10742696
9042 10742696 11195718 11661783 12115323 12619274 12979552 13179527 13242387 13350981 13681802 14190975
9032 14190975 14879789 15608562 16306076 16801402 17291547 17625111 17973018 18256881 18818592
9023 18818592 19535761 20458359 21365949 22304310 23356981 24682782 26446231 28785963 31585197
9014 31585197 34952558 38629656 41650241 42387800 40281930 37024937 33839656 31478570
9006 31478570 30124510 29547310 29468686 29855999 30501409 30989096 30911268 30295658 29792592 29755802
8996 29755802 30213713 31212888 33040035 35706551 39294889 43257918 46483258 47353288 45372675
8987 45372675 42227248 39266032 37417659 36956074 37756495 39473191 41558294 43087636
8979 43087636 43199221 41765809 39811632 38616762 38581910 39884334 42341814 45360900 48135374
8970 48135374 49149035 47475717 42910207 37826692 33906933 31274614 29866432 29338508
8962 29338508 29519235 30388779 31883819 33590754 34849543 34924217 34188291 33478052 33181563
8953 33181563 33438787 34583092 36932944 40007394 42794491 43692032 41837323 37049919
8945 37049919 31572845 27183346 24165866 22143302 21005401 20295010 19885755 19564204 19013435
8936 19013435 18066316 16769845 15725111 14890281 14132781 13256404 12445806 11873365 11474797
8927 11474797 11187081 11059749 10837096 10515663 10163499 10032024 10039486 10156532 10393447 10850320
8917 10850320 11326106 11482384 11245136 10505617 9292309 8115372 7259339 6651802 6236602
8908 6236602 5842995 5542763 5322385 5087832 4912581 4805873 4728915 4630132 4479940 4261653
8898 4261653 4096193 3963679 3841208 3736623 3617732 3467543 3338331 3243623 3144476 3078845
8888 3078845 3030700 2963749 2932134 2848952 2818472 2746659 2712316 2674482 2580646 2515221 2441297
8877 2441297 2374920 2352282 2341154 2394054 2405801 2334533 2319155 2273221 2221516 2242146 2202848
8866 2202848 2183654 2206312 2161784 2137266 2145126 2100549 2002578 1940529 1926005 1882045 1848646 1873888
8854 1873888 1863735 1882208 1848065 1807749 1734114 1697083 1722596 1683115 1669202 1664112 1641023 1671880
8842 1671880 1714106 1671601 1613716 1607419 1642843 1656676 1650668 1674154 1642604 1613031 1662051 1618824
8830 1618824 1599251 1647779 1640778 1550124 1550567 1634887 1655507 1616245 1554292 1565923 1538489 1454645
8818 1454645 1493087 1481640 1526862 1533359 1552368 1505723 1548198 1612753 1578361 1549878 1516500 1565986
8806 1565986 1539598 1552285 1645173 1642888 1580023 1555108 1601104 1617098 1609119 1621669 1592786 1566207
8794 1566207 1570327 1662308 1696754 1659791 1669024 1646702 1761676 1790490 1742667 1783600 1864029 1883851
8782 1883851 1907986 1962257 1975202 1945556 1995558 2051259 2088768 2083319 2126583 2157438 2184481 2258864
8770 2258864 2278930 2249652 2256103 2312582 2302946 2326184 2364214 2397705 2415397 2438185 2454971 2484900
8758 2484900 2551786 2583408 2629546 2665025 2723997 2819557 2840833 2880886 2928837 2969389 3030623
8747 3030623 3122034 3200400 3253854 3330378 3400496 3489383 3541110 3620518 3688034 3757203 3888564
8736 3888564 4038141 4161790 4310403 4393265 4448274 4725887 4956673 5185912 5305389 5490732
8726 5490732 5711166 5917071 6097026 6302087 6523811 6734843 6937479 7186355 7408581 7799759
8716 7799759 8178294 8739187 9309915 10058269 10900763 11992493 13152228 14546811 16058791
8707 16058791 18001717 20274431 23474403 27818779 34379473 43313445 53325156 59605347
8699 59605347 61038428 54575157 41402637 31220258 24573704 20108547 16806356 14349877
8691 14349877 12374946 11010933 9910375 9157607 8464233 7906437 7429672 7141462 6790919
8682 6790919 6479983 6172841 5920146 5672411 5447335 5279838 5120519 4936431 4771365 4514973
8672 4514973 4371536 4176060 4082594 3972281 3952244 3901541 3776586 3712888 3715129 3728059 3571209
8661 3571209 3430119 3343845 3320686 3283871 3284897 3251257 3264991 3278889 3250450 3175146 3168810 3166390
8649 3166390 3193069 3261000 3345755 3336596 3348616 3390172 3454119 3562479 3641567 3775464 3865814
8638 3865814 3982172 4063928 3973680 3937475 3858990 3740955 3695198 3752811 3756056 3720074 3724710
8627 3724710 3811078 3886389 3828315 3877744 3932101 3971271 4070157 4129147 4179128 4311892 4429635
8616 4429635 4530839 4592540 4680977 4808958 4884777 4952003 5069491 5235665 5353347 5490232
8606 5490232 5627315 5880182 6030610 6226437 6452726 6646774 6775555 6862032 6927455 7022605
8596 7022605 7106834 7275816 7287836 7257167 7359839 7421305 7400137 7425853 7585909 7683452 7838634
8585 7838634 8054841 8239448 8386391 8614250 8914129 9135084 9429266 9760473 9975535 10246699
8575 10246699 10650818 11072143 11512374 11981506 12437429 12943872 13474910 14057972 14699266
8566 14699266 15466268 16263227 17118510 17998241 18740278 19434130 20206716 21043773 21733940
8557 21733940 22280554 22563611 22709875 23021406 23321308 23656506 24129194 24964960 26304915
8548 26304915 28142996 30593651 33875832 37822691 42360111 46708536 49360604 48701818
8540 48701818 45644309 42071461 38755210 36048560 34033613 32873233 32467524 32617826
8532 32617826 32938615 32908033 32210447 31431870 30864197 30601316 30517282 30651160 31012295 31535824
8522 31535824 32121563 32728424 33284665 33677718 34003991 34542960 35264583 36227087 37540361
8513 37540361 39201505 41231752 43493796 45778141 48296610 51661497 56148389 61308261
8505 61308261 66187065 69103228 69487595 68583302 66446662 62969438 57750246 51847149
8497 51847149 46921756 43161625 40151364 37486732 34809705 32055772 29807446 28033853
8489 28033853 26615647 25606927 24984913 24623196 24385460 23982293 23342956 22748381 22310353
8480 22310353 22074343 22102469 22281533 22872939 23609956 24509645 25230209 25681913 25500586 25037569
8470 25037569 25032543 25446781 26517084 28330414 30853259 33617894 35802822 36493797 35130848
8461 35130848 31398573 27159745 23468498 20182389 17469596 15335124 13800917 12693158
8453 12693158 11795294 11122851 10652139 10290169 10025359 9735386 9361557 8872917 8334149
8444 8334149 7748104 7288108 6807457 6426974 6042836 5727689 5455618 5200924 4958816 4718668
8434 4718668 4573818 4445013 4334298 4178964 4025359 3897467 3756078 3544012 3463442 3475857
8424 3475857 3354005 3202771 3060646 2941705 2918419 2865931 2781411 2705759 2672882 2593905 2555533
8413 2555533 2497185 2417747 2342491 2305182 2307612 2221836 2207188 2160874 2086605 2042881 1896201
8402 1896201 1861182 1777501 1730101 1690242 1691296 1657229 1615083 1587998 1535987 1482446 1465980 1457053
8390 1457053 1434369 1437219 1434123 1416266 1360580 1316041 1281849 1263546 1302278 1289130 1250016 1247615
8378 1247615 1127838 1176286 1184365 1171263 1121486 1050001 1019521 995589 987112 988231 976383 990638
8366 990638 957372 919977 941314 901072 855493 866877 821026 866099 879555 794081 838731 821405
8354 821405 836626 732122 700323 714163 718816 728319 684034 625284 665227 588312 617590 647995
8342 647995 635089 572669 532935 584461 523085 601168 545073 470297 472452 446946 459440 450796
8330 450796 440792 401119 435951 455382 430015 419273 354885 375188 353152 379160 356468 340586
8318 340586 411878 469743 351130 357976 363528 384815 406525 414071 326978 308590 326637 239275
8306 239275 279084 277136 304661 319584 324165 257651 271676 324337 278870 219487 273291 328672
8294 328672 290514 261587 268353 294352 283356 315324 323302 231758 255552 258363 212205 257531
8282 257531 279901 244362 206877 156705 156971 199930 257566 235983 198509 165078 185372 219400
8270 219400 199068 184976 178448 187352 198173 187546 170955 276951 255762 193686 167903 178759
8258 178759 183657 177062 185759 132326 187809 166004 176233 201801 217486 196194 212179 253202
8246 253202 213706 196545 160426 135342 156914 209008 220617 199784 181576 202268 187659 211011
8234 211011 200951 195221 225566 273286 202307 192711 227174 287480 274962 265181 366590 445152
8222 445152 410548 424729 400112 220944 134988 140186 169432 150281 138453 124686 65081 89990
8210 89990 69114 94485 115925 128110 105236 125680 168680 110220 83389 60759 41785 103407
8198 103407 133646 58626 70060 73887 52356 54038 689079 640724 357288 303152 215839 257435
8186 257435 204158 221741 202929 188891 198075 219900 248850 221025 151248 175324 176857 165744
8174 165744 148481 138440 219977 236731 232073 303223 290467 312150 285587 285039 270464 235460
8162 235460 262341 297170 237184 200559 213181 242300 176164 156030 174430 243940 250543 248723
8150 248723 238084 232586 245874 234303 216134 233459 242316 214296 240297 267913 250145 231275
8138 231275 207706 190543 209238 225359 212951 195918 271855 294416 307594 351461 324366 279623
8126 279623 218059 243665 206306 189722 201031 212729 198121 193747 221397 197500 221218 213521
8114 213521 99338 72536 105987 119451 156608 102434 149240 127681 150547 165381 142382
8103 142382 126805 106643 124369 111322 151971 154625 122127 98067 108086 112483 83122 99333
8091 99333 48717 82065 109216 82291 38732 77584 89265 79103 62684 58710 18451 22202
8079 22202 33262 41662 18791 44336 35229 -15848 -80040 -53158 -25011 -44782 31342 42445
8067 42445 -42261 -85531 -58099 -35576 -40515 -48928 -8349 -53477 -77963 -55829 -44802 -54825
8055 -54825 -44056 -99081 -126609 -79301 -33615 -69769 -98660 -36786 9851 -30219 -110408 -106733
8043 -106733 -30322 -23926 -31908 -88434 -74867 -49465 -74524 -61935 -30913 -53559 -164213 -200349
8031 -200349 -96036 -69393 -41923 -6326 -72953 -96137 -75864 -49917 -58591 -58160 -53515 -68486
8019 -68486 -45146 -52865 -71501 -35356 -50897 -130102 -110187 -121943 -123282 -95062 -76915 -66847
8007 -66847 -91721 -115046 -96951 -98467 -106577 -109586 -148755 -70629 -100680 -80664 -67426 -77716
7995 -77716 -62802 -128491 -85025 -101796 -73087 -113925 -126064 -94592 -58735 -96581 -77217 -55679
7983 -55679 -83476 -63676 -95704 -119310 -65692 -70460 -28339 -9972 -83577 -43995 -72230 -175475
7971 -175475 -133541 -91001 -112550 -95193 -133362 -42337 -33053 -70011 -5809 -142605 -132480 -100939
7959 -100939 -125233 -91550 -114286 -131864 -136907 -143428 -120354 -90342 -44067 -63851 -96651 -125639
7947 -125639 -104504 -104887 -142844 -178116 -157201 -93307 -111675 -28062 -53670 -125698 -120407 -72382
7935 -72382 -42560 -29566 -78368 -72688 -71034 -55774 -76369 -77353 -55088 -90408 -107850 -95759 -93608
7922 -93608 -76237 -28312 -93095 -119182 -87843 -71554 -66571 -127060 -94357 -52202 -70311 -127867
7910 -127867 -81002 -17312 -40424 -118785 -146197 -128199 -81273 -58867 -79251 -84652 -40888 -55136
7898 -55136 -66358 11158 15637 -26418 -35652 -109792 -57728 -31572 -62729 -55629 -26222 -20203 26282
7885 26282 -11146 -17273 1547 -3962 -36315 -27059 -20436 548 -17618 -118116 -59648 -41849
7873 -41849 -33849 -34747 -43464 -59407 -36887 -20056 -5873 -85076 -165295 -127336 -152098 -97903 -54201
7860 -54201 -121548 -121516 -80255 -14917 939 6182 -40483 -73452 -82420 -88993 -69423 -117497 -158423
7847 -158423 -173886 -181827 -167110 -116113 -53303 -36381 -81539 -98374 -81408 -79943 -27245 -85018
7835 -85018 -113373 -88889 -95604 -110096 -72686 -131392 -109833 -117926 -97084 -86812 -149949 -125405
7823 -125405 -130773 -166248 -142979 -181001 -186107 -128834 -110839 -28346 9500 -22439 -125338 -147163
7811 -147163 -151802 -95974 -34419 -58356 -126728 -128821 -96709 -83423 -35516 -18481 -20822 -27204
7799 -27204 -61352 -94829 -59984 -66892 28980 31264 -41371 -66934 -84711 -81509 -83355 -68952 -63343
7786 -63343 -79133 -79572 -53987 49029 7759 -32316 44952 31061 -94053 -132893 -82382 -40957
7774 -40957 -25162 -29655 -63721 -76521 -60160 -53401 -1541 35344 25300 25009 -57607 -58751 -32179
7761 -32179 10564 -31757 -62031 -38729 -85324 -69446 -32761 -62460 -124852 -69045 1126 -16819
7749 -16819 -48040 -92523 -140374 -67211 -102660 -67769 -115265 -127968 -93081 -81587 -66484 -63896
7737 -63896 -62196 -26522 28416 -45075 -84804 -106036 -123577 -108985 -135154 -67046 -12851 26391
7725 26391 -39760 -57768 -81366 -67539 -105272 -92761 -65071 -153383 -183390 -152480 -107833 -116074
7713 -116074 -142896 -145987 -94849 -79756 -21976 -10101 6039 -39899 -75008 -127820 -107484 -56180
7701 -56180 -65911 -22642 -100662 -95733 -43426 -58242 -56714 -61467 -88666 -58999 -37401 -44647 -48198
7688 -48198 -39680 -83805 -66510 -74573 -101742 -110931 -118916 -95861 -88840 -100588 -48601 -9780 -102342
7675 -102342 -68781 6501 18891 15824 6391 -25429 -75554 -22029 -8679 -8769 -1532 -8414 -41843
7662 -41843 -34536 8365 -48260 -40181 -89394 -116470 -104916 -56546 -98656 -39587 -19699 -32522
7650 -32522 -28410 -44746 -72062 -93378 -54333 -97209 -87654 -30316 -20490 -49076 -30519 7754
7638 7754 -17025 -11245 -77550 -102383 -56147 -66668 -50090 -54549 -55681 -51995 -24816 -5577 -6889
7625 -6889 -34979 -15856 56859 41920 10557 3866 -21145 6922 21548 -30965 -55337 -1986
7613 -1986 -36253 -44416 -54369 -49414 -56281 -6924 2458 28031 -1758 -52435 -43814 -49736 -66681
7600 -66681 -72688 -42729 -20843 -18094 -53872 -13513 -21788 16342 29035 -29666 -46023 -7763
7588 -7763 13976 4867 -16943 -7513 -25865 -17130 -18083 16071 983 -56100 -53654 -105553 -102130
7575 -102130 -64178 -54374 2962 -45553 -49575 -59421 -62773 -42785 -7145 -24628 -21193 17613 -9336
7562 -9336 11199 84035 70890 10293 -23883 23587 -3106 16925 65305 57415 12601 19104
7550 19104 57479 -21021 15772 1559 77639 127369 118587 57863 15577 51809 47292 71181
7538 71181 94350 53563 47263 59663 98506 97872 108503 87486 83760 124025 134726 137937 76274
7525 76274 124779 224550 186634 166924 201142 210371 188545 247281 334184 360054 396984 398777
7513 398777 395380 400260 401432 390285 372945 323912 327177 353368 319347 216819 194323 115840
7501 115840 109109 113897 173309 186081 82790 91313 81975 101054 164209 208789 165352 182848
7489 182848 144097 125142 172590 147500 95802 136859 172703 167953 172119 189368 177618 162298
7477 162298 170714 142301 88530 100790 160319 119275 102732 157324 195865 154285 175889 245991
7465 245991 204859 186882 250495 269262 322405 318121 316740 382598 401273 419467 363062 352255
7453 352255 321383 306035 291546 182458 100672 173850 194587 194095 151019 181665 146883 138627
7441 138627 120200 142634 137296 134664 179011 197639 203675 187991 202055 194644 193325 176450 116548
7428 116548 109113 106865 134569 197125 112218 90821 82674 157795 134798 103462 153468 156327
7416 156327 124784 164157 152416 123302 142296 94674 92561 119394 85787 136543 131164 156838
7404 156838 209196 259645 278597 253690 274882 263865 285465 281765 312812 362746 313623 312623
7392 312623 299596 339732 438614 517566 578053 656210 733426 812764 884314 922002 955725 950296
7380 950296 966277 957736 966530 983204 947766 895732 781160 696663 624911 496228 444631 425291
7368 425291 371350 348720 335463 258212 270318 229381 220942 218166 170404 161144 162238 181122
7356 181122 201390 227781 201866 196505 165069 77817 22091 115342 136269 114315 110607 92463
7344 92463 77288 73283 65229 98261 124735 70650 102229 168947 117982 145830 113986 173025
7332 173025 185648 203409 190717 111497 140734 176537 203147 94209 95656 154010 179054 99029
7320 99029 66325 122417 127527 153752 122143 127324 96734 71191 78888 68061 88162 109146
7308 109146 113007 110377 119062 68363 71285 111247 148669 190472 125365 107031 160980 152533 198535
7295 198535 165373 191568 174541 135896 128243 141848 196668 273122 210118 143990 192082 225523
7283 225523 121987 126093 212709 198562 178696 138515 185241 174177 171831 170635 158696 204338
7271 204338 183583 182904 144551 156564 225508 234949 190062 241205 225956 175369 155335 133641
7259 133641 154030 145296 148128 208172 283293 300813 271865 162016 163708 213875 252241 234769
7247 234769 218127 280020 211545 204263 261409 236568 263486 312142 350053 319950 293121 251592
7235 251592 292831 259313 220576 285390 316717 337625 304487 285573 341792 361635 335528 382258
7223 382258 360797 326727 307354 290651 257892 354685 434083 364459 356217 343836 319449 329231
7211 329231 347585 335690 432517 416379 397685 387611 403771 397272 408339 396133 422399 468650
7199 468650 449532 454482 466327 508927 453801 514828 516322 522270 493083 502094 533160 575908
7187 575908 634144 583058 582606 601216 594313 588265 563648 551673 660314 672769 641358 675447
7175 675447 685489 714154 702194 717782 738670 778369 852249 878094 826440 821459 863190 903219
7163 903219 907223 886605 937855 938216 951964 955214 1000305 1029645 978587 1023309 1066192 1157114
7151 1157114 1251823 1338078 1321662 1274469 1295435 1426389 1501668 1427999 1487464 1486094 1558867
7140 1558867 1619551 1703693 1762742 1844081 1852741 1857666 1858984 1943080 2026991 2159227 2168358 2170938
7128 2170938 2196799 2228354 2312117 2408960 2515678 2528084 2590526 2670890 2742128 2821518 2890064
7117 2890064 2964261 3042983 3139696 3265854 3322509 3509064 3684068 3893436 4019849 4162450
7107 4162450 4256357 4374383 4448197 4549316 4681248 4794153 4949512 5106341 5314226 5552534
7097 5552534 5781996 6154989 6519418 6860191 7273217 7751303 8370686 9035598 9579695 10113792
7087 10113792 10566798 10891877 11217736 11542138 11845956 12296285 12952238 13688799 14472993
7078 14472993 15201215 15709257 16042972 16098066 16028616 16216263 16563237 17237142 18315384 19656507
7068 19656507 21170435 23169153 25620752 28857682 33069214 38575583 45616252 53913602
7060 53913602 62341005 69123177 71824279 69360021 62730726 53492535 44446996 36701294
7052 36701294 30665673 26001849 22446410 19770987 17763310 16216630 15024409 14095044
7044 14095044 13393502 12667534 11993759 11482078 11049762 10735602 10546893 10514451 10567353 10777821
7034 10777821 11137652 11816095 12814984 14164553 15674806 17073753 17874206 17722904 16549147
7025 16549147 14633823 12407822 10511216 9006455 7852492 7016735 6385237 5764817 5290801
7016 5290801 4899738 4565832 4309657 4127265 3931870 3676271 3451700 3287948 3180440 3070120
7006 3070120 2899523 2862321 2724909 2618131 2556061 2389546 2278279 2249323 2169925 2104694
6996 2104694 2046995 1958637 1898046 1846619 1766579 1736898 1652586 1520237 1427490 1393280 1316657
6985 1316657 1260865 1274863 1242927 1169250 1131580 1152523 1139788 1142558 1111981 1022521 1012844 1050802
6973 1050802 1049648 1002011 1001750 924195 830822 839201 833677 824101 808818 753367 743406 719861 615407
6960 615407 684449 736108 720982 670370 627388 576255 583772 594464 594063 591518 593546 601832 576311
6947 576311 554927 554515 552162 536998 504897 523004 486485 530320 478986 483353 437925 422443
6935 422443 466041 523656 457265 394122 403799 382683 357059 323241 282820 310340 380031 322509
6923 322509 292259 285761 312352 253396 283768 285577 263993 309082 304229 218069 230744 277451
6911 277451 241890 228684 206101 263533 236802 287117 300568 294461 268042 225596 251424 205070
6899 205070 206369 238164 237584 251751 256221 238897 187686 228988 286583 283074 262273 268110 198871
6886 198871 161624 200046 181461 159117 175603 202977 166388 108646 83146 121148 138361 154683
6874 154683 142784 152410 152032 189771 135493 104603 83308 110340 101749 134887 199844 144588
6862 144588 163636 205510 185436 159082 102269 104981 157927 144900 93791 116831 100724 89138
6850 89138 95622 84902 62957 113120 129895 94609 87549 72135 147752 243909 165915 128959
6838 128959 74072 104798 77849 59513 118861 131508 159871 99264 71372 62443 60948 104512
6826 104512 126270 135721 119664 103132 106210 126385 148519 151288 108956 145483 197955 124872
6814 124872 86443 113693 205166 173511 92113 103122 126457 95598 134621 144150 115347 56672
6802 56672 28449 27763 45326 55274 122136 91450 130413 128085 127824 164332 109977 85577 38757
6789 38757 56212 141626 145862 104932 85430 120218 156912 150159 124726 90650 112259 174827
6777 174827 164312 102733 107989 159524 185616 205307 180278 148903 137125 103317 89414 91071
6765 91071 74281 102737 147409 96603 98962 154338 123392 77686 3832 32381 87798 44997
6753 44997 41660 28606 104584 98661 91953 20515 59456 2978 -49961 40470 1770 5759 28569
6740 28569 40501 107660 31757 -11528 18833 29082 123648 101440 96968 130183 179019 162608
6728 162608 80401 53916 35824 19561 17842 15715 42614 82213 68043 34146 21727 93330
6716 93330 42896 83119 146811 198706 165104 73442 103418 87705 108236 100587 52916 49937
6704 49937 90462 22389 52863 55697 62356 65540 69661 37204 6379 52643 98454 104407 128247
6691 128247 129050 142496 139888 149717 157413 132125 82591 94749 156970 174515 167130 149459 128500
6678 128500 132658 140600 115464 133128 176795 229632 207023 181083 162218 167291 158638 174268
6666 174268 168712 186853 234328 263752 284749 265638 288449 378129 418179 355776 439161 460980
6654 460980 382410 299017 283885 284495 282897 185583 139035 188458 161067 163735 141267 183891
6642 183891 186213 148058 116582 119646 145446 133531 83442 103067 111504 145647 141015 137656 139738
6629 139738 146633 133934 130374 112202 119352 111880 111151 100727 123740 98190 62839 91958 103179
6616 103179 78838 86285 72589 48628 79388 60475 -34897 4415 70331 54175 45262 17198
6604 17198 -25998 -35396 -2902 5179 45303 55662 7104 35992 34325 -35293 -2888 48835
6592 48835 102609 47257 88803 101606 21363 11967 26269 42684 74750 30483 72663 3209
6580 3209 20211 40792 22527 65423 2158 26048 51476 53379 60788 97840 54276 33387
6568 33387 48114 -4058 -2251 23222 94574 103094 110213 130652 91047 78761 96354 33280
6556 33280 97847 134148 39676 -11639 14815 25466 66805 112561 44617 29012 43955 19356
6544 19356 10717 88661 114872 27258 -9464 63013 87182 39938 13229 8108 -22890 12779
6532 12779 50835 28210 50566 78625 21037 80428 114406 78463 31780 39872 58061 31905
6520 31905 15176 -26498 -10664 54872 40138 64942 75876 17493 6093 39911 74361 75578
6508 75578 -7354 -18830 8096 -4460 39566 99218 109514 100364 93771 62215 7888 37214
6496 37214 37362 7797 -22423 30313 56565 27741 31722 7307 11574 85096 88108 100279 57436
6483 57436 13095 58939 55881 77475 111797 76140 68438 52702 46166 66061 50070 61760
6471 61760 81004 136410 144536 100771 107896 143868 165985 153811 138294 63170 103360 135375
6459 135375 109212 96929 81186 109292 115652 132738 120763 70533 56030 48709 22458 99892
6447 99892 117720 80782 125847 150703 66426 104226 81754 146334 185353 193120 177479 134352
6435 134352 112874 107681 79667 127851 86882 100924 101918 146701 175885 161319 148575 137009
6423 137009 124644 128908 114764 138401 227009 152516 143551 123993 135732 170292 151563 187279
6411 187279 152906 172983 190548 166653 132811 170954 207299 209853 244864 267696 214076 229853
6399 229853 280799 277033 305547 309995 294014 279688 373527 378373 367066 323721 332275 341657 323817
6386 323817 328272 293282 299391 313959 340273 391390 373694 405428 475295 494415 534713 565135
6374 565135 625326 653813 717291 799762 830852 875960 872912 884878 900415 856550 871384 835921
6362 835921 760519 759672 713310 688974 657968 675313 698193 722921 734419 757617 741069 790030
6350 790030 809264 907112 963952 1078039 1164335 1351574 1483848 1476315 1390004 1295073 1185053
6339 1185053 1065318 978861 907625 856582 796078 738672 652875 606504 628390 658481 701669
6328 701669 694162 731763 749397 814770 843763 842030 895966 878801 889765 866380 823629 769926
6316 769926 733801 681273 598900 584475 590522 527510 461469 402283 389120 485235 477872 503546
6304 503546 527884 604902 689673 694846 607323 486248 467470 455264 449210 400208 368140 344480
6292 344480 322811 280739 304463 329915 298120 302271 371973 325284 403224 368420 305217 296214
6280 296214 359607 391360 451510 523454 508894 451915 460591 421629 448015 431181 413122 418671
6268 418671 413773 343444 332499 355173 337579 383838 370408 396338 380878 320134 312331 310896
6256 310896 312685 299624 292883 320046 364841 377911 349592 286793 219841 283841 316447 330353
6244 330353 369935 396442 347796 324912 355926 329306 366488 430396 423911 413120 472710 391932
6232 391932 380317 370695 363011 420734 454852 393720 328752 400301 470308 430514 378882 458496
6220 458496 470838 420556 384949 418492 425700 474632 450517 443801 468541 480002 492867 504464
6208 504464 522484 520743 538017 554447 607274 605706 617998 588963 566925 568889 569367 497551 473628
6195 473628 489465 448358 438283 451836 467891 488767 458711 476665 474029 475435 439982 422808
6183 422808 459135 452599 415043 417458 468295 536180 564498 578845 544346 446120 436516 448804
6171 448804 482467 422567 450367 444340 459811 417516 424708 417453 388466 385395 400976 440456
6159 440456 459253 386026 423893 408911 348061 357641 412680 442460 448998 451972 399018 410569
6147 410569 431053 437327 452025 452176 491191 519398 442169 405319 432290 478724 520964 470896
6135 470896 452400 461527 480166 509079 503255 487072 466804 467833 409587 504115 562018 557746
6123 557746 487636 437864 521752 563442 561643 542916 567447 538523 628201 635089 606604 634066
6111 634066 697447 644923 658843 657651 650694 598008 600999 606215 650951 672942 639359 652135
6099 652135 640793 651937 630456 657404 662523 676167 714302 749810 779368 797319 759199 709948
6087 709948 762296 829871 877000 882375 835406 892100 841667 858613 876961 894235 930722 946048
6075 946048 943945 914758 921772 992860 963004 1026549 1093903 1047636 1068071 1102817 1104026 1098099
6063 1098099 1129884 1174072 1158112 1261702 1323581 1329273 1334131 1347178 1323949 1351457 1352958 1382296
6051 1382296 1401114 1381116 1410432 1499819 1505842 1541773 1550298 1579506 1628271 1690677 1721382 1804462
6039 1804462 1857298 1869310 2007752 2110471 2218636 2344669 2366927 2483320 2529317 2621604
6029 2621604 2759849 2956915 3113410 3356524 3655358 3895310 4122582 4128716 4032470 3802387
6019 3802387 3677973 3480461 3299949 3203826 3182239 3166446 3137791 3211690 3383605 3471797 3667510
6008 3667510 3804889 4073670 4467766 4734765 5001244 5140862 5271134 5359111 5410480 5403558
5998 5403558 5272499 5248155 5133892 4964262 4800456 4653978 4498534 4380789 4272533 4186667
5988 4186667 4107891 4127423 4197277 4241280 4292636 4379705 4523231 4730856 4968745 5224636 5494801
5977 5494801 5826346 5985773 5999099 5847262 5510983 5270882 5143374 5039786 4966899 4998826
5967 4998826 5063425 5062072 5004483 5059729 5048848 5104635 5032123 5070791 5222439 5384863 5504783
5956 5504783 5609259 5710874 5814263 6003605 6116421 6330183 6477019 6668966 6793935 6951878
5946 6951878 7189121 7409322 7617853 7881149 8213649 8584208 9017377 9347679 9760960 10254410
5936 10254410 10627286 10803162 10850956 10893674 10870778 11053146 11260754 11482305 11830333 12263658
5926 12263658 12761253 13238434 13857007 14485823 15239484 16012106 16937203 18004342 19225875
5917 19225875 20442067 21726869 23165234 24599177 25982373 27275647 28561256 29961678
5909 29961678 31609810 33611559 36043839 38822448 42032292 45498628 48470766 49775370
5901 49775370 48554462 45194066 41368717 38071526 35566747 33869671 32832100 32359382
5893 32359382 32497328 33131988 34232157 35841767 38012035 40375527 42784283 44813836
5885 44813836 46248286 47034809 47428132 48136254 49663250 52510580 56585051 61958980 68538532
5876 68538532 75370867 80829961 82130008 77673890 69168072 60076297 52323537 46272899
5868 46272899 41856588 38468105 36016148 34428474 33477581 33171527 33344427 33843696 34603095
5859 34603095 35413377 36069172 36409988 36393318 36243629 36329492 36760342 37599499 38759713 40615146
5849 40615146 43125565 45557538 47041977 46322632 42943209 38076670 33208330 29050383
5841 29050383 25781627 23246812 21288241 19797780 18581003 17562269 16725062 16113121
5833 16113121 15637762 15243495 14951045 14777028 14480878 14045836 13603963 13210085 12946166
5824 12946166 12753807 12614432 12584679 12426931 11934630 11107647 10250800 9577310 8983062 8504847
5814 8504847 8150549 7759046 7496649 7292588 7136608 7030489 6959290 6793976 6701502 6615138
5804 6615138 6598983 6608619 6662779 6659649 6559169 6519025 6495004 6383629 6366057 6443141 6545839
5793 6545839 6620284 6640343 6570971 6416666 6189663 5916666 5568208 5210219 4983725 4756603
5783 4756603 4628562 4507141 4469990 4385619 4398652 4363580 4312190 4294856 4153947 4067750 4004907
5772 4004907 3869486 3745858 3551813 3472521 3305461 3171073 2963814 2864575 2822417 2769703
5762 2769703 2760711 2662820 2655566 2584559 2519060 2454929 2358179 2323243 2324978 2274508 2255767 2243600
5750 2243600 2183106 2153412 2149518 2085581 2041874 2066074 2010966 1917480 1872005 1805424 1806916 1828640
5738 1828640 1829498 1841968 1815575 1725708 1680927 1727036 1727015 1723246 1756666 1761835 1726821 1674668 1643087
5725 1643087 1655666 1662590 1698756 1672802 1624602 1700661 1700500 1687638 1715180 1775000 1753218 1773498
5713 1773498 1757189 1762162 1783358 1704280 1679346 1625205 1627601 1662089 1568097 1476352 1504641 1434206
5701 1434206 1424230 1425831 1399564 1367818 1401483 1478164 1546680 1583021 1562984 1630950 1638367 1643821
5689 1643821 1749741 1798688 1865646 1890564 1917559 1862053 1760771 1677721 1654303 1545200 1498844
5678 1498844 1436397 1378174 1364228 1309161 1328763 1338744 1367272 1337741 1326768 1382004 1431157 1452400
5666 1452400 1471774 1484516 1442667 1417477 1502249 1624468 1648689 1610849 1558698 1530950 1470212
5655 1470212 1435395 1436252 1381694 1378572 1363072 1303549 1306207 1234847 1212933 1252335 1258263 1262666 1270336
5642 1270336 1304586 1311378 1369881 1403260 1356206 1426163 1454754 1482220 1556860 1585394 1628149 1527446
5630 1527446 1503613 1462820 1484046 1427202 1424220 1453740 1458631 1449405 1463117 1444737 1463835 1503092
5618 1503092 1516305 1482480 1570698 1594657 1571909 1584548 1589774 1639309 1618966 1588446 1640888 1700249
5606 1700249 1703279 1723932 1816643 1870691 1882169 1882331 1893583 1916072 1907034 1882877 1897075 1953409
5594 1953409 1972318 2014528 2075328 2141405 2144152 2152513 2150350 2217851 2275630 2353077 2422844 2494416
5582 2494416 2515276 2599422 2677973 2710209 2723671 2759489 2854526 2925210 2988858 3005115 2992802
5571 2992802 3045943 3178876 3256963 3309827 3337348 3381201 3418899 3490953 3555298 3624586 3675819
5560 3675819 3746321 3796531 3854679 4005529 4141985 4252258 4419381 4565893 4662627 4788495
5550 4788495 4951126 5182209 5335717 5518573 5750169 6059851 6372341 6768139 7105940 7559925
5540 7559925 8036442 8211255 8177401 8088355 8020157 8101189 8161788 8294038 8528402 8707305
5530 8707305 8880472 9125416 9393809 9591055 9883510 10219697 10583639 11038544 11479656 12021723
5520 12021723 12597249 13236568 14012154 14854956 15878714 17063148 18471768 20090408 22150414
5511 22150414 24550016 27398294 30661880 34076020 37104048 38995416 38870674 36841964
5503 36841964 33669152 30582403 28008524 26032326 24693108 23781956 23221811 22877764 22731346
5494 22731346 22835292 23159629 23756955 24679073 25818920 27322132 29069866 31233377 33917706
5485 33917706 37309646 41418245 46503938 52412667 58799125 64852973 69005886 69451890
5477 69451890 65597000 58777357 51245038 44449461 38910757 34553212 31227550 28619961
5469 28619961 26588163 25065649 23870279 23047400 22510354 22187095 22117913 22225790 22514269
5460 22514269 23088962 23881888 24939491 26425145 28432167 30899430 33685388 36436238
5452 36436238 38578414 39126228 37434582 33873505 29755662 25888262 22645607 20056563
5444 20056563 17943145 16172602 14682317 13456096 12516917 11654486 10941926 10308520 9783112
5435 9783112 9343337 8856800 8489114 8132756 7883722 7587556 7315759 7083706 6877709 6728304
5425 6728304 6544027 6461846 6321312 6173467 6134590 6029875 5916658 5693341 5530673 5448242
5415 5448242 5251635 5026462 4852327 4670672 4474325 4350994 4217791 4090815 3945427 3847192
5405 3847192 3846047 3792629 3656096 3624272 3600884 3578776 3514118 3519533 3492885 3474463 3521341 3497323
5393 3497323 3468363 3447924 3485507 3462856 3383008 3267327 3165981 2981426 2865504 2773824 2754494
5382 2754494 2665558 2630785 2541275 2522950 2582734 2585543 2583405 2542533 2525620 2522599 2553255 2619614
5370 2619614 2690761 2795512 2938252 3042507 3141158 3189939 3200924 3097296 2975144 2912486
5360 2912486 2781878 2667086 2664197 2687815 2671624 2562493 2562630 2539014 2510072 2523116 2519485 2556563
5348 2556563 2571806 2607785 2729775 2769227 2850410 2973056 3155646 3345811 3559503 3785048
5338 3785048 3922535 3953611 3810731 3716720 3562946 3341287 3268974 3232467 3253986 3245267 3219271
5327 3219271 3279847 3327456 3310398 3291391 3197619 3129292 3135895 3158039 3196155 3237586 3365113
5316 3365113 3531888 3723050 3926959 4238683 4527515 4786514 4985489 5022008 4935015 4718705
5306 4718705 4602872 4420698 4216008 4045264 3917367 3853469 3829168 3821795 3804806 3804978 3677623
5295 3677623 3533266 3457589 3406429 3373679 3312009 3346840 3420851 3526692 3636501 3732412 3909697
5284 3909697 4096364 4135009 4229002 4374726 4514244 4724655 4924383 4980492 4878679 4523525
5274 4523525 4101125 3781061 3608434 3463016 3279928 3200736 3050418 3002504 2939794 2868809
5264 2868809 2818737 2726621 2610512 2594622 2620832 2656726 2656464 2660043 2657066 2661173 2677491 2657079
5252 2657079 2666021 2791899 2943950 3167443 3260445 3188046 2990902 2713508 2536161 2403093
5242 2403093 2246788 2155618 2019919 2003514 2098781 2039162 2047169 2126384 2065894 2114848 2108477
5231 2108477 1956560 1855037 1780492 1775504 1693852 1619616 1638887 1720126 1689973 1692381 1644746
5220 1644746 1636049 1682206 1620023 1550169 1521883 1545310 1585448 1563935 1581061 1618468 1554859 1630358
5208 1630358 1678638 1729883 1825337 1978647 2110718 2257642 2402959 2505967 2709040 2922776
5198 2922776 3139284 3283513 3403991 3481039 3444615 3288873 3075886 2829433 2509555 2279612
5188 2279612 2106834 1861887 1662271 1575291 1463275 1438929 1318969 1206788 1112778 1047800
5178 1047800 1009931 977455 964270 945927 979837 922697 924738 879986 814839 810055 788924 766048
5166 766048 756444 744681 754175 799270 828123 815936 783452 729644 789734 804309 805095 823670
5154 823670 815793 869758 892772 815505 729981 679388 711874 639189 635876 674952 701365 716885
5142 716885 682022 657660 695076 650448 645640 664524 617593 547494 527044 535992 503831 547915
5130 547915 546521 553181 598754 587140 617633 578958 519974 537628 484080 489425 457116 442806
5118 442806 408508 409042 426146 400844 387812 322679 294079 323237 280434 352735 356099 339942
5106 339942 389497 369970 363491 345104 415934 440758 356145 290074 305033 273450 286097 282354
5094 282354 288980 277162 282945 272693 306549 317301 249690 228933 286810 274456 276159 318879
5082 318879 273688 227455 257611 316429 267649 253186 233115 207851 237024 256808 203584 250867
5070 250867 243455 227432 189716 275919 212866 225241 244938 223970 205625 201212 199275 195905
5058 195905 263185 282171 226640 158508 185654 166661 190806 202114 184917 215202 235152 184329
5046 184329 192101 225165 223176 196389 261947 270601 299111 261387 295192 255268 168873 199244
5034 199244 279488 242156 258682 254246 256306 242296 183370 212446 225906 246331 230884 189260
5022 189260 237562 259181 222433 208444 186602 183341 181414 178000 237033 214202 260836 251868
5010 251868 248309 232960 166541 237888 294095 353826 283270 245346 216458 235669 228597 282324
4998 282324 215880 221308 225689 182810 206122 279812 320604 301972 303571 231239 161938 150236
4986 150236 155296 207680 187637 209991 239697 273321 279271 304294 340211 291770 266318 271576
4974 271576 287312 322190 334587 233960 195974 183125 227310 271373 282030 289654 306126 309377
4962 309377 286166 287643 288542 244714 198686 221366 256152 286374 283648 352783 307414 258447
4950 258447 255002 261614 251623 292600 390921 379555 338066 353026 275347 255680 291491 300599
4938 300599 316889 300547 266406 239559 183237 218782 288759 238258 294386 320861 299163 259241
4926 259241 217044 246446 322286 327820 252697 263953 319617 260295 256996 281501 277946 273926
4914 273926 284358 303548 276882 334738 310857 300064 369391 357735 339985 288412 315791 285338
4902 285338 336683 331937 298382 288535 331429 331054 388547 354354 360238 390913 381613 405936 370367
4889 370367 362615 353341 327230 311240 284388 338106 360153 356856 366379 390309 355469 325554
4877 325554 350319 324321 298069 312285 307647 312180 274593 248140 281399 328537 331620 315287
4865 315287 320963 323759 291587 256292 331024 261857 325680 336951 299249 311895 275163 298097
4853 298097 323949 288576 281672 356137 366535 377553 422007 333121 351750 358104 324376 286649
4841 286649 304486 357320 366551 338567 347157 359858 376627 361620 325133 302833 336489 363304
4829 363304 337866 337135 319135 346970 362316 359339 358448 342506 431946 408624 461536 467979 441356
4816 441356 468758 426704 375236 420219 463836 353517 348963 418819 442198 453509 443618 403414
4804 403414 368285 297646 389649 435925 455314 401621 395751 374304 298956 331936 361515 382260
4792 382260 374850 377894 453553 497648 472435 432657 454180 416958 367016 393926 469822 419249
4780 419249 437520 461587 388259 407826 438410 379442 368674 364244 368942 376749 411054 419376
4768 419376 447353 484890 462279 520364 518181 518163 547668 503815 505497 620675 614837 622184 618452
4755 618452 617856 586093 600156 545907 568119 548767 518263 535903 484407 435288 465506 471592
4743 471592 493408 492684 564047 582124 502155 525455 524439 575037 599507 616090 534685 536502
4731 536502 576384 600031 602827 581302 540372 554019 550698 559902 615170 638759 603095 550458
4719 550458 544536 620586 672114 633526 614134 581605 600304 621223 634420 589788 539068 556600
4707 556600 643134 625975 626977 668494 676252 744333 750699 699749 739694 747350 758090 782615
4695 782615 862042 865624 855025 860120 826174 851965 838945 788262 810910 794705 726686 738356
4683 738356 728014 715835 781715 885024 832750 760426 746806 788559 784978 815374 868669 809494
4671 809494 827796 861397 915470 937490 870638 837042 848399 869651 916593 923068 921628 955416
4659 955416 982795 940303 942533 928210 882036 842565 873368 907921 950277 1013185 998166 1003899
4647 1003899 1022062 1037859 995178 1050823 1056261 1063000 1077755 1097539 1050660 1096172 1066960 1093586
4635 1093586 1152774 1151619 1173492 1174292 1173222 1194969 1158517 1112233 1158871 1215386 1252325 1245461
4623 1245461 1263027 1256447 1242874 1258710 1290544 1307977 1291603 1299826 1325169 1351934 1390711 1341940
4611 1341940 1319522 1367725 1415905 1468370 1451367 1455898 1460217 1488830 1511545 1559341 1559797 1550212
4599 1550212 1538908 1545061 1615418 1678470 1672787 1658514 1675342 1677792 1664927 1661249 1657684 1769892
4587 1769892 1815018 1800606 1853224 1877393 1859395 1900246 1929397 1929086 1958621 1920872 1958503 1970069
4575 1970069 1995497 2015826 2074550 2113922 2153347 2130206 2179870 2220068 2173272 2261326 2340030
4564 2340030 2362366 2332643 2250312 2307273 2380276 2463046 2440223 2471614 2508743 2556067 2663085
4553 2663085 2689271 2669703 2724471 2755531 2792272 2783966 2843456 2918519 2923177 2953007 2968180 3009027
4541 3009027 3074803 3137719 3179031 3237477 3279302 3352777 3413057 3452934 3476451 3543969 3579905
4530 3579905 3595933 3666505 3701641 3706486 3801096 3826958 3889975 3945848 4037944 4127931 4213103 4290921
4518 4290921 4299398 4292063 4367956 4495332 4532373 4530290 4649457 4772893 4775444 4915457 4973055
4507 4973055 5126398 5301937 5365459 5454186 5554749 5673957 5786683 5793615 5883754 5934464 5911270
4496 5911270 5965204 5946429 6041260 6144784 6156583 6321279 6394465 6517301 6648967 6758402
4486 6758402 6845416 6890568 6977708 7070629 7198134 7324942 7453821 7576450 7695759 7794372
4476 7794372 7937312 8046969 8136540 8217348 8360093 8498080 8641067 8754801 8844902 8960688
4466 8960688 9111991 9267493 9472799 9734181 9875095 10044809 10162222 10174743 10249496 10325835
4456 10325835 10435050 10515084 10616135 10768255 10880057 10996049 11087203 11149063 11291367 11413962
4446 11413962 11562890 11631749 11683708 11847403 11856482 11934659 12076434 12125638 12134284 12210644 12330232
4435 12330232 12400299 12450801 12519134 12655968 12694440 12810420 12953031 13030898 13136097 13283268
4425 13283268 13390388 13480423 13547510 13537179 13490682 13351853 13175662 12920779 12745027 12559133
4415 12559133 12367609 12221589 12106496 12039864 11984335 11930285 11793905 11679971 11571642 11555318
4405 11555318 11532024 11424898 11285517 11230743 11171452 11194473 11193268 11074372 10903077 10833773 10909904
4394 10909904 10922528 10871897 10903641 10900484 10949220 11094370 11246707 11461667 11644987 11845789
4384 11845789 12055195 12170392 12244944 12244520 12394535 12707721 13163277 13720209 14327067 14850890
4374 14850890 15046085 14607627 13699532 12880205 12075246 11399273 10830012 10405413 10105794
4365 10105794 9877489 9695905 9589095 9585108 9657543 9871604 10061893 10284700 10590244 10864431
4355 10864431 10958419 10863349 10745094 10471601 10040408 9652841 9229568 8792991 8418736 8139628
4345 8139628 7867507 7699863 7563325 7494188 7415401 7347283 7248665 7165116 7160771 7092351 7068995
4334 7068995 6983805 7015576 7030004 7146748 7361701 7518402 7675919 7787411 7789670 7585276
4324 7585276 7398522 7100891 6802086 6609969 6439640 6359757 6228671 6197551 6240933 6208316
4314 6208316 6114765 6137761 6180035 6321836 6486108 6677472 6886446 7125425 7458222 7764743
4304 7764743 8050129 8320730 8611917 8856844 9120485 9158847 8992046 8834016 8739670 8646824
4294 8646824 8431780 7925270 7250776 6747582 6326679 6076363 5839098 5674903 5540503 5434904
4284 5434904 5452488 5395803 5300757 5376085 5483456 5585235 5702468 5849652 6016954 6149726
4274 6149726 6216978 6196903 5964027 5624066 5435876 5299106 5087677 4983157 4958262 4883922
4264 4883922 4796726 4751732 4748778 4772203 4744004 4846476 4906783 4940009 4998140 5010597 5027265
4253 5027265 5087386 5125454 5189234 5250255 5342007 5538496 5734029 5882470 6155523 6414787
4243 6414787 6737304 7164156 7507438 7722762 7640635 7376966 7148384 6930641 6807465 6696464
4233 6696464 6618641 6573173 6566445 6606524 6634143 6666999 6673784 6697728 6745546 6791647 6925540 7062843
4221 7062843 7262788 7442127 7571659 7811707 7985930 8167976 8408938 8625311 8875809 9185093
4211 9185093 9530230 9912898 10318048 10693592 11065628 11293410 11283799 11182960 11102345 10995992
4201 10995992 10975544 11169650 11256334 11495771 11680667 11899358 12080135 12296306 12493548 12627792
4191 12627792 12826109 13062976 13359783 13613225 13888441 14198627 14413635 14826231 15168045
4182 15168045 15530277 15930657 16342993 16757817 17179072 17720427 18328135 18839398 19553839
4173 19553839 20369395 21314658 22421606 23547221 24538260 25451909 26421065 27358496 28219269
4164 28219269 29134750 30084794 31044945 31970274 33048391 34120061 35387427 36789308 38464366
4155 38464366 40247232 42353153 44781966 47683025 50957548 54791533 59130937 64264645
4147 64264645 70332097 77730064 86554435 97028529 109186611 123350555 139716535 159416478
4139 159416478 183417092 212133450 242653324 268659313 280486167 271063165 243873426
4132 243873426 206412490 170398913 140432915 117218053 99751516 86389633 76086152
4125 76086152 67937335 61430025 56275081 52140956 48670053 45715657 43133685 40708539
4117 40708539 38606641 36717538 34987578 33441692 31908823 30520419 29152660 27872859
4109 27872859 26794135 25795565 24881959 24100301 23350165 22709518 22130447 21503404 20844695
4100 20844695 20351549 20052247 19780590 19567165 19427542 19540533 19708368 19945455 20163790
4091 20163790 20440594 20920949 21685640 22909180 24446798 25844739 26538952 25914731 24067033
4082 24067033 21867389 20100582 18946288 18276947 17823179 17515439 17238788 16920606 16474085
4073 16474085 15977632 15151195 14334697 13597079 12836244 12196237 11744801 11347208 10955519
4064 10955519 10631553 10302908 9957088 9766749 9663162 9594773 9490560 9194782 9064888 8962988
4054 8962988 8932599 8850611 8869175 8952198 9052224 9056325 8977614 8830954 8563110 8198215 7840044
4043 7840044 7612233 7378476 7251578 7178553 7057549 6982809 6947527 6969463 6890368 6972811 6970303
4032 6970303 7051416 7128747 7239268 7373992 7484037 7685359 8032004 8328860 8557413 8810440
4022 8810440 9119373 9358499 9500580 9336511 9046500 8696719 8416782 8150246 7961067 7861718
4012 7861718 7767588 7873434 7954933 8020893 8044850 8106319 8059171 8058464 8100383 8101307 8185837 8262133
4000 8262133 8377489 8570289 8751492 8872615 9140395 9390611 9756466 9909733 10026486 9946404
3990 9946404 9632834 9322013 9045380 8841440 8652571 8564193 8610406 8689682 8868932 9020290
3980 9020290 9180807 9430458 9724901 10009992 10303290 10612185 10907173 11235643 11415686 11599934
3970 11599934 11804921 11923091 12026035 12161747 12254686 12359433 12538942 12608562 12696560 12960339
3960 12960339 13251077 13649462 14216797 14894627 15618951 16596946 17788274 19089578 20529549
3951 20529549 21882440 22738707 23211063 23377396 23536620 23991409 24902218 26198009 27637443
3942 27637443 28638206 28648047 27361000 25334368 23649658 22431865 21716451 21503577 21707766
3933 21707766 22168217 22934888 24012989 25454925 27351311 29825881 32855983 36374497
3925 36374497 40041082 43162591 44950147 44424671 41811065 38284159 34869924 31892831
3917 31892831 29541152 27640453 26141997 25081776 24315022 23676070 23353369 23271642 23427291
3908 23427291 23776073 24451301 25391199 26588724 28144567 30103813 32427223 35422413 39062398
3899 39062398 43329162 47983070 52418340 55361690 55661810 53142153 48470652 43043782
3891 43043782 38015032 33934620 30663009 28109976 26088140 24465281 23168924 22154772
3883 22154772 21456731 20998346 20769293 20780463 20947396 21363697 21988168 22820472 23930955
3874 23930955 25425110 27382785 29721642 32366879 35102954 37322863 38319953 37322595
3866 37322595 34461887 30727409 27025275 23883071 21275091 19248133 17640467 16292581
3858 16292581 15197189 14367307 13626309 13083185 12633747 12276208 12099741 11941221 11985798
3849 11985798 12066393 12211384 12443374 12799582 13280618 13767425 14128890 14420319 14545692 14234545
3839 14234545 13421179 12306990 11210422 10189086 9258706 8542072 7970523 7483387 7108170
3830 7108170 6751017 6416198 6158975 5937845 5674016 5503506 5395379 5271579 5131745 4982125
3820 4982125 4835641 4748628 4664227 4547303 4482090 4386685 4315181 4282700 4233563 4154736 4123287
3809 4123287 4074226 4021164 4034740 3966113 3922501 3932315 3912193 3879480 3900526 3953420 3990967 4045450
3797 4045450 4060603 4016059 3946023 3912770 3857592 3888664 3782890 3680300 3562393 3414991 3377893
3786 3377893 3348834 3274866 3325076 3381471 3319453 3298872 3293891 3279491 3250107 3200273 3145346 3109964
3774 3109964 3087925 3150086 3210505 3242828 3279850 3271712 3388891 3404951 3346886 3350333 3347876 3284903
3762 3284903 3221086 3257656 3199909 3184962 3182685 3138657 3173610 3203240 3252101 3250774 3306772 3224515
3750 3224515 3093949 2995334 2883246 2817098 2851997 2827600 2807884 2795270 2802970 2892925 2961352
3739 2961352 2944231 2967819 2949409 2974296 3007300 3033424 3128341 3262326 3254061 3302433 3393078
3728 3393078 3338674 3310423 3247936 3204021 3067273 2904830 2813996 2738991 2658942 2577388 2502314
3717 2502314 2513049 2433844 2460042 2470347 2427891 2407831 2404411 2397158 2492288 2542718 2578579 2599719
3705 2599719 2636098 2684467 2823239 2869585 2851004 2835886 2814731 2724875 2677238 2626854 2621834
3694 2621834 2608042 2644492 2748134 2833970 2798120 2748221 2716472 2632466 2561806 2425608 2362932
3683 2362932 2258911 2181285 2129460 2168649 2210254 2237384 2256756 2337709 2333531 2338669 2365474 2268543
3671 2268543 2249969 2221219 2145896 2120274 2076801 1994283 1994545 1984684 1923350 1902341 1899875 1895082
3659 1895082 1901653 1836277 1865099 1860447 1835381 1773738 1739564 1770502 1797944 1804571 1838474 1891811
3647 1891811 1918318 1973905 1933898 1913918 1901263 1956203 1988441 1948689 1913269 1987752 2003264
3636 2003264 2083248 2182120 2225963 2316305 2330928 2382502 2462991 2518254 2451215 2299683 2207156
3625 2207156 2160301 2044151 1922525 1842899 1855732 1833434 1766515 1730906 1749220 1776381 1772677
3614 1772677 1737588 1768739 1825194 1793936 1752546 1769617 1763963 1824636 1815031 1766551 1750603 1654615
3602 1654615 1684579 1675601 1618840 1607415 1639867 1598957 1611757 1629463 1586179 1550718 1533992 1571137
3590 1571137 1650445 1635442 1629473 1671488 1614201 1611221 1631105 1618819 1636524 1640158 1628059 1652787
3578 1652787 1672339 1655741 1655017 1615900 1554260 1576154 1557276 1555995 1597409 1570032 1549530 1532521
3566 1532521 1513707 1507576 1557457 1562453 1527724 1580235 1558581 1514732 1544793 1552469 1496513 1513555
3554 1513555 1623194 1628418 1667151 1677482 1662727 1604281 1647346 1673682 1667263 1678688 1651730 1759463
3542 1759463 1755785 1712575 1710722 1624222 1672314 1677218 1654658 1616324 1584490 1588529 1627572 1575096
3530 1575096 1571416 1546559 1589804 1579095 1594811 1590860 1629334 1706726 1678453 1644444 1623011 1695349
3518 1695349 1734199 1738019 1759785 1778915 1770952 1846394 1903157 1977917 1949503 1914602 1892375 1796060
3506 1796060 1772922 1777218 1800799 1809163 1814333 1867540 1879554 1855899 1822684 1891714 1859018 1843158
3494 1843158 1867798 1919639 1922277 2002455 2040978 2152598 2200108 2297003 2452456 2662809 2858007
3483 2858007 2964027 2878977 2738165 2554272 2405332 2246963 2124724 2039145 1985249 1945626
3473 1945626 1903493 1936418 1932770 1908135 1904290 1849787 1806364 1833065 1798108 1792233 1823168 1834166
3461 1834166 1767514 1771066 1784564 1865117 1840856 1836117 1863232 1867285 1882792 1909130 1986091 2030873
3449 2030873 1937503 1976198 2070249 2070909 2030815 2080908 2068573 2032811 2037993 2076981 2121720 2160513
3437 2160513 2172472 2187748 2250059 2290702 2339234 2352996 2443543 2560519 2639534 2715234 2801934
3426 2801934 2948374 3120324 3368265 3649508 4041841 4474550 5017946 5347565 5289329 4897690
3416 4897690 4350572 3925396 3586143 3309600 3169015 3102126 3043918 3019055 2961127 2941337
3406 2941337 2945430 2974870 2993861 3020217 3041704 3157572 3295943 3355768 3446821 3626917 3791144
3395 3791144 4015250 4244511 4559404 5024879 5653508 6379283 7318436 8246214 8817399 8664648
3385 8664648 7698196 6599773 5808535 5216607 4765747 4449480 4279257 4131688 3894344
3376 3894344 3758186 3665110 3590371 3574116 3505652 3537051 3590365 3571209 3659582 3741780 3736751
3365 3736751 3888899 4008861 4105587 4226721 4387007 4639295 4931805 5368915 5880863 6279870
3355 6279870 6526548 6503265 6083547 5589647 5215111 4987012 4830958 4664568 4506248 4473141
3345 4473141 4359745 4317555 4278909 4178515 4116675 3993362 3977018 3973230 3901307 3896957 3890637
3334 3890637 3896293 3930012 3949759 3922907 3902077 4017760 4076027 4124094 4245024 4281927 4277900
3323 4277900 4264309 4212957 4141101 4137465 4134635 4183381 4239325 4262798 4305665 4337153 4319038 4393503
3311 4393503 4503487 4543529 4533206 4604549 4698918 4716097 4795600 4901153 4971735 5151669 5319149
3300 5319149 5343414 5501838 5665128 5859072 6108364 6335362 6590840 6797424 6859779 6826832
3290 6826832 6628434 6510872 6413256 6310335 6270066 6268202 6367514 6353668 6356315 6364728 6432883
3279 6432883 6446781 6534993 6645482 6667701 6752566 6828317 6956887 7079615 7221961 7410946
3269 7410946 7651620 7765999 7846562 8008475 8232309 8543412 8848555 9117473 9423549 9706867
3259 9706867 9880794 9868768 9839574 9851524 9874812 10051498 10276160 10498726 10763358 11157608
3249 11157608 11513626 11951973 12473864 13053806 13651746 14252877 14902111 15620200 16313705
3240 16313705 16860517 17333956 17707794 17786451 17539166 17055582 16328916 15533952 14718174 13919049
3230 13919049 13088209 12359402 11685598 11037172 10484810 9954180 9453611 8991372 8654289
3221 8654289 8345030 8013108 7705531 7444460 7241746 7057764 6829241 6638560 6488491 6332869
3211 6332869 6189865 6110107 5960457 5867363 5839977 5733573 5661370 5557816 5450437 5366886
3201 5366886 5295425 5142654 5110407 4960379 4841400 4730421 4562854 4493157 4470353 4396633
3191 4396633 4358779 4350029 4224067 4192210 4107798 4026255 3911850 3798509 3758208 3723430 3673393
3180 3673393 3703210 3636541 3553846 3459606 3425468 3482784 3397326 3338873 3322729 3269361 3261411 3198453
3168 3198453 3201058 3231494 3255262 3239887 3212020 3091559 3034445 3033608 2993474 2953639 2898388 2891241
3156 2891241 2826741 2795813 2812977 2791304 2776299 2757318 2704822 2665228 2611332 2627831 2581309
3145 2581309 2573144 2566013 2548863 2524429 2452079 2396844 2420368 2397160 2451286 2471972 2424019 2432956
3133 2432956 2419093 2350549 2391947 2398908 2384718 2312496 2212978 2210421 2223535 2183385 2153548 2138196
3121 2138196 2150485 2173730 2163171 2125327 2179958 2187669 2146777 2112168 1998110 1966498 2028003
3110 2028003 2006596 2039310 1995024 2009799 2002926 2034904 2027574 1964876 1995601 1993194 2024545 1999670
3098 1999670 1996174 1976946 1987537 1885770 1885347 1848898 1885937 1934348 1886961 1873239 1893519 1844080
3086 1844080 1873216 1880194 1879050 1808076 1764810 1772698 1780180 1830930 1806928 1758686 1736637 1776093
3074 1776093 1776077 1669133 1690380 1715919 1731123 1690410 1688759 1718907 1792440 1794802 1753442 1666376
3062 1666376 1668037 1714150 1732101 1717926 1685424 1730371 1715454 1736553 1732349 1701324 1589760 1615739
3050 1615739 1598718 1604840 1676219 1678701 1680113 1630016 1624315 1656858 1630612 1643474 1656942 1619174
3038 1619174 1572396 1669481 1710908 1674605 1604635 1582547 1649350 1712632 1696667 1720386 1703565
3027 1703565 1767350 1794503 1725684 1671242 1699590 1773127 1761770 1779568 1727964 1751950 1789958
3016 1789958 1779020 1776049 1791745 1843723 1893821 1931919 1957827 1991914 2022064 2077897 2150766 2188746
3004 2188746 2263828 2312784 2398652 2413595 2381260 2415804 2452061 2426568 2438325 2363811 2378375
2993 2378375 2403876 2404118 2448458 2471761 2444153 2400464 2481735 2526521 2485537 2457024 2488682 2485566
2981 2485566 2564742 2618615 2628970 2692731 2775078 2796283 2758809 2896973 3012231 3114658 3187842
2970 3187842 3280323 3466182 3659168 3793365 3858152 3905718 3823452 3852329 3836301 3779914 3657416
2959 3657416 3601640 3581627 3527965 3535855 3612519 3628264 3605835 3558688 3448777 3335140 3253469
2948 3253469 3268721 3242151 3182082 3268739 3270035 3244498 3284850 3353935 3460237 3495412 3598247
2937 3598247 3686750 3764597 3881575 4012910 4099944 4255801 4323610 4405505 4513308 4570922 4572705
2926 4572705 4593948 4569335 4526142 4564419 4593785 4696242 4723107 4729159 4718898 4711127 4654173 4570332
2914 4570332 4594406 4544006 4605968 4674190 4698696 4769998 4826174 4890530 4984207 5115801 5222076
2903 5222076 5360234 5500486 5664226 5820299 5929170 6087974 6209839 6220895 6219500 6139927
2893 6139927 6032601 5849360 5669688 5498160 5396412 5263480 5207068 5156707 5126575 5165191
2883 5165191 5162515 5153415 5200000 5319542 5357186 5340700 5369304 5441575 5477485 5548650 5627677 5634330
2871 5634330 5645548 5616342 5630079 5619695 5489738 5432844 5297194 5131722 4975928 4801494
2861 4801494 4742353 4574394 4455428 4356709 4265996 4217925 4165301 4120044 4089484 4044215 3951916
2850 3951916 3946103 3872964 3810843 3786583 3723656 3608948 3523550 3444836 3380254 3288319 3159341
2839 3159341 3040564 2942190 2882500 2833976 2692162 2647361 2560751 2475323 2424749 2401140 2285659
2828 2285659 2251995 2265330 2190429 2098243 1991502 1993812 1987408 2002696 1958969 1963372 1875304 1810188
2816 1810188 1776240 1814560 1847487 1783390 1757169 1777798 1756399 1673122 1651201 1659139 1629545 1559289
2804 1559289 1506087 1523727 1464688 1406548 1441071 1397020 1365734 1336074 1274763 1244992 1257071
2793 1257071 1291296 1321304 1192258 1140558 1170602 1185401 1185050 1169515 1168138 1143574 1111663 1130731
2781 1130731 1105300 1104873 1060140 1053198 1056888 1020558 992885 992820 1022533 993880 936412 915518 943945
2768 943945 1022769 1013622 911384 868318 899577 829903 838129 811216 734205 695772 692570 750134
2756 750134 752893 751981 689377 710433 704145 664525 701244 695010 713107 719495 683683 657478 575085
2743 575085 555443 533804 607477 653297 610628 578150 531755 499469 475294 479828 530496 544515
2731 544515 538651 510089 529865 533893 536014 542608 522986 581462 546407 493203 507131 494809
2719 494809 439027 398102 439109 457667 448723 396285 399004 408606 413145 412938 382320 430305 433543
2706 433543 420930 433250 405419 332753 348729 376471 429801 474808 422549 408809 392199 413187
2694 413187 401388 389252 358766 319721 299017 359494 397772 392149 384752 436968 367554 341158
2682 341158 361523 346960 302435 301297 251723 326445 349929 328571 361841 355707 373290 401324
2670 401324 436108 376624 319386 375840 388457 376610 409411 365807 390556 361838 371018 427232
2658 427232 454810 454191 432578 433849 407805 400410 424997 428192 468853 494339 513408 532236 515890
2645 515890 547210 529521 477777 547655 535151 523831 538747 581185 551757 534304 557858 508045
2633 508045 507093 570582 606122 644268 604437 577414 564318 639004 717172 725148 774858 731639
2621 731639 760894 770324 751342 731260 756873 780605 772455 801012 773582 760181 778994 790985
2609 790985 767754 779482 837644 850166 830269 839008 812532 833095 754256 718883 733573 750999
2597 750999 788367 814477 821236 823933 879994 899130 846986 896007 900219 954497 950795 949337 1004967
2584 1004967 958413 873198 819350 881844 857756 833689 822525 781374 764469 811467 789121
2573 789121 787643 791815 763027 835907 761550 755600 743650 706738 723980 752599 740358 741846
2561 741846 695171 700264 689217 713281 735803 767591 701051 704426 733606 744581 769203 720131
2549 720131 707311 596665 638700 537156 503195 519961 470176 476755 510186 505947 516028 518037
2537 518037 453277 491304 497926 408091 412635 393060 417611 393127 402399 323362 346419 322597
2525 322597 273585 321740 384453 371420 337672 288649 209888 226266 295408 274175 218544 241552
2513 241552 277246 289400 298969 263005 184849 170295 230794 226815 174292 169835 223023 176858
2501 176858 146965 125532 109877 160433 199164 238611 182725 139614 124219 173528 180782 131805
2489 131805 148085 115929 114197 41697 81449 90783 39078 33550 48790 45752 77018 123281
2477 123281 94134 144742 71317 157804 175657 147678 148351 118622 118231 88492 62758 100686
2465 100686 91840 24704 30522 71379 102560 93198 57869 86689 109742 102182 63785 91921
2453 91921 56264 78812 73645 84243 69724 93190 126324 119011 51046 41228 112799 58556
2441 58556 44450 79708 89091 37126 20223 57844 79033 84075 50754 30413 32939 35108 106783
2428 106783 177975 156982 101197 120182 68707 56233 162277 152213 113131 120001 60470 26451
2416 26451 54682 37683 43826 65416 58913 49782 5069 70800 84518 115261 101748 9373
2404 9373 34375 34845 29242 72413 39588 58291 53806 75949 65402 41526 80329 78214 15998
2391 15998 55190 81578 74953 15462 -1222 84406 77768 41956 37538 50223 35661 57995
2379 57995 35255 15599 24839 65594 110189 108683 53253 18128 91227 82057 105878 141679
2367 141679 123308 165282 250083 290942 164436 84251 47451 125951 195064 131862 118331
2356 118331 106537 107820 56454 52936 79086 98036 83528 53505 102878 61064 4840 38862
2344 38862 66452 65650 73214 116812 114020 86701 61643 58121 48257 36124 67148 48097 34316
2331 34316 94748 102427 50262 55014 27768 97186 93118 51054 16393 -14895 -1651 11575
2319 11575 -3574 -26545 42750 81325 24615 31718 72629 76375 104238 77848 -7898 14249
2307 14249 37821 8475 21341 54287 92267 101357 12428 62704 63102 41384 46862 29740 72365
2294 72365 38895 71317 30213 41433 96342 40733 84901 94149 120223 49980 26265 62144
2282 62144 74810 63762 64080 28016 100598 144804 118106 121726 80984 52965 54474 126365 156664
2269 156664 128968 76188 111002 71248 48063 48773 5984 71171 84399 34811 74358 42688
2257 42688 49864 -10281 37358 50552 23570 73914 115585 128600 104979 123271 90102 65467
2245 65467 85720 97260 109380 83868 131016 113975 149912 138289 157707 140289 86947 73421
2233 73421 90431 141194 101728 122129 156349 190869 152778 147290 128480 160834 194469 181664
2221 181664 211252 178467 133847 165560 150254 90971 110142 114608 174261 185118 122011 135994
2209 135994 203185 153976 173462 182249 161838 175650 163222 151409 165954 128457 181100 271872
2197 271872 305802 289302 204007 197613 246712 208826 181950 244523 264505 316984 322199 311542
2185 311542 302361 333329 338005 383120 342827 346950 415390 419992 401057 406862 461694 494546 490166
2172 490166 535539 614794 608129 567178 574370 537023 537425 554302 507736 524740 586152 610884
2160 610884 593316 613402 665522 624108 618584 659552 627867 655553 625732 642559 660039 677633
2148 677633 683154 702376 758459 790081 824933 818872 832054 860274 934339 928473 981237 1036930
2136 1036930 1051259 1061997 1098195 1202915 1286976 1367804 1387440 1371550 1505131 1572091 1597728
2125 1597728 1706697 1814274 1916572 1939304 2022390 2089958 2278920 2448031 2536672 2651192
2115 2651192 2867528 3153298 3347218 3540685 3879610 4116293 4387268 4727535 5156914 5745528
2105 5745528 6491522 7302751 8453679 9977283 12285928 15398831 19236268 22583668 24133630
2096 24133630 22725687 17942413 13623923 10780551 8831561 7351068 6266188 5429519
2088 5429519 4776262 4298622 3985952 3790996 3567139 3355019 3174058 2946625 2717994 2491413
2078 2491413 2284502 2091591 2020962 1922972 1725840 1635091 1538500 1473898 1392021 1297627 1234309
2067 1234309 1227670 1201832 1173598 1160227 1075559 1019008 964068 920454 876788 816023 717539 722344
2055 722344 732744 692522 681108 682065 650346 642749 609413 614077 649450 600635 601552 554242 614623
2042 614623 587994 563253 552896 505372 487395 465931 487406 468914 457589 459848 409346 377053
2030 377053 372520 425588 369172 337279 298369 307122 223469 236701 299716 276156 251263 236510
2018 236510 186702 258965 284885 267316 286774 322961 271903 218230 232692 265180 251630 254097
2006 254097 226072 211773 212311 174318 196388 183570 178261 184596 140086 145737 170761 149281 149750
1993 149750 97884 77086 141764 140983 197886 181040 122794 182939 179223 113289 125024 166968
1981 166968 183986 147409 181466 241864 175715 97294 89524 118495 153094 170184 178661 136772
1969 136772 81397 152628 124209 22371 110714 207021 233068 191823 164910 141508 164093
1958 164093 112601 93964 124363 98063 124323 95454 143732 121704 139928 123126 67056 84815
1946 84815 83936 33369 15143 57429 81659 70701 63536 106126 118719 83928 114903 154605
1934 154605 107480 74158 74887 62904 30205 23140 99628 60504 21019 -6983 38683 51470
1922 51470 42685 -27097 27282 55086 74791 -3746 -63179 4583 -4480 -2271 10015 16483 23662
1909 23662 -7601 42919 38031 19035 67962 115415 184457 177970 149295 58527 100088 55927
1897 55927 3920 -33073 -28004 -2056 14259 26562 19672 5546 -42846 -7713 15598 41738
1885 41738 72336 27403 45278 51574 51699 101897 39132 103414 56080 81132 133975 104110
1873 104110 103549 55723 -24878 -21214 -33923 -30627 55691 53173 51030 44551 3600 -8564 -14106
1860 -14106 13725 -4204 -22044 -15600 37568 73374 112210 54452 40331 92158 75015 74576
1848 74576 28579 17567 20306 415 -5409 34380 22262 6563 -3081 45974 52830 3114 24014
1835 24014 66669 97346 75120 62649 62203 5503 -20640 47938 98292 107962 121270 89337
1823 89337 51528 14316 47044 43545 18389 42278 53984 34772 59916 38443 43551 59024
1811 59024 64511 71762 83059 61120 27298 44031 42305 -4523 -238 1455 36930 17870 -28063
1798 -28063 -6066 8886 -16689 -28611 -107082 -21935 69501 18551 -17102 -8898 19111 49252
1786 49252 41377 40946 36652 48407 41272 38562 -12798 -58370 -86725 -77134 -27244 -10109 44702
1773 44702 -10036 -39778 -31017 -9122 -13470 806 2720 21647 -8645 -78267 -60925 7025
1761 7025 -46605 -57585 -9083 -10287 80925 -10806 1503 45380 46480 27347 10592 25485
1749 25485 4908 60817 98357 11671 22149 37511 46241 32565 60939 42832 -4232 -8208
1737 -8208 -29774 -69767 -16513 26017 61927 48418 31910 -30548 -4572 -3199 -2244 19063 34871
1724 34871 25886 -26746 28428 49875 102221 64929 39160 -5973 27429 14664 45203 -19857
1712 -19857 -25977 -7282 14449 15743 44178 6213 -55343 -21888 -21766 -6133 16413 -24635 -30123
1699 -30123 -74235 4998 -15785 -12216 17491 -30886 -11521 9661 13579 13525 -16013 13791 54935
1686 54935 77953 11771 -98104 -67425 23663 -3073 21829 -2671 20276 27718 41774 62912
1674 62912 38422 -315 20504 1734 33673 19962 -4029 5546 8778 -45185 -73805 -9233
1662 -9233 8977 -27862 -18316 2095 25777 39949 31614 25351 -56862 -27957 10548 28234 51218
1649 51218 87793 64832 91224 71181 83284 63508 16661 21890 39332 -16479 4935 -21258
1637 -21258 -21193 -5076 -14760 -63228 -87375 -19259 -26186 -49825 -78164 -49219 -24533 10873 53882
1624 53882 53528 41331 5419 -14882 2016 3449 -2933 5425 -30707 11428 12683 5449 38481
1611 38481 24733 36896 68705 -9726 17164 15242 10649 7091 -24556 -26788 -7135 50369 52789
1598 52789 8457 -1421 -53930 21658 7051 -31883 -6906 -18019 -20288 -48038 -48054 19678 52346
1585 52346 26455 6808 19033 -9089 9903 3406 -2444 -58957 -67198 -83701 -75845 -40284 -26586
1572 -26586 -15193 21666 49466 21681 7075 3818 53603 17426 -31747 -62806 -76205 -55660
1560 -55660 -10293 -15208 -73510 -58129 -71480 -39215 -37013 -75893 -61133 -102671 -38440 -81430
1548 -81430 -60957 16442 -41145 -19928 45069 46108 56461 21462 17012 -32287 -37467 -44135 -8017
1535 -8017 32678 28821 7437 -51055 -87867 -34604 -30476 21764 35089 38806 20540 35823 39285
1522 39285 19738 65201 -4965 -39434 9710 5650 96604 77625 30215 -80523 -83137 -7014
1510 -7014 86759 79339 32052 11836 -63084 -53605 -25126 11254 -7543 4199 28982 47679
1498 47679 79743 64132 63560 52589 28654 16811 9193 68755 12608 32893 46716 14827
1486 14827 -24187 21939 21625 -11178 -6542 26599 51221 52746 18483 29794 -34069 -43954 -91333
1473 -91333 -84142 -37431 -26695 -63703 349 47705 47644 29231 -5418 22658 5643 -33891 -16138
1460 -16138 -1823 -39676 51646 22567 10143 63433 58033 32669 -20255 -24404 10246 -35132
1448 -35132 -10568 7865 -30156 -16149 -8408 28734 76710 81680 97269 101596 118059 90910
1436 90910 43951 29119 13527 -8275 -29189 -63657 -18105 -52817 -89204 10363 98 -4307
1424 -4307 25003 1443 -15089 -15829 -1144 -6474 53485 33183 14938 61121 45102 19198 -10253
1411 -10253 -39791 11803 -13624 -20111 -18342 57688 25505 3596 -18297 62097 85935 4704
1399 4704 23332 -21867 13934 72855 42766 -16326 -35321 31286 78377 2303 -5355 -12593
1387 -12593 -10490 -28115 494 36645 23955 -35806 -40828 18198 65433 16854 -44038 14122
1375 14122 34601 47503 51795 21688 44734 -11969 -943 -19051 40791 13038 -15995 12487
1363 12487 -76564 -87693 -89505 -67218 -63617 10086 28959 -44469 -25338 -2691 -10795 13472
1351 13472 2113 74408 111919 38291 36729 36356 53590 23668 -3851 -42428 -638 2524 42390
1338 42390 68580 47226 11945 -22115 -29709 13935 70522 31936 59639 15592 17304 3506
1326 3506 -52405 -40321 -22299 18078 22182 12663 16693 -31886 2496 -3476 -17522 52221 25840
1313 25840 -48003 -22360 2384 29177 17654 33990 83468 -24948 -52587 16596 48613 91620
1301 91620 43531 -2338 4674 17779 -7876 -36169 -27730 -7971 -9022 -13397 10837 -17935 -15838
1288 -15838 -87573 -85069 137 13128 4510 -1310 39888 94374 51261 -19067 5065 16764
1276 16764 -1935 -4626 -13757 -10699 -3579 12069 -21762 27817 -5763 78005 48879 -39871 -6005
1263 -6005 8438 29986 29048 62102 32281 24616 21864 -36881 -60996 -33729 -45919 -21724 20255
1250 20255 52303 -11282 -36585 -9997 -19907 22493 -3540 4179 78370 121738 24534 -66860
1238 -66860 -47775 -18370 -43493 -68698 -39192 46874 28067 -33146 -37509 -11632 26735 25926
1226 25926 -32976 -46819 -14715 7831 37436 11094 30808 -19124 7811 25960 -43609 -8171
1214 -8171 53101 -32394 27297 45668 -8363 -284 4246 1099 -22113 -54696 -58461 -27831 26618
1201 26618 -33185 -8129 17638 16325 -24898 12861 -18750 -28122 36364 69325 70885 22623
1189 22623 -60470 -85797 -75718 -44950 -33066 9436 18312 37727 -22187 -12013 44991 -3658
1177 -3658 -58321 -21283 34302 -2067 1492 -59782 7849 6628 11559 29627 -10105 -5139 -36814
1164 -36814 -19898 47923 -1810 -31576 -14568 -12256 -13970 -20992 -25053 26246 5016 7355 59938
1151 59938 73249 -4455 -13889 -1881 2733 2758 -31344 -23320 43188 14433 27187 -42696 -33853
1138 -33853 -76654 -41270 -18609 -23824 -1149 -33464 -21091 -70757 -61655 -60208 -90678 -69280
1126 -69280 -6621 -48075 -70317 -16444 19835 27197 -33495 -57845 -10581 11251 -28979 2004
1114 2004 18244 10925 86961 49123 30778 25783 49672 5184 3756 -15813 20212 -24129 -59253
1101 -59253 1988 62298 36305 -26520 -14835 41438 83232 23800 15646 -5865 -16487 -67089
1089 -67089 -68084 -2850 5277 5624 26712 25435 -17893 -5994 14499 21651 -7882 -1762 13223
1076 13223 19373 19643 -44344 -70785 -60639 21130 29975 -38143 -80525 -90253 -63056 -26629 -27066
1063 -27066 -1098 36035 18522 -17950 20917 25435 18415 -53724 -65823 -39418 -68748 -73960
1051 -73960 -45967 -58209 -49698 -80119 -57052 -36658 -25608 -52947 -18159 -5994 -37798 -87445
1039 -87445 -49016 -40331 -86340 -24513 -1256 54398 33559 11624 -1216 6387 61324 33052
1027 33052 -599 -8706 10515 10661 27251 -1860 -35748 17645 32292 4393 13219 16590 -56845
1014 -56845 -61050 -46095 -128923 -118381 -65515 -66688 -82390 -103588 -96531 -72622 -47701 -41235 -18144
1001 -18144 26510 45727 -8824 20342 -5051 -14520 -37328 -38913 -40634 45781 19804 -56848
989 -56848 -41256 -13934 -27840 -22586 -12920 -21929 -45329 -10355 228 34341 -23042 15117 -1920
976 -1920 -59316 -58833 -49621 5394 12145 3667 -36948 -58270 -64487 -31379 24492 55641 24513
963 24513 -50234 -32598 -30966 -99128 -86474 -68092 -68240 -47705 -55303 -19294 -8816 4614 40722
950 40722 -135 -22381 9921 -3916 6792 47390 72677 -13969 -84437 -40516 34391 21205
938 21205 -18592 24313 23854 -8851 -4809 28723 12287 -5983 32055 38829 58213 22059 4980
925 4980 -22223 -57919 -23042 -18299 -12122 7783 80763 61820 37821 41499 48580 -43877 -23467
912 -23467 54610 94563 67844 85562 29636 -9772 44165 67366 -16447 -68863 -34945 -5285
900 -5285 1744 22463 -21441 -46404 -4243 55812 54779 82688 48459 8725 72694 18739 -55861
887 -55861 -54205 -67457 42687 16903 -14182 -60282 -98789 -34250 15650 33446 -33430 -83718
875 -83718 -37234 -1797 -51950 -25305 -22209 -53550 31279 20610 18334 47697 106 647 0
862 0 24191 -7754 -14867 12730 64370 47763 21171 18187 50533 -17303 -26419 19926 -46117
849 -46117 -45256 -63396 -76230 -43540 14229 -36480 -53453 -34086 -40749 21619 -36173 -48129 -77304
836 -77304 -27432 8151 -31 -31016 -39012 39836 12640 -57525 -7884 22018 20711 16103 12815
823 12815 12370 10223 40639 -20823 30506 10771 -58611 -57271 12400 28687 -9101 -7311 -74064
810 -74064 -67178 -46620 53130 32787 -4014 2305 -35806 28168 -35264 -74294 -64075 27742
798 27742 31202 -21663 -5364 36923 32041 11181 41969 37914 -51301 -76925 -96511 -22334 56004
785 56004 28577 -2789 9772 28828 -33565 -78556 -76926 -41788 -36920 -25544 -65447 -49511
773 -49511 -24224 -29483 -39371 -51708 -57962 -3688 -35408 -34276 -9745 -4638 7083 6690 52152
760 52152 -8283 -5209 55240 -3837 14172 -34702 31656 1326 -45967 -43289 18791 41801
748 41801 -26389 16489 -16124 -74701 10090 68725 28862 494 -5932 22052 4069 1581
736 1581 -18109 -9193 -13945 -41066 -68530 -59523 -27621 -68819 -80065 -313 -9740 -12362 9657
723 9657 -57801 -31435 -76163 -74568 -101849 -98285 -40749 27935 -7564 16731 49111 -69983
711 -69983 -114750 -114231 -76672 -43455 -13276 52661 83017 41857 37245 35016 11820 5533 18064
698 18064 14886 -57590 -11773 79071 71149 10239 52191 64190 -10596 33837 27240 19887 73409
685 73409 48800 -38417 -61382 9125 36727 -22064 -7554 18 -22405 -20471 -81502 -77251 4030
672 4030 -18603 7618 -30416 41859 43738 21726 -15697 -176 19539 -9560 15151 10832 16338
659 16338 71800 73429 15520 50179 58526 -22590 -28843 16416 5560 -14758 -31802 -34886 -43328
646 -43328 -61636 -64530 -66668 -66475 -4942 43244 -2383 11500 -12269 -14452 -55567 -37145 -7319
633 -7319 19647 -40751 -60724 -22888 -15898 19596 28359 -38670 -953 -12533 -22190 -26753 -58730
620 -58730 25485 23190 7063 32221 37319 42055 35540 20566 7902 51926 13633 -64238 -82270
607 -82270 -59038 -71101 -18939 38592 47177 25229 -27569 -21665 12488 50279 57527 16222 -44809
594 -44809 2251 -50893 -52111 31141 67187 72742 -416 -74009 3515 13073 -24338 -8262 36993
581 36993 9218 47999 -19897 -20052 33107 33586 -26513 -23614 1625 17852 -36673 -48228 -84749
568 -84749 -50887 -35705 -18989 -74516 -77574 2145 -29546 -45143 -58534 -30100 -40508 8578
556 8578 24055 -44172 -13009 -42449 -43060 32037 -22693 -1279 -20163 -8347 17550 26904 24115
543 24115 -44965 -24435 -13830 -28062 -60861 -79185 -51604 -15647 35190 39573 85440 53329
531 53329 -7080 -12320 -14754 -66458 -44869 18350 -23237 -84989 -83669 -20708 83873 53934
519 53934 -18735 -71179 -38590 -36288 -58437 -19282 -49875 -60336 -52715 -53241 -12732 4137 24489
506 24489 -55793 -2958 53705 -38324 -18410 -11793 -14017 -23855 -49617 -59182 -1296 3097 -20734
493 -20734 -41382 16210 65307 52320 2035 16413 27289 -37647 -36788 -28290 -76044 -92436 -104663
480 -104663 -114100 -79850 -3529 -33634 -26042 -31854 -83584 -88605 -9160 -68193 -88581 -55284 -13984
467 -13984 -13994 -69867 -45685 -28902 -20805 -30239 29015 35909 17572 4823 -19721 -72040 -24935
454 -24935 12115 13663 -6286 -39477 517 -23213 -6904 -29101 -60848 -33347 -26488 -5059
442 -5059 -54635 -76461 -134085 -118888 -71069 -27984 -31862 -20618 -16344 -29208 -27531 -14967 -56299
429 -56299 -32292 40002 38621 -13132 -5205 14024 52441 6145 -59325 -33652 6647 63055
417 63055 31893 -15503 -74523 -73970 -28712 -59077 -59825 -102441 -25133 16442 -43666 -3386 47632
404 47632 12441 -24555 -25244 -69633 -9310 13612 29375 -16835 -43646 9137 1953 33879 36471
391 36471 28063 5118 49549 50001 75819 76539 48868 110544 71923 40293 53680 52144 46077
378 46077 39826 -1865 -71321 -45074 -16180 -21876 -36192 30619 27712 16978 6831 -2395 -8770
365 -8770 -11834 -37597 -27263 51010 -36059 -51831 2843 -13041 -75276 -10654 -16744 -35350 -31933
352 -31933 27700 4815 -1497 2994 3623 25093 -39017 5621 8479 31129 -49089 5081 20275
339 20275 -20274 -52421 -66710 -71864 -33581 -11964 6370 15730 -33227 -22074 -43946 161
327 161 11131 -1147 -18236 19871 14767 -13029 29553 60417 -4087 15410 58598 23993 -54789
314 -54789 -36453 72192 34289 45645 52560 11262 63300 7937 12397 992 53464 67254
302 67254 19656 -8989 15688 -4081 -59323 -39214 43142 16400 27659 -9636 -24246 26436
290 26436 11656 -17439 -4797 33668 32462 6091 20663 -19715 -21896 10023 -115591 -112158
278 -112158 -44168 -111515 -110427 -86963 -7446 53095 59786 24023 6697 18397 38795 21676
266 21676 -3682 34525 69671 49256 14935 -9280 -27083 23718 46889 70004 111511 37948
254 37948 1572 -11645 -14417 -2327 -41131 -20902 6498 570 -1610 13847 -16302 37740 12554
241 12554 -52677 -15619 5237 34268 12338 9166 -7762 -12550 11582 -35964 22020 -2525
229 -2525 5468 -38100 -71106 -52542 -42438 -9061 4173 4839 -25680 -31024 -28765 27883 19253
216 19253 -4392 -17640 -62134 -11360 -3490 -12201 -32146 -59946 -37927 14208 -37092 -14430
204 -14430 -7520 2974 10601 46901 20862 1741 -6338 -14098 -65513 6932 5826 -34605 -34695 -30368
190 -30368 46703 49391 6360 -12895 -8584 10900 -26248 11867 33756 51178 6216 18307
178 18307 11930 -8273 10483 840 37134 49900 53323 -4839 -10952 -23162 18483 17410 -8155
165 -8155 14951 -20388 2050 21249 -20570 -26474 -15795 -2796 -12973 -5857 -1229 -7327 -62266
152 -62266 -42604 -33651 17167 25308 -18778 -42094 -14395 19733 -27241 -34473 22584 55528 47573
139 47573 4423 1228 -24620 35990 26604 -39184 16272 -14884 -24818 -10745 -24592 -2570 -36170
126 -36170 1817 5462 -7998 -8318 -22544 -55174 -44852 9621 -11693 -67839 -70806 -55536 -67233
113 -67233 -27136 -6842 -8052 -56195 -69542 18583 -25029 -30697 37460 15167 -38787 -40230 -44244
100 -44244 -6324 12019 -302 -51303 -22462 43209 23520 -11044 13176 15293 -17812 -16314
88 -16314 9037 -11084 21637 59039 6498 15544 30730 -6574 13909 -14892 12130 34952
76 34952 4022 -11111 -10063 13669 27830 23713 1988 13558 -37658 3819 40149 -12299 -56247
63 -56247 -89213 -28702 6252 3986 -24861 36002 -10968 -40420 -51050 -74704 -9617 15658
51 15658 24112 16830 27324 -21903 -28400 -20591 1706 -39902 -62299 -41506 -41564 -41102 -9321 3740
37 3740 4847 24273 30906 20110 16900 9817 21670 -12541 -40688 -40331 -4761 -11334 -34810 -64704
23 -64704 -79259 -44812 -17082 17869 35285 -1259 30314 22399 14341 15817 -21967 -9683 1514
10 1514 981 -19450 -17608 -28793 -34809 -12750 -20324 -43287 -28688 -11417
0 -11417
$$ Imaginary data points
##PAGE= N=2
##DATA TABLE= (X++(I..I)), XYDATA
16383 -575769 -527054 -529421 -550188 -527213 -499031 -514445 -480645 -446946 -467501 -433840 -372826 -344324
16371 -344324 -396499 -396062 -358841 -373408 -332548 -288496 -300500 -290045 -333091 -300516 -270608 -328467
16359 -328467 -263804 -217846 -256624 -214600 -167269 -170976 -191924 -189967 -187837 -177076 -204030 -189415
16347 -189415 -166776 -174413 -111238 -63071 -42906 -60295 -47199 -81926 -43060 -29010 -19398 -47220
16335 -47220 -96700 -51886 -24813 13114 63704 68805 57031 76105 100513 169589 134959 166616
16323 166616 173812 120873 156547 173744 157565 151526 128576 129225 140365 192757 201111 198470 222392
16310 222392 248360 283560 301007 244173 234921 211445 274619 350900 269633 311789 385537 367455
16298 367455 363384 343024 326524 376766 333971 374460 396359 448255 449205 416073 411325 439254
16286 439254 442724 454292 464145 540291 564107 590117 588305 538240 519343 556269 527628 555844
16274 555844 601317 556854 555192 577301 569914 595880 619077 594388 590608 643211 642145 638009
16262 638009 692404 705117 677948 697529 709092 719434 710523 721437 755494 759650 771582 751582
16250 751582 828437 798119 758321 790822 814285 809485 817441 847728 815426 792471 832906 822601
16238 822601 762407 835491 840270 845775 836868 848936 872184 859864 819400 858561 885653 828047
16226 828047 895387 889959 901824 935281 939304 1004280 948521 967369 1002439 1001788 1036663 1016461
16214 1016461 1021290 992207 1026463 992618 979335 1002999 1020908 982600 997453 1022820 1066660
16203 1066660 1090876 1076184 1083808 1034515 1020368 1105879 1108954 1118492 1031704 1043148 1037475 1030421
16191 1030421 1027666 1082192 1113826 1103001 1128434 1024635 1063794 1075679 1111931 1091564 1031161
16180 1031161 1116459 1190306 1144117 1104308 1150319 1155828 1190410 1151646 1099213 1131442 1157343
16169 1157343 1131173 1146033 1185093 1188777 1195357 1222090 1222863 1199309 1178919 1209616 1164583 1108433
16157 1108433 1168535 1182765 1217605 1231543 1166367 1164234 1217266 1275555 1292355 1245119 1198784
16146 1198784 1292071 1315980 1358093 1335212 1299065 1227908 1176636 1163690 1140127 1117694 1197547
16135 1197547 1282415 1225866 1177669 1208158 1192168 1183710 1176353 1178510 1231422 1221522 1234952 1242389
16123 1242389 1211806 1177572 1218083 1205279 1204561 1251681 1274603 1191937 1284417 1346075 1307631 1262199
16111 1262199 1273100 1321311 1293595 1265377 1323398 1241174 1249181 1259142 1304985 1338062 1262085 1229095
16099 1229095 1270382 1255767 1189139 1201260 1208191 1197421 1256236 1264655 1307413 1286133 1314800 1272447
16087 1272447 1206224 1256913 1321056 1308561 1237489 1249075 1260837 1322577 1309633 1283674 1294543
16076 1294543 1295101 1300778 1382504 1381644 1382162 1370333 1265942 1249981 1272989 1313483 1357118 1345423
16064 1345423 1388384 1379853 1363411 1315417 1271357 1197722 1249033 1266990 1225994 1299487 1288190
16053 1288190 1303024 1310247 1298534 1315420 1340331 1356503 1328389 1342652 1404181 1349714 1306547
16042 1306547 1258474 1302798 1378502 1381657 1309075 1244389 1256499 1297874 1284201 1333009 1331053 1310470
16030 1310470 1355926 1331789 1300722 1301804 1328875 1372856 1365533 1336135 1336544 1308269 1290538 1299416
16018 1299416 1372807 1388962 1326987 1302008 1315781 1340049 1299361 1276744 1356083 1297724 1306403
16007 1306403 1350532 1320268 1325942 1349795 1273418 1227660 1253331 1327244 1311880 1276780 1280146 1326793
15995 1326793 1276296 1210462 1209512 1305328 1329802 1299289 1303199 1321024 1341808 1341922 1325737 1282759
15983 1282759 1298835 1229735 1232892 1241848 1284180 1362737 1340225 1286966 1340684 1375643 1426480 1444888
15971 1444888 1381428 1384073 1324436 1333976 1415854 1380210 1316232 1300376 1291622 1228499 1278945 1287736
15959 1287736 1284139 1245229 1278286 1291026 1248391 1243433 1290405 1314525 1237649 1290556 1331470 1323981
15947 1323981 1326118 1365963 1387897 1413644 1335819 1229222 1280223 1348948 1313735 1303563 1280458
15936 1280458 1282577 1290753 1308793 1323763 1290745 1288572 1266630 1297682 1329957 1361301 1361347 1384710
15924 1384710 1390990 1374419 1316518 1309884 1338144 1263313 1251621 1261254 1362304 1379293 1401449 1282399
15912 1282399 1289168 1335431 1284306 1274889 1261540 1259419 1245494 1343972 1361795 1341403 1347676 1318200
15900 1318200 1340776 1310415 1358794 1323253 1278310 1332875 1352275 1319799 1324974 1336827 1311008
15889 1311008 1310420 1301631 1315972 1326022 1371596 1391620 1403043 1394955 1412739 1366992 1282967 1307187
15877 1307187 1381103 1372321 1359196 1301026 1329695 1320495 1359980 1358209 1278643 1325267 1310412 1317596
15865 1317596 1322409 1336733 1362351 1379066 1397955 1267599 1247215 1282411 1378186 1355245 1308087
15854 1308087 1305697 1256903 1285290 1320653 1303260 1295117 1277925 1301236 1339948 1327920 1310594 1300352
15842 1300352 1296592 1303301 1285349 1301826 1301189 1287984 1323254 1334277 1330829 1353479 1425433 1417323
15830 1417323 1379846 1361502 1361576 1322400 1339393 1368291 1412240 1396965 1401060 1406337 1322589 1323769
15818 1323769 1328553 1293393 1380379 1366274 1297810 1341814 1366269 1398735 1368589 1414708 1388993
15807 1388993 1349583 1333507 1305261 1315783 1296470 1309036 1304510 1279365 1318868 1367776 1364245 1352860
15795 1352860 1360747 1387617 1339539 1388255 1342750 1312844 1357798 1318277 1358425 1376210 1314083
15784 1314083 1341172 1341151 1307439 1304919 1248618 1317638 1384227 1397288 1382013 1332604 1403677 1405902
15772 1405902 1347313 1390481 1391869 1364745 1329812 1332348 1346480 1313161 1332699 1400811 1367545 1361681
15760 1361681 1448498 1461677 1436535 1421857 1384649 1390634 1389350 1401543 1344319 1310550 1305569 1334095
15748 1334095 1352248 1367656 1310263 1317457 1320213 1315567 1401869 1379050 1383661 1389250 1372932 1302037
15736 1302037 1297928 1329049 1328848 1311783 1325038 1305506 1335193 1372444 1347242 1342687 1337143 1372375
15724 1372375 1331525 1328999 1336336 1368017 1365181 1347995 1380192 1337958 1417264 1403739 1402518 1412878
15712 1412878 1408920 1365878 1369045 1347069 1371760 1365847 1401803 1379909 1339340 1352658 1369389 1397839
15700 1397839 1448135 1406666 1375461 1387615 1419240 1486613 1400565 1379496 1422771 1402589 1437454
15689 1437454 1438921 1392637 1420756 1364172 1386271 1395959 1419338 1401394 1397100 1390757 1386316 1428379
15677 1428379 1426531 1403565 1415497 1358733 1313839 1285875 1349067 1380591 1355965 1377442 1377493 1382929
15665 1382929 1386693 1347496 1353351 1324357 1345287 1367326 1348749 1350662 1320262 1355649 1371863 1367788
15653 1367788 1392201 1441074 1456427 1430718 1337649 1396412 1388764 1395659 1333094 1341203 1384688 1308776
15641 1308776 1326730 1403104 1433598 1416108 1367917 1318202 1343869 1362790 1369977 1350648 1365507
15630 1365507 1372923 1429979 1454041 1394795 1358146 1390914 1378031 1383888 1389506 1382736 1364050 1364842
15618 1364842 1387500 1348467 1375273 1349691 1309547 1350196 1364967 1344294 1370071 1357064 1395364
15607 1395364 1387209 1361629 1374306 1363911 1386658 1433390 1407980 1382229 1417337 1405084 1345483
15596 1345483 1326311 1419223 1438329 1416420 1432944 1424087 1415548 1431994 1391051 1368594 1389353 1386914
15584 1386914 1409944 1397230 1350526 1364902 1370231 1423680 1412145 1396287 1413202 1442343 1449709 1432638
15572 1432638 1408612 1397072 1367677 1360803 1392753 1367095 1338391 1389865 1362442 1453968 1440736
15561 1440736 1401439 1449763 1462020 1411001 1417134 1424675 1390582 1387746 1395763 1378133 1406360 1331547
15549 1331547 1362393 1428829 1454854 1482735 1459969 1419577 1419820 1411293 1331058 1345850 1422753 1463738
15537 1463738 1438439 1419124 1416782 1434387 1380092 1360102 1422034 1420494 1372535 1388211 1347948 1376977
15525 1376977 1325244 1338906 1366842 1392684 1344920 1358861 1398577 1387466 1358220 1386897 1367860
15514 1367860 1369183 1359588 1420342 1402540 1367036 1329342 1401600 1436432 1350763 1372374 1348266 1318928
15502 1318928 1345759 1419836 1376551 1331792 1372839 1394226 1315812 1348897 1441528 1430600 1405828
15491 1405828 1402140 1377624 1363383 1413376 1467595 1398131 1373233 1409164 1381727 1356925 1361491 1432389
15479 1432389 1398452 1356594 1321457 1338373 1388604 1380951 1358306 1375822 1373998 1413342 1428037 1417591
15467 1417591 1371050 1344117 1435522 1386151 1413361 1416305 1402068 1430297 1411674 1414159 1375668 1448701
15455 1448701 1432664 1427167 1440378 1396253 1449704 1402737 1397140 1386439 1416184 1403719 1366083 1396331
15443 1396331 1374760 1361556 1393110 1392923 1391117 1357229 1368412 1413648 1431239 1452933 1465711 1438231
15431 1438231 1409854 1442095 1451625 1416445 1370575 1366305 1410460 1382233 1401524 1404979 1392257 1343693
15419 1343693 1349309 1341792 1354501 1415813 1394693 1384735 1410765 1385435 1361031 1427437 1449896 1380708
15407 1380708 1370346 1441222 1422828 1429602 1467517 1389900 1345442 1456803 1452778 1419181 1411778 1456274
15395 1456274 1362875 1427455 1471471 1470711 1453974 1419964 1401704 1448380 1503695 1388063 1435046
15384 1435046 1437495 1463227 1414166 1435329 1487659 1415606 1404275 1390912 1399027 1343806 1318331 1401940
15372 1401940 1425678 1453592 1379185 1378998 1387919 1413280 1441598 1438288 1382346 1398052 1413007 1428605
15360 1428605 1472889 1437652 1377908 1465761 1454446 1355719 1372715 1350564 1362734 1403341 1381757
15349 1381757 1363516 1436337 1438052 1399421 1390389 1416400 1478678 1486564 1479251 1512002 1502602 1376127
15337 1376127 1389688 1375241 1381742 1462719 1445905 1410312 1357436 1333258 1335702 1376117 1390604 1441694
15325 1441694 1432660 1434256 1458972 1395093 1365100 1423453 1424569 1415074 1378508 1407355 1441329 1480739
15313 1480739 1475109 1426801 1413576 1359082 1385466 1456710 1455426 1422981 1449343 1404213 1308261 1298319
15301 1298319 1379656 1367707 1332312 1389609 1380935 1379195 1432633 1484895 1495751 1494801 1485400 1425397
15289 1425397 1433605 1500071 1462543 1453313 1462044 1465625 1403565 1399963 1464599 1466666 1470073 1474081 1447349
15276 1447349 1478907 1463495 1410354 1381800 1397621 1376621 1409050 1387567 1390421 1426170 1475489
15265 1475489 1475649 1452534 1430425 1378160 1353319 1356776 1346735 1365764 1407196 1431241 1448191 1464295
15253 1464295 1466683 1463836 1449828 1452371 1479969 1446898 1468269 1512363 1459267 1414855 1473137 1458907
15241 1458907 1513198 1478695 1425216 1404140 1426839 1451036 1442803 1436563 1489255 1495572 1433995 1460825
15229 1460825 1492325 1473485 1490741 1493907 1351989 1333531 1396992 1382641 1439775 1466366 1503408
15218 1503408 1473064 1444126 1431179 1407911 1391547 1439794 1453081 1480011 1499069 1437286 1434304
15207 1434304 1437141 1369412 1367458 1370831 1353305 1402430 1470980 1445161 1455067 1467391 1480216 1535404
15195 1535404 1455826 1412789 1442287 1411901 1388493 1442089 1446431 1469083 1465783 1454289 1495273 1473407
15183 1473407 1423532 1439326 1418049 1472199 1467303 1469903 1436750 1415745 1469802 1435618 1486383 1510090
15171 1510090 1466292 1427709 1470652 1460568 1441628 1499373 1494684 1494957 1449701 1417383 1432769 1423781
15159 1423781 1459783 1469502 1438021 1462229 1475423 1443538 1472120 1490149 1434327 1432809 1453135 1469894
15147 1469894 1412875 1419073 1442025 1430842 1416960 1400569 1406316 1447492 1478190 1482153 1490900 1493466
15135 1493466 1456445 1462195 1477404 1459186 1473919 1511799 1444402 1452100 1445364 1437893 1441158 1443232
15123 1443232 1411450 1384285 1409505 1370186 1483605 1482327 1436431 1430770 1444786 1490273 1498640 1511310
15111 1511310 1507637 1416942 1425012 1430388 1399161 1444071 1484596 1439143 1470496 1491954 1445642 1426703
15099 1426703 1415080 1447878 1473421 1469848 1471619 1486729 1458178 1450064 1455267 1455388 1436221 1436210 1468398
15086 1468398 1420407 1403826 1466347 1425970 1446102 1505427 1557905 1527252 1426534 1370533 1409112
15075 1409112 1441472 1397981 1421422 1397022 1412356 1439301 1488745 1485630 1469101 1411529 1478488
15064 1478488 1553010 1566367 1479689 1455460 1490495 1460846 1477542 1429338 1400580 1462022 1454719
15053 1454719 1451183 1511947 1534898 1524926 1504694 1464358 1433610 1498278 1457266 1436570 1478214 1447345
15041 1447345 1382007 1473222 1496554 1422730 1434829 1468744 1490451 1488912 1494391 1510582 1534067 1508012
15029 1508012 1475519 1483852 1520335 1545541 1542922 1485042 1506720 1474209 1425228 1427087 1500035 1506606
15017 1506606 1461951 1515982 1528962 1560834 1526000 1487962 1534027 1538942 1526174 1475366 1495112
15006 1495112 1500869 1489565 1568784 1541647 1487608 1463455 1448639 1412163 1485252 1550453 1524180
14995 1524180 1533948 1508775 1523725 1592214 1529044 1497280 1490802 1465166 1415238 1400261 1478151 1524825
14983 1524825 1450106 1430888 1419553 1457784 1517269 1523673 1523528 1536154 1515037 1496506 1432677 1468060
14971 1468060 1485086 1456184 1445067 1449382 1463159 1466037 1456785 1438957 1456955 1530526 1519898 1461575
14959 1461575 1445228 1450391 1449696 1470905 1453627 1424693 1437870 1522647 1583780 1538482 1516380 1506948
14947 1506948 1512847 1508573 1426263 1407362 1438628 1430938 1476385 1448396 1415963 1468699 1491870 1522815
14935 1522815 1518602 1519251 1526274 1478763 1460935 1512382 1535823 1512241 1502569 1534520 1487258 1476497
14923 1476497 1517228 1524904 1580440 1471733 1458448 1472163 1491974 1492739 1498763 1486660 1481328 1489160
14911 1489160 1481669 1468186 1463316 1497247 1565762 1523231 1532844 1581242 1559825 1512258 1444079 1513690
14899 1513690 1508482 1446243 1433540 1449158 1515609 1465862 1468829 1448776 1475866 1497480 1462130 1468964
14887 1468964 1515077 1578249 1574833 1475502 1484128 1517681 1495571 1473299 1477046 1461337 1487317 1472339
14875 1472339 1501999 1514407 1405974 1454219 1500354 1500403 1580611 1521026 1492180 1516598 1513943 1504706
$$ [...]
##END NTUPLES=NMR SPECTRUM
##END=
