##TITLE=1H_EC-3278(II-3)
 CDCl3
 8 sc, 
 28.09.2022
##JCAMPDX= 6.0         $$ Bruker NMR JCAMP-DX V2.0
##DATA TYPE= NMR SPECTRUM
##DATA CLASS= NTUPLES
##ORIGIN= UXNMR, Bruker Analytische Messtechnik GmbH
##OWNER= root
$$ XWIN-NMR		Version 3.5
$$ Wed Sep 28 13:42:46 2022 Russian Standard Time (UT+4h)  she@DPX200
##.OBSERVE FREQUENCY= 200.1313499994
##.OBSERVE NUCLEUS= ^1H
##.ACQUISITION MODE= SIMULTANEOUS
##.ACQUISITION SCHEME= undefined
##.AVERAGES= 8
##.DIGITISER RES= 18
##SPECTROMETER/DATA SYSTEM= spect
##.PULSE SEQUENCE= zg30
##.SOLVENT NAME= CDCl3
##.SHIFT REFERENCE= (INTERNAL, CDCl3, 0, 15.7645)
##AUDIT TRAIL= $$ (NUMBER, WHEN, WHO, WHERE, WHAT)
$$ ##TITLE= Audit trail, XWIN-NMR		Version 3.5
$$ ##JCAMPDX= 5.01
$$ ##ORIGIN= Bruker BioSpin GmbH
$$ ##OWNER= she
$$ F:/spectra/data/she/nmr/H-F/1/pdata/1/auditp.txt
$$ ##AUDIT TRAIL=  $$ (NUMBER, WHEN, WHO, WHERE, WHAT)
(   1,<2022-09-28 13:41:23.70 +0400>,<she>,<DPX200>,
      <created by zg, POWCHK disabled, PULCHK disabled
       configuration hash MD5:
       00 E9 B6 7A A2 85 ED C7 34 08 36 98 17 FE 4E 26
       data hash MD5: 16K
       46 9C 69 CB 98 F9 98 70 F8 98 72 49 FD 77 29 39>)
(   2,<2022-09-28 13:41:26.20 +0400>,<she>,<DPX200>,
      <Start of raw data processing
       efp BC_mod = 2 LB = 0.24 FT_mod = 6 PKNL = 1 PHC0 = -18032.64 PHC1 = 9.200689 SI = 16K 
       data hash MD5: 16K
       96 9B 48 AC 59 A8 6C CB 39 79 43 DB 45 D7 03 59>)
(   3,<2022-09-28 13:41:53.10 +0400>,<she>,<DPX200>,
      <pk PHC0 = 2.102566 PHC1 = 0.4 
       data hash MD5: 16K
       3B A1 A6 5B 31 0C 36 3F 75 AC D8 D7 7E CC 94 81>)
(   4,<2022-09-28 13:41:59.48 +0400>,<she>,<DPX200>,
      <abs ABSG = 5 
       data hash MD5: 16K
       C6 4C 63 B3 11 8F A6 29 0E 3B 0A AA F9 72 C0 5B>)
$$ ##END=
$$ 
$$ hash MD5
$$ A8 8C 64 08 D5 BE 5C 64 60 EA EA 07 E2 A4 01 0F
##$RELAX= 
##$RELAX= 
##$RELAX= 
##$RELAX= 
##$RELAX= 
##$RELAX= 
$$ Bruker specific parameters
$$ --------------------------
##$DU= <F:/spectra>
##$EXPNO= 1
##$NAME= <H-F>
##$PROCNO= 1
##$TYPE= <nmr>
##$USER= <she>
##$AMP= (0..31)
100 100 100 100 100 100 100 100 100 100 100 100 100 100 100 100 100 100 
100 100 100 100 100 100 100 100 100 100 100 100 100 100 
##$AQSEQ= 0
##$AQ_mod= 1
##$AUNM= <au_zg>
##$AUTOPOS= <>
##$BF1= 200.13
##$BF2= 200.13
##$BF3= 200.13
##$BF4= 200.13
##$BF5= 200.13
##$BF6= 200.13
##$BF7= 200.13
##$BF8= 200.13
##$BYTORDA= 1
##$CFDGTYP= 0
##$CFRGTYP= 5
##$CHEMSTR= <none>
##$CNST= (0..31)
1 1 145 1 1 1 1 1 1 1 1 1 1 1 1 1 1 1 1 1 1 1 1 1 1 1 1 1 1 1 1 1 
##$CPDPRG= <>
##$CPDPRG1= <>
##$CPDPRG2= <>
##$CPDPRG3= <>
##$CPDPRG4= <mlev>
##$CPDPRG5= <mlev>
##$CPDPRG6= <mlev>
##$CPDPRG7= <mlev>
##$CPDPRG8= <mlev>
##$CPDPRGB= <>
##$CPDPRGT= <>
##$D= (0..31)
0 1.2 0 0 0 0 0 0 0 0.06 0 0.03 0 0 0 0 0.0002 0 0 0 0 0 0 0 0 0 0 0 0 
0 0 0 
##$DATE= 1664358083
##$DBL= (0..7)
120 120 120 120 120 120 120 120 
##$DBP= (0..7)
150 150 150 150 150 150 150 150 
##$DBP07= 0
##$DBPNAM0= <>
##$DBPNAM1= <>
##$DBPNAM2= <>
##$DBPNAM3= <>
##$DBPNAM4= <>
$$ [...]
##$SUBNAM3= <"">
##$SUBNAM4= <"">
##$SUBNAM5= <"">
##$SUBNAM6= <"">
##$SUBNAM7= <"">
##$SUBNAM8= <"">
##$SUBNAM9= <"">
##$SW= 18.0517283424941
##$SWIBOX= (0..15)
0 0 2 0 0 0 0 0 0 0 0 0 0 0 0 0 
##$SW_h= 3612.71676300578
##$TD= 16384
##$TD0= 1
##$TE= 0
##$TE2= 300
##$TE3= 300
##$TEG= 300
##$TL= (0..7)
0 120 120 120 120 120 120 120 
##$TP= (0..7)
150 150 150 150 150 150 150 150 
##$TP07= 0
##$TPNAME0= <>
##$TPNAME1= <>
##$TPNAME2= <>
##$TPNAME3= <>
##$TPNAME4= <>
##$TPNAME5= <>
##$TPNAME6= <>
##$TPNAME7= <>
##$TPOAL= (0..7)
0.5 0.5 0.5 0.5 0.5 0.5 0.5 0.5 
##$TPOFFS= (0..7)
0 0 0 0 0 0 0 0 
##$TUNHIN= 0
##$TUNHOUT= 0
##$TUNXOUT= 0
##$USERA1= <user>
##$USERA2= <user>
##$USERA3= <user>
##$USERA4= <user>
##$USERA5= <user>
##$V9= 5
##$VALIST= <valist>
##$VCLIST= <CCCCCCCCCCCCCCC>
##$VD= 0
##$VDLIST= <DDDDDDDDDDDDDDD>
##$VPLIST= <PPPPPPPPPPPPPPP>
##$VTLIST= <TTTTTTTTTTTTTTT>
##$WBST= 1024
##$WBSW= 4
##$XGAIN= (0..3)
0 0 0 0 
##$XL= 0
##$YL= 0
##$YMAX_a= 498056
##$YMIN_a= -851165
##$ZGOPTNS= <>
##$ZL1= 120
##$ZL2= 120
##$ZL3= 120
##$ZL4= 120
##$ABSF1= 15.77333
##$ABSF2= -2.27852
##$ABSG= 5
##$ABSL= 3
##$ALPHA= 0
##$AQORDER= 0
##$ASSFAC= 0
##$ASSFACI= 0
##$ASSFACX= 0
##$ASSWID= 0
##$AUNMP= <proc_1d>
##$AZFE= 0.1
##$AZFW= 0.1
##$BCFW= 0
##$BC_mod= 2
##$BYTORDP= 0
##$COROFFS= 0
##$CY= -3
##$DATMOD= 1
##$DC= 0
##$DFILT= <>
##$DTYPP= 0
##$F1P= 0
##$F2P= 0
##$FCOR= 1
##$FTSIZE= 16384
##$FT_mod= 6
##$GAMMA= 0
##$GB= 0
##$INTBC= 1
##$INTSCL= 3.70164e-10
##$ISEN= 128
##$LB= 0.24
##$LEV0= 0
##$LPBIN= 0
##$MAXI= 10000
##$MC2= 0
##$MEAN= 0
##$ME_mod= 0
##$MI= 1.114404
##$NCOEF= 0
##$NC_proc= -6
##$NLEV= 6
##$NOISF1= 3.799351
##$NOISF2= 2.8
##$NSP= 0
##$NTH_PI= 0
##$NZP= 0
##$OFFSET= 15.76452
##$PC= 1
##$PHC0= -18030.54
##$PHC1= 9.600689
##$PH_mod= 1
##$PKNL= yes
##$PPARMOD= 0
##$PSCAL= 0
##$PSIGN= 0
##$REVERSE= no
##$SF= 200.130001405052
##$SI= 16384
##$SIGF1= 3
##$SIGF2= 2
##$SINO= 5.538805
##$SIOLD= 16384
##$SREGLST= <1H.CDCl3>
##$SSB= 0
##$STSI= 16384
##$STSR= 0
##$SW_p= 3612.71676300578
##$SYMM= 0
##$S_DEV= 0
##$TDeff= 16384
##$TDoff= 0
##$TI= <>
##$TILT= no
##$TM1= 0
##$TM2= 0
##$TOPLEV= 0
##$USERP1= <user>
##$USERP2= <user>
##$USERP3= <user>
##$USERP4= <user>
##$USERP5= <user>
##$WDW= 1
##$XDIM= 16384
##$YMAX_p= 461265500
##$YMIN_p= -517847
$$ End of Bruker specific parameters
$$ ---------------------------------
##NTUPLES= NMR SPECTRUM
##VAR_NAME=  FREQUENCY,     SPECTRUM/REAL,   SPECTRUM/IMAG
##SYMBOL=    X,             R,               I
##VAR_TYPE=  INDEPENDENT,   DEPENDENT,       DEPENDENT
##VAR_FORM=  AFFN,          ASDF,            ASDF
##VAR_DIM=   16384,         16384,           16384
##UNITS=     HZ,            ARBITRARY UNITS, ARBITRARY UNITS
##FACTOR=    0.220516191357247, 1,           1
##FIRST=     3154.95334800332, 0,            0
##LAST=      -457.763415002462, 0,           0
##MIN=       -457.763415002462, -517847,     0
##MAX=       3154.95334800332, 461265500,    0
$$ Real data points
##PAGE= N=1
##DATA TABLE= (X++(R..R)), XYDATA
$$ [...]
7766I7354j04021m296Q2123p1246j8202K00513Q860j61221j29324J7071K10651
$$ 97354 -6667 -10963 71160 -86 -18288 182225 191085 29864 -99460 -82389 128262
7755A28262J6804k9547n6785n5156R9898k9848p4146j3411P2412J37910p874l4792
$$ 128262 145066 115519 58734 3578 103476 73628 -518 -13929 58483 196393 188519 153727
7743A53727O6065Q897K8988N2151m5359j88672k7157L953n1931p192j07551q458
$$ 153727 219792 228689 257677 309828 264469 75797 48640 52593 662 -6530 -114081 -122539
7731a22539P6226Q3217l5820j70768J05736O5113K21999j06836J2418n1270O9395
$$ -122539 -46313 36904 1084 -169684 -63948 1165 223164 116328 128746 77476 146871
7720A46871K8785m6555Q1908Q9287n2572n8315j11405r3632K40937N1896j02701
$$ 146871 175656 129101 211009 300296 247724 189409 78004 -15628 225309 277205 174504
7709A74504q1873l7455P0999J30596R83r3476p0905L6693o6127K03287l9271j71167
$$ 174504 92631 55176 126175 256771 257754 164278 93373 130066 63939 267226 227955 56788
7697E6788O1851Q138j17088n4673P027j04822R1949J48942K4257J9587j88157
$$ 56788 118639 126777 9689 -44984 -37957 -142779 -50830 98112 122369 141956 -46201
7686d6201R938M391N3414J98235m7931N7159j1549k8648o8584O7963N5935L9146
$$ -46201 -36263 -31872 21542 219777 171846 229005 217456 188808 120224 188187 244122 283268
7674B83268k45703r2122J14305J49064J8425j79966K48166j18290j74585N8553
$$ 283268 37565 -54557 59748 208812 227237 47271 295437 177147 2562 61115
7664F1115J55357J7022j6355m3849j6108r4677j0188J14775N3188J69988N1643
$$ 61115 216472 233494 217139 173290 157182 62505 52317 167092 220280 390268 441911
7653D41911j48j4055L0673J71054j47553q66j51373o7754p5733J11020j7499o7258
$$ 441911 441763 427708 458381 629435 481882 481016 329643 261889 186156 297176 279677 212419
7641B12419p3805M4588N0819M5861R5412l9646j81239N6733L6932k8297j6430
$$ 212419 138614 183202 234021 279882 375294 335648 154409 211142 248074 219777 203347
7630B03347j40775M0637O1554k080J64228J23636R3783m3889l0832p7178J2708
$$ 203347 62572 103209 164763 162683 326911 450547 544330 500441 469609 392431 405139
7619D05139J21751j1904K77705j2095N8250J46589K34431K39573j61951k25785
$$ 405139 526890 514986 792691 780596 838846 985435 1219866 1459439 1297488 1071703
7609A071703k6349k76547j73501j2006O6200q7983K851q9383N9058J34j87760
$$ 1071703 1045354 768807 595306 583300 649500 561517 564368 474985 534043 534177 346417
7598C46417m5321j32576J10387K9535o2564J10248j41149N5659L8377K2977L6999
$$ 346417 301096 168520 278907 308442 245878 356126 214977 270636 309013 331990 368989
7587C68989J00634K0768K3316N2561O2871K2691j14214K39764K76790m8077K23266
$$ 368989 469623 490391 513707 566268 629139 651830 537616 777380 1054170 1006093 1229359
7576A229359L7336j12311P6844o1687r7529j40562j07587j40672j16058l21265
$$ 1229359 1266695 1154384 1231228 1169541 1072012 931450 823863 683191 567133 245868
7566B45868J83509K0984j89788J05844K01507j35979J542j7735l0124J03056j01151
$$ 245868 429377 450361 260573 366417 567924 431945 433487 415752 385628 488684 387533
7555C87533o9307k7343n417o9981Q7910J7715o7143L020K1281P3837Q6823j3404
$$ 387533 318226 290883 285466 215485 303395 321110 253967 256987 278268 352105 438928 425524
7543D25524O7201j09352l7504N3215M1581J93136M223j75475j15310n1322N0718
$$ 425524 492725 383373 345869 399084 440665 633801 638024 462549 347239 295917 346635
7532C46635j10073n6660p8340J20791p6375K2871N0511j80011J45171Q0435l6874
$$ 346635 236562 179902 101562 222353 145978 168849 219360 39349 184520 264955 228081
7521B28081q8963Q175o0439J60816n6949r5172j2198J83749j0651r7490R0925
$$ 228081 139118 147293 86854 247670 190721 95549 83351 267100 256449 158959 249884
7510B49884p3532M1095K662P9055J8793j3172j25326N0537Q1087n9443j44025
$$ 249884 176352 217447 220109 299164 317957 304785 179459 229996 311083 251640 107615
7499A07615J07308N5708J63095K0334j75367J13811J01835j58347J6103m4417
$$ 107615 214923 270631 433726 454060 278693 392504 494339 335992 352095 307678
7489C07678m8566o3373P3604L2196j1388P7149k40388n657J01226O0344k0159
$$ 307678 259112 195739 269343 301539 290151 367300 126912 121255 222481 282825 262666
7478B62666j0466k8580l3086J24674j09132k2756J61544M8712n5723j68563q5224
$$ 262666 252200 223620 190534 315208 206076 183320 344864 393576 337853 169290 84066
7467H4066Q1060Q1323J8432R681m4476J15220j35701l6013l506J19123L4867p7796
$$ 84066 165126 246449 264881 274562 230086 345306 209605 173592 170086 289209 324076 246280
7455B46280J1526j56239o408J09419O7243p1787K8255R9044O255k07767p3725
$$ 246280 257806 101567 95159 204578 271821 200034 228289 327333 333588 125821 52096
7444E2096K26325q4873m1184k3771P35J82278J9635j51014J96912k7181M0996
$$ 52096 278421 193548 152364 128593 129328 311606 331241 180227 377139 349958 390954
7433C90954M7576j90453m0204J03695k8552L8509o4875P8662J775P3729j35373
$$ 390954 438530 248077 207873 311568 283016 321525 256650 335312 337087 410816 275443
7422B75443q3874R4414N2372J5705r3486J5461R791o4235l8650J26880q2248J41175
$$ 275443 191569 285983 338355 354060 260574 276035 285826 221591 182941 309821 227573 368748
7410C68748n4921l8652L4618m4350o6111R8542r3077k7746q5119N5602K07790
$$ 368748 313827 275175 309793 265443 199332 297874 204797 177051 91932 147534 355324
7399C55324j42730l4769P6962j46328o8810J33736K1931J2157J04589M5955p0336
$$ 355324 212594 177825 254787 108459 39649 173385 195316 207473 312062 358017 287681
7388B87681K9520j09714n4278O3880J44224j71255l6559O5233M4801l4594K7166
$$ 287681 317201 207487 153209 217089 361313 190058 153499 218732 263533 228939 256105
7377B56105Q6044o870k1532M5300J1246j6856J3697j58221l0342J05257O9444
$$ 256105 342149 335279 313747 359047 370293 353437 367134 208913 178571 283828 353272
7366C53272l81555J01483J72266J34645J21920j13046N5610J9522l9516K31956
$$ 353272 -28283 73200 245466 380111 502031 388985 444595 464117 424601 656557
7356F56557r113J9509J74862M3237n3174k1092o1754o7832n5361J20377J11703
$$ 656557 647444 666953 841815 885052 831878 810786 749032 681200 625839 746216 857919
7345H57919j51796m6187P7302J3819m6128n9001O6532r5069n0151j52891J67020
$$ 857919 706123 659936 737238 751057 704929 645928 712460 617391 567240 414349 581369
7334E81369P7718k382n9538P0483n5556M7868Q7626j39180J7962k5917J26376
$$ 581369 659087 656705 597167 667650 612094 659962 747588 608408 626370 600453 726829
7323G26829j07008R5334R1940j22054J3274L9913M5818j3690j3026P9860j90886
$$ 726829 619821 715155 807095 685041 698315 738228 784046 770356 757330 837190 646304
7312F46304K43020P5133j36699m5449J0417k1377O7335L3879P2358p0573o4023
$$ 646304 889324 964457 827758 782309 792726 771349 838684 872563 944921 874348 810325
7301H10325P0786J8998q1870Q8826j9365k15456k8589k5275n554j00871K15732
$$ 810325 881111 900109 818239 907065 887700 672244 643655 618380 612826 511955 727687
7290G27687J46395j17599j20460R5419J9835m0955J13148L0083k6376M57J12969
$$ 727687 874082 756483 636023 731442 751277 710322 823470 853553 827177 827634 940603
7279I40603j7507M3950l5997O5707K7203n7269j28697r9617J29147j6026K13167
$$ 940603 923096 967046 931049 996756 1023959 966690 837993 738376 867523 851497 1064664
7268A064664J49222j04550j54398N4105Q2934j35195k5286j89764q6566j07126
$$ 1064664 1213886 1109336 954938 1009043 1091977 956782 931496 741732 655166 548040
7258E48040P4654l0511O3402m1143J35190K7649m8357J8212J37942m8970j52654
$$ 548040 622694 592183 655585 614442 749632 777281 728924 747136 885078 836108 683454
7247F83454k7476M3493L6562j86179J11191O6870j96431L6843l9532j78128J50475
$$ 683454 655978 699471 736033 549854 661045 727915 531484 568327 528795 350667 501142
7236E01142q1389J13015J05593j16996L5061m5757j11427J55484J02001j31299
$$ 501142 419753 532768 638361 521365 556426 510669 399242 554726 656727 525428
7226E25428J2442J9229k2253p6599j6331J76681N5471J89205L3564r0528j77020
$$ 525428 537870 557099 534846 458247 441916 618597 674068 863273 896837 806309 629289
7215F29289p7896r361L6953o195Q1309R8537P9917J1402j0829q1434m2967J90153
$$ 629289 551393 542032 578985 572790 654099 752636 832553 843955 833126 751692 708725 898878
7203H98878J10724j10240P8644P646K44058P1317j16757j29943O677N8244p7469
$$ 898878 1009602 899362 978006 985652 1229710 1301027 1184270 1054327 1061004 1119248 1041779
7192A041779k9825P5800N3167M2049J02553j77528J3624K39914K3231o9812P3822
$$ 1041779 1011954 1087754 1140921 1182970 1285523 1107995 1121619 1361533 1384764 1314952 1388774
7181A388774Q0836m1494O1490J14972L13634J45993J00600P2561J94167J12627
$$ 1388774 1469610 1428116 1489606 1604578 1918212 2064205 2164805 2237366 2431533 2544160
7171B544160J22946K62474J91785K52827M04536L82678N7208j29165l03057l65306
$$ 2544160 2667106 2929580 3121365 3374192 3778728 4161406 4218614 4089449 3786392 3421086
7161C421086m92773k50551k74013j85482l54977j04813j53128M948K732p6642
$$ 3421086 2928313 2677762 2403749 2218267 1863290 1758477 1605349 1610297 1613029 1536387
7151A536387j11748j14418J33290J16284L9781n4309O7526j368j07323L6580J47843
$$ 1536387 1424639 1310221 1443511 1559795 1599576 1545267 1612793 1611425 1504102 1540682 1688525
7140A688525r712K7706J91145J37557J41288K99658L08353L34457L07173K42179
$$ 1688525 1678813 1706519 1897664 2035221 2176509 2476167 2784520 3118977 3426150 3668329
7130C668329Q2002p1463j69596l03163l22831l76105j35344j90601j58117j62376
$$ 3668329 3750331 3678868 3509272 3206109 2883278 2507173 2371829 2181228 2023111 1860735
7120A860735p0862Q7619k2595j70580k29740Q5706k8175P3030P0606l77525j82228
$$ 1860735 1789873 1877492 1854897 1684317 1454577 1540283 1512108 1585138 1655744 1278219 1095991
7109A095991L4741o4991J44567J7225q2845k86197k1488J01399L9283J77004l5692
$$ 1095991 1130732 1065741 1210308 1227533 1144688 858491 837003 938402 977685 1154689 1118997
7098A118997q6190O7108Q1710p306p7510n7218M4977r3126K4374j3877j6861K9577
$$ 1118997 1032807 1099915 1181625 1174319 1096809 1039591 1084568 991442 1015816 1001939 985078 1014655
7086A014655l1985k14236L6568j6163N6890j2054j76124M1254L8508r149l6247
$$ 1014655 982670 768434 805002 788839 845729 833675 657551 698805 737313 728164 691917
7075F91917j63208M7066n588k1753k6348l8310O1740l587P8476l0232j24920o727
$$ 691917 528709 575775 570187 548434 522086 483776 545516 541929 620405 590173 465253 458526
7063D58526J9976l0726K17266R7895r085M137q2976J13259j42334j15649P3194
$$ 458526 478502 447776 665042 762937 753852 757989 675013 788272 645938 530289 603483
7052F03483J4102J3355j39191Q75J51317R1234p7352j5336j53500q4536N033J5492
$$ 603483 617585 630940 491749 492624 643941 735175 657823 642487 488987 404451 409484 424976
7040D24976J0246n3453m2400P0821K9021L3942P1547J03835J31013k36558L4386
$$ 424976 435222 381769 339369 410190 439211 473153 544700 648535 779548 542990 577376
7029E77376J18592j76646J20318m9470p4871m6873J60645L5699j26357k2756j46784
$$ 577376 695968 519322 639640 590170 515299 468426 629071 664770 538413 515657 368873
7018C68873L7411L3894J35847p4492N7542Q6176j55667m4713j260l6333Q8287
$$ 368873 406284 440178 576025 501533 559075 645251 489584 444871 443611 407278 495565
7007D95565K01636k00851n3334K12O9752K29209l594k3068r5087n8380P3341j7303
$$ 495565 697201 496350 443016 443228 512980 742189 738595 715527 620440 562060 635401 618098
6995F18098J7410Q7552k3864l8309m6268L104O7911r0864j03856P5634M0864K8797
$$ 618098 635508 723060 699196 660887 614619 617723 685634 594770 490914 566548 607412 636209
6983F36209N3988l3713J11842r824j37681N9411k3163P4150Q7432j98391k6093
$$ 636209 690197 656484 768326 758502 620821 680232 657069 731219 818651 620260 594167
6972E94167O9037j1937k8939j9294N6638k2049K568p5025o2781J81549K8043L5151
$$ 594167 663204 651267 622328 603034 659672 637623 640191 565166 502385 683934 711977 747128
6960G47128M782J33954L7774m9009K6444m1055j10510l261J01635J40882j3869
$$ 747128 751910 885864 923638 874629 901073 860018 749508 746247 847882 988764 974895
6949I74895r505p4171m8622J40584P2583n0740L2009J76379r5490l4734j4365
$$ 974895 965390 891219 842597 983181 1055764 1005024 1037033 1213412 1117922 1083188 1068823
6938A068823J01558n1317O1897N5694j22703j49231r1484K31199L3871K294K01005
$$ 1068823 1170381 1119064 1180961 1236655 1113952 964721 873237 1104436 1138307 1140601 1341606
6927A341606j64817j3526J06743j9582J25227M4359M8827J85938O8378L1967l0384
$$ 1341606 1176789 1163263 1270006 1250424 1375651 1420010 1468837 1654775 1723153 1755120 1724736
6916A724736J26358J60991J65375J15063q0569P4691N8380J9802K68720M836j64387
$$ 1724736 1851094 2012085 2177460 2292523 2211954 2286645 2345025 2364827 2633547 2638383 2473996
6905B473996J08408K65671K7481p3491L19214K03878K24394M04732N13226N06310
$$ 2473996 2582404 2848075 2875556 2802065 3121279 3325157 3549551 3954283 4467509 4973819
6895D973819K06563m08192n97050n59898m25915k75851l22807j68769j6272k12182
$$ 4973819 5180382 4772190 4175140 3615242 3189327 2913476 2590669 2421900 2405628 2193446
6885B193446j42994j9960P1263Q3164l271k08743j63861l1936j68915j21059n6968
$$ 2193446 2050452 2030492 2101755 2184919 2181648 1972905 1809044 1777108 1608193 1487134 1430166
6874A430166M0301J09940o9417p6795J60217n8988m7556O9238R9501L200m6081
$$ 1430166 1470467 1580407 1510990 1434195 1594412 1535424 1487868 1557106 1656607 1659807 1613726
6863A613726K6061Q76j08038K3088J72281m0451J05709K7338q85P4261n5796j36408
$$ 1613726 1639787 1640663 1532625 1555713 1727994 1687543 1793252 1820590 1819705 1893966 1838170 1701762
6851A701762J5310J23188R8532N0862J051p5831J7104N8470j66976J02059k6428
$$ 1701762 1717072 1840260 1938792 1989654 1990705 1914874 1931978 1990448 1823472 1925531 1899103
6840A899103j9474m4505j34973Q9152J4890q6734J65784k6239j04440J35492O8134
$$ 1899103 1879629 1835124 1700151 1789303 1804193 1717459 1883243 1857004 1752564 1888056 1956190
6829A956190j4748n0738M2658Q2059j18386q4216o5689J02885q8689o7732J12096
$$ 1956190 1941442 1890704 1933362 2015421 1897035 1812819 1747130 1850015 1761326 1693594 1805690
6818A805690N3153R4744L6352j33970l3726K60851n3328o1292K68676N3608K9293
$$ 1805690 1858843 1953587 1989939 1855969 1822243 2083094 2029766 1968474 2237150 2290758 2320051
6807B320051j9772q6060J01650R9297J47755p8669j19332K05525L8792l756m084
$$ 2320051 2300279 2214219 2315869 2415166 2562921 2484252 2364920 2570445 2609237 2605481 2601397
6796B601397J9541j7628J33549O9888M4884j13002N7770J70485K3168q2969J05898
$$ 2601397 2620938 2603310 2736859 2806747 2851631 2738629 2796399 2966884 2990052 2907083 3012981
6785C012981J91587k4026K20725J57944p6280J63300K45454j03197J42940J65658
$$ 3012981 3204568 3180542 3401267 3559211 3482931 3646231 3891685 3788488 3931428 4097086
6775D097086J06671L7734R7350K62298M3962m8878N7825j39618J29961J68162
$$ 4097086 4203757 4241491 4338841 4601139 4645101 4596223 4654048 4514430 4644391 4812553
6765D812553R4227O9928N6500j51749J07188K50713J89374J18337L10834J09959
$$ 4812553 4906780 4976708 5033208 4881459 4988647 5239360 5428734 5547071 5857905 5967864
6755E967864K28146L48345K94853L83466N39612N63850P15424R05486R39709Q57683
$$ 5967864 6196010 6544355 6839208 7222674 7762286 8326136 9041560 9947046 10886755 11744438
6745A1744438R95063P53180K6921n03947p00818o62936l89671l97129l55989j19687
$$ 11744438 12739501 13492681 13519602 13015655 12314837 11651901 11262230 10865101 10509112 10389425
6735A0389425R425K43628J52391K11023L24980O07298P48083O29732R73855J163221
$$ 10389425 10398850 10642478 10794869 11005892 11330872 11938170 12686253 13315985 14289840 15453061
6725A5453061J457893J780580K075658K692684L181910L610189L115549J872634
$$ 15453061 16910954 18691534 20767192 23459876 26641786 30251975 33367524 35240158
6717C5240158J32792r85447k198869l101793k982966k562183k106832j364926
$$ 35240158 35372950 34387503 32188634 29086841 26103875 23541692 21434860 20069934
6709B0069934j123278q18692l18047K331J6037K39262O52230N41581J089211J342786
$$ 20069934 18946656 18127964 17809917 17812248 17828285 18067547 18719777 19261358 20350569 21693355
6699B1693355J469161K205826K690098L174960M082675M854864M631657L934192
$$ 21693355 23162516 25368342 28058440 31233400 35316075 40170939 44802596 48736788
6691D8736788K170980m56832l082352m639595m905040m696973l940020l346502
$$ 48736788 50907768 50450936 47368584 42728989 37823949 33126976 29186956 25840454
6683B5840454k622328j848810j461325q80030n52122l85418k26596J48204M30589
$$ 25840454 23218126 21369316 19907991 19027961 18475839 18090421 17863825 18012029 18442618
6674A8442618N15801P01790R62835J358458J794417K364862K615227L152486L054281
$$ 18442618 18958419 19660209 20623044 21981502 23775919 26140781 28756008 31908494 34962775
6665C4962775J837492L14452j165520k755371l652623l848664l410851k787784
$$ 34962775 36800267 37114719 35949199 33193828 29541205 25692541 22281690 19493906
6657A9493906k334540j895912j361716j038181r99723o49057l92970n58688l25700
$$ 19493906 17159366 15263454 13901738 12863557 11863834 11214777 10821807 10263119 9937419
6648I937419l3240j64460L3967k77081J42575L07942N51750M92897N90339Q10566
$$ 9937419 9904179 9739719 9773686 9496605 9639180 9947122 10498872 10991769 11582108 12392674
6638A2392674N35727p5072p55108j158473j248354j117163j021724p41472n89367
$$ 12392674 12928401 12853329 12098221 10939748 9691394 8574231 7552507 6811035 6221668
6629F221668m81694m24473k44382l18266j68445j84460k00336j84347k1234k20854
$$ 6221668 5739974 5315501 5071119 4752853 4584408 4399948 4199612 4015265 3994031 3773177
6619C773177j71531M9356j06008r9157j84100m948l1053j56583p8499r186j0595
$$ 3773177 3601646 3651002 3544994 3445837 3261737 3256789 3225736 3069153 2990654 2981468 2970873
6608B970873l8130j46099O4969J3577J9641l5906o267P9150k0565K8723Q7998
$$ 2970873 2932743 2786644 2851613 2865190 2884831 2848925 2842658 2921808 2901243 2929966 3017964
6597C017964K4397N5762J71936O9104Q8828n2380m29315J37047j7400l64993L8015
$$ 3017964 3042361 3098123 3270059 3339163 3427991 3375611 2946296 3083343 3065943 2700950 2738965
6586B738965j43235j35817j92515j60491J6379o531l3526o6566p7607m6098Q699
$$ 2738965 2595730 2459913 2267398 2106907 2123286 2116755 2083229 2016663 1939056 1892958 1901657
6575A901657k9761M4674q0738O671j0779l7166N2422j554O9974q9025J9098m5163
$$ 1901657 1871896 1916570 1835832 1842503 1831724 1794558 1846980 1845426 1915400 1826375 1845473 1800310
6563A800310p8273J07425K8093O5394n0584p4682n2694K0166J5483K3383R3232
$$ 1800310 1722037 1829462 1857555 1922949 1872365 1797683 1744989 1765155 1780638 1804021 1897253
6552A897253l2975j28185j49911K61710P8106n5111K17968J80888j7088K4011
$$ 1897253 1864278 1736093 1586182 1847892 1925998 1870887 2088855 2269743 2252655 2276666
6542B276666O7561J29324o130k4760q4855K14232n4738j56060j01075j83493P2841
$$ 2276666 2344227 2473551 2467421 2442661 2357806 2572038 2517300 2361240 2260165 2076672 2149513
6531B149513O0110m1477J40577P4376N9595M4184m7203j6204J05356j77340k1268
$$ 2149513 2209623 2168146 2308723 2383099 2442694 2486878 2439675 2423471 2528827 2351487 2330219
6520B330219J07655R2516o7621K8567r7441J18577J04854j1881J76353r4080j14967
$$ 2330219 2437874 2530390 2462769 2491336 2393895 2512472 2617326 2605445 2781798 2687718 2572751
6509B572751L2293j20514j78957q7445L613l1317j56607J40167Q1592K7870n2533
$$ 2572751 2605044 2484530 2305573 2218128 2221741 2190424 2033817 2173984 2255576 2283446 2230913
6498B230913O7959L6241M7895J46279o2968p1446l9822R0046Q9033O6763L3311
$$ 2230913 2298872 2335113 2383008 2529287 2466319 2394873 2355051 2445097 2534130 2600893 2634204
6487B634204l4328J39307M2220K76601K11714J69278j2018l7092O6430M1075l0030
$$ 2634204 2599876 2739183 2781403 3058004 3269718 3438996 3426978 3389886 3456316 3497391 3467361
6476C467361k2324m1295p9679m856J8716j60621J71K02666j44288M3854J63856
$$ 3467361 3445037 3403742 3324063 3319207 3337923 3177302 3177473 3380139 3235851 3279705 3443561
6465C443561M1790N2036P002M8221N0447o6767l3531J21624J2462N1385M1362
$$ 3443561 3485351 3537387 3544389 3592610 3643057 3576290 3542759 3664383 3676845 3728230 3769592
6454C769592Q6970Q1201J61384Q5415J12727r303J38734q381P8357J00844j35464
$$ 3769592 3856562 3937763 4099147 4184562 4297289 4287986 4426720 4418339 4496696 4597540 4462076
6443D462076J09879M3451j57829O0081J52202K209R1555j5368M186K02285Q1356
$$ 4462076 4571955 4615406 4457577 4517658 4669860 4672069 4763624 4748256 4752442 4954727 5036083
6432E036083l4338M6950J88162l6293k81601N8386J21486Q3956j63846k21558
$$ 5036083 5001745 5048695 5236857 5200564 4918963 4977349 5098835 5182791 5018945 4797387
6422D797387P6279l0248R1621n2765J67535L4391j26420m874R3957L7237n8522
$$ 4797387 4873666 4843418 4935039 4882274 5049809 5084200 4957780 4952906 5046863 5084100 5025578
6411E025578n7975j27042r8107j3276O004q2669j74506N5324o3714R2883r043
$$ 5025578 4967603 4840561 4742454 4729178 4735182 4652513 4478007 4533331 4469617 4562500 4553457
6400D553457j22569Q3421J32278L3149k6797n1131R9005J24290J21091L29879
$$ 4553457 4430888 4514309 4646587 4679736 4652939 4601808 4700813 4825103 4946194 5276073
6390E276073j24531p0995o2151k03446j04536r7462k60312j63531k02049j94511
$$ 5276073 5151542 5080547 5018396 4814950 4710414 4612952 4352640 4189109 3987060 3792549
6380C792549j21290j33486K59p4197j40676r3974q9925q9345R838k0292j2835
$$ 3792549 3671259 3537773 3538032 3463835 3323159 3229185 3139260 3049915 3059753 3039461 3026626
6369C026626l3807k57808J95302q4459j3710l0367P164K3430k53217j11377J39886
$$ 3026626 2992819 2735011 2930313 2845854 2832144 2801777 2808941 2832371 2579154 2467777 2607663
6358B607663J10932l5219L4873N974j30091L1538O0543J96572J70762j35038j21092
$$ 2607663 2718595 2683376 2718249 2724223 2594132 2625670 2686213 2882785 3053547 2918509 2797417
6347B797417N7807l0140L0005p191o0021p4258p125J1562q1883r63L8988m6229
$$ 2797417 2855224 2825084 2855089 2847898 2787877 2713619 2706494 2718056 2636173 2635210 2674198 2627969
6335B627969J51202k4148K6527J04096n3910q2008K7387O7740L6454M6607Q0125
$$ 2627969 2779171 2755023 2781550 2885646 2831736 2749728 2777115 2844855 2881309 2927916 3008041
6324C008041N496l3632M659j1987o5861k02519J1817j4398j23690j35379n4842
$$ 3008041 3013537 2979905 2984564 2972577 2906716 2704197 2716014 2701616 2577926 2442547 2387705
6313B387705J72100N1609j49401M028q4399m4652J27977l345O6134n2131M1477
$$ 2387705 2559805 2611414 2462013 2466041 2381642 2336990 2464967 2461622 2527756 2475625 2517102
6302B517102J28450m1437J36955M9993j00204K2874k3064o69R8553q5038K9861
$$ 2517102 2645552 2604115 2741070 2791063 2690859 2713733 2690669 2690000 2788553 2703515 2733376
6291B733376j74526j06604m591l1760l3186j46770K6264J07826r4948j23045m8044
$$ 2733376 2558850 2452246 2447655 2415895 2382709 2235939 2262203 2370029 2275081 2152036 2103992
6280B103992P6524L4582n3484J2399J56039M714P0337j97706O1195k3021J38435
$$ 2103992 2180516 2215098 2161614 2174013 2330052 2334766 2405103 2207397 2268592 2245571 2384006
6269B384006J12964j14493K2029l5493P709j43204j47899J05121K9004l2159J35326
$$ 2384006 2496970 2382477 2404506 2369013 2376722 2233518 2085619 2190740 2219744 2187585 2322911
6258B322911k4779p3385o1515K371m3321J2376l4362k8322J18P8628N5005K6797
$$ 2322911 2298132 2224747 2163232 2165603 2122282 2134658 2100296 2071974 2072092 2150720 2205725 2232522
6246B232522r2820L508J4548l3933o9211Q048l4354R9684p8423p475J21313R4565
$$ 2232522 2139702 2143210 2157758 2123825 2054614 2062662 2028308 2127992 2049569 2042094 2163407 2257972
6234B257972O1432j5173r6208l1232K43887k3463j49811q5024O5765Q556o5806
$$ 2257972 2319404 2304231 2208023 2176791 2420678 2397215 2247404 2162380 2228145 2236701 2170895
6223B170895N4970J13953k48136n523J38998Q8650P653K8097N0923r9521J5180
$$ 2170895 2225865 2339818 2091682 2086159 2225157 2313807 2321460 2349557 2400480 2300959 2316139
6212B316139J93295l0318L0771J6598M5481L8131r4690r9972j01014n9756J05268
$$ 2316139 2509434 2479116 2509887 2526485 2571966 2610097 2515407 2415435 2314421 2254665 2359933
6201B359933J63597L0213Q0454p8404O8102K6870N9209m9630J43935L4061J69269
$$ 2359933 2523530 2553743 2634197 2555793 2623895 2650765 2709974 2660344 2804279 2838340 3007609
6190C007609J60258J06111R5492p8032M861M6479J02116J36919j46353k13671
$$ 3007609 3167867 3273978 3369470 3291438 3296299 3342778 3444894 3581813 3435460 3221789
6180C221789K05359m7825q2773Q6229J00191q5478j41730j23986Q4742K8481p0335
$$ 3221789 3427148 3379323 3296550 3382779 3482970 3397492 3255762 3131776 3216518 3244999 3174664
6169C174664K5704l3851J27852q2503J64503N2194N2292K38792J05628K25161
$$ 3174664 3200368 3166517 3294369 3211866 3376369 3428563 3480855 3719647 3825275 4050436
6159D050436J66660J12970P8850J29886J82644J38181j81434j50108N052q583
$$ 4050436 4217096 4330066 4408916 4538802 4721446 4859627 4678193 4528085 4533137 4524554
6149D524554j9221J04623O719k986L0919J6210j5660N1223j6790j47574j4577
$$ 4524554 4505333 4609956 4616675 4613689 4644608 4660818 4645158 4696381 4679591 4532017 4517440
6138D517440M0135j40492j14497K15927J66700k12258J50370J91694J82688O3284
$$ 4517440 4557575 4417083 4302586 4518513 4685213 4472955 4623325 4815019 4997707 5060991
6128E060991P3332J10744O3528j8052j47102q0893k19413J7061J67669O7648o0547
$$ 5060991 5134323 5245067 5308595 5290543 5143441 5062548 4843135 4860196 5027865 5095513 5034966
6117E034966j23867J21406j36834k1867o9681n5720L6631J03043j8288n1212J00935
$$ 5034966 4911099 5032505 4895671 4873804 4804123 4748403 4785034 4888077 4869789 4818577 4919512
6106D919512o3672J04328k0096p4405N1093L7282J4184J26831p6263J6293m3268
$$ 4919512 4855840 4960168 4940072 4865667 4916760 4954042 4968226 5095057 5018794 5035087 4991819
6095D991819P9780p9420l3359N2317J09906J8339P1143o4711k8341J8538r58l3153
$$ 4991819 5071599 4992179 4958820 5011137 5121043 5139382 5210525 5145814 5117473 5136011 5135053 5101900
6083E101900L3641n8437r6816q6648j17770j97488k41845j59664l5194j00365
$$ 5101900 5135541 5077104 4980288 4893640 4775870 4578382 4336537 4176873 4141679 4041314
6073D041314n1718j93794j33181m9231Q2218M0372k5185j02414p6359J20290J16385
$$ 4041314 3989596 3795802 3662621 3613390 3695608 3735980 3710795 3608381 3532022 3652312 3768697
6062C768697k3321j3346K96673Q19j17321K18067O0726M5735J17511Q7822j8984
$$ 3768697 3745376 3732030 4028703 4029522 3912201 4130268 4190994 4236729 4354240 4442062 4423078
6051D423078N2352K22267J8233j28379o2583L9570M064j62229j56028n8630j29795
$$ 4423078 4475430 4697697 4715930 4587551 4524968 4564538 4568602 4406373 4250345 4191715 4061920
6040D061920j6161M0515k7745j51476J80004k2549L3415O4363j32091l8597J0662
$$ 4061920 4045759 4086274 4058529 3907053 4087057 4064508 4097923 4162286 4030195 3991598 4002260
6029D002260k43514j26764O5259j10304j80343k08687J31774O3312j23502m7420
$$ 4002260 3758746 3631982 3697241 3586937 3406594 3197907 3329681 3392993 3269491 3222071
6019C222071M6079q8039n5232P8002j79166J17378k631n6262O2286J0165m9701
$$ 3222071 3268150 3180111 3124879 3202881 3023715 3141093 3138462 3082200 3144486 3154651 3104950
6008C104950J89905m3057j40893J76796J36474j26731o1592J12800J00235m6809
$$ 3104950 3294855 3251798 3110905 3287701 3424175 3297444 3235852 3348652 3448887 3402078
5998C402078J27773m298n5958R615k0051p0681K8729L2786o8618m5268q3172k7809
$$ 3402078 3529851 3525553 3469595 3479210 3459159 3388478 3417207 3449993 3381375 3336107 3252935 3225126
5986C225126P1013j26206k45983n535O3748o862q1314j26363Q7626J03071J1948
$$ 3225126 3296139 3169933 2923950 2918415 2982163 2975301 2893987 2767624 2855250 2958321 2970269
5975B970269J6356j30824o7556J50650q6669M8268R9463j51265R9670l0468J19889
$$ 2970269 2986625 2855801 2788245 2938895 2852226 2900494 2999957 2848692 2948362 2917894 3037783
5964C037783R1120j44499J10372P5071K3888n6656j1104K6309r965N9229k30029
$$ 3037783 3128903 2984404 3094776 3169847 3193735 3137079 3125975 3152284 3142319 3201548 2971519
5953B971519Q5549J76231M755n1095n933k3712J08326q4667P815O5370K5240J1339
$$ 2971519 3057068 3233299 3238054 3186959 3181026 3157314 3265640 3180973 3188788 3254158 3279398 3290737
5941C290737k4595o4640N3223K23652J17642J52602K4711N5464m8372J77889J53436
$$ 3290737 3266142 3201502 3254725 3478377 3596019 3748621 3773332 3828796 3780424 3958313 4111749
5930D111749J12635n004K62066K80019J04904K75186R8784J96983J13246L00101
$$ 4111749 4224384 4219380 4481446 4761465 4866369 5141555 5240339 5437322 5550568 5850669
5920E850669J65436J61555N7956j5341m3516k0907l24105k64074p6509k31923
$$ 5850669 6016105 6177660 6235616 6220275 6176759 6155852 5831747 5567673 5491164 5259241
5910E259241j41768l97195j97785k14706m6066k01326k58059j90484o7461M7702
$$ 5259241 5117473 4720278 4522493 4307787 4261721 4060395 3802336 3611852 3544391 3592093
5900C592093r3904J52291R9175k02752J25320K65328k5732j4432j6850P8210l6781
$$ 3592093 3498189 3650480 3749655 3546903 3672223 3937551 3911819 3897387 3880537 3958747 3921966
5889C921966r0912k05269q4931J14508j1969m1571l2066M0836M6520j5773Q2199
$$ 3921966 3831054 3625785 3540854 3655362 3643393 3601822 3569756 3610592 3657112 3641339 3723538
5878C723538J36706n9899l0860J44554R8909M2889Q9838K41893J33963J44700
$$ 3723538 3860244 3800345 3769485 3914039 4012948 4055837 4145675 4387568 4521531 4666231
5868D666231J17024J98556L20716M05283L00768L68245L45193P9969k3453Q430
$$ 4666231 4783255 4981811 5302527 5707810 6008578 6376823 6722016 6801985 6778532 6786962
5858F786962N8252j10589j82030j08729l71550k76013k99762k25222l66989k89528
$$ 6786962 6845214 6734625 6552595 6443866 6072316 5796303 5496541 5271319 4904330 4614802
5848D614802o3612k32163L3956k25029j73106N6984n0408k03906J53511K0378
$$ 4614802 4551190 4319027 4352983 4127954 3954848 4011832 3961424 3757518 3911029 3931407
5838C931407j24300Q5184j00235K08131j9748l9677L6207M0252M0117j10795j10667
$$ 3931407 3807107 3892291 3792056 4000187 3980439 3940762 3976969 4017221 4057338 3946543 3835876
5827C835876k8668L0269k9458m5546n0798J15203k7851j61648Q6529K4204p883
$$ 3835876 3807208 3837477 3808019 3762473 3711675 3826878 3799027 3637379 3723908 3748112 3740229
5816C740229n7034j9105K39561J19653P3578r6245J31866J74850M8026J49226
$$ 3740229 3683195 3664090 3903651 4023304 4096882 4000637 4132503 4307353 4355379 4504605
5806D504605L0566J22692J52249K8153J60025j35352K4143K17767J34457K56567
$$ 4504605 4535171 4657863 4810112 4838265 4998290 4862938 4887081 5104848 5239305 5495872
5796E495872M28532N07576L02738L17801O49985R04932J053245J567382J915387
$$ 5495872 5924404 6431980 6734718 7052519 7702504 8607436 9660681 11228063 13143450
5787A3143450J838467J062498m98255j740602k055268j725865j484485j268407
$$ 13143450 14981917 16044415 15546160 13805558 11750290 10024425 8539940 7271533
5779G271533p65711n14174m33657l75749j77440o3425j03630r7070k02915n6479
$$ 7271533 6505822 5991648 5557991 5182242 5004802 4941377 4837747 4740677 4537762 4481283
5769D481283R1956j59692k03142L7752J3236q0630j8321J21003j873P2807J0080
$$ 4481283 4573239 4413547 4210405 4248157 4261393 4180763 4162442 4283445 4281572 4354379 4364459
5758D364459K01629K16376P2798n027j95255k75207j95548m2426k01353q1988
$$ 4364459 4566088 4782464 4855262 4850235 4654980 4379773 4184225 4141799 3940446 3858458
5748C858458j2208j66664k3448m4394J29171J03596r203o7142j1445m0163M2381
$$ 3858458 3846250 3679586 3656138 3611744 3740915 3844511 3835308 3768166 3756721 3716558 3758939
5737C758939o9363o9232P7068j78130R314k6494k02676n7438J00185k82037p3051
$$ 3758939 3689576 3620344 3697412 3519282 3528596 3502102 3299426 3241988 3342173 3060136 2987085
5726B987085J49797J3870P3006m3532K5006j98621J64413j05475j12442J56436
$$ 2987085 3136882 3150752 3223758 3180226 3205232 3006611 3171024 3065549 2953107 3109543
5716C109543q0240J42797K854K4405r8147K24471J04260n6879N7985o2720J5170
$$ 3109543 3029303 3172100 3174954 3199359 3101212 3325683 3429943 3373064 3431049 3368329 3383499
5705C383499J30070l1707r9074J16240O0050j837O0729J8478k8397O2643J26842
$$ 3383499 3513569 3481862 3382788 3499028 3559078 3557241 3617970 3636448 3608051 3670694 3797536
5694C797536L0118R8787L2289P4193p4806q3085J38543K63017J61874J98K25842
$$ 3797536 3827654 3926441 3958730 4032923 3958117 3875032 4013575 4276592 4438466 4438664 4664506
5683D664506o7184M2748r895k8626P1458P6010j92759n8783o0407J95480L1937
$$ 4664506 4597322 4640070 4630175 4601549 4673007 4749017 4556258 4497475 4437068 4632548 4664485
5672D664485q3414J33303l3323L5991l7053j88931m3493O7472l8327M091j70818
$$ 4664485 4581071 4714374 4681051 4717042 4679989 4491058 4447565 4515037 4476710 4480801 4309983
5661D309983p2422m3747R2643k5375j51870R971q0732Q1078P1513j4328j05388
$$ 4309983 4237561 4193814 4286457 4261082 4109212 4119183 4038451 4119529 4191042 4176714 4071326
5650D071326j25560J38884l3627m7797L9738J85488m1937r560j10589P4772N3119
$$ 4071326 3945766 4084650 4051023 4003226 4042964 4228452 4186515 4176955 4066366 4141138 4194257
5639D194257K7952K06582J46001J17J08093M6082K42986N1200o569l7579K03193
$$ 4194257 4222209 4428791 4574792 4574909 4683002 4729084 4972070 5023270 5016701 4979122 5182315
5628E182315j33367K0546J01369j71798m7589P0651K1267O8560J50736J32522
$$ 5182315 5048948 5069494 5170863 4999065 4951476 5022127 5043394 5111954 5262690 5395212
5618E395212J67545j4162J24753p7284m8036J50338J23031N1355j27470L2349
$$ 5395212 5562757 5548595 5673348 5596064 5548028 5698366 5821397 5872752 5745282 5777631
5608E777631K94176J60448K37126J15278L9111J83027J96420r8555K3412K96792
$$ 5777631 6071807 6232255 6469381 6584659 6623770 6806797 7003217 6904662 6928074 7224866
5598G224866L1751K02098K644p5896j8698m1912j7265j40109P8194L353R8117
$$ 7224866 7256617 7458715 7461359 7385463 7366765 7324853 7307588 7167479 7245673 7249026 7347143
5587G347143K85069P3208O859m2778J08593K48975J02148L60865J6871L0899q1646
$$ 7347143 7632212 7705420 7712279 7669501 7778094 8027069 8129217 8490082 8506953 8537852 8456206
5576H456206J40333P4125m2346J36280J80040n8965r8514J74078K64760J20399
$$ 8456206 8596539 8670664 8628318 8764598 8944638 8885673 8787159 8961237 9225997 9346396
5566I346396L244K6888K49683J70153p0175M0325L7336J50958J79206k8377K34464
$$ 9346396 9349640 9376528 9626211 9796364 9726189 9766514 9803850 9954808 10134014 10105637 10340101
5555A0340101K29838J32448K32931L76672J94716J84646L34897M18185M24555
$$ 10340101 10569939 10702387 10935318 11311990 11506706 11691352 12026249 12444434 12868989
5546A2868989M54997N11871N46459N83546P45983O36324J032583J015287J179990
$$ 12868989 13323986 13835857 14382316 14965862 15711845 16348169 17380752 18396039 19576029
5537A9576029J572667K048160K598305K849783K277938P44306j507634k960282
$$ 19576029 21148696 23196856 25795161 28644944 30922882 31667188 30159554 27199272
5529B7199272k910068k318638j743219j368724r94475j001337n36850m65596m37618
$$ 27199272 24289204 21970566 20227347 18858623 17864148 16862811 16325961 15860365 15422747
5520A5422747k54854M2990n5726j02746j08266p942o9856O8549O9318L0759J8457
$$ 15422747 15167893 15210883 15155157 15052411 14944145 14936203 14866347 14934896 15004214 15034973 15053430
5509A5053430K39257K22532J89799J54706K62805K93346L12052K13199L4601K5263
$$ 15053430 15292687 15515219 15705018 15859724 16122529 16415875 16727927 16941126 16975727 17000990
5499A7000990n01389m86607k26044n0486k91850m6264K1771j16051P7843N6993
$$ 17000990 16499601 16012994 15786950 15736464 15444614 15398350 15420121 15304070 15381913 15438906
5489A5438906o6747r7829q8656o9543p0085j19337J18782R2977O937K19656P6338
$$ 15438906 15372159 15274330 15185674 15116131 15046046 14926709 15045491 15138468 15145405 15365061 15441399
5478A5441399J74841J24085j9145M2557j15948k58704n6375j50069l32428o6700
$$ 15441399 15616240 15740325 15721180 15763737 15647789 15389085 15332710 15182641 14850213 14783513
5468A4783513N2984N97K66K12608J18217K24547K72119J87423J88645k1224n0623
$$ 14783513 14836497 14837094 14837360 15049968 15168185 15392732 15664851 15852274 16040919 16019695 15969072
5457A5969072j84992k02610J0632q7028l8132M7346q5994j45476J02519J15773
$$ 15969072 15784080 15581470 15592102 15505074 15466942 15514288 15428294 15282818 15385337 15501110
5447A5501110o8398J3490k7767Q4751K02033m7159K72940J06228j9474J2137P1990
$$ 15501110 15432712 15446202 15418435 15503186 15705219 15658060 15931000 16037228 16017754 16029891 16101881
5436A6101881M5733M2314K4607P2669K5819J09822J59428L10807L53025N6447
$$ 16101881 16147614 16189928 16214535 16287204 16313023 16422845 16582273 16893080 17246105 17302552
5426A7302552k68352j89442N5554k1543L831K5196l794K44763K79827J38923J15438
$$ 17302552 17034200 16844758 16900312 16878769 16882600 16907796 16904002 17148765 17428592 17567515 17682953
5415A7682953K35762J25202K11914L99591L35958J01127J32591L32084L24755
$$ 17682953 17918715 18043917 18255831 18655422 18991380 19092507 19225098 19557182 19881937
5406A9881937K74585K88904q466p9608N5985p6153M9666n8780L34973K22443N7793
$$ 19881937 20156522 20445426 20436960 20357352 20413337 20337184 20386850 20328070 20663043 20885486 20943279
5395B0943279L4934n2543R3130q0738r1398Q7680K326m2942N2162K21641J96984
$$ 20943279 20978213 20925670 21018800 20938062 20846664 20934344 20936670 20893728 20945890 21167531 21364515
5384B1364515L09094L28230K68690L94450J40906Q4453N1653M1241J54867J91437
$$ 21364515 21673609 22001839 22270529 22664979 22805885 22890338 22941991 22983232 23138099 23329536
5374B3329536O0974n6662j56771n1043j2127m8515J94460K04785K15731L16412
$$ 23329536 23390510 23333848 23177077 23126034 23113907 23065392 23259852 23464637 23680368 23996780
5364B3996780L89681L89321K51990K21245J41769L20208M49906K42829L64626
$$ 23996780 24386461 24775782 25027772 25249017 25390786 25710994 26160900 26403729 26768355
5355B6768355M21568K63885N24916O19707M72282M80696L55530O68841O49382
$$ 26768355 27189923 27453808 27978724 28598431 29070713 29551409 29906939 30575780 31225162
5346C1225162O89936Q34365P53201P34535R82023Q95358J006127J124984R88274
$$ 31225162 31915098 32749463 33502664 34237199 35219222 36114580 37120707 38245691 39233965
5337C9233965R63522J488258J781790K120279K640259L583929M098161L996161
$$ 39233965 40197487 41685745 43467535 45587814 48228073 51812002 55910163 59906324
5329E9906324K714006Q77150p15067j727346j922635j279528p31594o29143o38443
$$ 59906324 62620330 63497480 62782413 61055067 59132432 57852904 57121310 56492167 55853724
5320E5853724m80333l48849j012388j345161j220087o71870m76539k01982K59344
$$ 55853724 55373391 55024542 54012154 52666993 51446906 50775036 50298497 50096515 50355859
5311E0355859P61832R18985J435372K094557K566125L344613M365080N113756
$$ 50355859 51117691 52036676 53472048 55566605 58132730 61477343 65842423 70956179
5303G0956179O187630P044407O389906N407254L963419K956561J921227P55120
$$ 70956179 77143809 84188216 90578122 95985376 99948795 102905356 104826583 105581703
5295A05581703K51564R87906K593391M167743N079581M123821L96322m322046
$$ 105581703 105833267 106821173 109414564 113582307 118661888 122785709 123182031 118859985
5287A18859985p420446q166488p397865n830945m263688k757360j404774n11230
$$ 118859985 111439539 103273051 95875186 90044241 85780553 83023193 81618419 81107189
5279H1107189K97290N58286J166163J396654J521109J819359J797174K073399
$$ 81107189 81404479 81962765 83128928 84525582 86046691 87866050 89663224 91736623
5271I1736623K218441K140876R61375n55275q38865J03421J325405K504767L016188
$$ 91736623 93955064 96095940 97057315 96502040 95663175 95766596 97092001 99596768 102612956
5262A02612956J994062r69631m480053o972824q033635p687003o789020n493748
$$ 102612956 104607018 103637387 99157334 92184510 84150875 76463872 69674852 64181104
5254F4181104m417915l486759k677566j832552j526690r86381p90802n22545k17944
$$ 64181104 59763189 56276430 53598864 51766312 50239622 49253241 48462439 47939894 47721950
5245D7721950m5537m6151M78943N95984O74744J091046J340575J573459K151592
$$ 47721950 47676413 47630262 48109205 48705189 49379933 50470979 51811554 53385013 55536605
5236E5536605K630289L078741L778290M958593O355324P481470Q007514P643026
$$ 55536605 58166894 61245635 65023925 69982518 76337842 83819312 91826826 99469852
5228I9469852O051699K830992j077680l826885m563290m234731l661690k682371
$$ 99469852 105521551 108352543 107274863 103447978 98884688 94649957 90988267 88305896
5220H8305896k252519k774670l836877m146548l613576k766595j901225r71430
$$ 88305896 86053377 83278707 79441830 75295282 71681706 68915111 67013886 66042456
5212F6042456k74946L85106R67074J832203L137400M548691O023696O985258P135092
$$ 66042456 65767510 66152616 67119690 68951893 72089293 76637984 82661680 89646938 96782030
5203I6782030O019450L812525O08808j881116l008867l195060k435188j539121
$$ 96782030 102801480 106614005 107222813 105341697 102332830 99137770 96702582 95163461
5195I5163461j327968j916596l058811l467037k809120j932634j395645j923158
$$ 95163461 93835493 91918897 88860086 85393049 82583929 80651295 79255650 77332492
5187G7332492l153859m375340n270380n425542m823614l715157k943081k297245
$$ 77332492 74178633 69803293 64532913 59107371 54283757 50568600 47625519 45328274
5179D5328274j532182o46131l83636K96079L53174R81447R02489N81001L45012
$$ 45328274 43796092 43149961 42766325 43062404 43415578 44397025 45299514 45880515 46225527
5170D6225527K61385L91776L96370Q80291J097757J603893J272482J75449j361574
$$ 46225527 46486912 46878688 47275058 48155349 49253106 50856999 52129481 52304930 50943356
5161E0943356l185100m064118m276352l579660l156211k671602j787951j632062
$$ 50943356 47758256 43694138 39417786 35838126 32681915 30010313 28222362 26590300
5153B6590300j367355r67257p53932p29349p09397o64861n72538m33723l91825
$$ 26590300 25222945 24255688 23501756 22772407 22063010 21398149 20825611 20391888 20000063
5144B0000063l89057n00552m04004j57320j65458l19649l30667N5352l5965J32138
$$ 20000063 19611006 19110454 18706450 18549130 18383672 18064023 17733356 17788708 17752743 17884881
5134A7884881L0054J53125L0930J44627k67075m93023k85317n25718l18693j88782
$$ 17884881 17914935 18068060 18098990 18243617 17976542 17483519 17198202 16672484 16353791 16165009
5124A6165009j22098K0608L7971j88236J5197K41871M7133J39995K98715K47392
$$ 16165009 16042911 16063519 16101490 15913254 15928451 16170322 16217455 16357450 16656165 16903557
5114A6903557N71019N28743K70858K3768j13962j25173k07087P5331J60490K17689
$$ 16903557 17474576 18003319 18274177 18297945 18183983 18058810 17851723 17927054 18087544 18305233
5104A8305233K76801L09308K75186j54332m59900m95818o40724m69461m53524
$$ 18305233 18582034 18891342 19166528 19012196 18552296 18056478 17415754 16946293 16492769
5095A6492769l12147k69649p4373j94282o5391j16136m11692j03127j57381j83220
$$ 16492769 16180622 15910973 15836600 15642318 15576927 15460791 15049099 14945972 14788591 14605371
5085A4605371j77975j6328j11196j59752o9203j15885k1202n7245j13921Q2954
$$ 14605371 14427396 14411068 14299872 14140120 14070917 13955032 13933830 13876585 13762664 13845618
5075A3845618M353O5386j29111q6890j16772j60968j0000J18197q5737R256j64815
$$ 13845618 13849971 13915357 13786246 13699356 13582584 13421616 13411616 13529813 13444076 13453332 13288517
5064A3288517j4231r4779J08068N5209k08531j06877R8368l9780p8244j60152
$$ 13288517 13274286 13179507 13287575 13342784 13134253 13027376 13125744 13085964 13007720 12847568
5054A2847568j7275L0356O8152j20423k2689Q3222k14558j70734M7499M0300L8892
$$ 12847568 12830293 12860649 12928801 12808378 12785689 12868911 12654353 12483619 12531118 12571418 12610310
5043A2610310J50525M3304J94695K99225L57105O70389P14385N98074O60038k31829
$$ 12610310 12760835 12804139 12998834 13298059 13655164 14325553 15039938 15638012 16298050 16066221
5033A6066221q92521r40170p56918o40696o40768o37798l26409l13104l51354
$$ 16066221 15173700 14233530 13476612 12835916 12195148 11557350 11230941 10917837 10566483
5024A0566483j46050j54144l68976p5211j71989j77067j98245k13418j74938p3954
$$ 10566483 10420433 10266289 9897313 9822102 9650113 9473046 9274801 9061383 8886445 8812491
5014H812491k34p0592j39383j81426l1781R5290j48587j41975j27102j9026j77338
$$ 8812491 8812257 8741665 8602282 8420856 8389075 8484365 8335778 8193803 8066701 8047675 7870337
5003G870337k42146L22k8643k16849R8712l2795p1213R1646J2637L1079n5919
$$ 7870337 7628191 7628513 7599870 7383021 7481733 7448938 7377725 7469371 7482008 7513087 7457168
4992G457168l8667l7904r1772M8276q9950j6143J12255O2627r6093J97400J12735
$$ 7457168 7418501 7380597 7288825 7337101 7247151 7231008 7343263 7405890 7309797 7507197 7619932
4981G619932p8983Q7307n7646j23018R6820L5079r1211M7109O5394j61410J2970
$$ 7619932 7540949 7628256 7570610 7447592 7544412 7579491 7488280 7535389 7600783 7439373 7452343
4970G452343J30597l2139J6524l814N3988j5912K7366R3352l7246O2815Q768J38607
$$ 7452343 7582940 7550801 7567325 7563511 7617499 7601587 7628953 7722305 7685059 7747874 7756642 7895249
4958G895249J66213Q9146L7734Q5008p4993J22006R1079M1477L0957K4555J26447
$$ 7895249 8061462 8150608 8188342 8273350 8198357 8320363 8411442 8452919 8483876 8508431 8634878
4947H634878J55936K12327m5729J30982R6463q5825R1688K53212K21207K43017
$$ 8634878 8790814 9003141 8957412 9088394 9184857 9099032 9190720 9443932 9665139 9908156
4937I908156K00095K40110J66103J51112j2607J34144O956J20387O9561m8784
$$ 9908156 10108251 10348361 10514464 10665576 10652969 10787113 10794069 10914456 10984017 10935233
4927A0935233L915R1471k89694P0113K02187o416L45804J74747Q0531J05781M0420
$$ 10935233 10939148 11030619 10740925 10811038 11013225 11006809 11352613 11527360 11607891 11713672 11754092
4916A1754092J92430J48651J33409M26870K18238K17889N00954M13831N37346
$$ 11754092 11946522 12095173 12228582 12655452 12873690 13091579 13592533 14006364 14543710
4907A4543710L38059K65362L70412K20857K37804J78311J32316Q0273J22675Q7963
$$ 14543710 14881769 15147131 15517543 15738400 15976204 16154515 16286831 16367104 16489779 16577742
4897A6577742K63969J28774R0499L56701K73570J90337j99620m169q7165j65645
$$ 16577742 16841711 16970485 17060984 17417685 17691255 17881592 17681972 17677803 17590638 17424993
4887A7424993l3215j00857K2105O0042j81502J45750K7200n6248n2767K29922
$$ 17424993 17391778 17290921 17313026 17373068 17191566 17337316 17364516 17308268 17255501 17485423
4877A7485423K32020K36530P5881J94849K11906K38918M9060K30425L96009L43733
$$ 17485423 17717443 17953973 18029854 18224703 18436609 18675527 18724587 18955012 19351021 19694754
4867A9694754P43215L68912J46297J37502o8663J76897K19579M59695O42408P11185
$$ 19694754 20437969 20806881 20953178 21090680 21022017 21198914 21418493 21878188 22520596 23231781
4857B3231781Q58347J076722Q13575Q14305R48755J007828P67567Q20347J172882
$$ 23231781 24090128 25166850 25980425 26794730 27743485 28751313 29518880 30339227 31512109
4848C1512109J243749J344543J447686J242771J635583J590153J774971J594332
$$ 31512109 32755858 34100401 35548087 36790858 38426441 40016594 41791565 43385897
4840D3385897J519157J772495J977315K085738K443777K604807L121832L797893
$$ 43385897 44905054 46677549 48654864 50740602 53184379 55789186 58911018 62708911
4832F2708911M803164N933329O756547P933815R033809J0213841J2576101J5584147
$$ 62708911 67512075 73445404 80201951 88135766 97169575 107383416 119959517 135543664
4824A35543664K0094592K5992441L5219920M8412050N8887227O4939330N8544885
$$ 135543664 155638256 181630697 216850617 265262667 324149894 389089224 447634109
4817D47634109J3631391n4417679p3276086o3626643n1932074l9967651l0187134
$$ 447634109 461265500 406847821 333571735 269945092 218013018 178045367 147858233
4810A47858233k1784806j7146564j2918237j0158205q038379o467011m987251
$$ 147858233 126073427 108926863 96008626 85850421 77812042 71345031 66357780
4803F6357780m620572l953541l652651l160470k877490k521184k325028j925129
$$ 66357780 61737208 57783667 54131016 50970546 48093056 45571872 43246844 41321715
4795D1321715j932050j743944j416496j213823j183007r88650j247995j107966
$$ 41321715 39389665 37645721 36229225 35015402 33832395 32843745 31595750 30487784
4787C0487784j024829r82357j286272j329632j108649q36711q35332o67384n22371
$$ 30487784 29462955 28480598 27194326 25864694 24756045 23919334 23084002 22416618 21894247
4778B1894247n56119m72199k56323k43765l76149o49541n01590n69033k96173
$$ 21894247 21338128 20865929 20609606 20365841 19989692 19340151 18838561 18269528 17973355
4769A7973355m67065l13943j52439l02150k28009j96828m35993m95747k23283
$$ 17973355 17506290 17192347 17039908 16737758 16509749 16312921 15876928 15381181 15157898
4760A5157898j08282j09085J01007k79599j92927k44110j55757j58841k66787
$$ 15157898 15049616 14940531 15041538 14761939 14569012 14324902 14169145 14010304 13743517
4751A3743517k31586j98994j22913k01433p2480j64102j0336J80867j71349j3373
$$ 13743517 13511931 13312937 13190024 12988591 12916111 12752009 12741673 12922540 12751191 12737818
4741A2737818j13210j62572j79651j93456j25487j17293j97661j29599j72582
$$ 12737818 12624608 12462036 12282385 12088929 11963442 11846149 11648488 11518889 11346307
4732A1346307K9994j04343j55610M7024n7204Q604J72985M6342J38799K90957
$$ 11346307 11376301 11271958 11116348 11163372 11106168 11114772 11287757 11334099 11472898 11763855
4722A1763855K99703J59093J16488j29802j84764k91159k7243j15444j65075l0848
$$ 11763855 12063558 12222651 12339139 12209337 12024573 11733414 11706171 11590727 11425652 11394804
4712A1394804j30511j17832r2008k51852p8607N1048j43852n1874p1388n9438
$$ 11394804 11264293 11146461 11054453 10802601 10723994 10775042 10631190 10579316 10507928 10448490
4702A0448490M9293j0621o351L8679j27026j13059q6850n1331l3908q2101K9761
$$ 10448490 10497783 10487162 10480811 10519490 10392464 10279405 10192555 10141224 10107316 10025215 10054976
4691A0054976P3893k00731J18373j32251J40792j52936j44073m0058r6302m0586
$$ 10054976 10128869 9928138 10046511 9914260 10055052 9902116 9758043 9717985 9621683 9581097
4681I581097k6370K5430O978j51657j52262J54006J31413q5195K00863Q0795q5591
$$ 9581097 9554727 9580157 9587135 9435478 9283216 9437222 9568635 9483440 9684303 9765098 9679507
4670I679507J01632K29063J42660R7224K82994J79495k82175o5324J09788J30390
$$ 9679507 9781139 10010202 10152862 10250086 10533080 10712575 10430400 10365076 10474864 10605254
4660A0605254l9433Q2711K26303N4096K03025J43717J28614K95689L96115L10922
$$ 10605254 10565821 10648532 10874835 10928931 11131956 11275673 11404287 11699976 12096091 12407013
4650A2407013J70420K14946K63777K13663L70278K45320L84547L16759M29089
$$ 12407013 12577433 12792379 13056156 13269819 13640097 13885417 14269964 14586723 15015812
4641A5015812L20664N61771P14451N63755O52357R55725O75167R70865J164218
$$ 15015812 15336476 15898247 16612698 17176453 17828810 18784535 19459702 20430567 21594785
4632B1594785J312885J458186J959195K169629K431917L165456M010192N164193
$$ 21594785 22907670 24365856 26325051 28494680 30926597 34092053 38102245 43266438
4624D3266438O284273P805052R538336J0946931J1542175Q523074M13828p254832
$$ 43266438 49550711 57355763 66894099 77841030 89383205 97906279 98320107 91065275
4616I1065275j1800091j2468904j0876508q698299o900272n216805m090667l275289
$$ 91065275 79265184 66796280 55919772 47221473 40321201 35104396 31013729 27738440
4608B7738440k555138j942829j791595j369009j097896j053450r77033p66448
$$ 27738440 25183302 23240473 21448878 20079869 18981973 17928523 16951490 16185042
4600A6185042q62104p09725n19200m55885n23012m23764l33952l82164k11263
$$ 16185042 15322938 14613213 14094013 13638128 13115116 12691352 12357400 11975236 11763973
4591A1763973n04731m20046k34571k64788l28484l50132l81198j94704k21674
$$ 11763973 11259242 10839196 10604625 10339837 10011353 9661221 9280023 9085319 8863645
4582H863645l14740k5552k11831j29802k2983k38666p4356Q4091J04667n9094
$$ 8863645 8548905 8523353 8311522 8181720 8158737 7920071 7845715 7929806 8034473 7975379
4572G975379k60139j55458L3019r6667j28293q6753n3027j98263k49719p1848
$$ 7975379 7715240 7559782 7592801 7496134 7367841 7281088 7228061 7029798 6780079 6708231
4562F708231R8417k89428q7039K8105m153j0022k2012j06377K2702P3767j79110
$$ 6708231 6806648 6517220 6430181 6458286 6454133 6444111 6422099 6315722 6338424 6412191 6233081
4551F233081r664r6351J0094K8768J7929j7679j06988O4458n6946L8629n6569
$$ 6233081 6223417 6127066 6137160 6165928 6183857 6166178 6059190 6123648 6066702 6105331 6048762
4540F048762m8284R9459j34358j45505L6107K6938p1830j6477J6366k19025j10763
$$ 6048762 6000478 6099937 5965579 5820074 5856181 5883119 5811289 5794812 5811178 5592153 5481390
4529E481390K32499N8896J17874r9715j28569k2740m9109q581o4102J03349J02166
$$ 5481390 5713889 5772785 5890659 5790944 5662375 5639635 5590526 5581945 5517843 5621192 5723358
4518E723358j56629q0992M4377L8818J34626N864K6226Q5808J491J24302R0170
$$ 5723358 5566729 5485737 5530114 5568932 5703558 5709422 5735648 5821456 5822947 5947249 6037419
4507F037419K43714J27811K06895K02027K41422K93094L52942J17229j43174k83470
$$ 6037419 6281133 6408944 6615839 6817866 7059288 7352382 7705324 7822553 7679379 7395909
4497G395909l52062k66453k40295j30636r9928m3088j170L0913l0172M6056L943
$$ 7395909 7043847 6777394 6537099 6406463 6306535 6263447 6262277 6293190 6263018 6309074 6313017
4486F313017O397O2763J11711J0856P5968j46035J61274O5429J92378J32201j6982
$$ 6313017 6319414 6382177 6493888 6504744 6580712 6434677 6595951 6661380 6853758 6985959 6968977
4475F968977P510O3450j790L9883J09430j5716K2546K32100J74297M8451M9192
$$ 6968977 6976487 7039937 7038147 7078030 7187460 7171744 7194290 7426390 7600687 7649138 7698330
4464G698330L65536L27648L386K02875L54079L74620K79566K47619K96227j27340
$$ 7698330 8063866 8391514 8394900 8597775 8951854 9326474 9606040 9853659 10149886 10022546
4454A0022546j58351n91065k34771r6504n4358k10026j68805L9722j02369N7352
$$ 10022546 9864195 9273130 9038359 8941855 8887497 8677471 8508666 8548388 8446019 8503371
4444H503371o221L1823k3574j7606J7970K6059K1141K70291Q865j33625K6721
$$ 8503371 8497150 8528973 8505399 8487793 8505763 8531822 8552963 8823254 8832119 8698494 8725215
4433H725215J36474k5713Q9389K04158K14611L3682J75565L2569j12614k96088
$$ 8725215 8861689 8835976 8925365 9129523 9344134 9377816 9553381 9585950 9473336 9177248
4423I177248k89798j79110r6844k10183k93275j55393p8852n3586j6071J41653
$$ 9177248 8887450 8708340 8611496 8401313 8108038 7952645 7873793 7820207 7804136 7945789
4413G945789M2996K2456K59407j43436J40194J56326n6332J39292o1340j10033
$$ 7945789 7988785 8011241 8270648 8127212 8267406 8423732 8367400 8506692 8445352 8335319
4403H335319q7878Q5288n2064j99317l7582j69434j23920q2630Q9208p5860o0015
$$ 8335319 8247441 8332729 8280665 8081348 8043766 7874332 7750412 7667782 7756990 7681130 7621115
4392G621115N4708J32464Q8091J4013M8199J69834J92569N261O3070J18132J15624
$$ 7621115 7675823 7808287 7896378 7910391 7958590 8128424 8320993 8326254 8389324 8507456 8623080
4381H623080l6601n0628K61464L9088j54708J26619J05299N1830j18843j70588
$$ 8623080 8586479 8535851 8797315 8836403 8681695 8808314 8913613 8965443 8846600 8676012
4371H676012n6441m4520K8732j93824o6118j12466j24105K7418K17754M1291j38649
$$ 8676012 8619571 8575051 8603783 8409959 8343841 8231375 8107270 8134688 8352442 8393733 8255084
4360H255084M4180J90287J3425M3141J5575o2973m8030o9683J20821K39365J61258
$$ 8255084 8299264 8489551 8502976 8546117 8561692 8498719 8450689 8381006 8501827 8741192 8902450
4349H902450J54907j40271J40977K06498J10299K91885J3315J5221j10482k2945
$$ 8902450 9057357 8917086 9058063 9264561 9374860 9666745 9680060 9695281 9584799 9561854
4339I561854K55708K46299K5561J92305Q1854O3730J45397L41714J28415J77810
$$ 9561854 9817562 10063861 10089422 10281727 10363581 10427311 10572708 10914422 11042837 11220647
4329A1220647L47733J62059K4140K35930Q4023l8060J18485J04778J86216K79490
$$ 11220647 11568380 11730439 11754579 11990509 12074532 12036472 12154957 12259735 12445951 12725441
4319A2725441K24892L26410M147L43042L42955j0804J80758K03645K36028R8576
$$ 12725441 12950333 13276743 13280890 13623932 13966887 13956083 14136841 14340486 14576514 14675090
4309A4675090K73168K51979J62022M6605P1872L83574J84469M98143M22350N31668
$$ 14675090 14948258 15200237 15362259 15408864 15480736 15864310 16048779 16546922 16969272 17500940
4299A7500940P21475O81387N52542K91270N90424P78202M14419K91905N16231
$$ 17500940 18222415 18903802 19456344 19747614 20338038 21116240 21530659 21822564 22338795
4290B2338795O71142J30424l55501p99926r41300r37083p71705n69716o76585
$$ 22338795 23009937 23140361 22784860 21984934 21043634 20106551 19334846 18765130 18088545
4281A8088545j66815o3461M795J3598j11322K24281j5717k13757Q2614j27433
$$ 18088545 17921730 17858269 17863064 17876662 17765340 17989621 17973904 17760147 17842761 17715328
4271A7715328K07927K05076J44313L06028N22313M83381N67551N37831O75416
$$ 17715328 17923255 18128331 18272644 18578672 19100985 19584366 20151917 20689748 21365164
4262B1365164P94113O78350M96361j15397o14576p52669p00380o28863o13254
$$ 21365164 22159277 22837627 23333988 23218591 22604015 21851346 21150966 20522103 19908849
4253A9908849m56443l28124k63247j48902o4299Q9495P0524L1196N1960J16386
$$ 19908849 19452406 19124282 18861035 18712133 18647834 18737329 18807853 18839049 18891009 19007395
4243A9007395J56175j6969j90989j65538r4336n36j9391j21130k18885K18958
$$ 19007395 19163570 19146601 18955612 18790074 18695738 18695202 18675811 18554681 18335796 18554754
4233A8554754K29739J11704P7441J27321K13200L22384K93960K86295J92962J12070
$$ 18554754 18784493 18896197 18973638 19100959 19314159 19636543 19930503 20216798 20409760 20521830
4223B0521830n1289J24401R1241J85080K03569K55747L91798L65620L31417L14045
$$ 20521830 20470541 20594942 20686183 20871263 21074832 21330579 21722377 22087997 22419414 22733459
4213B2733459J46400j30299k2303p7423n9327o8542J24050K08626K58765K99468
$$ 22733459 22879859 22749560 22727257 22649834 22590507 22521965 22646015 22854641 23113406 23412874
4203B3412874M79581O53386O69170O32867P02446R94314R66606P98573O38204
$$ 23412874 23892455 24545841 25215011 25847878 26550324 27544638 28511244 29309817 29948021
4194B9948021L36133j25084l65361o97364p50673o23470n27765k75756p0059M01237
$$ 29948021 30284154 30159070 29793709 29096345 28345672 27722202 27194437 26918681 26848622 27249859
4184B7249859M89952O72219Q36489J317347J290462J110281O14911J09117j22844
$$ 27249859 27739811 28412030 29248519 30565866 31856328 32966609 33581520 33690637 33567793
4175C3567793l87253p97215p60321r20799q43189l71797m52056l1584J77564L02231
$$ 33567793 33180540 32383325 31623004 30702205 29859016 29487219 29035163 29003579 29181143 29483374
4165B9483374O41365N90030Q40731M51334L53874L75589J01927k17563j46095
$$ 29483374 30124739 30714769 31555500 32006834 32360708 32736297 32838224 32620661 32474566
4156C2474566k97841k7624K73K88412O84538Q48311P79909P55532Q02654O67479
$$ 32474566 32176725 32149101 32149374 32437786 33122324 33970635 34750544 35506076 36308730 36976209
4146C6976209P67837P90275N72073J77439j25252k58005k21801k56184L981K08210
$$ 36976209 37744046 38534321 39106394 39283833 39158581 38900576 38678775 38422591 38426572 38634782
4136C8634782M50257N78474J058600J395926J785360J932205J994333K046719
$$ 38634782 39085039 39663513 40722113 42118039 43903399 45835604 47829937 49876656
4128D9876656J423839R50463K98936o32389j576518k211122k658973l015833l270360
$$ 49876656 51300495 52250958 52549894 51917505 50340987 48129865 45470892 42455059 39184699
4119C9184699l212715k716872k319436j930094j609918j324050j263620j007131
$$ 39184699 35971984 33255112 30935676 29005582 27395664 26071614 24807994 23800863
4111B3800863q74424n04101o43331n21764m37501o40176l51772l71895m05804
$$ 23800863 22926439 22422338 21779007 21257243 20819742 20179566 19827794 19455899 19050095
4102A9050095k52011j64600k01546l59877k34994k7384k4709k31803m0342j38215
$$ 19050095 18798084 18633484 18431938 18072061 17837067 17809683 17784974 17553171 17512829 17374614
4092A7374614K00638P2736j57836j48588o3537j20273m2631P8239J33891K9616
$$ 17374614 17575252 17647988 17490152 17341564 17278027 17157754 17115123 17193362 17327253 17356869
4082A7356869o578j0701J95504J53654R2293M9095R6616J34077M7424k07591N3963
$$ 17356869 17350291 17339590 17535094 17688748 17781041 17830136 17926752 18060829 18108253 17900662 17954625
4071A7954625L48258N2658K41756K45496L04323J55007J9802K94222L39435J47829
$$ 17954625 18302883 18355541 18597297 18842793 19147116 19302123 19321925 19616147 19955582 20103411
4061B0103411J91943K54605L62475L32264K57090N70481N48556N07307M96537
$$ 20103411 20295354 20549959 20912434 21244698 21501788 22072269 22620825 23128132 23624669
4052B3624669L93740M58597L65098N8483J27161M76840L40557L19595L02176O31914
$$ 23624669 24018409 24477006 24842104 24900587 25027748 25504588 25845145 26164740 26466916 27098830
4042B7098830N21864N86688M85015O18268Q10263P44001P69186P79267Q48769
$$ 27098830 27620694 28207382 28692397 29310665 30120928 30864929 31634115 32413382 33262151
4033C3262151O94462J056761J101221R03516J096079J228270J390882J395716
$$ 33262151 33956613 35013374 36114595 37018111 38114190 39342460 40733342 42129058
4025D2129058J448809J394721J527839J558614J650546J867086J914485J960547
$$ 42129058 43577867 44972588 46500427 48059041 49709587 51576673 53491158 55451705
4017E5451705K169614K467195K497629K456424K592292K812518L044245L206282
$$ 55451705 57621319 60088514 62586143 65042567 67634859 70447377 73491622 76697904
4009G6697904L025841L200001L398306L515010L248029L599922L520163L601244
$$ 76697904 79723745 82923746 86322052 89837062 93085091 96685013 100205176 103806420
4001A03806420L737686L873624L976316L985091M252561M030754L960000L787379
$$ 103806420 107544106 111417730 115394046 119379137 123631698 127662452 131622452 135409831
3993A35409831L746985L553585L305519K965459K921033K811233K471265K460525
$$ 135409831 139156816 142710401 146015920 148981379 151902412 154713645 157184910 159645435
3985A59645435K309042K121862K196160J843517J781166J422083R42623L47026
$$ 159645435 161954477 164076339 166272499 168116016 169897182 171319265 172261888 172608914
3977A72608914p5784l36394o83616j120664j328884j736861j696682j644791j691493
$$ 172608914 172533130 172196736 171513120 170392456 169063572 167326711 165630029 163985238 162293745
3968A62293745k021489k214733k417117k649401k910319l221291l429531l699502
$$ 162293745 160272256 158057523 155640406 152991005 150080686 146859395 143429864 139730362
3960A39730362l966959m011664m003387l930913l739903l820302l919178l624375
$$ 139730362 135763403 131751739 127748352 123817439 120077536 116257234 112338056 108713681
3952A08713681l616591l689581l499729l537090l463855l207350l322748l198052
$$ 108713681 105097090 101407509 97907780 94370690 90906835 87699485 84376737 81178685
3944H1178685l188582l060691k819696k679287k310002k146029j968660j898017
$$ 81178685 77990103 74929412 72109716 69430429 67120427 64974398 63005738 61107721
3936F1107721j543231j606908j659412j667371j953208k328996k584161k647071
$$ 61107721 59564490 57957582 56298170 54630799 52677591 50348595 47764434 45117363
3928D5117363k153004j957440j830357j652031j372071j442494j158948j266339
$$ 45117363 42964359 41006919 39176562 37524531 36152460 34709966 33551018 32284679
3920C2284679r76019p21985r10775p09176p63778o61563o23107n56554n57388
$$ 32284679 31308660 30586675 29675900 28966724 28202946 27541383 26918276 26361722 25804334
3911B5804334n18444n56057m88972m82745k19218l82360m28174m02362j60806
$$ 25804334 25285890 24729833 24240861 23758116 23538898 23156538 22728364 22326002 22165196
3902B2165196k54455j19796O235R8441M00767J22204J30779k82031o61911q44404
$$ 22165196 21910741 21790945 21797180 21895621 22296388 22418592 22549371 22267340 21605429 20761025
3892B0761025q36710q52692p17369p05102m45130l23064m55791l13514k50095
$$ 20761025 19924315 19071623 18354254 17649152 17204022 16880958 16425167 16111653 15861558
3883A5861558k58942l92466m84923j91302k28482j40055l27716l6959p1397j05816
$$ 15861558 15602616 15210150 14725227 14533925 14305443 14165388 13837672 13800713 13729316 13623500
3873A3623500j14649k18331q4065J5351q90l6086p8963q8239J63429K48343k4597
$$ 13623500 13508851 13290520 13206455 13221806 13220916 13184830 13105867 13017628 13181057 13429400 13404803
3862A3404803j7811J86309K258j09161J04750J27845K16665m7346j91302P8518
$$ 13404803 13386992 13573301 13575559 13466398 13571148 13698993 13915658 13868312 13677010 13755528
3852A3755528R7282j92050L1013k52878j32093J2509j03355m7139j82444r5111
$$ 13755528 13852810 13660760 13691773 13438895 13306802 13319311 13215956 13168817 12986373 12891262
3842A2891262R43m5485j34395N3811k52716k64172n2567M0553k88297n8569j44762
$$ 12891262 12892205 12846720 12712325 12766136 12513420 12249248 12196681 12237234 11948937 11890368 11745606
3831A1745606j76801j47649j62057k72508j31871j86771j01292j67476p2349r0022
$$ 11745606 11568805 11421156 11259099 10986591 10854720 10667949 10566657 10399181 10326832 10236810
3821A0236810R0909J43790R9646m4373j31346j16521j31225j75102p8656j35678
$$ 10236810 10327719 10471509 10571155 10526782 10395436 10278915 10147690 9972588 9893932 9758254
3811I758254k40588J02881K53898o8032k61796j39652o0742n3327p0476M9318
$$ 9758254 9517666 9620547 9874445 9806413 9544617 9404965 9344223 9290896 9220420 9269738
3801I269738J561n7924M1900j35495o3194K25153j00969K528J68013J5073j38870
$$ 9269738 9271299 9213375 9255275 9119780 9056586 9281739 9180770 9183298 9351311 9366384 9227514
3790I227514L4049M3692R6754J2118O1105N8765J01481m0475o0458K0135j38319
$$ 9227514 9261563 9305255 9402009 9414127 9475232 9533997 9635478 9595003 9534545 9554680 9416361
3779I416361k76805n1101J27560m3235K0525J8560k3554l0304n074J50120j60208
$$ 9416361 9139556 9088455 9216015 9172780 9193305 9211865 9188311 9158007 9152933 9303053 9142845
3768I142845o1765K10925l9692l583P0743R4373K40257J94662L8046O9300K37438
$$ 9142845 9081080 9292005 9252313 9248730 9319473 9413846 9654103 9848765 9886811 9956111 10193549
3757A0193549P2424O6214J07395M5806K86867J91584J48565R0883J67052J62577
$$ 10193549 10265973 10332187 10439582 10485388 10772255 10963839 11112404 11203287 11370339 11532916
3747A1532916K70214N9760M9320J50785p7053P2872K5202O3221Q6772K60677J17829
$$ 11532916 11803130 11862890 11912210 12062995 11985942 12058814 12084016 12147237 12234009 12494686 12612515
3736A2612515L1451K16412n1639j7454J25880J3531k4853M3303L7759J72325p0112
$$ 12612515 12643966 12860378 12808739 12791285 12917165 12930696 12905843 12949146 12986905 13159230 13089118
3725A3089118k4951J36784J40669M3077J17011J3333J63450m7261Q8394K14119
$$ 13089118 13064167 13200951 13341620 13384697 13501708 13515041 13678491 13631230 13719624 13933743
3715A3933743K28010L01211J63190P4865J04069K92349K19732J90247O9613K42481
$$ 13933743 14161753 14462964 14626154 14701019 14805088 15097437 15317169 15507416 15577029 15819510
3705A5819510K84449O3298K62913K15083P3120K43940L31099K29711K87832K44508
$$ 15819510 16103959 16167257 16430170 16645253 16718373 16962313 17293412 17523123 17810955 18055463
3695A8055463J5232J65638M76122M13948O3904K91186L23273L43545M27111K44790
$$ 18055463 18070695 18236333 18712455 19126403 19190307 19481493 19804766 20148311 20575422 20820212
3685B0820212M30753M08507L33860O52364L42495L82561M92768M61936N72947
$$ 20820212 21250965 21659472 21993332 22645696 22988191 23370752 23863520 24325456 24898403
3676B4898403O53473M99428M66669N02030O16241N91893O54137R64445Q05010
$$ 24898403 25551876 26051304 26517973 27020003 27636244 28228137 28882274 29846719 30651729
3667C0651729R11923J044094R80353J078127J033861J262969J086137J389812
$$ 30651729 31563652 32607746 33588099 34666226 35700087 36963056 38049193 39439005
3659C9439005J460317J460748J681972J841470J843920J899549J847268K128019
$$ 39439005 40899322 42360070 44042042 45883512 47727432 49626981 51474249 53602268
3651E3602268K282874K272526K226519K426302K440419K268307K319588K173326
$$ 53602268 55885142 58157668 60384187 62810489 65250908 67519215 69838803 72012129
3643G2012129J885336J883699J810393J650344J771479J571235J532521J593639
$$ 72012129 73897465 75781164 77591557 79241901 81013380 82584615 84117136 85710775
3635H5710775J469148J297614J221007J159757R76409N60819K85016K08866n1978
$$ 85710775 87179923 88477537 89698544 90858301 91834710 92395529 92680545 92889411 92837433
3626I2837433k06372k82050n42501m96442k79311j62017J5013j70958j38257r686
$$ 92837433 92631061 92349011 91806510 91310068 91030757 90868740 90883753 90712795 90574538 90564852
3616I0564852L9994O8910J96326L32335K57207M68009M76666R07053J126374J303903
$$ 90564852 90604846 90673756 90870082 91202417 91459624 91927633 92404299 93311352 94437726 95741629
3606I5741629J716159J914848K134829K551097K782555L101328L585514M011904
$$ 95741629 97457788 99372636 101507465 104058562 106841117 109942445 113527959 117539863
3598A17539863M368066M824678N083946N663638N655055N720252N794804N973026
$$ 117539863 121907929 126732607 131816553 137480191 143135246 148855498 154650302 160623328
3590A60623328N954765N768709N431928N316670N260293M826245M841041M738921
$$ 160623328 166578093 172346802 177778730 183095400 188355693 193181938 198022979 202761900
3582B02761900M352727M523807M425158M065087L673510L053135K274085J552651
$$ 202761900 207114627 211638434 216063592 220128679 223802189 226855324 229129409 230682060
3574B30682060P07778k50152j057757j460608j589515k156757k387066k434315
$$ 230682060 231389838 231139686 230081929 228621321 227031806 224875049 222487983 220053668
3566B20053668k345137k333061k212175k432427k473753k469414k581152k532458
$$ 220053668 217708531 215375470 213163295 210730868 208257115 205787701 203206549 200674091
3558B00674091k521331k353075j972759j548431j179493m63718j54401M74657
$$ 200674091 198152760 195799685 193826926 192278495 191099002 190635284 190480883 190955540
3550A90955540J133366J508616J751769K286595K643120K616093K905044K982719
$$ 190955540 192088906 193597522 195349291 197635886 200279006 202895099 205800143 208782862
3542B08782862K839093K683047K541309K472432K574231K746590K715069K520360
$$ 208782862 211621955 214305002 216846311 219318743 221892974 224639564 227354633 229874993
3534B29874993K592276K388630K099232J971485J513082R35993K68908l44620
$$ 229874993 232467269 234855899 236955131 238926616 240439698 241375691 241644599 241299979
3526B41299979j014863j374176j981055k544360k921523l400950l692320m116738
$$ 241299979 240285116 238910940 236929885 234385525 231464002 228063052 224370732 220253994
3518B20253994l944056l900551l409863l165079l067811l032183l394838l453253
$$ 220253994 216309938 212409387 208999524 205834445 202766634 199734451 196339613 192886360
3510A92886360l742582l859673l990712l838070l820419l499536l075363k567535
$$ 192886360 189143778 185284105 181293393 177455323 173634904 170135368 167060005 164492470
3502A64492470j887331j457223r92420m12818l865J72846N01730O93849P51089
$$ 164492470 162605139 161147916 160155496 159742678 159738813 159911659 160413389 161107238 161858327
3493A61858327R42134J330770J230097J415451J570631J658413J888781K013071
$$ 161858327 162800461 164131231 165361328 166776779 168347410 170005823 171894604 173907675
3485A73907675K137531K385140K599584L241573L439495L892766M642121N147953
$$ 173907675 176045206 178430346 181029930 184271503 187710998 191603764 196245885 201393838
3477B01393838N460630O393070O953803P693645R050752J0326674J1842564J3889797
$$ 201393838 206854468 213247538 220201341 227894986 236945738 247272412 259114976 273004773
3469B73004773J6081575J8213269K0088267K1666646K1976184K1047242J9063694
$$ 273004773 289086348 307299617 327387884 349054530 371030714 392077956 411141650
3462D11141650J5834194J1762870P196639K721573j334783m028918n470826n459521
$$ 411141650 426975844 438738714 445935353 448656926 447322143 443293225 437822399 432362878
3454D32362878m785735l558781k348475j468690j243178k210497m223880p341334
$$ 432362878 427577143 424018362 421669887 420201197 418958019 416747522 412523642 405182308
3446D05182308j1534547j5762295j9540663k2528530k4199126k4775847k4136922
$$ 405182308 393647761 377885466 358344803 335816273 311617147 286841300 262704378
3439B62704378k2413623k0101827j7563515j5074753j2710459j0940748r630579
$$ 262704378 240290755 220188928 202625413 187550660 174840201 163899453 154268874
3432A54268874p969955o954360o119718n119859m506020l632188l306670k835055
$$ 154268874 146298919 139344559 133224841 128104982 123598962 119966774 116660104 113825049
3424A13825049k345106k096421k013870j990906j835906j966334k163751k110815
$$ 113825049 111479943 109383522 107369652 105378746 103542840 101576506 99412755 97301940
3416I7301940k314316k346338k100780k176143k182707k080017j974838j989303
$$ 97301940 94987624 92641286 90540506 88364363 86181656 84101639 82126801 80137498
3408H0137498j906614j967609k139269j896654k392838k616750k491693k462490
$$ 80137498 78230884 76263275 74124006 72227352 69834514 67217764 64726071 62263581
3400F2263581k463502k490983k451721k511784k311121k011041j696176j908308
$$ 62263581 59800079 57309096 54857375 52345591 50034470 48023429 46327253 44418945
3392D4418945j632644j528725j514757j262007j394208j069877j127922j048388
$$ 44418945 42786301 41257576 39742819 38480812 37086604 36016727 34888805 33840417
3384C3840417j023405r40470p92002p83299r22160o79908p29743o06721n42658
$$ 33840417 32817012 31876542 31084540 30301241 29379081 28699173 27969430 27362709 26820051
3375B6820051p95346p02443o77410n21116k92783o26162n35243m10486m09048
$$ 26820051 26024705 25322262 24644852 24123736 23830953 23204791 22669548 22259062 21850014
3366B1850014l49703l17440m66060m71303k55584l86049k74354l51281j24436
$$ 21850014 21500311 21182871 20716811 20245508 19989924 19603875 19329521 18978240 18853804
3357A8853804l98843m01831k78362j89644l92092j47306l20931j39617k43490
$$ 18853804 18454961 18053130 17774768 17585124 17193032 17045726 16724795 16585178 16341688
3348A6341688m08797l50190j92866Q21l30113j81725k18460n1370j40609k43114
$$ 16341688 15932891 15582701 15389835 15390656 15060543 14878818 14660358 14608988 14468379 14225265
3338A4225265k85045k41712q2468k51482j72419j55186k07614J321q9328j32284
$$ 14225265 13940220 13698508 13616040 13364558 13192139 13036953 12829339 12830660 12741332 12609048
3328A2609048j76887r8196j29945k28263n1681j30051j97617l5208o7714k16040
$$ 12609048 12432161 12333965 12204020 11975757 11924076 11794025 11596408 11561200 11493486 11277446
3318A1277446k51753k8113p5949K9930o4181M9294l5078j05110j65180J55121
$$ 11277446 11025693 10997580 10921631 10951561 10887380 10936674 10901596 10796486 10631306 10786427
3308A0786427R1843k70998j11809q5298J8772l8067L7040q3707l3830l6330J5019
$$ 10786427 10878270 10607272 10495463 10410165 10428937 10390870 10427910 10344203 10310373 10274043 10289062
3297A0289062k75084R0999L844j74852J58594L0071j20126r078k02906K6197j7727
$$ 10289062 10013978 10104977 10108821 9933969 10092563 10122634 10002508 9993430 9790524 9816721 9798994
3286I798994j7235J75686o7819N7494R8047j639m0144J2456q6612p4523j73585
$$ 9798994 9781759 9957445 9889626 9947120 10045167 10043528 10003384 10015840 9929228 9854705 9681120
3275I681120N2846J47080K7660j9773r3358m8833K600J58904N5141q7653j1893
$$ 9681120 9733966 9881046 9908706 9888933 9795575 9746742 9749342 9908246 9963387 9875734 9863841
3264I863841J2483N4968l1816j54816j0781l946J05479J40263P6932J12615M3424
$$ 9863841 9876324 9931292 9899476 9744660 9733879 9729933 9835412 9975675 10052607 10165222 10208646
3253A0208646L4130M898O0333Q3066K60650J08138K08748P963L4216K59692J95583
$$ 10208646 10242776 10247674 10308007 10391073 10651723 10759861 10968609 10976572 11010788 11270480 11466063
3242A1466063J46481N1875J92466K62388K80498K60272N32817L11140L96168O03534
$$ 11466063 11612544 11664419 11856885 12119273 12399771 12660043 13192860 13504000 13900168 14503702
3232A4503702M89292L22826J94941K80934P0920K86489N73426P37891P11486O99587
$$ 14503702 14992994 15315820 15510761 15791695 15862615 16149104 16722530 17460421 18171907 18871494
3222A8871494P18069P90302P09337R01383Q72644O18651N14072J08477k62759
$$ 18871494 19589563 20379865 21089202 21990585 22863229 23481880 23995952 24104429 23841670
3213B3841670n52106r18554j188405j235362j088163j121391j051529o58415o60930
$$ 23841670 23289564 22371010 21182605 19947243 18859080 17737689 16686160 16027745 15366815
3204A5366815n21440m52899j45782n2712j2282j99893n01194o01682m39007l01320
$$ 15366815 14845375 14392476 14246694 14193982 14181700 13981807 13480613 12878931 12439924 12138604
3194A2138604n17526m74856k45159k88013m01343l46796j51375k08641j90433
$$ 12138604 11621078 11146222 10901063 10613050 10211707 9864911 9713536 9504895 9314462
3185I314462j30442j86515k45306j07589N9185j03427N0064O7734q9879p3459
$$ 9314462 9184020 8997505 8752199 8644610 8703795 8600368 8650432 8718166 8628287 8554828
3175H554828o7105J2913P9945O1660j4137P0531R8144P3722p9843j68957k42399
$$ 8554828 8487723 8500636 8580581 8642241 8628104 8698635 8796779 8870501 8790658 8621701 8379302
3164H379302m38949k57115j64910n5880l4823r5698j50351M7613l53165m12821
$$ 8379302 7940353 7683238 7518328 7462448 7427625 7331927 7181576 7229189 6876024 6463203
3154F463203j8865j60947k79518j27456k37132k90288j33627k71494r1252k1776
$$ 6463203 6444338 6283391 6003873 5876417 5639285 5348997 5215370 4943876 4852624 4830848
3144D830848j49272j66860l0424r2686q9052o2209r7816j30343q0398L9893J30673
$$ 4830848 4681576 4514716 4484292 4391606 4302554 4240345 4142529 4012186 3931788 3971681 4102354
3133D102354k6951j99220j10949p6219R2219j04108m3895j5246m3704n7393p0181
$$ 4102354 4075403 3876183 3765234 3689015 3781234 3677126 3633231 3617985 3574281 3516888 3446707
3122C446707k0111J05832m9496o0027q8296Q236r7655j20405k4579L7815J1147
$$ 3446707 3426596 3532428 3482932 3422905 3334609 3342845 3245190 3124785 3100206 3138021 3149168
3111C149168j37043k42414L3652J358j53910O0030l9559O0528j18329o5438R2167
$$ 3149168 3012125 2769711 2803363 2804721 2650811 2710841 2671282 2731810 2613481 2548043 2640210
3100B640210L3864j23095l8978j55113q1203N6663q6661J79J50380J11388j52347
$$ 2640210 2674074 2550979 2512001 2356888 2275685 2332348 2245687 2245866 2396246 2507634 2355287
3089B355287j86307Q5822j00831n8584J29234J4573n5658O4482K3411r9554j01277
$$ 2355287 2168980 2254802 2153971 2095387 2224621 2239194 2183536 2248018 2271429 2171875 2070598
3078B070598p6525p089l6439p918k142j5691Q3879o5775K7569j21624j70126J05275
$$ 2070598 1994073 1986984 1950545 1942627 1940485 1924794 2008673 1942898 1970467 1848843 1678717 1783992
3066A783992J48753n9494j85803n388J24142n7896L4077L1919r4088q287O945
$$ 1783992 1932745 1873251 1687448 1682060 1806202 1748306 1782383 1814302 1720214 1711927 1718872
3055A718872J0493J18976o0343Q6983j22576j45668R7577l2833N0822m1637N2912
$$ 1718872 1729365 1848341 1787998 1874981 1752405 1606737 1704314 1671481 1722303 1680666 1733578
3044A733578n5511K8489l6112j72628k6864K23841N6731j73122k8909O1395m6353
$$ 1733578 1678067 1706556 1670444 1497816 1470952 1694793 1751524 1578402 1549493 1610888 1564535
3033A564535k1954J58482j38839j51010L0884Q7747K41185j2049k53931Q6615
$$ 1564535 1542581 1701063 1562224 1411214 1442098 1529845 1771030 1758981 1505050 1591665
3023A591665o4628P738O6411R8287R406p6504l9690k7917R1182j55342K1473N602
$$ 1591665 1527037 1534775 1601186 1699473 1708879 1632375 1592685 1564768 1655950 1500608 1522081 1527683
3011A527683m1192K2114m263j35532r3025L2075J55063m1813j22617q9755J2658
$$ 1527683 1486491 1508605 1504342 1368810 1275785 1307860 1462923 1421110 1298493 1208738 1221396
3000A221396o2220P7029M0708p0891N1028o9433J1202J59706q8406j16172J7299
$$ 1221396 1159176 1236205 1276913 1206022 1257050 1187617 1198819 1358525 1270119 1153947 1171246
2989A171246J76547K92196r0454k48582J6440J88520Q169m7946o1839j19842j66028
$$ 1171246 1347793 1639989 1549535 1300953 1317393 1505913 1514082 1466136 1404297 1284455 1118427
2978A118427Q1469J52003l5842L2679J3081j11509R3083K21543n1358k7244m2895
$$ 1118427 1199896 1351899 1316057 1348736 1361817 1250308 1343391 1564934 1513576 1486332 1443437
2967A443437j66859N3579J88898j11213j04222j39479L226n6019J87243J10688
$$ 1443437 1276578 1330157 1519055 1407842 1303620 1164141 1167367 1111348 1298591 1409279
2957A409279j06621k5978M1488K9790Q4391l6628n5325j8065j12479J18398R2527
$$ 1409279 1302658 1276680 1318168 1347958 1432349 1395721 1340396 1322331 1209852 1328250 1420777
2946A420777J02628j16721r3432p1086J82866o059o67j5749j09440J8407K6497
$$ 1420777 1523405 1406684 1313252 1242166 1425032 1418973 1418306 1402557 1293117 1311524 1338021
2935A338021o2435J13591O9894P807L1012K4885R1987n9657N3040P2084n2580
$$ 1338021 1275586 1389177 1459071 1466878 1497890 1522775 1614762 1555105 1608145 1680229 1627649
2924A627649p3921m3138M7775Q8485j596P1982o0789J35698j22322J38335J4709
$$ 1627649 1553728 1510590 1558365 1646850 1645254 1717236 1656447 1792145 1669823 1808158 1822867
2913A822867m8795j09798j1419L27659J19441O1645o1147J36218J57410k0868
$$ 1822867 1774072 1664274 1652855 1980514 2099955 2161600 2100453 2236671 2394081 2373213
2903B373213j37545j0797J22145p088j02459J839J14944J41290N9314N1441j24424
$$ 2373213 2235668 2224871 2347016 2339928 2237469 2239308 2354252 2495542 2554856 2606297 2481873
2892B481873p6612j02041L7390J01038O6243O2651J59770Q4869K86307m0943o5317
$$ 2481873 2405261 2303220 2340610 2441648 2507891 2570542 2730312 2815181 3101488 3060545 2995228
2881B995228J58226R2616J93218J02604R8946J85289P1986j44691j97785j58354
$$ 2995228 3153454 3246070 3439288 3541892 3640838 3826127 3898113 3753422 3555637 3397283
2871C397283j60838J2528j86783j38343k19027J69316P4177P7222j38469j34132
$$ 3397283 3236445 3248973 3062190 2923847 2704820 2874136 2948313 3025535 2887066 2752934
2861B752934J0011K0867K24296o1515J2276k4173O4072J90908r285O4051K2797
$$ 2752934 2762945 2783812 3008108 2946593 2958869 2934696 2998768 3189676 3180391 3244442 3267239
2850C267239j18149N2432L4242n793p8841L1877j11925J2352p2234k19028k90080
$$ 3267239 3149090 3201522 3235764 3229971 3151130 3183007 3071082 3083434 3011200 2792172 2502092
2839B502092q357L7594j82j22823K0719j1107M7436j44159M2714n4689n2234J27825
$$ 2502092 2493735 2531329 2531147 2408324 2429043 2417936 2465372 2321213 2363927 2309238 2257004 2384829
2827B384829r9413O3290k675j88454n9486k2599o1389J21205J1316k61746o6838
$$ 2384829 2285416 2348706 2346031 2157577 2098091 2075492 2014103 2135308 2146624 1884878 1818040
2816A818040M0807j71539j81874j31342p564l0242k08878O1121J3359j27338K9950
$$ 1818040 1858847 1687308 1505434 1374092 1366528 1336286 1127408 1188529 1201888 1074550 1104500
2805A104500n1152j4191J5103N5750n2026m7592k9896r4441J66964j04618o3916
$$ 1104500 1053348 1039157 1054260 1110010 1057984 1010392 980496 886055 1053019 948401 884485
2794H84485j8929r8933L5650m590K4641J34772K0484q9912o1492j06483m3380
$$ 884485 865556 766623 802273 797683 822324 957096 977580 887668 826176 719693 676313
2783F76313M9774J2915j65451N1655l0304k00534Q099K74679N0390l4697r3872
$$ 676313 726087 739002 573551 625206 594902 394368 402467 677146 727536 692839 598967
2772E98967j13005J33986M419j03706k2673M943O046R360J2159L2401L416R868
$$ 598967 485962 619948 624367 520661 497988 502931 508977 518337 530496 562897 566313 576181
2760E76181j81402R4916J68488R639j61647M8628p161k1870r9181O1404l6884
$$ 576181 394779 489695 658183 667822 506175 554803 547642 525772 426591 487995 451111
2749D51111L5183K52574j10906o7363j31535R6665q4700J47470j79803j4974K6174
$$ 451111 486294 738868 627962 560599 429064 525729 441029 588499 408696 393722 419896
2738D19896K6419p3929N0697P8267J4767j32845O2668M9947k40614j2561J48863
$$ 419896 446315 372386 423083 501350 516117 383272 445940 495887 255273 242712 391575
2727C91575p7217J9986P3485O7073J27568j15969L889m0187r4935j7269j0897
$$ 391575 314358 334344 407829 474902 602470 486501 490390 450203 355268 337999 327102
2716C27102p3430j2255J45067q3388j40931m7459J4513J2694J30140K72074j90391
$$ 327102 253672 241417 386484 303096 162165 114706 129219 141913 272053 544127 353736
2705C53736Q5530J5224j72744j86514O8789Q9548k10098J44469M4911n5804J26755
$$ 353736 439266 454490 281746 95232 164021 253569 43471 187940 232851 177047 303802
2694C03802R3361r0590m9988N5580j67701N0044K18821o6630J8381O9098q7970
$$ 303802 397163 306573 256585 312165 144464 194508 413329 346699 365080 434178 346208
2683C46208o4045J9356J54232k05224j13090l0774J23354J0358k1542J36003m9211
$$ 346208 282163 301519 455751 250527 137437 106663 230017 240375 218833 354836 305625
2672C05625o4349P6760L4296K2574j24663p7767J56333k2665k26383M4793J72256
$$ 305625 241276 318036 352332 374906 250243 172476 328809 306144 79761 124554 296810
2661B96810J55J1399j53897J9952P1319m8682M1646P5094m7509r2491P5794m0449
$$ 296810 296965 308364 154467 174419 245738 197056 238702 313796 266287 173796 249590 209141
2649B09141j63357M3315K42577O2378J7620l4522q6127K472K9639o2979l1545
$$ 209141 45784 89099 331676 394054 411674 377152 291025 293497 323136 260157 228612
2638B28612R2298N4677Q63l5156o2685J42702N0096j30446M483P9701L3957J1185
$$ 228612 320910 375587 376450 341294 278609 421311 471407 340961 345444 425145 459102 470287
2626D70287Q542q4869K4101k2929p7992k2964o3755j2560q5359j27423O7990K27533
$$ 470287 478829 393960 418061 395132 317140 294176 230421 217861 132502 5079 73069 300602
2614C00602j33481p6473M0175L1666M0433O4617n84o3535N6887J5104p1879m4877
$$ 300602 167121 90648 130823 162489 202922 267539 266955 203420 260307 275411 203532 158655
2602A58655J09619n9563l7135J24347R9335n9906m5354q4762n0944J61273r7633
$$ 158655 268274 208711 171576 295923 395258 335352 289998 205236 154292 315565 217932
2591B17932o4847Q2701Q0058q7234n3365M093p0848J03329O1417n2391n0366J24555
$$ 217932 153085 235786 315844 228610 175245 179338 108490 211819 273236 220845 170479 295034
2579B95034j75612J9968j32462J89727M4036J39758L393k05563k6378N8331N7923
$$ 295034 119422 139390 6928 196655 240691 380449 383842 178279 151901 210232 268155
2568B68155j20825P2347L1889j17108J3929L7995j14994j53309P5994R1396Q7807
$$ 268155 147330 219677 251566 134458 148387 186382 71388 -81921 -5927 85469 173276
2557A73276O3155j30826j20151P4609J23062N7603n0954J31349j72216j5329L7294
$$ 173276 236431 105605 -14546 60063 183125 240728 189774 321123 148907 133578 170872
2546A70872l6366N8478o8951m0486j39194J68240N7319j20770j42780Q4832J0594
$$ 170872 134506 192984 124033 83547 -55647 112593 169912 49142 -93638 -8806 1788
2535A788J02805j79688p4981J57566O4102l7102J50175q0799P1718o2235J8738
$$ 1788 104593 -75095 -150076 7490 71592 34490 184665 103866 175584 113349 132087
2524A32087m0649K6769J26975j33363o6351M2843P1439k2576j23936O777P1416
$$ 132087 91438 118207 245182 111819 45468 88311 159750 137174 13238 20015 91431
2513I1431j5745l8098K5645J18019j34004J9042N6779J08617J41809n2713k1751
$$ 91431 75686 37588 63233 181252 47248 66290 123069 231686 373495 320782 299031
2502B99031o7875p9448L7645L3601l6969j15298n745J4300R9748j51368K882O2906
$$ 299031 231156 151708 189353 222954 185985 70687 64942 79242 178990 27622 30504 93410
2490I3410O572M6111r5316l6995K4678n0393l528m1082J62331R9842j31321J43530
$$ 93410 99982 146093 50777 13782 38460 -11933 -15461 -56543 105788 205630 74309 217839
2478B17839j29068o7458N4217q1708Q7699N4967r7574J1833j82954J13810N3278
$$ 217839 88771 21313 75530 -6178 81521 136488 38914 50747 -132207 -18397 34881
2467C4881O0050J9503l63248K6652K66199K66224l3666r4130k3816j31289m0728
$$ 34881 94931 114434 -248814 -222162 44037 310261 276595 182465 158649 27360 -13368
2456a3368j9959l0596J7340J13283J96332j7415j16090K6601N2025j11331p9730
$$ -13368 -33327 -63923 -46583 66700 263032 245617 129527 156128 208153 96822 17092
2445A7092L103J3139m4335N3026K5764n292J31364j19861k5944k1654o1929N8216
$$ 17092 20195 33334 -11001 42025 67789 62497 193861 74000 48056 26402 -35527 22689
2433B2689m175q9265M2232P1257M0365o3310n9731J38925k5468K6587m5409J29764
$$ 22689 18514 -70751 -28519 42738 83103 19793 -39938 98987 73519 100106 54697 184461
2421A84461j04856k6005O0426j59463j2621O9204j7107j28366J48537n8551M3518
$$ 184461 79605 53600 114026 -45437 -58058 11146 -5961 -134327 14210 -44341 -823
2410h23k4884O0538O0982o1326N3483n0052l996O726Q8298J414K1165r7304R6201
$$ -823 -25707 34831 95813 34487 87970 37918 33922 40648 128946 130360 151525 54221 150422
2397A50422N8003k92l6306L3338Q1422j62944K4361N6960j14480J5421J11300
$$ 150422 208425 208133 171827 205165 286587 123643 148004 204964 90484 105905 217205
2386B17205j26262q1793M1824M2256L9402m7312q5858j9992J50150J15121j14661
$$ 217205 90943 9150 50974 93230 132632 85320 -538 -20530 129620 244741 130080
2375A30080j49094L1735O5415K5396j68372P6459J71563j41293j36627K9351J80905
$$ 130080 -19014 12721 78136 103532 -64840 11619 183182 41889 -94738 -65387 115518
2364A15518J00178j77336J35252j17434j91464J49618K9635J93330j11772q7053
$$ 115518 215696 38360 173612 56178 -135286 14332 43967 237297 125525 38472
2354C8472J46394j7816J3216Q8548o0774j00993j244J54554q1687k0815J81460
$$ 38472 184866 167050 180266 268814 208040 107047 105803 260357 178670 157855 339315
2343C39315J6388j09944R2827L4898k10075J4323M300Q8652J4393k5283n270j18603
$$ 339315 355703 245759 338586 373484 163409 177732 182032 270684 285077 259794 254524 135921
2331A35921J7758N220M5463k7461J7790K2004o7062j37341J425n4898P0125N5699
$$ 135921 153679 158899 204362 176901 194691 216695 149633 12292 13717 -41181 28944 84643
2319H4643N8366J09712Q624m4457j26475N0979O504o6000l0614o170M1447k3392
$$ 84643 143009 252721 261345 216888 90413 141392 147896 81896 51282 45112 86559 63167
2307F3167j8447p0151k4613K22502N8985p3745r2348K501N7353J36852j32886
$$ 63167 44720 -25431 -50044 172458 231443 157698 65350 67851 125204 262056 129170
2296A29170k02547O4017J16460l8392J105l0839N2633N7367N6661J27014j20839
$$ 129170 -73377 -9360 107100 68708 69813 38974 91607 148974 205635 332649 211810
2285B11810k2266R7627l7726j34945J628l7771n5821Q8807J17333k5692j46857
$$ 211810 189544 287171 249445 114500 116128 78357 22536 111343 228676 202984 56127
2274E6127N0679P426j4179L3198k5649k1638L5635P0656J9512P4588R099j18844
$$ 56127 106806 114232 100053 133251 107602 85964 121599 192255 211767 286355 295454 176610
2262A76610R1753N4156m0074j60753q122j4213M7515n8091m0204K21227j7028
$$ 176610 268363 322519 282445 121692 113570 99357 146872 88781 48577 269804 252776
2251B52776L3517q1771p4444J4004N0299J87038r2560o8517J39345j34099J4174
$$ 252776 286293 204522 130078 144082 194381 381419 288859 220342 359687 225588 239762
2240B39762j0612k9881O5159J08664p1995r8523p5404O6205J64669j9521j47281
$$ 239762 229150 199269 264428 373092 301097 202574 127170 193375 358044 338523 191242
2229A91242J13078J2271n756n9056K6901N2210r0868j19543J83188L6133m8422
$$ 191242 304320 316591 310835 251779 278680 330890 240022 120479 303667 339800 291378
2218B91378j844l5233P7488J23078R660n1847n1646n5929k0443P7515n8343j22200
$$ 291378 289534 254301 331789 454867 464527 412680 361034 305105 284662 362177 303834 181634
2206A81634O3646P2301l7843J40174J55068k06195n9754l14M9256K976r543K7985
$$ 181634 245280 317581 279738 419912 574980 368785 309031 308717 357973 360949 351406 379391
2194C79391Q6296j73333J29768J23004j12433l9213M408L5207P2844p5183k650
$$ 379391 465687 292354 422122 545126 432693 393480 397888 433095 505939 430756 428106
2183D28106J36034j49281J54214l5075j13292k9894J33713K600j01412P7504O3215
$$ 428106 564140 414859 569073 533998 420706 390812 524525 527125 425713 503217 566432
2172E66432J57502N4628k6734M1623K4955n6688O6990J98816J6997j92665J34039
$$ 566432 723934 778562 751828 793451 818406 761718 828708 1027524 1044521 851856 985895
2161I85895R4502j9952m1486l4729m9924J29080p1790P5094j11994N4578J77812
$$ 985895 1080397 1060445 1018959 984230 934306 1063386 991596 1066690 954696 1009274 1187086
2150A187086J66437o8325J5460P4661P2086o1957N9179K4006J17695o2581j5901
$$ 1187086 1353523 1285198 1300658 1375319 1447405 1385448 1444627 1468633 1586328 1523747 1507846
2139A507846j1377j05314J97818J07144j33858L6220j1491n7265M1771N7188O6194
$$ 1507846 1496469 1391155 1588973 1696117 1562259 1598479 1586988 1529723 1571494 1628682 1694876
2128A694876k8207K03825o9977m7120Q0805N7156J14345P9572j13619J63017K71817
$$ 1694876 1666669 1870494 1800517 1753397 1834202 1891358 2005703 2085275 1971656 2134673 2406490
2117B406490J97345L7643Q7920K32261K46906K00101O2932J74796J20902J91062
$$ 2406490 2603835 2641478 2729398 2961659 3208565 3408666 3471598 3646394 3767296 3958358
2107C958358J73225L85831R2928Q0587M52194L97824L62671J57796K87982K80441
$$ 3958358 4131583 4517414 4610342 4690929 5143123 5540947 5903618 6061414 6349396 6629837
2097F629837M25524M95352N20902O96211R65521Q48402O19037N86735R19147J134628
$$ 6629837 7055361 7550713 8071615 8767826 9733347 10581749 11200786 11787521 12706668 13841296
2087A3841296J122368J439485K166528K702493L619920M506593O562880Q277362
$$ 13841296 14963664 16403149 18569677 21272170 24892090 29398683 35961563 44238925
2079D4238925R816813J0448891O333227o334595j2270314j0263792q544588o286331
$$ 44238925 54055738 64504629 70837856 64503261 52232947 41969155 33424567 27138236
2071B7138236n027799l380705k704750j807589j529955j208061p17509n71612
$$ 27138236 22110437 18729732 16024982 14217393 12687438 11479377 10761868 10190256
2063A0190256n26461l44913o56222n72631p42482p12446o58472l85865j93573
$$ 10190256 9663795 9318882 8662660 8090029 7347547 6635101 5976629 5590764 5397191
2054E397191k93574k80176l77486k08688k06040m045l13762j6019j92291k48707
$$ 5397191 5103617 4823441 4445955 4237267 4031227 4027182 3713420 3697401 3505110 3256403
2044C256403j70906j51326o6422k68499k00118j24700j69982M4473R2817J7068
$$ 3256403 3085497 2934171 2867749 2599250 2399132 2274432 2104450 2148923 2241740 2258808
2034B258808j7454j68580l4098k59629j16983L1255M4596M589j55344q7374K7863
$$ 2258808 2241354 2072774 2038676 1779047 1662064 1693319 1737915 1742504 1587160 1499786 1527649
2023A527649p6129j39112L897N396o2501n6674l0795J51294r6951k06254j32014
$$ 1527649 1451520 1312408 1316305 1321701 1259200 1202526 1171731 1323025 1226074 1019820 887806
2012H87806J49299J72977K5487r9390j24325j03721o1429L5992p8755J46053R4399
$$ 887806 1037105 1210082 1235569 1136179 1011854 908133 846704 882696 803941 949994 1044393
2001A044393o1959m6312k66576L5603P0402p7033p1668K9616K1883M3255K3958
$$ 1044393 982434 936122 669546 705149 775551 698518 626850 656466 678349 721604 745562
1990G45562K3522l0609r448q1733J12728N8519j71029j87378j54693q533J15307
$$ 745562 769084 738475 729027 647294 760022 818541 647512 460134 305441 296908 412215
$$ [...]
##END NTUPLES=NMR SPECTRUM
##END=
