##TITLE=1H_EC-3278(II-2)
 CDCl3
 8 sc, 
 28.09.2022
##JCAMPDX= 6.0         $$ Bruker NMR JCAMP-DX V2.0
##DATA TYPE= NMR SPECTRUM
##DATA CLASS= NTUPLES
##ORIGIN= UXNMR, Bruker Analytische Messtechnik GmbH
##OWNER= root
$$ XWIN-NMR		Version 3.5
$$ Wed Sep 28 13:50:27 2022 Russian Standard Time (UT+4h)  she@DPX200
##.OBSERVE FREQUENCY= 200.1313499994
##.OBSERVE NUCLEUS= ^1H
##.ACQUISITION MODE= SIMULTANEOUS
##.ACQUISITION SCHEME= undefined
##.AVERAGES= 8
##.DIGITISER RES= 18
##SPECTROMETER/DATA SYSTEM= spect
##.PULSE SEQUENCE= zg30
##.SOLVENT NAME= CDCl3
##.SHIFT REFERENCE= (INTERNAL, CDCl3, 0, 15.7513)
##AUDIT TRAIL= $$ (NUMBER, WHEN, WHO, WHERE, WHAT)
$$ ##TITLE= Audit trail, XWIN-NMR		Version 3.5
$$ ##JCAMPDX= 5.01
$$ ##ORIGIN= Bruker BioSpin GmbH
$$ ##OWNER= she
$$ F:/spectra/data/she/nmr/H-F/1/pdata/1/auditp.txt
$$ ##AUDIT TRAIL=  $$ (NUMBER, WHEN, WHO, WHERE, WHAT)
(   1,<2022-09-28 13:48:35.09 +0400>,<she>,<DPX200>,
      <created by zg, POWCHK disabled, PULCHK disabled
       configuration hash MD5:
       00 E9 B6 7A A2 85 ED C7 34 08 36 98 17 FE 4E 26
       data hash MD5: 16K
       F2 D2 C8 17 5B B9 FB 61 26 F2 22 EB 0A 55 1A BC>)
(   2,<2022-09-28 13:48:37.84 +0400>,<she>,<DPX200>,
      <Start of raw data processing
       efp BC_mod = 2 LB = 0.24 FT_mod = 6 PKNL = 1 PHC0 = -18030.54 PHC1 = 9.600689 SI = 16K 
       data hash MD5: 16K
       33 3B 0D A9 DF AF F9 83 BB FA 77 44 7B 3A 9F F8>)
(   3,<2022-09-28 13:48:55.04 +0400>,<she>,<DPX200>,
      <pk PHC0 = -0.3808665 PHC1 = -0.6 
       data hash MD5: 16K
       C5 C0 0F 6D A4 00 33 18 B6 F0 34 04 8F D5 14 90>)
(   4,<2022-09-28 13:48:58.29 +0400>,<she>,<DPX200>,
      <abs ABSG = 5 
       data hash MD5: 16K
       6A C9 D1 48 6A 23 38 4F 81 05 48 91 EA FD 27 AF>)
$$ ##END=
$$ 
$$ hash MD5
$$ 5C 78 E8 8D 91 01 CD 59 91 9A 9B 8A B9 B2 D1 E3
##$RELAX= 
##$RELAX= 
##$RELAX= 
##$RELAX= 
##$RELAX= 
##$RELAX= 
$$ Bruker specific parameters
$$ --------------------------
##$DU= <F:/spectra>
##$EXPNO= 1
##$NAME= <H-F>
##$PROCNO= 1
##$TYPE= <nmr>
##$USER= <she>
##$AMP= (0..31)
100 100 100 100 100 100 100 100 100 100 100 100 100 100 100 100 100 100 
100 100 100 100 100 100 100 100 100 100 100 100 100 100 
##$AQSEQ= 0
##$AQ_mod= 1
##$AUNM= <au_zg>
##$AUTOPOS= <>
##$BF1= 200.13
##$BF2= 200.13
##$BF3= 200.13
##$BF4= 200.13
##$BF5= 200.13
##$BF6= 200.13
##$BF7= 200.13
##$BF8= 200.13
##$BYTORDA= 1
##$CFDGTYP= 0
##$CFRGTYP= 5
##$CHEMSTR= <none>
##$CNST= (0..31)
1 1 145 1 1 1 1 1 1 1 1 1 1 1 1 1 1 1 1 1 1 1 1 1 1 1 1 1 1 1 1 1 
##$CPDPRG= <>
##$CPDPRG1= <>
##$CPDPRG2= <>
##$CPDPRG3= <>
##$CPDPRG4= <mlev>
##$CPDPRG5= <mlev>
##$CPDPRG6= <mlev>
##$CPDPRG7= <mlev>
##$CPDPRG8= <mlev>
##$CPDPRGB= <>
##$CPDPRGT= <>
##$D= (0..31)
0 1.2 0 0 0 0 0 0 0 0.06 0 0.03 0 0 0 0 0.0002 0 0 0 0 0 0 0 0 0 0 0 0 
0 0 0 
##$DATE= 1664358514
##$DBL= (0..7)
120 120 120 120 120 120 120 120 
##$DBP= (0..7)
150 150 150 150 150 150 150 150 
##$DBP07= 0
##$DBPNAM0= <>
##$DBPNAM1= <>
##$DBPNAM2= <>
##$DBPNAM3= <>
##$DBPNAM4= <>
$$ [...]
##$SUBNAM3= <"">
##$SUBNAM4= <"">
##$SUBNAM5= <"">
##$SUBNAM6= <"">
##$SUBNAM7= <"">
##$SUBNAM8= <"">
##$SUBNAM9= <"">
##$SW= 18.0517283424941
##$SWIBOX= (0..15)
0 0 2 0 0 0 0 0 0 0 0 0 0 0 0 0 
##$SW_h= 3612.71676300578
##$TD= 16384
##$TD0= 1
##$TE= 0
##$TE2= 300
##$TE3= 300
##$TEG= 300
##$TL= (0..7)
0 120 120 120 120 120 120 120 
##$TP= (0..7)
150 150 150 150 150 150 150 150 
##$TP07= 0
##$TPNAME0= <>
##$TPNAME1= <>
##$TPNAME2= <>
##$TPNAME3= <>
##$TPNAME4= <>
##$TPNAME5= <>
##$TPNAME6= <>
##$TPNAME7= <>
##$TPOAL= (0..7)
0.5 0.5 0.5 0.5 0.5 0.5 0.5 0.5 
##$TPOFFS= (0..7)
0 0 0 0 0 0 0 0 
##$TUNHIN= 0
##$TUNHOUT= 0
##$TUNXOUT= 0
##$USERA1= <user>
##$USERA2= <user>
##$USERA3= <user>
##$USERA4= <user>
##$USERA5= <user>
##$V9= 5
##$VALIST= <valist>
##$VCLIST= <CCCCCCCCCCCCCCC>
##$VD= 0
##$VDLIST= <DDDDDDDDDDDDDDD>
##$VPLIST= <PPPPPPPPPPPPPPP>
##$VTLIST= <TTTTTTTTTTTTTTT>
##$WBST= 1024
##$WBSW= 4
##$XGAIN= (0..3)
0 0 0 0 
##$XL= 0
##$YL= 0
##$YMAX_a= 429759
##$YMIN_a= -727848
##$ZGOPTNS= <>
##$ZL1= 120
##$ZL2= 120
##$ZL3= 120
##$ZL4= 120
##$ABSF1= 15.76452
##$ABSF2= -2.28733
##$ABSG= 5
##$ABSL= 3
##$ALPHA= 0
##$AQORDER= 0
##$ASSFAC= 0
##$ASSFACI= 0
##$ASSFACX= 0
##$ASSWID= 0
##$AUNMP= <proc_1d>
##$AZFE= 0.1
##$AZFW= 0.1
##$BCFW= 0
##$BC_mod= 2
##$BYTORDP= 0
##$COROFFS= 0
##$CY= -3
##$DATMOD= 1
##$DC= 0
##$DFILT= <>
##$DTYPP= 0
##$F1P= 0
##$F2P= 0
##$FCOR= 1
##$FTSIZE= 16384
##$FT_mod= 6
##$GAMMA= 0
##$GB= 0
##$INTBC= 1
##$INTSCL= 3.70164e-10
##$ISEN= 128
##$LB= 0.24
##$LEV0= 0
##$LPBIN= 0
##$MAXI= 10000
##$MC2= 0
##$MEAN= 0
##$ME_mod= 0
##$MI= 1.114404
##$NCOEF= 0
##$NC_proc= -6
##$NLEV= 6
##$NOISF1= 3.799351
##$NOISF2= 2.8
##$NSP= 0
##$NTH_PI= 0
##$NZP= 0
##$OFFSET= 15.7513
##$PC= 1
##$PHC0= -18030.92
##$PHC1= 9.000689
##$PH_mod= 1
##$PKNL= yes
##$PPARMOD= 0
##$PSCAL= 0
##$PSIGN= 0
##$REVERSE= no
##$SF= 200.130004051342
##$SI= 16384
##$SIGF1= 3
##$SIGF2= 2
##$SINO= 5.538805
##$SIOLD= 16384
##$SREGLST= <1H.CDCl3>
##$SSB= 0
##$STSI= 16384
##$STSR= 0
##$SW_p= 3612.71676300578
##$SYMM= 0
##$S_DEV= 0
##$TDeff= 16384
##$TDoff= 0
##$TI= <>
##$TILT= no
##$TM1= 0
##$TM2= 0
##$TOPLEV= 0
##$USERP1= <user>
##$USERP2= <user>
##$USERP3= <user>
##$USERP4= <user>
##$USERP5= <user>
##$WDW= 1
##$XDIM= 16384
##$YMAX_p= 386743930
##$YMIN_p= -378761
$$ End of Bruker specific parameters
$$ ---------------------------------
##NTUPLES= NMR SPECTRUM
##VAR_NAME=  FREQUENCY,     SPECTRUM/REAL,   SPECTRUM/IMAG
##SYMBOL=    X,             R,               I
##VAR_TYPE=  INDEPENDENT,   DEPENDENT,       DEPENDENT
##VAR_FORM=  AFFN,          ASDF,            ASDF
##VAR_DIM=   16384,         16384,           16384
##UNITS=     HZ,            ARBITRARY UNITS, ARBITRARY UNITS
##FACTOR=    0.220516191357247, 1,           1
##FIRST=     3152.30770441411, 0,            0
##LAST=      -460.409058591673, 0,           0
##MIN=       -460.409058591673, -378761,     0
##MAX=       3152.30770441411, 386743930,    0
$$ Real data points
##PAGE= N=1
##DATA TABLE= (X++(R..R)), XYDATA
$$ [...]
6312A746519L5608O4081J72146J05638R8893j16041P002J41310j85682R3500p3135
6301B089839j4972Q309k43070P4184M1712O4226o9955o1022R3370p0857j49851
6290A761913J23019J58199l820k24778R855N4193K5617K42773J24432k6093p2681
6279B172629K75617M6950m7949n9551o4843k2808l7190j41968j00371j34048j41164
6268A745304Q789j9247n1003j77351k8116O1494J07779j3444j54657r8785R9441
6257A480204j9135m2577Q7265N8906n2838m2010K3981J30507j20928R9499J26482
6246A729356n089J74098k5199r9425J31880J07579m8672J3480j01039J821k1748
6235A857042O6837l4077m4259P2524k0299L0444J9560O7256o6835Q099j00041
$$ plain form
6312 1746519 1782127 1846208 2018354 2123992 2222885 2106844 2113846 2255156 2069474 2162974 2089839
6301 2089839 2074867 2083176 1840106 1914290 1956002 2020228 1950273 1889251 1982621 1911764 1761913
6290 1761913 1884932 2043131 2039311 1814533 1824388 1878581 1904198 2146971 2271403 2245310 2172629
6279 2172629 2448246 2495196 2447247 2387696 2322853 2300045 2262855 2120887 2020516 1886468 1745304
6268 1745304 1754093 1734846 1683843 1506492 1478376 1539870 1647649 1634205 1479548 1380763 1480204
6257 1480204 1461069 1418492 1505757 1564663 1511825 1469815 1493796 1624303 1503375 1602874 1729356
6246 1729356 1724267 1898365 1873166 1773741 1905621 2013200 1964528 1978008 1876969 1878790 1857042
6235 1857042 1923879 1889802 1845543 1918067 1897768 1928212 1947772 2015028 1948193 1956292 1856251
6224A856251R3498J21607J45498O9321r3279j22383J50572J76647M5616J0439
6214B453787r0696o9827L4918Q5027K67q838j0554j09488m7998k1333P0630J97296
6202B483191N8643J15296J05757j0625K9723M4602j0443J87864j66516j95404
6192B642088K6750K2096M8999K8770j39328K4654k6814J10930r8074p9845M0898
6181B601124J09626Q4877K5623R7211o1118n3009J87744J91306J5219J97282L8502
6170C434387J52300M0407J19467J07508k0953j29974n8234q3330l030J26814j13370
6159C571992j56775j01085J4884k07485m3998N4769k7127l80P34n716N1179j72262
6147B978730l660K12171P3576P9553J4636O5442J11786l9192k43831m0899Q7894
$$ plain form
6224 1856251 1949749 2071356 2216854 2286175 2192896 2070513 2221085 2397732 2443348 2453787
6214 2453787 2363091 2293264 2328182 2413209 2413476 2404638 2394084 2284596 2236598 2215265 2285895 2483191
6202 2483191 2541834 2657130 2762887 2752262 2781985 2826587 2816144 3004008 2837492 2642088
6192 2642088 2668838 2690934 2739933 2768703 2629375 2654029 2627215 2738145 2640071 2560226 2601124
6181 2601124 2710750 2795627 2821250 2918461 2857343 2804334 2992078 3183384 3198603 3395885 3434387
6170 3434387 3586687 3627094 3746561 3854069 3833116 3703142 3644908 3561578 3558548 3685362 3571992
6159 3571992 3415217 3314132 3329016 3121531 3077533 3132302 3105175 3104795 3105529 3099813 3150992 2978730
6147 2978730 2975070 3187241 3260817 3340370 3355006 3420448 3532234 3493042 3249211 3208312 3296206
6136C296206r9322j15957K07718J5080j84152j28656j32564j67598K7242O869
6126B724866q8319j75355o2562R7083l9928R680J57422r2033L6000p1517j72540
6115B322797m0855l2128K35432j28743o2229j9706j11852j53363K5619O8746j79984
6104A923734O9445r7082P0995r4571j96380p3727N8979j31920K9178M370q8843
6093A474178N2305q0559K3318r2854j24507J62607Q1754m9342Q8038j80379k4649
6082A329910R502k6637j64076Q741l5222j66987P3631J03823j38081M5258O0495
6071A100357j75746k02981O5671L9696M8747k01008Q4707j3177Q0231o7314j848
6060G57335J93368m258j26281N3632r4791Q9859O2305j09482k0041n5243M4726
$$ plain form
6136 3296206 3196884 3080927 3288645 3303725 3119573 2990917 2858353 2690755 2717997 2724866
6126 2724866 2636547 2461192 2398630 2495713 2455785 2465465 2622887 2530854 2566854 2495337 2322797
6115 2322797 2281942 2249814 2485246 2356503 2294274 2274568 2162716 2009353 2034972 2103718 1923734
6104 1923734 1993179 1896097 1967092 1872521 1676141 1602414 1661393 1529473 1558651 1563021 1474178
6093 1474178 1526483 1445924 1469242 1376388 1251881 1414488 1496242 1446900 1534938 1354559 1329910
6082 1329910 1339412 1312775 1148699 1157440 1122218 955231 1028862 1132685 994604 1039862 1100357
6071 1100357 924611 721630 787301 826997 875744 674736 759443 746266 826497 759183 757335
6060 757335 950703 946445 820164 873796 779005 868864 931169 821687 801646 746403 791129
6049G91129j05778N5974Q9244j07520J1535O8242j01248J8067M4296m0927j04525
6038F18489M9154r5148M1254l2359l1274Q369j04721J07567K0776M0794R3309
6027G16210j35041J7781N3798J12538j24199l5668P613j2884j22212l7153R5164
6016E35947J94601M120o2066o7885l2514J2913p0881j16300J49726L084K7039
6005E77784J44195K0961n1843j80037M848m1501k4394M8808n967k022K3809J4904
5993E29545M6829J02K4590k02068j15391J09114L2209Q0770K5651k9668j89396
5982C12287O9416k312p2611Q9454J28813J49299O5544j30683k540o9759k9452
5971E07456J30150p1477j16895o9805q909L2216L5246J53587n3896l3751L5924
$$ plain form
6049 791129 685351 741325 830569 723049 734584 802826 701578 719645 763941 723014 618489
6038 618489 667643 572495 613749 581390 550116 558485 453764 561331 582107 622901 716210
6027 716210 581169 598950 652748 765286 641087 605419 613032 600148 477936 440783 535947
6016 535947 730548 734668 672602 604717 572203 585116 514235 397935 547661 550745 577784
6005 577784 721979 742940 691097 511060 515908 474407 450013 498821 492854 490832 514641 529545
5993 529545 576374 576476 601066 398998 283607 392721 424930 505700 531351 501683 312287
5982 312287 381703 379391 306780 396234 525047 674346 739890 609207 606667 536908 507456
5971 507456 637606 566129 449234 379429 370520 402736 437982 591569 537673 503922 539846
5960E39846J7446r888j2815P8503M209j08059K9264J7850j13663n4394m1023L9754
5948C87030J23699R5273J19322j4721l0547K9838j3619O3214L7146n4994j5309
5937G26332N4353P789J08316K7427L1086m0330n6050j65464J60246k0462m9610
5926G83633j5935o3014Q1515P5807k00194j6599q1750J11850R0143j49247m8750
5915E67459M0508L724L514n9746K5404L5952n81K4604r904l4489M9721L7843q5384
5902E98625l8946P984J61772o0458n6397q1458J29248j03246q5297k2146K03830
5891F53511m1598O0470J85044R548M596j22556n1271J1207J09477j61148k4398
5880F32882j36572j7901l1389J06404M3982r2751J35441K1640K1309K1437j09196
$$ plain form
5960 539846 557292 547404 534589 613092 617301 509242 538506 556356 442693 388299 347276 387030
5948 387030 510729 606002 725324 710603 680056 709894 696275 759489 796635 741641 726332
5937 726332 780685 788474 896790 924217 955303 914973 858923 693459 853705 833243 783633
5926 783633 767698 704684 786199 862006 661812 645213 563463 675313 765456 616209 567459
5915 567459 607967 611691 615205 555459 580863 616815 616234 640838 630934 596445 646166 684009 598625
5902 598625 559679 567663 729435 668977 612580 531122 660370 557124 471827 449681 653511
5891 653511 611913 672383 857427 866975 871571 749015 697744 708951 818428 657280 632882
5880 632882 496310 478409 447020 553424 597406 504655 640096 661736 683045 704482 595286
5869E95286M4239J53620J5075M4483k1858q2188j6940Q5201J08881l4992m9476
5858H41331M0998p1390j01402o846q9877J88910J48752j55460P0827Q9528p2023
5847H83348p7419M59N1369O5332j06198n0671L7673o3181K3651J15459L7684n7227
5835H60279J49646O9305j26380j02959n9848O8359K50432J0547J05372r9376K6686
5824A152063j1709o7018O887K49805P3074q191R9687j57754J31025J2961J05308
5813A586138J23093P9694K7853o520L07016L41698r1634K25523L10691K32821
5803C136373L70917K33507M23981R52289J132318J400156J404893P88057k75798
5794I566693j238132j546268j098103q06040n99186n70443m12099k96476k65034
$$ plain form
5869 595286 639525 793145 808220 852703 830845 748657 731717 816918 925799 890807 841331
5858 841331 882329 810939 709537 702691 612814 801724 950476 795016 865843 955371 883348
5847 883348 805929 806388 857757 923089 816891 766220 803893 740712 764363 879822 917506 860279
5835 860279 1009925 1079230 952850 849891 790043 858402 1108834 1119381 1224753 1125377 1152063
5824 1152063 1140354 1073336 1080223 1330028 1403102 1394911 1494598 1336844 1467869 1480830 1586138
5813 1586138 1709231 1788925 1816778 1810258 2117274 2458972 2367338 2592861 2903552 3136373
5803 3136373 3507290 3740797 4164778 5117067 6249385 7649541 9054434 9842491 9566693
5794 9566693 8328561 6782293 5684190 4878150 4278964 3708521 3296422 2999946 2734912
5785B734912r2398j11488k18188R704m6411j26728q7112k0673k2271j28370l5325
5774A855652n6005r0035Q728K92704J53678l7830L6763J66873r472k70416k27518
5763A823122j91888k0904k18137m9730J17688N5753K6953j58879p6407m8462J9297
5752A278406j92771J7484R4031l2366J14044j56182k2692L7968p8190p7715R4511
5741A076528p495l9400M0596j666j95710j12388N3944J423M9960k32457q5523
5730E47812R3692P0264q6241J24303J85300k1318j36766j05301j7965Q1399j7316
5719G17863M5961J07938j01243J62677M5247J4224j47055K5162N0552j7956N9567
5708I62937j20892j28813N5622R4892P2987J219p9258p6899p9181L4061M1100
$$ plain form
5785 2734912 2642514 2531026 2312838 2322542 2276131 2149403 2062291 2041618 2019347 1890977 1855652
5774 1855652 1799647 1709612 1718340 2011044 2164722 2126892 2163655 2330528 2321056 2050640 1823122
5763 1823122 1631234 1610330 1392193 1342463 1460151 1515904 1542857 1383978 1307571 1259109 1278406
5752 1278406 1085635 1103119 1197150 1164784 1278828 1122646 1099954 1137922 1059732 982017 1076528
5741 1076528 1069033 1029633 1070229 1068563 872853 760465 814409 815832 865792 633335 547812
5730 547812 641504 711768 625527 749830 935130 913812 777046 671745 653780 735179 717863
5719 717863 763824 871762 770519 933196 978443 992667 845612 870774 921326 903370 962937
5708 962937 842045 713232 768854 863746 936733 937952 858694 781795 702614 736675 777775
5697G77775l1508J10665J48855q6309K26638p8677j67934J77657q1217q1524J53417
5686A067838J4770N8066Q285n0182K8061K4981q3313J29061n4216l4606J04689
5675A213434k6144J04881q9537l0521O9158j9650j39045j10922J62669k2785k123
5664A109415K2318K15387k17m2009M9023J25670n2425m5486J60369L1764q1023
5653A492786j55411J0682J53853J50580o4136k3380L5758q4297O5792J16532j9716
5642A679043k9406J36308j02917j56840Q1980K42K8790J68190N4788J9332J18321
5631A997831n4965L3701J66864m6296j00402O1059O773Q053R2518l148J59579
5620B321567J18685j38423R7307J30352j6903n516Q9669J16193Q0012N7301R4511
$$ plain form
5697 777775 746267 856932 1005787 919478 1146116 1067439 899505 1077162 995945 914421 1067838
5686 1067838 1082608 1140674 1148959 1098777 1126838 1151819 1068506 1197567 1143351 1108745 1213434
5675 1213434 1187290 1292171 1202634 1172113 1241271 1221621 1082576 971654 1134323 1111538 1109415
5664 1109415 1131733 1347120 1346903 1304894 1353917 1479587 1427162 1381676 1542045 1573809 1492786
5653 1492786 1337375 1348057 1501910 1652490 1588354 1564974 1600732 1516435 1582227 1698759 1679043
5642 1679043 1649637 1785945 1683028 1526188 1608168 1608410 1637200 1805390 1860178 1879510 1997831
5631 1997831 1942866 1976567 2143431 2097135 1996733 2057792 2064565 2072618 2165136 2161988 2321567
5620 2321567 2440252 2301829 2399136 2529488 2512585 2507069 2596738 2712931 2792943 2850244 2944755
5609B944755J58863K31511P8711O9003K95278J42846l2812J74103J37149J61660
5599D361067J5601n6270k40j53506o4690j04040K6301J9934j23197j78076r2645
5588C650239l4219L9988L3312j11626J77836J48405J82171O3160m2277Q3108K23878
5577D413975J15740K7212J35550J17001J57458L41296M16457K73061J76377M51281
5567F625408J02083J50631K51756J3260K84264K70054J41875M6464K39736L40883
5557H466414J57543K09845J55734K98975K24232K58650M06592O19587R70396J588820
5547A3356788J749772J790634J230634l99769j927299k300829j931725j542848
5539A0025358r97770p28346n95228n04956N597k48768r0035k6207j1560N0535
$$ plain form
5609 2944755 3103618 3335129 3413840 3482843 3778121 3920967 3888155 4062258 4199407 4361067
5599 4361067 4376668 4320398 4320158 4166652 4101962 3997922 4024223 4044157 3920960 3742884 3650239
5588 3650239 3616020 3656008 3689320 3577694 3755530 3903935 4086106 4149266 4106989 4190097 4413975
5577 4413975 4529715 4556927 4692477 4809478 4966936 5308232 5724689 5997750 6174127 6625408
5567 6625408 6727491 6878122 7129878 7143138 7427402 7697456 7839331 7885795 8125531 8466414
5557 8466414 8623957 8833802 8989536 9288511 9512743 9771393 10177985 10797572 11767968 13356788
5547 13356788 15106560 16897194 18127828 17728059 15800760 13499931 11568206 10025358
5539 10025358 9027588 8299242 7704014 7199058 7204655 6955887 6865852 6839645 6828085 6878620
5529F878620J37655k7265K19267Q9218q7200K8306L2693Q4911o0253q7284j52307
5518G056361N8248m8777J52889j65686n4333j37796j72487k76143l87473m86797
5508E538006k49929j22112k20839j78572r8479k0626N3967M0572P704J2044L5541
5497D797277j3742J95491k2542k8512R8698n1811J28840J89439Q6361J10261j31989
5486E357771K7346J82647j70197j79704k01697k6224J5455L9483r8659n8585J09763
5475D997399k5490j14334M5131j5616m9421J4974n931n7965O2164J7095R3295
5464D961301j8075J57678J0926J30758J15127K49393L897K0476K69390J07832
5454F008703J24742K52400R2970L9645M15J7590J51595J58835j6580J48075J22429
$$ plain form
5529 6878620 7016275 6989010 7208277 7297495 7210295 7238601 7271294 7356205 7295952 7208668 7056361
5518 7056361 7114609 7065832 7218721 7053035 6998702 6860906 6688419 6412276 6024803 5538006
5508 5538006 5288077 5165965 4945126 4766554 4668075 4647449 4701416 4741988 4749692 4761736 4797277
5497 4797277 4783535 4979026 4956484 4927972 5026670 4974859 5103699 5293138 5379499 5489760 5357771
5486 5357771 5385117 5567764 5397567 5217863 5016166 4989942 5005397 5044880 4946221 4887636 4997399
5475 4997399 4971909 4857575 4902706 4887090 4837669 4852643 4846712 4788747 4850911 4868006 4961301
5464 4961301 4943226 5100904 5111830 5242588 5357715 5607108 5611005 5631481 5900871 6008703
5454 6008703 6133445 6385845 6478815 6518460 6518875 6536465 6688060 6846895 6830315 6978390 7100819
5443G100819o7857o145O0209j20069o2694l0695P9303M1019J23039K05818L4159
5432G356906J37193J71267K24157J89712J2581J45359J65172J19140L78818P9937
5422H980242L10229J39142K19236K89966P2817Q1388Q625J76806J8973M9079K46004
5411A0592507K82333Q3940R2479L8269J907K12484m1979N3473K4448J06689m5752
5400A1400798m3326J27513J5469K27040J93577J54717J29117k31638j8430J77923
5390A2132760j50790r4959j58672l5886j41456N2143J92222J61666K05289J10758
5380A2273075J73987K83624J28675K54663Q3186n2602P7617k1165k5823J01451
5370A3276688J33964K02584K37293R283K11631M07560M18086O5551L88762K32686
$$ plain form
5443 7100819 7032962 7026817 7087026 6966957 6904263 6873568 6952871 6993890 7116929 7322747 7356906
5432 7356906 7494099 7665366 7889523 8079235 8091816 8237175 8402347 8521487 8900305 8980242
5422 8980242 9290471 9429613 9648849 9938815 10011632 10093020 10101645 10278451 10297424 10346503 10592507
5411 10592507 10874840 10958780 11051259 11089528 11091435 11303919 11261940 11315413 11339861 11446550 11400798
5400 11400798 11357472 11484985 11500454 11727494 11921071 12075788 12204905 11973267 11954837 12132760
5390 12132760 11981970 11887011 11728339 11692453 11550997 11603140 11795362 11957028 12162317 12273075
5380 12273075 12447062 12730686 12859361 13114024 13197210 13144608 13222225 13201060 13175237 13276688
5370 13276688 13410652 13613236 13850529 13859812 14071443 14479003 14897089 14962640 15351402 15584088
5360A5584088J66518K68203L58407L51903M70129O29923R12975Q68527J034529
5351B0645202J254541J569888J916638K663455L365561L696786L695766K837406
5343D1645243P76086q53125j564852j780169j174678o67477m56799l80758j97166
5334C5346305l81965n81766j146554j110913o54876m42826n3045J56283M54657
5325C1585300R30465J208661J480031K151031K531064L435121M434622N143373
5317E2899668N823231N707692M929586L349709K364396J507191M23939l72392
5309G6633020K55491J837000L537839M430490L426622M80003l854388p558537
5301G9187540q534843p534124o141238m640135l306973k396786j735036j315444
$$ plain form
5360 15584088 15750606 16018809 16377216 16729119 17199248 17829171 18742146 19610673 20645202
5351 20645202 21899743 23469631 25386269 28049724 31415285 35112071 38807837 41645243
5343 41645243 42421329 41568204 40003352 38223183 37048505 36381028 35924229 35543471 35346305
5334 35346305 34964340 34382574 33236020 32125107 31470231 31027405 30974360 31130643 31585300
5325 31585300 32515765 33724426 35204457 37355488 39886552 43321673 47756295 52899668
5317 52899668 58722899 64430591 69360177 72709886 75074282 76581473 77005412 76633020
5309 76633020 76888511 78725511 82263350 86693840 90120462 90600465 86746077 79187540
5301 79187540 70652697 63118573 56977335 52337200 49030227 46633441 44898405 43582961
5293D3582961q28550j11932J36070Q79905J506032K216066L147327L556288L388309
5284E7472476K696801J129583J29205P41063K150698L581692L783701L068109
5276G4753328N78492k676753n454680o630369o286945n512202m272702l473120
5268D1025049k608079k070072j730482j232932r69276o68652m32925l62921l03320
5259C0646390j20811J21031J51555K82471L56731N36367R88537J145680J642374
5250C5750325K223106K348706L110211M009543N220146O290910O971347O718567
5242G2642861M434506J246798k682648m964850m823880l288120j664654p70701
5234F0129312p55343j491946k694432l281573l310923k341984j322297o34504
$$ plain form
5293 43582961 42754411 42642479 42778549 43658454 45164486 47380552 50527879 54084167 57472476
5284 57472476 60169277 61298860 61428065 62169128 64319826 67901518 71685219 74753328
5276 74753328 75331820 72655067 67200387 60570018 54283073 48770871 44498169 41025049
5268 41025049 38416970 36346898 34616416 33383484 32414208 31745556 31312631 30949710 30646390
5259 30646390 30525579 30646610 30798165 31080636 31437367 31973734 32962271 34107951 35750325
5250 35750325 37973431 40322137 43432348 47441891 52662037 58952947 65924294 72642861
5242 72642861 77077367 78324165 75641517 70676667 65852787 62564667 60900013 60129312
5234 60129312 59373969 57882023 55187591 51906018 48595095 46253111 44930814 44296310
5226D4296310K15594P48494J300289J997872K772989L829897N251167O119151
5218F6531763O386894N493868L139208K48870k091198k943481k561860j755500
5210G2448564q08831q18399j424663k574126l164288k453258j347876j001493
5202E8855630j579728k865482m033821m697030m362443l528318k895201j841942
5194C3051665j381411j042239p39399k41004J54519N72895P29085Q18032L93739
5185C2315882K84102M3481L56314N44492Q47277J232648J433207J444698M86365
5176C8988466q98262k608038l878831l698384l067475k407943j873752j582635
5168A8973146j306644j146784p17053n59530o68259n32686m49284n18883l93457
$$ plain form
5226 44296310 44511904 45260398 46560687 48558559 51331548 55161445 60412612 66531763
5218 66531763 72918657 78412525 81551733 81800603 79709405 76765924 74204064 72448564
5210 72448564 71639733 70821334 69396671 66822545 63658257 61204999 59857123 58855630
5202 58855630 57275902 54410420 50376599 45679569 41317126 37788808 34893607 33051665
5194 33051665 31670254 30628015 29888616 29647612 29802131 30375026 31104111 31922143 32315882
5185 32315882 32599984 32643465 32999779 33544271 34391548 35624196 37057403 38502101 38988466
5176 38988466 38090204 35482166 31603335 27904951 24837476 22429533 20555781 18973146
5168 18973146 17666502 16519718 15802665 15243135 14574876 14042190 13592906 13074023 12680566
5159A2680566l46537j82558l71916k17429k60911j98565K328j80275k29628l4053
5149A0661022P3488J83645J20965J88542J66005K67835N43612N34248K60858L9586
5139A3039806J24949L08573P51307R49798J228433J270598O49875K68968n42048
5130A8050259j021501j132244r03064n25090j92800J10858L84754O71275Q23302
5121A6265749J247092J893163K590955L314881L240876K158232j24528k578726
5113B8007694l958812l650443k759844k158971j783095j337823j113641q55974
5105A0389091p82558o50466n43985k43202m94300m97218k82959n02591r5528j78641
5095F117643j07873r2513j86506k33296k24628l4630j50557j35868j80937j42018
$$ plain form
5159 12680566 12334029 12151471 11779555 11562126 11301215 11102650 11104978 10924703 10695075 10661022
5149 10661022 10734510 10918155 11039120 11227662 11393667 11661502 12205114 12739362 13000220 13039806
5139 13039806 13164755 13473328 14224635 15174433 16402866 17673464 18323339 18592307 18050259
5130 18050259 17028758 15896514 14993450 14468360 14275560 14386418 14771172 15442447 16265749
5121 16265749 17512841 19406004 21996959 25311840 28552716 30710948 30586420 28007694
5113 28007694 24048882 20398439 17638595 15479624 13696529 12358706 11245065 10389091
5105 10389091 9606533 8956067 8412082 8168880 7674580 7177362 6894403 6391812 6296284 6117643
5095 6117643 6009770 5917257 5730751 5497455 5272827 5238197 5087640 4951772 4770835 4628817
5085D628817M4832p8750j08659k6836r2134j80935L9523L0076j24237J25666N8281
5074D315644l9358j32105Q217j86311o7576k42l6819m9520j01859J3052p6645
5063C646478j943l3360n8280R0455Q6253J8741Q1883J77682R6278J37501K03017
5052D444705K60050R0480l43816m57571k84979k83547j44324p4706m973p8648
5042C122671j94111r609M1885O7395k48578n3879j4906J20439j00663L2711N8084
5031B821439p4107j19272q3026o8812l2522r141R3757p1117J36139J88543O7701
5020B849582q3602j11720j12696j81377R177j15433q5351J45498l0558m5842j83529
5009B054149p294K6330J3257P3262L3595p7285l2845K8106J1678j71791M9103
$$ plain form
5085 4628817 4673649 4594899 4486240 4459404 4367270 4186335 4225858 4255934 4131697 4257363 4315644
5074 4315644 4276286 4144181 4152398 3966087 3898511 3898269 3861450 3811930 3710071 3723123 3646478
5063 3646478 3644535 3611175 3552895 3643350 3729603 3748344 3830227 4007909 4104187 4241688 4444705
5052 4444705 4704755 4795235 4451419 3993848 3708869 3425322 3280998 3206292 3201319 3122671
5042 3122671 2928560 2918951 2960836 3028231 2779653 2725774 2710868 2831307 2730644 2763355 2821439
5031 2821439 2747332 2628060 2545034 2476222 2443700 2434559 2528316 2457199 2593338 2781881 2849582
5020 2849582 2765980 2654260 2541564 2360187 2369364 2253931 2168580 2314078 2283520 2237678 2054149
5009 2054149 2046855 2073185 2086442 2159704 2193299 2116014 2083169 2111275 2122953 1951162 2000265
4998B000265N6071m1442K2029R9463r7845L3837J13602m6647P1628L6359K00863
4987B448183L5300q3121J68818J79187J956p4662j5626Q8469M4540J9268m4060
4976B768252R3294J63429J8831J02771m3248n7239J79671p466p7641p79J58317
4965C298192L3268J04217L0417m8752M4426K00938j05735J20861k4150Q9127J7715
4954C760524j502O981n8908j461l9668k8130K7247J42960M021J15291J18645J2912
4942D058912J5990K8477R7267Q5282p2460j9123K08779K47436n6236P1661J24541
4931D790526K85447J25486K5044Q9006j9177J27012j82551m5389J34116j2055
4921E317465L11402K50828J35183J64898Q7194K3368r5854n9465O8628J10368
$$ plain form
4998 2000265 2056336 2014894 2036923 2136386 2038541 2072378 2185980 2139333 2210961 2247320 2448183
4987 2448183 2483483 2400362 2569180 2748367 2750323 2675661 2660035 2748504 2793044 2812312 2768252
4976 2768252 2861546 3024975 3043806 3146577 3103329 3046090 3225761 3218295 3140654 3139875 3298192
4965 3298192 3331460 3435677 3466094 3417342 3461768 3662706 3556971 3677832 3653682 3742809 3760524
4954 3760524 3759022 3766003 3707095 3705634 3665966 3637836 3665083 3808043 3812064 3927355 4046000 4058912
4942 4058912 4074902 4103379 4200646 4285928 4213468 4194345 4403124 4650560 4594324 4665985 4790526
4931 4790526 5075973 5201459 5226503 5315509 5296332 5423344 5240793 5195404 5329520 5317465
4921 5317465 5628867 5879695 6014878 6179776 6266970 6290338 6194484 6135019 6203647 6314015
4911F314015J59672L95210J78168J68364N5625J09730J09042J30521L61461K94673
4901H276481J3803R5648K15243N0237J84042K65839P3031O9783J54521K12693
4891I611321J51893J23994J19447J30873K43506K83510J21682R2845K27897L151
4881A1110119J74283K15391J00474J85084L0086J08068L67864L15731L46941L17716
4871A3271757M41702L70543M33017O51897M66360N63858O76981P56096P28054
4862A8360265P94465P97501Q59938P91262R34414J173348J172742J311594J190595
4853B7386124J093115J260450J362024J541495J535721J709098J774539K008929
4845C9671495K139021K562949L122635M077735M980501N955979P130207Q909536
$$ plain form
4911 6314015 6473687 6868897 7047065 7215429 7271054 7380784 7489826 7620347 7981808 8276481
4901 8276481 8290284 8385932 8601175 8651412 8835454 9101293 9174324 9244107 9398628 9611321
4891 9611321 9763214 9887208 10006655 10137528 10381034 10664544 10786226 10879071 11106968 11110119
4881 11110119 11284402 11499793 11600267 11785351 11815437 11923505 12291369 12607100 12954041 13271757
4871 13271757 13713459 14084002 14517019 15168916 15635276 16199134 16876115 17632211 18360265
4862 18360265 19154730 19952231 20812169 21603431 22537845 23711193 24883935 26195529 27386124
4853 27386124 28479239 29739689 31101713 32643208 34178929 35888027 37662566 39671495
4845 39671495 41810516 44373465 47496100 51573835 56554336 62510315 69640522 78550058
4837G8550058J0117451J1606627J3385436J7850156K5186234L5491224M8543253
4830B40730439N9855723N3813647L2344121j5990499o5507657o5924384m9031968
4823A90289422l4734947k5395192j9386981j5234801j2469459r920666p636225
4816F5511151o146205m823984l987008l629510l163620k879287k630796k283996
4808C5966745j968710j917635j463607j379526j432118j220286j224755r86957
4800B4373151q82592q07896p93345r65789r70556j050802q68321q54787n45568
4791A6633495o36997n90792m22353m48999l53923l19380l53444k31301j37070
4782A3139236n568p7476k19951L8425K60154M9268Q545m24494o84146p15362n82361
$$ plain form
4837 78550058 88667509 100274136 113659572 131509728 156695962 192187186 240730439
4830 240730439 300586162 354399809 386743930 370753431 305245774 239321390 190289422
4823 190289422 155554475 130159283 110772302 95537501 83068042 73147376 65511151
4816 65511151 59364946 54540962 50553954 46924444 43760824 40881537 38250741 35966745
4808 35966745 33998035 32080400 30616793 29237267 27805149 26584863 25360108 24373151
4800 24373151 23490559 22682663 21889318 20923529 19952973 18902171 18033850 17179063 16633495
4791 16633495 15996498 15405706 14983353 14534354 14180431 13861051 13507607 13276306 13139236
4782 13139236 13133668 13056192 12836241 12874666 13134820 13184088 13192633 12768139 12083993 11368631 10786270
4771A0786270n94214n37626k93730m03815k30740l97306k96959k54181k27197
4762G550502k48291l37614L5439j53682j62159k49835m1485k71652p9850J71301
4752F212674m2956k54645k39955k6553j15255r3310m1426O4000k1098j56948j33312
4741E151216k57544j94401j26160k60062M6738K4556r4688Q7429r3883j15438
4731D167763q6554j74235O3029q3130o1690k279j62065R1159o369k4387Q4532
4720C805774n0953Q0978j27774J30265J98677r4146J40604J88224J05596L66530
4710D743775M48145K40613J67918Q6580p1056k90779l45483o00197l68040k27960
4700C783516j28888j43701k18316j84825o0936k47517L201q2880j34171J38412
$$ plain form
4771 10786270 10192056 9654430 9360700 8956885 8726145 8328839 8031880 7777699 7550502
4762 7550502 7302211 6964597 7000036 6846354 6684195 6434360 6392875 6121223 6041373 6212674
4752 6212674 6169718 5915073 5675118 5648565 5533310 5440000 5398574 5462574 5441476 5284528 5151216
4741 5151216 4893672 4699271 4573111 4313049 4359787 4384343 4289655 4377084 4283201 4167763
4731 4167763 4081209 3906974 3970003 3886873 3825183 3822904 3660839 3751998 3745629 3721242 3805774
4720 3805774 3754821 3835799 3708025 3838290 4036967 3942821 4083425 4271649 4377245 4743775
4710 4743775 5191920 5432533 5600451 5687031 5615975 5325196 4979713 4379516 4011476 3783516
4700 3783516 3654628 3510927 3292611 3107786 3046850 2799333 2802534 2719654 2585483 2723895
4690B723895P7841P6188o8012j75787k6878k2002Q2025P3987n10k09365j44521
4679B386861N7376j6Q1722P9519M0849M8091j74939J5944J47026J05916o383K7413
4667B809379R7270K4224k0237L2990N1646J1229p7335o7408P3878J00702K7540
4656C063878M3686k331q3731l448n5705J06307J00631N6937J6926M585J38311
4645C386046K7046j29723K4007j05553j0872j54311j25692J66868N7938J29812
4635C265566P1644o7412K30617Q3102M3149J16942P9531J16212l312P9393J77129
4624D192561L3450J31308Q882K98594J44927K03862J95254J89349K05220K49710
4614E853117J48830J61422K44027L03640L71879L21065L90083N33176O80061Q27707
$$ plain form
4690 2723895 2801736 2877924 2809912 2634125 2607247 2585245 2667270 2741257 2740747 2531382 2386861
4679 2386861 2444237 2444221 2525943 2605462 2646311 2694402 2519463 2535407 2682433 2788349 2781966 2809379
4667 2809379 2906649 2930873 2910636 2943626 2995272 3006501 2929166 2861758 2935636 3036338 3063878
4656 3063878 3107564 3105233 3021502 3018054 2962349 3068656 3169287 3226224 3243150 3247735 3386046
4645 3386046 3413092 3283369 3307376 3201823 3190951 3036640 2910948 3077816 3135754 3265566
4635 3265566 3337210 3269798 3500415 3583517 3626666 3743608 3823139 3939351 3936039 4015432 4192561
4624 4192561 4226011 4357319 4366201 4664795 4809722 5013584 5208838 5398187 5603407 5853117
4614 5853117 6001947 6163369 6407396 6711036 7082915 7403980 7794063 8327239 9007300 9835007
4604I835007Q76712J020738J368115J554812J905631J944901K920478M118531
4596B5544925N583680O921813P409918N917286J699988m814726q403011p416220
4588C2443653n837765m256697l395326k499174k097630j640693j122292j138956
4580A0455120p94432o80261m87460o44902o16835m31855l47747l44961k49255
4571E857412j40325l45899j77755l14003k18128j57072j01419j68716j10683Q8904
4561D212316r2376o3833j97737j90011K2264j78561j10197n2392j08375n8491
4551C182607j01967j37792l3171J24545k0372j16485j40465l9972k3264o3851
4541B629813J40093l3078k53543j2422J20093q7340k07874N2981J28769R31P9496
$$ plain form
4604 9835007 10711719 11732457 13100572 14655384 16561015 18505916 21426394 25544925
4596 25544925 31128605 38050418 45460336 51377622 53077610 48262884 39859873 32443653
4588 32443653 26605888 22349191 18953865 16454691 14357061 12716368 11594076 10455120
4580 10455120 9660688 8980427 8492967 7848065 7231230 6799375 6451628 6106667 5857412
4571 5857412 5717087 5371188 5193433 4879430 4661302 4504230 4402811 4234095 4123412 4212316
4561 4212316 4119940 4056107 3858370 3668359 3690623 3512062 3401865 3349473 3241098 3182607
4551 3182607 3080640 2942848 2909677 3034222 3013850 2897365 2756900 2716928 2693664 2629813
4541 2629813 2769906 2736828 2483285 2470863 2590956 2503616 2295742 2348723 2477492 2478423 2557919
4530B557919n4577J13577p8418p9488m4589j26455J17354J29820n4554o8955J26465
4519B538099J07177o0138J26694J26268J62461J93323K94316K68361K16355j08392
4509C864524l74890l59602k43224j03344j36832m4143j37708j37794j8337P9998
4499B388648j26492k41622l016P9813j59713l2869q4680K44341k5370r960M1210
4488B070290L3572k1513L1447n480r4333j11534Q8032J07365M0107r450J395j07052
4476B022846m2997J01354k2420m8753J23466Q7340O5336L16778J18344k74652
4466B446642k1688l5966J16838l026r5475j36068p9801Q8182j09299k6656K1393
4455B165076R1114N9947j23302j5240K06119l0625K2255r4655L0587K9746j19066
$$ plain form
4530 2557919 2503342 2616919 2538501 2459013 2414424 2287969 2405323 2535143 2480589 2411634 2538099
4519 2538099 2645276 2585138 2711832 2838100 3000561 3193884 3488200 3756561 3972916 3864524
4509 3864524 3489634 3130032 2886808 2783464 2646632 2602489 2464781 2326987 2308650 2388648
4499 2388648 2262156 2020534 2017518 2097331 1937618 1904749 1820069 2064410 2039040 2029080 2070290
4488 2070290 2103862 2082349 2113796 2108316 2013983 1902449 1990481 2097846 2137953 2128503 2129898 2022846
4476 2022846 1979849 2081203 2058783 2010030 2133496 2220836 2286172 2602950 2721294 2446642
4466 2446642 2424954 2388988 2505826 2502800 2407325 2271257 2191456 2279638 2170339 2143683 2165076
4455 2165076 2256190 2316137 2192835 2177595 2383714 2353089 2375344 2280689 2311276 2341022 2221956
4444B221956J51732K2071j16149Q5811j19860K06656J40073j37037o7602K5239
4434B412890m6240M8681J15435j37975O3961J79706q5545p8384n81j51854O6096
4423B386190K11513j9586Q9044K0898J76676q9604K55445O3454l65354N0692l0729
4412B748639K9133q340j43016K04642J37763k2850Q9709r4025M5243n399J36299
4401C117798l1162J6438N9163m88J08429m4833J12940N7930J80064O5660o1291
4390C580648j1426J3216k628N4419P5683K6555j13051J35009J41075r4535l312
4379C801653J706J45153J77110J9275L3383J57477N5123j21751L0349Q5451J95289
4368D580218J62202r031L7540M5910J57200L4568O9951M4171P3664J65930P9811
$$ plain form
4444 2221956 2373688 2395759 2279610 2365421 2245561 2452217 2592290 2455253 2387651 2412890
4434 2412890 2366650 2415331 2530766 2392791 2456752 2636458 2550913 2472529 2471948 2320094 2386190
4423 2386190 2597703 2578117 2667161 2688059 2864735 2775131 3030576 3094030 2728676 2779368 2748639
4412 2748639 2777772 2769432 2626416 2831058 2968821 2945971 3035680 2941655 2986898 2981499 3117798
4401 3117798 3086636 3103074 3162237 3161749 3270178 3225345 3338285 3396215 3576279 3641939 3580648
4390 3580648 3569222 3582438 3579810 3634229 3709912 3736467 3623416 3758425 3899500 3804965 3801653
4379 3801653 3803359 3948512 4125622 4144897 4178280 4335757 4390880 4269129 4299478 4384929 4580218
4368 4580218 4742420 4733389 4770929 4816839 4974039 5008607 5078558 5122729 5196393 5362323 5442134
4357E442134N882J90201K39195j54837m8393P8133l1293J43062J01478L5L6779
4346F002376K03668M1445J04410J08103K07365P3455J40297K46893M678l4595
4336G098095K16890K60919k1381J45515R6035Q3850J52519J90041l9016M8365
4326H231832L5142Q684J46190R381L16958K43364K0740j30414K75697K90076K1964
4315I469614K51320J84412J89800K51837J61618R5330K174j3014J97081K49942
4305A1040114L20820J44080J60699J19367M5450j07683R4059K76094J61603N3690
4295A2308293K34985L01016K35370M2177P6669K67808K79637P0645K43995K38622
4285A4299217J23551J94004J15764J54442K64556L74098K88392J42258L01446
$$ plain form
4357 5442134 5448016 5638217 5877412 5722575 5674182 5752315 5721022 5864084 5965562 5965597 6002376
4346 6002376 6206044 6247489 6351899 6460002 6667367 6740822 6881119 7128012 7132690 7098095
4336 7098095 7314985 7575904 7554523 7700038 7796073 7879923 8032442 8222483 8183467 8231832
4326 8231832 8266974 8275658 8421848 8431229 8748187 8991551 9012291 8881877 9157574 9447650 9469614
4315 9469614 9720934 9905346 10095146 10346983 10508601 10603931 10606105 10593091 10790172 11040114
4305 11040114 11360934 11505014 11665713 11785080 11830530 11722847 11816906 12093000 12254603 12308293
4295 12308293 12543278 12844294 13079664 13121841 13198510 13466318 13745955 13816600 14060595 14299217
4285 14299217 14422768 14616772 14732536 14886978 15151534 15525632 15814024 15956282 16257728
4276A6257728K38692K43924M84391K09963L69247K85871J82078J87934K15500
4267A8675328J81212P7146J85570J95197R0197J82787J95540J46835K38273J1113
4257B0179198R4216K60564o7271j40861K1650L05868P7896n6253l2260j9913j94733
4246B0428101Q9983p7790j07759k99372j92079r264m00151M8944k48019k47664
4236A8984930j29520l66983l08778m07651o0373l47439k63573j41411k35047k13698
4226A6510457m83394l39703l26205q7036j70677l17911k93386j36868j97244k7405
4216A4130628m4884j08238p7300j04258q9363J46390J10233J47788K0167k5343
4206A4105820M4253k63940n1478q2223r3844k80709j14235J06502J17518J61627
$$ plain form
4276 16257728 16496420 16740344 17224735 17434698 17803945 18089816 18271894 18459828 18675328
4267 18675328 18856540 18933686 19119256 19314453 19404650 19587437 19782977 19929812 20168085 20179198
4257 20179198 20273414 20533978 20466707 20325846 20347496 20653364 20731260 20675007 20642747 20622834 20428101
4246 20428101 20518084 20440294 20332535 20033163 19841084 19831820 19431669 19480613 19232594 18984930
4236 18984930 18855410 18488427 18179649 17771998 17711625 17364186 17100613 16959202 16724155 16510457
4226 16510457 16027063 15687360 15361155 15274119 15103442 14785531 14492145 14355277 14158033 14130628
4216 14130628 14085744 13977506 13900206 13795948 13706585 13852975 13963208 14110996 14131163 14105820
4206 14105820 14150073 13886133 13834655 13752432 13658588 13377879 13263644 13370146 13487664 13649291
4196A3649291L03167O12380R18491O75891Q89846O27318K29786j98951m12593
4187A7294626o61435o59993n83536n70216n34477n04950l19318q3895J77603K84742
4177A3839151K50375L28827N37011M58091L98668O7637m8006m45667p16888p27994
4167A3941205p15678o27084m59309l01860j60181k78744j5659M3892K92493L13692
4157A2032767K66414K02838j42121m26319q55407n27860k72016k96274k56972
4148I725050k41258O5560J3583L6478m1186J06439O044k39672l60448j17912k10910
4137H741768j01912J48985L2220l05521o3382l9901k41626m1178J08004j16089
4127H121368k02469j45071j23095K3053l7255n6332l7272J0274J17143r0531O1851
$$ plain form
4196 13649291 13952458 14564838 15483329 16159220 17049066 17676384 17906170 17707219 17294626
4187 17294626 16633191 15973198 15389662 14819446 14284969 13780019 13460701 13376806 13554409 13839151
4177 13839151 14089526 14418353 14955364 15413455 15812123 15879760 15831754 15386087 14669199 13941205
4167 13941205 13225527 12598443 12139134 11837274 11677093 11398349 11382690 11426582 11719075 12032767
4157 12032767 12299181 12502019 12359898 11933579 11078172 10550312 10278296 9982022 9725050
4148 9725050 9483792 9549352 9562935 9599413 9558227 9664666 9670710 9431038 9070590 8952678 8741768
4137 8741768 8639856 8788841 8821061 8515540 8452158 8412257 8170631 8129453 8237457 8121368
4127 8121368 7918899 7773828 7650733 7673786 7636531 7580199 7542927 7553201 7670344 7579813 7641664
4116G641664j13794N4917j8202P1647J04547j6352L0175J1275J50146L5026J26427
4105H077476l5830R3763R1328q5147q3881J50040J73430J20577l2462J15675M7225
4094H632194J58128l1938P7747M6407K17801R8349O0707L75227j05375J13229
4084I642476P3376n672J04809J60151J53683J35669Q6610Q7554J94872j1653L28730
4073A0950605P4882J05150J49584K13952Q9956R5056N4004K58552M68524L51718
4063A2811983K92406K97059J28927K94598K94933J17616L60962L85314K80695
4054A5264493K27033L25229M69298L66861M15407N36396O27239M58186N47044
4045A9237186O24559O14905O52316P38670P79147R89888J037129Q35772J193898
$$ plain form
4116 7641664 7527870 7582787 7564585 7636232 7740779 7724427 7754602 7765877 7916023 7951049 8077476
4105 8077476 8041646 8135409 8226737 8141590 8057709 8207749 8381179 8501756 8469294 8584969 8632194
4094 8632194 8790322 8758384 8836131 8882538 9100339 9198688 9259395 9634622 9529247 9642476
4084 9642476 9715852 9710180 9814989 9975140 10128823 10264492 10351102 10438656 10633528 10621875 10950605
4073 10950605 11025487 11130637 11280221 11494173 11584129 11679185 11733189 11991741 12460265 12811983
4063 12811983 13104389 13401448 13530375 13824973 14119906 14237522 14598484 14983798 15264493
4054 15264493 15491526 15816755 16286053 16652914 17068321 17604717 18231956 18690142 19237186
4045 19237186 19861745 20476650 21128966 21867636 22646783 23636671 24673800 25509572 26703470
4036B6703470J260283J133595R86854J299462J431814J543733J618987J647847
4028C7626045J883586K031364J923461K271544K229342K265521K450898K624394
4020E5306155K705109K536174K551627K770365K987390K915617K930494K920295
4012G7623226K976289L145285L196579L188950L271225L242529L091347K912520
4004A02647950K493873K580008K265506K045659K060225J895272J796766J784231
3996A19569490J515180J482566J347986J064506P93531N28085K5138k88730o94640
3987A25343112j048106j288029j454087j362236j560198j558297j760440j836654
3979A13475065k111686k048926k378095k692323k938232l147751l236988l302645
$$ plain form
4036 26703470 27963753 29097348 30084202 31383664 32815478 34359211 35978198 37626045
4028 37626045 39509631 41540995 43464456 45736000 47965342 50230863 52681761 55306155
4020 55306155 58011264 60547438 63099065 65869430 68856820 71772437 74702931 77623226
4012 77623226 80599515 83744800 86941379 90130329 93401554 96644083 99735430 102647950
4004 102647950 105141823 107721831 109987337 112032996 114093221 115988493 117785259 119569490
3996 119569490 121084670 122567236 123915222 124979728 125773259 126301344 126326482 126037752 125343112
3987 125343112 124295006 123006977 121552890 120190654 118630456 117072159 115311719 113475065
3979 113475065 111363379 109314453 106936358 104244035 101305803 98158052 94921064 91618419
3971I1618419l217228l425431l261626l031385k968287l003855k724875k765833
3963F7219899k938248k713931k774119k622462k570330k509614k451134k287562
3955D6352499k337061j871805j793105j739776j550278j397603j186220r12798
3947C3563853p91745p03595r25251j035220j029415j214508j248732j062894j032481
3938B4520012q85828m30516n89966m41638l58793k24160j68724q4752J1866j91315
3928B1156186j40173J06387m4680j10739J02230J60838q7994J02969n1657p441
3918B1185926k07372j69589J13168o7014j23594o4272P2891J19894J78852K84477
3908B1323367m4250j55539n70895q69791p26600o43069o20291n29440n16669m87417
$$ plain form
3971 91618419 88401191 84975760 81714134 78682749 75714462 72710607 69985732 67219899
3963 67219899 64281651 61567720 58793601 56171139 53600809 51091195 48640061 46352499
3955 46352499 44015438 42143633 40350528 38610752 37060474 35662871 34476651 33563853
3947 33563853 32772108 32068513 31143262 30108042 29078627 27864119 26615387 25552493 24520012
3938 24520012 23634184 23203668 22613702 22172064 21813271 21589111 21420387 21335635 21347501 21156186
3928 21156186 21016013 21122400 21077720 20966981 21069211 21230049 21142055 21245024 21193367 21185926
3918 21185926 20978554 20808965 20922133 20855119 20731525 20667253 20740144 20860038 21038890 21323367
3908 21323367 21279117 21123578 20552683 19682892 18956292 18313223 17692932 17163492 16646823 16159406
3898A6159406l86146j93661k26966k42625j79388l4413j21657q5191j07623R63
3888A4582699J02571L72550K54368J71159L16866L10987L20037M35581N85521
3879A7452339N67040N54898P03143P17095P35588Q83556J066043P88233P17423
3870B4185358P02725O22293P37927L19336K10990J25987P3427r8746l4548j42252
3860B6702497o781j31177q1047l30294j66141m04550o24852o33468n23574r00538
3850B2900075q65670j105433q91727q95438q91099p43716q56974p22218o68616
3841A5259184o92628n41011l99452m64199m95413l38608l69301m19821k64344
3832A1274407j40553k25762k64939q9184k38846j78939k40957J05675n1089k48621
$$ plain form
3898 16159406 15773260 15579599 15352633 15110008 14930620 14896207 14774550 14689359 14581736 14582699
3888 14582699 14685270 15057820 15312188 15483347 15800213 16111200 16431237 16866818 17452339
3879 17452339 18019379 18574277 19277420 19994515 20730103 21613659 22679702 23467935 24185358
3870 24185358 24888083 25510376 26248303 26567639 26778629 26904616 26978043 26879297 26844749 26702497
3860 26702497 26695716 26564539 26483492 26153198 25987057 25582507 24957655 24324187 23800613 22900075
3850 22900075 22034405 20928972 20037245 19141807 18250708 17506992 16650018 15927800 15259184
3841 15259184 14566556 14025545 13626093 13161894 12666481 12327873 11958572 11538751 11274407
3832 11274407 11133854 10908092 10643153 10553969 10315123 10136184 9895227 10000902 9949813 9701192
3822I701192j23216k33693N0226o6841j74700j3226j66007p8708j957j45669m5027
3811H702374o6497j242M1678n6159j52782l7200N5868r3686j51821J2821l0181
3800H223173q8152J17725J2078k544l05162J83878N4518r4260J39211O1031Q0009
3789H381505j9966j6102l6349j08910J80572J15025k482Q0419j09717N1096P8375
3778H593466L2256R4564J32826J92883o0748J07180K68893N3681J61609P0239
3768I646849j34887K95703Q2529R2034J17950J85628J79098J70508O0677K73979
3758A0970068J09109R6372j03161j20323L2636R1931J60514N3798n1669k7422
3748A1211853L9132R3581R0651o6952M9003J01349O6010O6998L8239p8532N0079
$$ plain form
3822 9701192 9577976 9344283 9394509 9327668 9152968 9139742 8973735 8895027 8893070 8747401 8702374
3811 8702374 8635877 8634635 8676313 8620154 8467372 8430172 8486040 8392354 8240533 8253354 8223173
3800 8223173 8135021 8252746 8264824 8262280 7957118 8140996 8195514 8101254 8240465 8301496 8381505
3789 8381505 8361539 8345437 8309088 8200178 8380750 8495775 8493293 8573712 8463995 8515091 8593466
3778 8593466 8625722 8720286 8853112 9045995 8985247 9092427 9361320 9415001 9576610 9646849
3768 9646849 9511962 9807665 9890194 9982228 10100178 10285806 10464904 10635412 10696089 10970068
3758 10970068 11079177 11175549 11072388 10952065 10984701 11076632 11237146 11290944 11239275 11211853
3748 11211853 11250985 11344566 11435217 11368265 11417268 11518617 11584627 11651625 11689864 11611332 11661411
3737A1661411M156K7611J54519J66791M596J36659J49977J65648J33713J38057
3727A2743138J22534K36932O1773L0205L20911K06426K02458J90941J53309J12290
3717A4380917K94673L65071J75622J66894J22523K5987L0315L71029L36748K38125
3707A6507904N0210K29603K03615K24771J63748K92082K66752J25384L25713M09484
3697A8799266L60846K73422L52627N60697N56670M38603M60120L74864M46989
3688B2624104N72569M68583N87218N67269N01716O03623R27434O94837O22010
3679B8169363Q97198P62727Q60362J090483J003538J091031J271988J313763J210702
3670C7671155J313189J371319J357731J587625J920645J749655J714636J963849
$$ plain form
3737 11661411 11665567 11693178 11847697 12014488 12019084 12155743 12305720 12471368 12605081 12743138
3727 12743138 12865672 13102604 13164377 13194582 13515493 13721919 13924377 14115318 14268627 14380917
3717 14380917 14675590 15040661 15216283 15383177 15505700 15531687 15562002 15933031 16269779 16507904
3707 16507904 16558114 16787717 16991332 17216103 17379851 17671933 17938685 18064069 18389782 18799266
3697 18799266 19160112 19433534 19786161 20346858 20903528 21342131 21802251 22177115 22624104
3688 22624104 23196673 23665256 24252474 24819743 25321459 25925082 26852516 27547353 28169363
3679 28169363 29066561 29829288 30689650 31780133 32783671 33874702 35146690 36460453 37671155
3670 37671155 38984344 40355663 41713394 43301019 45221664 46971319 48685955 50649804
3662E0649804J924964J883817J855368K052157J837743J853383J478071J570608
3654F5105915J532915J452891J266742J158764J161431J068587J123143Q57672
3646G4728060P77254Q07467P06101L53570J54335k71904j12751m35874n81988
3637G6124270n97481n94139o07328o70146n44707m85710n88409m95972n25671
3628G1014707l76045l32376l26322k93241k79184j31821O1157L94328L58732N90960
3618G0680895R03801J103382J229164J492484J596804J875154K187442K580561
3610H3649687K925609L400918L338590L649564M151649M139476L923391M149121
3602A13328005M233496M161414L773431L574054L542562L273693L287895L264987
$$ plain form
3662 50649804 52574768 54458585 56313953 58366110 60203853 62057236 63535307 65105915
3654 65105915 66638830 68091721 69358463 70517227 71678658 72747245 73870388 74728060
3646 74728060 75505314 76312781 77018882 77372452 77526787 77254883 77142132 76706258 76124270
3637 76124270 75526789 74932650 74325322 73655176 73110469 72624759 72036350 71540378 71014707
3628 71014707 70638662 70306286 69979964 69686723 69407539 69275718 69336875 69731203 70089935 70680895
3618 70680895 71584696 72688078 73917242 75409726 77006530 78881684 81069126 83649687
3610 83649687 86575296 89976214 93314804 96964368 101116017 105255493 109178884 113328005
3602 113328005 117561501 121722915 125496346 129070400 132612962 135886655 139174550 142439537
3594A42439537L156830L231066L008908K715404K431387J960102J538742Q76746
3586A61358722J64135n42266j206317j549555j830585k103524k315995k304504
3578A49670111k316951k248807k095848j952977k119884j992300k186584k133815
3570A32622945k103250j769926j645202j285563p92979m06156P9162M99762J165927
3561A26364720J502924J848233J978829K440940K564377K854482K793905K689416
3553A45037826K502184K305715K312752K335004K471004K286831K398560K347872
3545A63997748J913832K038755J705099J078610O87341p4005n06861p93958j503908
3536A68542653j727182j955129k562328l072704l157373l299912l277014l204296
$$ plain form
3594 142439537 145596367 148827433 151836341 154551745 156983132 158943234 160481976 161358722
3586 161358722 161522857 160980591 159774274 158224719 156394134 154290610 151974615 149670111
3578 149670111 147353160 145104353 143008505 141055528 138935644 136943344 134756760 132622945
3570 132622945 130519695 128749769 127104567 125819004 125026025 124619869 124699031 125198793 126364720
3561 126364720 127867644 129715877 131694706 134135646 136700023 139554505 142348410 145037826
3553 145037826 147540010 149845725 152158477 154493481 156964485 159251316 161649876 163997748
3545 163997748 165911580 167950335 169655434 170734044 171421385 171347380 170840519 170046561 168542653
3536 168542653 166815471 164860342 162298014 159225310 156067937 152768025 149491011 146286715
3528A46286715k940867k713875k643193k497087k799221k823426l025516l172631
3520A23670899l109596k962382k714799k775324k414185j772667j021218o10144
3512A06290584m91025q091L11403O53435J001938J437305J642449J733516K177755
3503A14749269K418202K689687K748044L065834L267428L358844L385845L747967
3495A39431120L750466M112141M262734M624323M865882N588614O238031O681757
3487A79555068P466570Q392559R361060J0358031J2019360J3749651J5397932
3480B56300231J7017478J8076279J8434839J7790412J6067641J3286291R906614
3473C66879785O303239K197309j384554l777240m877398n150623m752640l593056
$$ plain form
3528 146286715 143345848 140631973 137988780 135491693 132692472 129869046 126843530 123670899
3520 123670899 120561303 117598921 114884122 112108798 109694613 107921946 106900728 106290584
3512 106290584 105799559 105791468 106102871 106756306 107758244 109195549 110837998 112571514 114749269
3503 114749269 117167471 119857158 122605202 125671036 128938464 132297308 135683153 139431120
3495 139431120 143181586 147293727 151556461 156180784 161046666 166635280 172873311 179555068
3487 179555068 187021638 195414197 204775257 215133288 227152648 240902299 256300231
3480 256300231 273317709 291393988 309828827 327619239 343686880 356973171 366879785
3473 366879785 373183024 375380333 373995779 370218539 365341141 360190518 355437878 351844822
3465C51844822k480346j715511j419127j908459l465276o084442r524218j3299678
3457C11947765j6652835j9478823k0996542k1562013k1135221j9681961j7741257
3450A74699113j5636241j3392483j1604229j0021118q706184p515537o851347
3443A00971974n867141n236158m751085m258486l673525l391751l005302k914294
3435F7874232k601385k455921k173726j955979k101412j843219j496639j532338
3427E1713613j574837j334902j448245j377834j243222j200138j164537q52229
3419D1517669q72573j081662j060945o71189p50886q32136o49284p23537m56361
3410C4419096p34424o96054o47426n99246n07898n03053m32044m75278l96559
$$ plain form
3465 351844822 349364476 347648965 346229838 344321379 340856103 334771661 325247443 311947765
3457 311947765 295294930 275816107 254819565 233257552 212122331 192440370 174699113
3450 174699113 159062872 145670389 134066160 124045042 115338858 107823321 100971974
3443 100971974 95104833 89868675 85117590 80859104 77185579 73793828 70788526 67874232
3435 67874232 65272847 62816926 60643200 58687221 56585809 54742590 53245951 51713613
3427 51713613 50138776 48803874 47355629 45977795 44734573 43534435 42369898 41517669
3419 41517669 40645096 39563434 38502489 37831300 37080414 36248278 35598994 34875457 34419096
3410 34419096 33684672 32988618 32341192 31741946 31234048 30730995 30298951 29823673 29427114
3401B9427114l06652o12101m20331l77453l67842l28644l67331k61183l05046
3392B6080531j76423k90302p653j86075l98642k13811q6259j71641j547k22536
3382B4325642k32503m4139j11980j22254P3978j27293l38798j31916r1960j23762
3372B3075015k9182p9257J09233p0967q1688J1702l2728n7939J1583o6274J40523
3361B2930021L7679O888J4772J0431j04521K4179L32438j3649M0406M8910O5871
3350B3393425J01046p5839l9074L5636R7959J11217P4547Q4462J11343J47917
3340B4042639K7007K04027J11413Q7737J89267J94954J98797K39762J89350L23219
3330B5808172J44215M3497K49524K15175K30615K78635L41078L48604J69973K20166
$$ plain form
3401 29427114 29120462 28508361 28088030 27710577 27342735 27014091 26646760 26385577 26080531
3392 26080531 25904108 25613806 25606153 25420078 25021436 24807625 24721366 24549725 24548178 24325642
3382 24325642 24093139 24049000 23937020 23814766 23888744 23761451 23422653 23290737 23198777 23075015
3372 23075015 23045833 22966576 23075809 23004842 22923154 22934856 22902128 22844189 22855772 22789498 22930021
3361 22930021 22967700 22974588 22989360 22999791 22895270 22919449 23251887 23238238 23278644 23327554 23393425
3350 23393425 23494471 23418632 23379558 23415194 23513153 23624370 23698917 23783379 23894722 24042639
3340 24042639 24069646 24273673 24385086 24472823 24662090 24857044 25055841 25295603 25484953 25808172
3330 25808172 25952387 25995884 26245408 26460583 26691198 26969833 27310911 27659515 27829488 28049654
3320B8049654L14535L05718M79679M06330M56918L32723L23598M11904N95606
3311C1676665L98860L41218N36764M35101N01607M90960M45225M49517M69442
3302C5745359O11182O78522M93636O26318N65628N39968M23324M75564N98572
3293D0758073M34953O35063P84957N83426O33993P32332Q46500P33158P93832
3284D6936287Q01874Q23732Q04082R11122P08357Q34243J090250R87038R28725
3275E4825710P21824Q48762R38841R92621J075313R63546J210482J359999J169728
3266F4106826J412317J365298J521353J504426J376000J638772J704620J657452
3258G6287064K032026K086722J956639K112392K302416K168211K410034K614923
$$ plain form
3320 28049654 28364189 28669907 29149586 29555916 30012834 30345557 30669155 31081059 31676665
3311 31676665 32075525 32416743 32953507 33388608 33890215 34381175 34826400 35275917 35745359
3302 35745359 36356541 37035063 37528699 38155017 38720645 39260613 39683937 40159501 40758073
3293 40758073 41193026 41828089 42613046 43196472 43830465 44562797 45409297 46142455 46936287
3284 46936287 47738161 48561893 49365975 50277097 50985454 51819697 52909947 53896985 54825710
3275 54825710 55547534 56396296 57335137 58327758 59403071 60366617 61577099 62937098 64106826
3266 64106826 65519143 66884441 68405794 69910220 71286220 72924992 74629612 76287064
3258 76287064 78319090 80405812 82362451 84474843 86777259 88945470 91355504 93970427
3250I3970427K881345L155587L374649L773459M126716M307372M708418N299878
3242A25597851N923928O632353P270838Q111576Q828269R516496J0331630J0912514
3234A93125455J1412709J1938919J2092919J1673991J0363632Q398760N152963
3227B64159348J137190l427871p878024j1050825j2938374j3245458j2538771
3220B04217215j1246688j0120805q851561p773478o912080o091099n634912n094440
3212A42492152m667274m135655l812651l297692l054619k969759k490536k282792
3204A15781174k224599j988080j816264j555543j671917j486637j436208j742916
3196A01859010j631547j631947j680262j624413j635466j851401j925182j822449
$$ plain form
3250 93970427 96851772 100007359 103382008 107155467 111282183 115589555 120297973 125597851
3242 125597851 131521779 138154132 145424970 153536546 162364815 171881311 182212941 193125455
3234 193125455 204538164 216477083 228570002 240243993 250607625 259006385 264159348
3227 264159348 265296538 261868667 253990643 242939818 230001444 216755986 204217215
3220 204217215 192970527 182849722 173998161 166224683 159312603 153221504 147586592 142492152
3212 142492152 137824878 133689223 129876572 126578880 123524261 120554502 118063966 115781174
3204 115781174 113556575 111568495 109752231 108196688 106524771 105038134 103601926 101859010
3196 101859010 100227463 98595516 96915254 95290841 93655375 91803974 89878792 88056343
3188H8056343j705902j792978j928422j896865k068902k011471j873746j728774
3180G3049283j695823j711798j561600j460684j525126j387891j306205j269812
3172F1130344j191582j034841j120689j085998j006507j097705r27774j144972
3164E2520276j202046r50859p95856r86931p78782r09104q07251p00874p69944
3155D4618629q09260n38321n43392p21245n36266n09477o79592o20802m39463
3146C9220811m58841p03509m31280l57490m52521m62007m93957m39296m20775
3137C5001135n63022m61981j71673k85239l10953m83211k44401l47571m16095
3128C1716989k54004l58596l64268l28669l66014l57269l68704k98914k68989
$$ plain form
3188 88056343 86350441 84557463 82629041 80732176 78663274 76651803 74778057 73049283
3180 73049283 71353460 69641662 68080062 66619378 65094252 63706361 62400156 61130344
3172 61130344 59938762 58903921 57783232 56697234 55690727 54593022 53665248 52520276
3164 52520276 51318230 50367371 49571515 48584584 47805802 46896698 46089447 45388573 44618629
3155 44618629 43809369 43271048 42727656 42006411 41470145 40960668 40281076 39660274 39220811
3146 39220811 38761970 38058461 37627181 37269691 36817170 36355163 35861206 35421910 35001135
3137 35001135 34438113 33976132 33804459 33519220 33208267 32725056 32480655 32133084 31716989
3128 31716989 31462985 31104389 30740121 30411452 30045438 29688169 29319465 29020551 28751562
3119B8751562k59850k32875l02129l46049j97201k74609j46618k08382k39048
3110B6544801k00489j78036k52361k86676k10461j53306k69855j00918l92205
3101B4500494j41651L732k60584k90935m8889n8003k10365j81558j11842N7005
3091B3257404j07654j75338k69813l03005L9543J9666j14467j67239k55207J404
3081B1925294p8889j04323R1431k60684j60553k0393O1562M1422j60867p0859
3071B1263141P6519L2776j81561J07939m6525j55785m6587O1167k53450j47048
3061B0710586m021l486k43241N4789k05210j53507j0090k16658k30686j78496
3051A9519980l20632p0090j05431j91869j85395j72884r2869j62701L126j91117
$$ plain form
3119 28751562 28491712 28258837 27956708 27610659 27413458 27138849 26992231 26783849 26544801
3110 26544801 26344312 26166276 25913915 25627239 25416778 25263472 24993617 24892699 24500494
3101 24500494 24358843 24362575 24101991 23811056 23762167 23704164 23493799 23312241 23200399 23257404
3091 23257404 23149750 22974412 22704599 22401594 22441137 22460803 22346336 22179097 21923890 21925294
3081 21925294 21846405 21742082 21833513 21572829 21412276 21391883 21453445 21494867 21334000 21263141
3071 21263141 21339660 21372436 21190875 21298814 21252289 21096504 21049917 21111084 20857634 20710586
3061 20710586 20706565 20703079 20459838 20514627 20309417 20155910 20145820 19929162 19698476 19519980
3051 19519980 19199348 19129258 19023827 18831958 18646563 18473679 18380810 18218109 18221235 18030118
3041A8030118j85876Q0599m5664k16071j36671k47817p1562L0187r0589j46700
3031A6999954l5506j53040N0441n5073l09369k24282j49585M0732k32697j91885
3021A5739690j20854k25420j92423k83121O5021j20961k39369J12225j23246j15487
3011A4496055j6692L4767j48128j24860j5692j04651r578l716J73915j0039k79699
3000A3991682J67763O5405J12049M382R2094p1344M438J70430r3952J66634K8046
2989A4637627K3566Q1190O4745P8667J48046R5101K16430K49581J33813j28565
2979A5600201M1405M4786J78788l4342P5506K41463J9906k53658k7421J92733
2969A6079367k3048J02630L36122J65303J49072J59183K90941K56613J36351J70932
$$ plain form
3041 18030118 17844242 17924841 17879177 17663106 17526435 17278618 17207056 17237243 17146654 16999954
3031 16999954 16964448 16811408 16861849 16806776 16497407 16273125 16123540 16164272 15931575 15739690
3021 15739690 15618836 15393416 15200993 14917872 14982893 14861932 14622563 14734788 14611542 14496055
3011 14496055 14479363 14514130 14366002 14241142 14225450 14120799 14111221 14107505 14281420 14271381 13991682
3000 13991682 14159445 14224850 14336899 14341281 14433375 14362031 14366469 14536899 14442947 14609581 14637627
2989 14637627 14661193 14742383 14807128 14885795 15033841 15128942 15345372 15594953 15728766 15600201
2979 15600201 15641606 15686392 15865180 15830838 15906344 16147807 16167713 15914055 15886634 16079367
2969 16079367 16056319 16158949 16495071 16660374 16809446 16968629 17259570 17516183 17652534 17823466
2959A7823466J79896J98948J67690K46555K99548K77201M26688L12102M86442
2950B0418536N11818N16967L01256J65514L11643K23120K15894J3157J73653J01395
2940B2952953J87565K81050J48800L86658L78019K25437K98315K97652M71115
2931B5627564M91372O07011O85452P08300P60907Q28849R96591R61566J111840
2922C2779452R98488J188330J073309R44149J173225J099194R38149Q81717O54738
2913D1730751O50930M83483M53674M04895L01977K94495L18827L90379M40544
2904D5469955O93570O06507Q02167R01221J182139J490879J673305J753996J946654
2895E6520393K189354K540746K764453K951904K930772L152009K831379K299955
$$ plain form
2959 17823466 18003362 18202310 18370000 18616555 18916103 19193304 19619992 19932094 20418536
2950 20418536 20930354 21447321 21748577 21914091 22225734 22448854 22664748 22677905 22851558 22952953
2940 22952953 23140518 23421568 23570368 23957026 24335045 24560482 24858797 25156449 25627564
2931 25627564 26118936 26725947 27411399 28119699 28880606 29709455 30706046 31667612 32779452
2922 32779452 33777940 34966270 36039579 36983728 38156953 39256147 40194296 41076013 41730751
2913 41730751 42381681 42865164 43318838 43723733 44025710 44320205 44639032 45029411 45469955
2904 45469955 46163525 46770032 47572199 48473420 49655559 51146438 52819743 54573739 56520393
2895 56520393 58709747 61250493 64014946 66966850 69897622 73049631 75881010 78180965
2887G8180965J376708J43246j031373k039235k581342k809157k594382k158048
2879F6487382j897439j446679p47156k35066j0664M87116Q37788J118605J358942
2870F5952829J531642J818720K179633K197908K285212K077637K349394K244211
2862H2637186J864420J627371R68698Q5337o33930j411753k013480k455009l014958
2853G7653882l400267l455323l218760k644186k051905j789784j211210r69811
2845E8912636o52811m31232O1121K0362M76338M41206N56098M76066J31338j1343
2835E9979779l55492o44402j109006j276066j603359k095468k381338k475960
2827D8038688k561985k441076j975531j957697j868508j549767j384918j283599
$$ plain form
2887 78180965 79557673 79700919 78669546 76630311 74048969 71239812 68645430 66487382
2879 66487382 64589943 63143264 62396108 62161042 62150378 62637494 63475282 64593887 65952829
2870 65952829 67484471 69303191 71482824 73680732 75965944 78043581 80392975 82637186
2862 82637186 84501606 86128977 87097675 87183012 86549082 85137329 83123849 80668840 77653882
2853 77653882 74253615 70798292 67579532 64935346 62883441 61093657 59882447 58912636
2845 58912636 58259825 57828593 57889714 57910076 58386414 58827620 59383718 59859784 59991122 59979779
2835 59979779 59624287 58979885 57870879 56594813 54991454 52895986 50514648 48038688
2827 48038688 45476703 43035627 41060096 39102399 37233891 35684124 34299206 33015607
2819C3015607j341694j088411r63544r40264q49291p30397p70181n45045n63436
2810B5223344n02724m39813n29761m11418n09641n13371q63331p79455n53707
2801B0120123o64596o60257p11240n88762l70504m86438m33768l53585m66192
2792A5384781l54542m20142m38717l94180j92616l17142k50930k43724l92020
2783A2380768m01190j44820j33612k80571r5287j50941k05616r2518J3338j64530
2773A0725021k16747k76280M690l5686l42712k39434l5022k93746j37190j96275
2763H956619k39951k38646k32874j7638l72033j83557N8386j43661k84668j16471
2753G185506q3874j46692k40247j3442M251l1763j22499k36592K5640q0750q6584
$$ plain form
2819 33015607 31673913 30585502 29621958 28681694 27832403 27102006 26331825 25786780 25223344
2810 25223344 24720620 24280807 23751046 23339628 22829987 22316616 21453285 20673830 20120123
2801 20120123 19455527 18795270 18084030 17495268 17124764 16638326 16204558 15850973 15384781
2792 15384781 15030239 14610097 14171380 13777200 13584584 13267442 13016512 12772788 12380768
2783 12380768 11979578 11834758 11701146 11420575 11325288 11174347 10968731 10876213 10889551 10725021
2773 10725021 10508274 10231994 10236684 10200998 9858286 9618852 9583830 9290084 9152894 8956619
2763 8956619 8716668 8478022 8245148 8227510 7855477 7671920 7730306 7586645 7301977 7185506
2753 7185506 7101632 6954940 6714693 6701251 6705502 6673739 6551240 6314648 6340288 6259538 6172954
2742F172954l9104l5677l3683j94169k36554o8436k00649K9413p6442k01967j20441
2731D995245j3081j39321n068j55631k09802j96257p8940Q2949l5386m7206k12492
2720C985010o1044j55682P2526J70308j66803j41661K1241j27879m8802m9192
2710C498022M5957n2280l8778n5248j2881k63643j92050K0912K49665l947j38348
2699C057381k9628K5831j77210j54314N3597n4356P8457j95571O6740N2351k5925
2688B697353N2619p0481m3568r4925J33140J9702q8362M0112k7968p5115j71886
2677B370621l3203N6571L0709q884N1583J6445O1266k07760r6103K4818r7578
2666B168485o4746J64297L3265p8937M6887K05055k1421j24687j48971J4796j01846
$$ plain form
2742 6172954 6133850 6098173 6064490 5870321 5633767 5565331 5364682 5394095 5317653 5115686 4995245
2731 4995245 4982164 4842843 4837775 4682144 4472342 4276085 4197145 4280094 4244708 4197502 3985010
2720 3985010 3923966 3768284 3840810 4011118 3844315 3702654 3723895 3596016 3547214 3498022
2710 3498022 3543979 3491699 3452921 3397673 3384792 3121149 2929099 2950011 3199676 3195729 3057381
2699 3057381 3027753 3053584 2876374 2722060 2775657 2721301 2799758 2604187 2670927 2723278 2697353
2688 2697353 2749972 2679491 2635923 2540998 2674138 2693840 2605478 2645590 2617622 2542507 2370621
2677 2370621 2337418 2393989 2424698 2415814 2467397 2483842 2545108 2337348 2241245 2266063 2168485
2666 2168485 2103739 2268036 2301301 2222364 2269251 2474306 2452885 2328198 2179227 2194023 2092177
2655B092177L5698J73323l8750j25325j45125P7114q8106p2378k6396R2545J09422
2644B084199J48563q5941O3546O9942k08349J5275J44128l8163L3799j920M3964
2633B269043j47900J38457n3328M4893M3306j10754n7308J74265K1305K4394J17702
2622B464075J3123j79496j91658l5467N8540k2232J20725K9142j64989J03109
2612B194872M6159J65085j25709m266P1763K64904Q0714N8477k1739j26686k76622
2601B326952K7124J06576J70338M582P375l4397P273K1323k02905j5437k9167
2590B389637O3557j1570p9829J3379N425r7493P9698K05620o5462r233J29600
2579B623329j363R233j23980k7499l554N7382J28186O5999Q1505J0735m3459n9664
$$ plain form
2655 2092177 2127875 2301198 2262448 2137123 1991998 2069112 1981006 1908628 1882232 1974777 2084199
2644 2084199 2232762 2146821 2210367 2280309 2071960 2087235 2231363 2193200 2226999 2225079 2269043
2633 2269043 2121143 2259600 2206272 2251165 2294471 2183717 2126409 2300674 2321979 2346373 2464075
2622 2464075 2477198 2297702 2106044 2070577 2129117 2106885 2227610 2256752 2091763 2194872
2612 2194872 2241031 2406116 2280407 2276141 2347904 2612808 2693522 2751999 2730260 2603574 2326952
2601 2326952 2354076 2460652 2630990 2635572 2642947 2608550 2615823 2637146 2434241 2418804 2389637
2590 2389637 2453194 2441624 2361795 2375174 2380599 2283106 2362804 2568424 2502962 2493729 2623329
2579 2623329 2621966 2631199 2507219 2479720 2476166 2533548 2661734 2727733 2809238 2819973 2776514 2716850
2567B716850n6177R269j65080l4423O1288l7314l5822q4295j18753O7204k768
2556B319979j69743J0445J74993k6393M556j43223l2836N9071j70234K2674o7652
2545A981637Q8642R5627j05629k3192o1547p4989P2376P6640K2194n5550M1439
2534B057648N6250J997j71844q6832Q3970o1217p3721j56288K9384n2374k5024
2523A601949R832l0222k7489j51536j95247j02696O4025J41377Q6896k25420J41459
2512A312928J40566r6942q3254j02810n2518o7302p3178J41059n0921r4775K2165
2501I95018J54744J9210q8125K5597j541j43990N1256J01501k32333q2915o8142
2490G30280n8715K0954J09820k953N7208N4196j0908q2912j20580j34188j04312
$$ plain form
2567 2716850 2660673 2669942 2504862 2470439 2531727 2494413 2458591 2374296 2255543 2322747 2319979
2556 2319979 2150236 2160681 2335674 2309281 2313837 2170614 2137778 2196849 2026615 2049289 1981637
2545 1981637 2070279 2165906 2060277 2037085 1975538 1900549 1972925 2049565 2071759 2016209 2057648
2534 2057648 2113898 2115895 1944051 1857219 1941189 1879972 1806251 1649963 1679347 1626973 1601949
2523 1601949 1611781 1581559 1554070 1402534 1207287 1104591 1168616 1309993 1396889 1171469 1312928
2512 1312928 1453494 1356552 1273298 1170488 1117970 1050668 977490 1118549 1067628 972853 995018
2501 995018 1149762 1168972 1080847 1106444 1104903 960913 1012169 1113670 881337 798422 730280
2490 730280 671565 692519 802339 799386 856594 910790 899882 816970 696390 562202 457890
2479D57890K37750M2976J16686o6309j46525K91213j5692k66334r8752M3305p5950
2468E20258J53648Q2007k08795q4129M9955O1030m162R736L9646j08705j3316
2457D97173K23034k88104J8096m2215m46j01110o8053J85569l0127k9615j305
2446C62897R9804J50497m0500j32093N4951r2745j8877l9558J04044J0044j53968
2435C04496r8973O2801R2875l911k7679j06184k6403J70933q4656j05637n6363
2424A21299N7896j28661J15730J60303N9597q2790n729p4043J21929L7015j81392
2413B01154k6242J41177o6670k11492P3659r7521q986J23642J57304l4157n625
2402B46243j2081j1756L5647q920J0175k5285p2413K037K5306j44441K8794J70535
$$ plain form
2479 457890 695640 738616 855302 788993 642468 933681 917989 651655 552903 596208 520258
2468 520258 673906 755913 547118 462989 512944 573974 569812 579548 619194 510489 497173
2457 497173 720207 432103 450199 407984 407538 306428 238375 423944 393817 364202 362897
2446 362897 462701 613198 572698 440605 495556 402811 383934 344376 448420 458464 304496
2435 304496 205523 268324 361199 357288 329609 223425 197022 367955 283299 177662 121299
2424 121299 179195 50534 166264 326567 386164 303374 297645 223602 345531 382546 201154
2413 201154 174912 316089 249419 37927 111586 14065 5079 128721 286025 251868 246243
2402 246243 234162 222406 258053 249133 259308 234023 161610 163647 188953 44512 73306 243841
2390B43841P5235k6003j6181j61856m7653j1368J89993O7522p6736R370q6093
2379A60071k758k1849J8720L5641j5921j22282Q2491J51417L5029q2239j21512
2368A16808R2432N3265j10663o2428K1777L7355o7086J91464L5473O8975j04348
2357B73024J03568P4764j00206J3290n3949q8793j2793N4075k6648R4276m7191
2346B83417o0411J14078j02514j5302O5602n4834j10723K7136o6440J7519N9987
2335A57515K2081q6516q373J38851j42087L3780R9937m5390Q1116j01977J02434
2324B51371j94787r3701q013L0850N3149j9892J72870m5520m8273l7749L663N78
2312F4546J03372o9576j6145j24749J5594N3005Q0173o6052M5716P9897O6195
$$ plain form
2390 243841 319076 293073 276892 115036 67383 56015 246008 313530 236794 246164 160071
2379 160071 157313 135464 154184 189825 173904 51622 134113 285530 320559 238320 116808
2368 116808 209240 262505 151842 89414 111191 148546 81460 272924 308397 377372 273024
2357 273024 376592 451356 351150 364440 310491 221698 208905 262980 236332 330608 283417
2346 283417 223006 337084 234570 219268 284870 230036 119313 146449 80009 97528 157515
2335 157515 179596 93080 84707 223558 81471 115251 215188 169798 250914 148937 251371
2324 251371 56584 -37117 -45130 -14280 38869 18977 191847 146327 98054 60305 63968 64546
2312 64546 167918 98342 82197 -42552 -26958 26047 106220 40168 85884 165781 231976
2301B31976P5197j72189N1288J6156j5824Q0361j19212j60431l0579P1650K11644
2290B40037L0393j1759l5786m9755q1293l7159R3513j62259j7511J00378J39357
2279B08156j4609l4406k3737r8207J4622O9976P0431j6779k13601j08622J15014
2268c1762J31838j56212Q8591J1275j34741l0434N7315o806j20496J56559K32356
2257A97483j03305r6112K9360j73136N3807M7889R065P9509r384N9127n5452K1747
2245F0598L0132k3518M9998K0750m8365J798R3295J31340l4617j10977J65131
2234C35565k14428K6860J21875p2940l1208J52310j6429K9361k9111k5609j3770
2223B62476J1824M1319N6538j01836o7829N9405q1502K19072o4419j712M4574
$$ plain form
2301 231976 307173 134984 186272 202428 186604 266965 147753 -12678 -43257 28393 240037
2290 240037 270430 258671 222885 173130 91837 54678 148191 -14068 -31579 68799 208156
2279 208156 193547 159141 135404 37197 51819 121795 192226 175447 -38154 -146776 -31762
2268 -31762 100076 -56136 32455 43730 -91011 -121445 -64130 -70936 -191432 -34873 197483
2257 197483 94178 -1934 27426 -145710 -91903 -44014 -34949 44560 35176 94303 38851 60598
2245 60598 90730 67212 117210 137960 89595 91393 184688 316028 281411 170434 335565
2234 335565 121137 147997 269872 196932 165724 318034 301605 330966 301855 276246 262476
2223 262476 274300 315619 372157 270321 202492 261897 180395 399467 335048 333336 377910
2212C77910o0292N3912l351l8757M8821Q9695j02180J6669m5964L1634O1733o4425
2200C65405Q510J63541m9988k6347J26080j10013o9651N1997J98769q8958j04498
2189D64847J95743L1315n1985p2908O0729J16597l3915r8546j8992J1336J48095
2178G52316j0942j54453O1635j14888J22260J58628Q6841m2868M766J76893L0482
2167A070670m4862J62660p1243n8997p0532N0553q4112J1366N3320m2184J50488
2156A127127L5949k0583J47463J6381O6046J12663O9239J04411m5477j7791k7426
2145A568002l8968k4307J16853P4694J88476N6750o4356m5192L8609N8121N0587
2134A979269J8824K13448Q3214j35665K00336O5371J39952J20500J16911J84758
$$ plain form
2212 377910 317618 371530 368179 329422 378243 467938 365758 382427 336463 368097 429830 365405
2200 365405 373915 537456 487468 461121 587201 477188 407537 459534 658303 569345 464847
2189 464847 660590 691905 639920 567012 627741 744338 710423 611877 592885 604221 752316
2178 752316 741374 586921 648556 533668 655928 814556 901397 858529 863295 1040188 1070670
2167 1070670 1025808 1188468 1117225 1058228 987696 1038249 954137 965503 1018823 976639 1127127
2156 1127127 1163076 1142493 1289956 1306337 1372383 1485046 1554285 1658696 1613219 1595428 1568002
2145 1568002 1529034 1504727 1621580 1696274 1884750 1941500 1877144 1831952 1870561 1928682 1979269
2134 1979269 1998093 2211541 2294755 2159090 2359426 2424797 2564749 2685249 2802160 2986918
2124B986918Q6588K04138N0682P2415R9030L40005K65932k0869K01934L42525
2114D629298L13524L2361L66859L68694L00683M89222L62071L91689N71469N77140
2104H403010P60610P49758N95273N63144O40669Q43644J405825J708175J951482
2095A7621590K181013L072184M137487N761402Q042367J1259085J1498924Q399223
2087G1973275Q20028j2291285j4056909r817931p003882m845993l756728k969954
2079A8050621k296958j828734j379403q92973m12320n58517n86813n24342j005240
2070H565321p30775p00787m81074l44165l17840m72644l43298l07124k05462j10568
2060D551584l66227j18539q2600l13283p2354q0780k64102k37561j51110k90625
$$ plain form
2124 2986918 3073506 3277644 3328326 3400741 3499771 3839776 4105708 4084839 4286773 4629298
2114 4629298 4942822 4975183 5342042 5710736 6011419 6500641 6862712 7254401 7825870 8403010
2104 8403010 9163620 9913378 10508651 11071795 11712464 12556108 13961933 15670108 17621590
2095 17621590 19802603 22874787 27012274 32773676 40816043 52075128 63574052 71973275
2087 71973275 72793303 60502018 46445109 36627178 29623296 24777303 21020575 18050621
2079 18050621 15753663 13924929 12545526 11652553 11240233 10681716 10094903 9570561 8565321
2070 8565321 7834546 7133759 6652685 6308520 5990680 5518036 5174738 4867614 4662152 4551584
2060 4551584 4185357 4066818 3984218 3670935 3598581 3517801 3253699 3016138 2865028 2574403
2050B574403j13157q6086o4760j45902r8170M0109n5085j07508N3797N0015j17383
2039A930273q3549j81546K894J67938j10109L1403p5139j92729Q7773r1503J6723
2028A502429q7915l9242j03855r7728K86q8737Q7594N1115k755n9910k73064n2375
2016H35843J96200j75728Q8292m5759n0547j4484P77o7695K1022j24702P2978
2005G36197R4086k70100j13501J46580Q111j06385k0089M1366J0125n6809l8991
1994D30590j02573P7784J59191j19614k1375O7525k6150m8909K9443K7894m4182
1983D29624j43318o9664P4922r1628r3765n6452R3644J28613Q6372l6498q2621
1972B39229o9689j547j448P2988R2423q1135j6923K7858j34560L7272j0773n9824
$$ plain form
2050 2574403 2461246 2375160 2310400 2164498 2066328 2106437 2051352 1943844 1997641 2047656 1930273
2039 1930273 1846724 1665178 1668072 1836010 1725901 1757304 1682165 1489436 1577209 1485706 1502429
2028 1502429 1414514 1375272 1271417 1173689 1173975 1085238 1172832 1223947 1221192 1161282 888218 835843
2016 835843 1032043 856315 944607 898848 848301 833817 834594 766899 787921 663219 736197
2005 736197 830283 560183 446682 593262 601373 494988 474899 516265 526390 469581 430590
1994 430590 328017 405801 564992 445378 424003 491528 465378 416469 445912 473806 429624
1983 429624 286306 216642 291564 199936 106171 49719 143363 271976 358348 321850 239229
1972 239229 169540 167993 166545 239533 331956 250821 233898 261756 127196 164468 153695 93871
1960I3871N9390l6608L9281j57253R6352M4045n7153O1048j10299L6964q9449
1949a9811k4046K04997M4409q6966l8681M906P7330o3901m3727O6433o4372N7636
1937A14207P9409N4379p8748p7514R9882k0923n5929p021Q8900j8278r2024k5737
1925F0603M7377l7713n1576N2796n4000l8142J09364j49723n105J5079L4795o5598
1913h1843K7741R6257O9682m5442r0661R2085M4010q3209m816j4121O6119L8335
1901A14137o5424o6466j28107K36148K8490P5063j26404o1662R7645k949Q3626
1890A84097j22195O1555q0720o4506m4086O0478Q1768j06256R4462k1527j766
1879D1304O7424j98572m7332O9971K7438J09979L6838j44426N958P5037k7479
$$ plain form
1960 93871 153261 116653 155934 -1319 95033 139078 81925 142973 32674 69638 -19811
1949 -19811 -43857 161140 205549 118583 79902 84808 162138 98237 54510 120943 56571 114207
1937 114207 193616 247995 169247 91733 191615 170692 114763 107742 196642 178364 86340 60603
1925 60603 107980 70267 18691 71487 17487 -20655 88709 -61014 -66119 -51040 -16245 -81843
1913 -81843 -54102 42155 111837 66395 -24266 67819 111829 28620 23804 9683 75802 114137
1901 114137 48713 -17753 -145860 90288 118778 193841 67437 5775 103420 100471 184097
1890 184097 61902 123457 42737 -21769 -65855 -5377 76391 -29865 64597 43070 41304
1879 41304 108728 -89844 -137176 -67205 -39767 70212 107050 -37376 -31418 43619 16140
1868A6140l3666J1777O5020j99398P6018K06212n2319p0438K7075q1418Q9424
1857E4427O8549r953j31653K6647K9760K1943J2232J34410k3151k06486K5875
1846B600k8246K1302r4325J27978M6193j08078q3805M2868L273Q1044j37563J38760
1834A2001O7732p5571P03L7023L2378m0285j16895J56953J40700l765m6483j69822
1822e331M5495K244J92763M7468L5364m5327j4378N6655l49215o8647J39258M6472
1810H2821n9750J09286Q3466l3074n0711j33870k9022q5573m3945N1522M8517
1799f0333R91P6383p7178l1970p885J09526J48524k1243j76778P052J14529n2201
1787B9417l0885K2691j17730j4312R6985R5820k3266n8653J93303j95057J0287
$$ plain form
1868 16140 -17526 -5749 59271 -140127 -64109 142103 89784 19346 46421 -34997 54427
1857 54427 122976 113023 -18630 8017 37777 59720 71952 206362 183211 -23275 2600
1846 2600 -25646 -4344 -98669 29309 75502 -32576 -116381 -73513 -70240 10804 -126759 12001
1834 12001 79733 4162 4865 41888 74266 33981 -82914 74039 214739 210974 164491 -5331
1822 -5331 40164 42408 235171 282639 318003 272676 258298 314953 -34262 -102909 36349 82821
1810 82821 23071 132357 215823 182749 132038 -1832 -30854 -116427 -160372 -108850 -60333
1799 -60333 -59342 17041 -60137 -92107 -99992 9534 158058 136815 -39963 -32911 81618 29417
1787 29417 -1468 21223 -96507 -110819 -13834 81986 58720 67 193370 -1687 8600
1776H600J12585k51295J81748k23061M1636L7709R9838n8960n7550R2826j44921
1765a60845P85J75479j53736Q5199m9036p5063J20353J74529Q5636j77675J40216
1754A65842r9738n7182N7855Q50m5753q1037O4880p6810l8463K6121l9429j3675
1742a36539q5311N6540M2568J1678o4927O3822P6654j495r2244l9765l445j770
1730a74234J1536P6071M8296n2051q6104Q5976q9674r3263J16086Q0916m9000
1719a25445j3771o3393J14864L4311r0406N2114Q3958j33078R292M3198q7596
1708a75952p2778L030J6719Q7777L3244K3631l2837Q2525r6949P2047L4798r4433
1696a19178q2410J69709J01981k40708J07573L494k1561j06951m6708P5731J09891
$$ plain form
1776 8600 121185 -130110 51638 -171423 -129787 -92078 7760 -51200 -108750 -15924 -160845
1765 -160845 -160060 15419 -138317 -53118 -102154 -177217 -56864 117665 203301 25626 165842
1754 165842 66104 8922 66777 67627 21874 -59163 5717 -71093 -109556 -83435 -122864 -136539
1742 -136539 -221850 -165310 -122742 -111064 -175991 -112169 -35515 -37010 -129254 -169019 -172464 -174234
1730 -174234 -162698 -86627 -38331 -90382 -176486 -90510 -180184 -273447 -157361 -76445 -125445
1719 -125445 -139216 -202609 -87745 -53434 -143840 -91726 -7768 -140846 -131554 -88356 -175952
1708 -175952 -248730 -245700 -228981 -141204 -107960 -84329 -117166 -34641 -131590 -59543 -24745 -119178
1696 -119178 -201588 -31879 70102 -170606 -63033 -59539 -81100 -188051 -234759 -159028 -49137
1685d9137j7379k7172j09647r7086J25844L7761o6380K78591O7082j65849O5314
1674D1942j5467q6307j03159m357M8230l6728K9915J47936q6304j59900J65254
1663e8945k6232J2354K05765j17872l4629R6859q1622J8425n75j62606J25165
1652b3913K0223p6811M5175L4012L6167R7953m0086q8319j47300R895P4967K2869
1640c5168J29867j19660j10509Q9704R5055P899J05097K6353R4645k14081m8573
1629B0629K6552l2485M2652r3234q6098Q519n7820q506K0489q9290J59918N2098
1617c6576j5860L3845k20r3657j42481P8202O3766k4157n8398j3852J28280Q8620
1605G512L2936k2491J34360P4576R884K9344j55339j72644j24072l9168m4536
$$ plain form
1685 -49137 -66516 -93688 -203335 -300421 -174577 -136816 -203196 75395 142477 -23372 41942
1674 41942 26475 -59832 -162991 -167348 -119118 -155846 -125931 22005 -64299 -224199 -58945
1663 -58945 -85177 -72823 132942 15070 -19559 77300 -4322 14103 13528 -149078 -23913
1652 -23913 -3690 -80501 -35326 -1314 34853 132806 92720 4401 -142899 -133004 -58037 -35168
1640 -35168 94699 -24961 -135470 -45766 49289 57188 162285 188638 283283 69202 20629
1629 20629 47181 14696 57348 -35886 -121984 -113465 -171285 -179791 -159302 -248592 -88674 -36576
1617 -36576 -52436 -18591 -18811 -112468 -254949 -176747 -112981 -137138 -195536 -209388 -81108 7512
1605 7512 40448 17957 152317 226893 236777 266121 110782 -61862 -185934 -225102 -269638
1594b69638j3672K4990J16138Q4187P5582k24000j4020J7492q3600R4211J2785
1583a79545k9468M8183k8410J33818K0453o7224L3561q217k3398o3966l5080J2003
1571a87290R0444k7317l1399j26877J98038K00878o5813j764j3668j01249k19687
1560b85704K7603R0764M4563r3948J72242K9578p4867J34850j49599M6470J5609
1549d2439j22164P3064M0123l8069r635o322m6238p157P7126J58179k78p7554
1537a364J52075o9158j72403p1960k4583Q1965J25547j01715O4439J9322p0388
1526f8223k2728l1499O8878o2332Q7396P2858j66340J82715l1616j42799P319
1515a06371M9682n2233M8273k4612J20313L2279q4618k9439L9330J03466n7386
$$ plain form
1594 -269638 -283310 -258320 -142182 -57995 17587 -206413 -220433 -202941 -286541 -192330 -179545
1583 -179545 -209013 -160830 -189240 -55422 -34969 -102193 -68632 -76849 -100247 -164213 -199293 -187290
1571 -187290 -96846 -124163 -155562 -282439 -84401 116477 50664 48900 35232 -66017 -285704
1560 -285704 -258101 -167337 -122774 -216722 -44480 -14902 -89769 45081 -104518 -58048 -42439
1549 -42439 -164603 -91539 -51416 -89485 -99120 -105442 -151680 -158837 -81711 76468 76190 -1364
1537 -1364 150711 81553 -90850 -162810 -187393 -105428 20119 -81596 -17157 2165 -68223
1526 -68223 -90951 -122450 -53572 -115904 -28508 44350 -121990 60725 29109 -113690 -106371
1515 -106371 -56689 -108922 -60649 -85261 35052 67331 -17287 -46726 -7396 96070 38684
1504C8684r3818o9631J5493N4273N9496k8234K2104n9322K55583m7412j11038
1493C6178l7736n5151r0448J46207L9760j23350m8076m9810J99434R7469o1501
1482E2976j44947j39952q0303K5281L00138J07675j25683N5385q0161j49027k0476
1471a99094J48235j15981J17707k5846L4600l1811m3194O0329O919J7230J78268
1460A47362j49480k4192P5324j70741j7369N1706J54887P9930j26884j28956K679
1449a05734K1078M7896k0903j01231m1771l1988J1832K9127P4777J77615O1520
1438A22218Q790K6891r3258j05737M4185j29953N3918J18243J10398J8072k25349
1427e1582q7376N7088n0152Q4387J38484k2880j40004l4085O3754o1879r62K2620
$$ plain form
1504 38684 -55134 -124765 -109272 -54999 4497 -23737 -1633 -60955 194628 147216 36178
1493 36178 -1558 -56709 -147157 -950 38810 -84540 -132616 -182426 17008 114477 52976
1482 52976 -91971 -231923 -312226 -286945 13193 120868 -4815 50570 -29591 -178618 -199094
1471 -199094 -50859 -166840 -49133 -74979 -40379 -72190 -115384 -55055 -48136 -30906 147362
1460 147362 -2118 -26310 49014 -121727 -139096 -87390 67497 147427 20543 -108413 -105734
1449 -105734 -84656 -36760 -57663 -158894 -200665 -232653 -220821 -191694 -116917 60698 122218
1438 122218 131008 157899 64641 -41096 3089 -126864 -72946 45297 155695 173767 -51582
1427 -51582 -138958 -81870 -132022 -47635 90849 67969 -72035 -106120 -42366 -104245 -105207 -82587
1415h2587o6414K1773L033j4463J472J09862r487O2234q9584k0413m545K3795
1403f5324M0148P9152j02105J13680j20623j41206J11356J49805M9736j41632
1393b7013n1005J06804O3046l2637J3627q8345j03320J28651j10619J78591Q5434
1382A63214k26734r964K2207o4149L5037q1669J83226Q9781j32643P4110L6696
1371H9112J60522j17238j61608k6574l802N403J6571o234Q1704p350j20279J42885
1359E3112M8477j06433j78909J17364M8103N5678N8321m78Q9264j33483L4590
1348H5606k25647J18606r104j1383n7205J68198k58056J01054N3495N444m5249
1337g4241j33351P5678p0876J59986m1956J2565k7680j19849n8940N4579l893
$$ plain form
1415 -82587 -149001 -127228 -124195 -138658 -137186 -27324 -36811 25423 -64161 -84574 -89119 -65324
1403 -65324 -25176 53976 -48129 65551 -55072 -196278 -84922 64883 114619 -27013
1393 -27013 -78018 28786 91832 59195 72822 -15523 -118843 9808 -100811 77780 163214
1382 163214 -63520 -73484 -51277 -115426 -80389 -162058 21168 110949 -21694 52416 89112
1371 89112 249634 132396 -29212 -55786 -59588 -54185 -37614 -43848 37856 30506 -89773 53112
1359 53112 101589 -4844 -183753 -66389 -18286 37392 95713 95235 184499 51016 85606
1348 85606 -140041 -21435 -30539 -41922 -99127 69071 -188985 -87931 -34436 -28992 -74241
1337 -74241 -207592 -131914 -202790 -42804 -84760 -72195 -99875 -219724 -278664 -224085 -227978
1326b27978O4336J21616l4671Q7923N9710Q8196l8622j04484o4560K0804j9799
1315d7529q4562M3652Q9008P9024l7907j08293k8699Q8950L281m0570P0841P9453
1303A06649o7596j03526J35798N2190j42583o1458m3208R3917J06431n5272M4583
1292F5925o3430M4309m0960k0424k9122m2122J50485N6236j34189q4140m0022
1281a37454j07820J1218N4330L3990J93621j0554J4171M4374j39234j21486J54235
1270a0609J54652j92904R9401r209j8692M6255k97O7985j04321J08961n2379k953
1258H5890j47105N1035j3937o2710Q3537k29118K2903J47806M8039Q1024k3946
1247D3418j39716l724P7948M6527m7688O8064K4160J8790j31415L6685l5955J42434
$$ plain form
1326 -227978 -163642 -42026 -76697 11226 70936 159132 120510 16026 -48534 -27730 -47529
1315 -47529 -132091 -88439 569 79593 41686 -66607 -95306 -6356 -3075 -43645 27196 106649
1303 106649 39053 -64473 71325 123515 -19068 -80526 -123734 -29817 76614 21342 65925
1292 65925 2495 46804 5844 -14580 -43702 -85824 64661 120897 -13292 -97432 -137454
1281 -137454 -245274 -234056 -179726 -145736 47885 37331 51502 95876 -43358 -164844 -10609
1270 -10609 144043 -48861 50540 41331 22639 68894 68597 136582 32261 141222 88843 85890
1258 85890 -61215 -10180 -24117 -86827 -3290 -232408 -209505 -61699 -13660 67364 43418
1247 43418 -96298 -100022 -22074 24453 -23235 44829 68989 87779 -43636 -6951 -42906 99528
1235I9528j82875O7684j53481j4669r9517Q6708O6389j6995L3844J63544o4273
1224a4113j74956J43975j8408J07905O6391j85825j5804j9589J37m2119M3194
1213a09212q4M212J28509r668m7514L9014N4311j03189P8336l3221m8920Q4590
1201C7164M7265n8265j8772n310k4916Q3091j97012J50853j3778K8045p160q1511
1189f0306o0268L2473J33975p6618Q2463M60j34361j9056P8726p3525q8113k313
1177a86463J25142P1027J27738j78201j67843K6756J85926j58666J33318q8973
1167a10239J39374l4658j05583J32558J25640j07803j887j1169l8910j6070L7458
1156H711J8085K4906Q111L357k0741O1819R0037j04930j66586l7319n0453j4266
$$ plain form
1235 99528 -83347 -15663 -169144 -183813 -283330 -196622 -130233 -147228 -113384 50160 -14113
1224 -14113 -189069 -45094 -63502 44403 110794 -75031 -90835 -110424 -110287 -152406 -109212
1213 -109212 -109296 -105084 23425 13757 -33757 5257 59568 -43621 34715 1494 -47426 37164
1201 37164 84429 26164 7392 2082 -22834 60257 -136755 14098 320 28365 21205 -60306
1189 -60306 -120574 -88101 45874 -30744 51719 52179 -82182 -101238 -22512 -96037 -184150 -186463
1177 -186463 -61321 9706 137444 -40757 -208600 -181844 4082 -154584 -21266 -110239
1167 -110239 29135 -5523 -111106 21452 147092 39289 37402 26233 -12677 -28747 8711
1156 8711 26796 51702 59813 63170 42429 104248 194285 89355 -77231 -114550 -165003 -179269
1144a79269M6632l0890J6734j6107N3232M5383l9766j6601N2459K52116q3436
1133A00487q7431j7204l8078j6534J12041k2842r1615Q1545j19074m317n5047
1122a58069N3853N3814J24960n0741l7599K248k38653j3145O3381J72950o7998
1111i4999P367P6300q771j24476n2381O4917R599Q4770Q19n5574r3330Q1610N3000
1098e1149R9042N4126O6848P2764j97082p3400P4362n4270R4910j9895J26955
1087A93211j47599r2095J19390p4102j47171q0711J03292N3033Q9490J0067k11076
1076a84271J12203L0716l9425J10045J4776p8533J39123j07997q3505M7535K5320
1065a4013j05444m506J16126M3136o5417k4618N428q1658L0646J57066j31884
$$ plain form
1144 -179269 -132637 -163527 -146793 -162900 -109668 -64285 -104051 -120652 -68193 183923 100487
1133 100487 13056 -4148 -42226 -58760 53281 30439 -61176 20369 -98705 -103022 -158069
1122 -158069 -104216 -50402 74558 23817 -13782 -11534 -250187 -263332 -199951 -27001 -94999
1111 -94999 -87632 -11332 -20103 -144579 -196960 -132043 -122444 -37674 -36855 -92429 -185759 -104149 -51149
1098 -51149 47893 102019 168867 241631 44549 -28851 45511 -8759 86151 66256 193211
1087 193211 45612 -46483 72907 -1195 -148366 -229077 -125785 -72752 16738 26805 -184271
1076 -184271 -72068 -41352 -80777 29268 44044 -34489 104634 -3363 -86868 -39333 -14013
1065 -14013 -119457 -123963 -7837 35299 -30118 -54736 -49308 -130966 -100320 56746 -75138
1054g5138K7947r0748r34J25956J90728o4950j5936j43531m3734L0001L0439M0918
1042A1018J38954J10244k08755M0111J4116K0918Q7664J4863o4866k03952r2374
1031a32059Q0490J7190J17428p1981P5589k47908k2842m0837P9609M6865J55323
1020E6867J1106n2384j21233o3611J57805M6665j3013k2853O6467L7794j13513
1009i903J1693L2632N7956j73549o646Q064R3437M6309l07415J22829L41577o0591
997A56393j29256j53976J4893J2973J46568M8989j19807M7262L0044r2439r8093
986a36449J03914M1208k6042J14204J25947j32898O0733p1634k8864K1083L55
975G1557R510O3482j64198Q301p5938k2841L7722O0206m3109Q7295P1973r3156
$$ plain form
1054 -75138 -47191 -137939 -138873 -12917 177811 112861 96925 -46606 -90340 -60339 -29900 11018
1042 11018 149972 260216 51461 91572 105688 126606 214270 229133 164267 -39685 -132059
1031 -132059 -51569 -34379 83049 11068 86657 -161251 -184093 -224930 -145321 -98456 56867
1020 56867 67973 15589 -105644 -169255 -11450 35215 22202 -651 65816 103610 -9903
1009 -9903 1790 34422 92378 -81171 -87817 -79753 13684 59993 -247422 -124593 216984 156393
997 156393 27137 -126839 -111946 -98973 47595 96584 -23223 24039 54083 -38356 -136449
986 -136449 -32535 8673 -17369 96835 222782 89884 150617 78983 50119 71202 71557
975 71557 81067 144549 -19649 -11348 -87286 -110127 -72405 -12199 -55308 31987 103960 10804
963A0804q9532j2350K5308Q9504k0565j33167J27657k4174j52897N7731J35798
952A4117N5812m3837r072p6372L7377n7511p7141R692O468L0113J41594k451P8814
939A07603J09649n3011j57704n8921O5583m9572M1391l8309m9630l9161J50553
928B8471n4296Q21l4066r0748K2331j0554m9495K04658j02307J49075j02686j6849
916e5645L2424O7335R5138q0046o0245r3896J33449J70262R2092j96896J8547
905A22519n9512k107Q3149j37368L7620j4913j10745J11552K787o3547m9955J84724
893A04204N5996j07173M8838r5597J41888q0800M708p2965j2881R7049j14761
882c1494q9345J61051J64585k02045K664J32224j60477j6912J12820m7111J22996
$$ plain form
963 10804 -78728 -91078 -65770 23734 3169 -129998 -2341 -26515 -179412 -121681 14117
952 14117 69929 26092 17020 -59352 -21975 -79486 -156627 -146935 -140467 -110354 31240 28789 107603
939 107603 217252 164241 6537 -52384 13199 -36373 5018 -33291 -82921 -122082 28471
928 28471 -25825 -25004 -59070 -149818 -127487 -138041 -187536 17122 -85185 63890 -38796 -55645
916 -55645 -23221 44114 139252 59206 -1039 -94935 38514 208776 300868 103972 122519
905 122519 63007 60900 144049 6681 44301 29388 -81357 30195 32982 -30565 -80520 104204
893 104204 160200 53027 101865 6268 148156 67356 72064 -901 -13782 83267 -31494
882 -31494 -120839 40212 204797 2752 5416 137640 -22837 -39749 73071 25960 148956
871A48956n4349p1224J0548k2929l4792m5942j08062M1608k682m2368J99263K0628
859C8655j79591K35993Q3852p8738j18041l433R1219K319r9325j9953R9765N2832
847A05554O3368o8152K84163k66340j64021K14934J68118q4669j12639J12017
837B52333j13979L731k51212o2317K5486l2251M8465M4080j24407K41848m6191
826a4414K8974j7085k1255O0375O913q886L5203p6067p9197J29442n3207J00887
814I1683j80910L1302K6730N6133Q8655j49848J4017q1306J60562J53820k2547
803A88291p3090m5118j09499n3043O8316L7460J53880J14377J04321k91812o0715
792C3368J10562N1936r5825j82731M2320K7845J4528M944n6053P5131m33p7332
$$ plain form
871 148956 94607 23383 33931 11002 -23790 -69732 -177794 -136186 -138868 -181236 18027 38655
859 38655 -140936 95057 178909 100171 -17870 -21303 69916 72235 -27090 -47043 52722 105554
847 105554 168922 100770 384933 118593 -45428 169506 337624 252955 140316 252333
837 252333 138354 142085 -109127 -171444 -145958 -178209 -129744 -85664 -210071 31777 -14414
826 -14414 14560 -2525 -23780 36595 43508 34622 69825 -6242 -85439 44003 -9204 91683
814 91683 -89227 -57925 -31195 24938 113593 -36255 -22238 -103544 57018 210838 188291
803 188291 115201 70083 -39416 -92459 -24143 13317 167197 281574 385895 94083 33368
792 33368 143930 195866 100041 -82690 -40370 -12525 2003 6947 -49106 26025 25592 -51740
780e1740M2082L1564K4194j2462j2999k5153O5329J07707K0143n161k08300j15944
768a40740Q505J57220p5435m8450J39503q1355J53508k0101q4843r3682J59296
757G3426L2359L1189k0849n2442p6357q3105J31517j17219q6236L0181O5958p5750
745a47328J48857N8681M4224l6056k13723l3475J30685K96189j12239o3118J71460
734B44157k45389j17469O6815R5766N2980m5238j47837R3999J8634m4397J01517
723G3538k0284j21195J54080k2158j36187M3524J18375n6793K4184L1905j00234
712a1245j08431n8868K00489L2962q0333K4713J62993J37641o534j28873N3658
701B18172q7813k5217K0466J8200j21385k7571O81J06484N5868j06028j76570
$$ plain form
780 -51740 -9658 21906 46100 33638 20639 -4514 60815 168522 188665 183504 -24796 -140740
768 -140740 -132235 24985 -50450 -98900 40603 -40752 112756 92655 7812 -85870 73426
757 73426 105785 136974 116125 63683 -12674 -95779 35738 -81481 -167717 -137536 -71578 -147328
745 -147328 1529 60210 104434 68378 -145345 -178820 -48135 248054 135815 72697 244157
734 244157 -1232 -118701 -51886 43880 96860 51622 -96215 -2216 16418 -27979 73538
723 73538 53254 -67941 86139 63981 -72206 -28682 89693 32900 57084 88989 -11245
712 -11245 -119676 -178544 21945 54907 -25426 -713 162280 299921 293387 164514 218172
701 218172 130359 105142 125608 143808 22423 -5148 -4467 102017 157885 51857 -124713
690a24713P565J6817m2142K32510J00675J0194j55491q283j4097m9305Q668n5097
678g2699k932P9967k8133N3811J10950o2414R602j3882j12450l8255k0552J22928
666B5941K3623j45705R3654Q316j21114O8500q2621J44545J8399J15444r903p2452
654F6627o5599m6840N3430R304l1797O1483R6209J0780M851p5083o7744p0413
642e4792J17019P4357p5191j29356J17706K2139j896J488J4471Q1563m2904p9699
630D4905N649m1724M1417M6895k4925j7660J9008l3580L7840j7863N8893q9113
618B9742j1526k81783O1713J82500o8463J2366J1826l3001Q4686N5301J36039
607A79400r212q5192P8509l0364j61625O7146K64030j32983j01530q4334M7716
$$ plain form
690 -124713 -117148 -100331 -142473 90037 190712 200906 45415 37132 23035 -26270 -17602 -72699
678 -72699 -75631 4336 -23797 30014 140964 78550 88152 74270 -38180 -76435 -96987 25941
666 25941 49564 -96141 -2487 5829 -115285 -46785 -129406 15139 33538 148982 139079 66627
654 66627 1028 -45812 7618 16922 -14875 46608 142817 153597 158448 83365 15621 -54792
642 -54792 62227 136584 61393 -67963 49743 71882 69986 71474 85945 167508 124604 44905
630 44905 50554 8830 50247 97142 72217 54557 73565 39985 77825 59962 118855 29742
618 29742 18216 -263567 -201854 -19354 -87817 -75451 -63625 -96626 -11940 43361 179400
607 179400 170188 84996 163505 133141 -28484 38662 302692 169709 68179 -16155 31561
596C1561p6101k293J21467Q5092j24514J579R8214M095l1402r9425K0929N7207
584H6409J0715j01028l874k7577J58031k9714j64510O8493n6661j9443R958J4058
572e5143R2477J13455j83171j90122L1600K03213P9904j8411j30319l4857J64421
561G3047J7247o1104o4107J22820o6947j95496O3676L0764Q6295R5401q315m6190
549D7091L2432K8615P3168K7164j3815k21193p0812L5055K3624N6121L5775O4093
537A17318M0359M2242j92805N601J20659r6876M2107J31162o5935k86288M656
526a37800J7958q492R6373k6944L2075j2407l3193Q2203n8830J82447m2130m4040
514D7220M1249o408L1800J00702P4952j12400j09139L3041M6331k01210J2016
$$ plain form
596 31561 -44540 -46833 74634 159726 35212 36791 135005 139100 107698 8273 29202 86409
584 86409 97124 -3904 -7778 -35355 122676 92962 -71548 -3055 -59716 -79159 -69201 -55143
572 -55143 37334 150789 -32382 -222504 -190904 12309 92213 73802 -56517 -91374 73047
561 73047 90294 29190 -34917 87903 20956 -174540 -110864 -80100 6195 101596 93281 47091
549 47091 79523 108138 181306 208470 194655 -26538 -97350 -62295 -38671 17450 53225 117318
537 117318 157677 199919 7114 12715 133374 36498 78605 209767 143832 -142456 -137800
526 -137800 -119842 -128334 -31961 -58905 -26830 -39237 -72430 9773 -49057 133390 91260 47220
514 47220 88469 82061 113861 214563 289515 177115 67976 101017 147348 -53862 -41846
503d1846n3990Q8557M21M539J14310k393j09037J9650K1013r1000m3626M5189
491d8213N6132P2032l9672l4850Q7081N3951k3058k320J0024j9269J3815J03056
479B28709j15724Q4971p6278j46903M8827J68441L8436p8375r2103k2661J0535
468D7875j33783M7816J8497J10267J1340j06989P038r6673p3244o6744K39381
457D781J49739N9531q8618L4553P6559j31404p912r2254m9172L0265J24302j09418
445I52L8971m6095j26229P9434K9214q0184m7965L6355J91686j04422o6639P543
433h7379m9915P0473R2740n0679r5833P0221J37739J55927j44877k14960J37814
422B1271j19344P0554P4458J02969p9236k82730J06741J14583n664O9037N6994
$$ plain form
503 -41846 -95836 -7279 -6858 -2319 111991 109598 561 20211 41224 -49776 -93402 -48213
491 -48213 7919 79951 40279 5429 92510 146461 123403 121083 131107 111838 125653 228709
479 228709 112985 197956 121678 -25225 23602 192043 230479 152104 60001 37340 47875
468 47875 -85908 -38092 -19595 90672 102012 -4977 2061 -94612 -167856 -234600 4781
457 4781 154520 214051 125433 159986 236545 105141 97229 4975 -44197 -13932 110370 952
445 952 39923 -6172 -132401 -52967 -23753 -103937 -151902 -115547 76139 -28283 -94922 -87379
433 -87379 -137294 -66821 25919 -24760 -120593 -50372 87367 243294 98417 -116543 21271
422 21271 -98073 -27519 46939 149908 70672 -212058 -105317 9266 3602 72639 129633
$$ [...]
##END NTUPLES=NMR SPECTRUM
##END=
