##TITLE=1H_EC-3278(II-1)
 CDCl3
 8 sc, 
 28.09.2022
##JCAMPDX= 6.0         $$ Bruker NMR JCAMP-DX V2.0
##DATA TYPE= NMR SPECTRUM
##DATA CLASS= NTUPLES
##ORIGIN= UXNMR, Bruker Analytische Messtechnik GmbH
##OWNER= root
$$ XWIN-NMR		Version 3.5
$$ Wed Sep 28 13:56:46 2022 Russian Standard Time (UT+4h)  she@DPX200
##.OBSERVE FREQUENCY= 200.1313499994
##.OBSERVE NUCLEUS= ^1H
##.ACQUISITION MODE= SIMULTANEOUS
##.ACQUISITION SCHEME= undefined
##.AVERAGES= 8
##.DIGITISER RES= 18
##SPECTROMETER/DATA SYSTEM= spect
##.PULSE SEQUENCE= zg30
##.SOLVENT NAME= CDCl3
##.SHIFT REFERENCE= (INTERNAL, CDCl3, 0, 15.7568)
##AUDIT TRAIL= $$ (NUMBER, WHEN, WHO, WHERE, WHAT)
$$ ##TITLE= Audit trail, XWIN-NMR		Version 3.5
$$ ##JCAMPDX= 5.01
$$ ##ORIGIN= Bruker BioSpin GmbH
$$ ##OWNER= she
$$ F:/spectra/data/she/nmr/H-F/1/pdata/1/auditp.txt
$$ ##AUDIT TRAIL=  $$ (NUMBER, WHEN, WHO, WHERE, WHAT)
(   1,<2022-09-28 13:55:23.85 +0400>,<she>,<DPX200>,
      <created by zg, POWCHK disabled, PULCHK disabled
       configuration hash MD5:
       00 E9 B6 7A A2 85 ED C7 34 08 36 98 17 FE 4E 26
       data hash MD5: 16K
       CE 74 88 A0 8B FB 51 3C 0D 22 B7 FE 64 B7 2C 99>)
(   2,<2022-09-28 13:55:25.96 +0400>,<she>,<DPX200>,
      <Start of raw data processing
       efp BC_mod = 2 LB = 0.24 FT_mod = 6 PKNL = 1 PHC0 = -18030.92 PHC1 = 9.000689 SI = 16K 
       data hash MD5: 16K
       0E 0C 38 8F 27 D2 FB 49 0A 9C F8 F2 B7 29 9E 1E>)
(   3,<2022-09-28 13:55:52.82 +0400>,<she>,<DPX200>,
      <pk PHC0 = -1.410289 PHC1 = -0.4 
       data hash MD5: 16K
       A3 01 2A 01 69 80 16 8D 6D 31 2C 82 59 53 4A 36>)
(   4,<2022-09-28 13:55:56.46 +0400>,<she>,<DPX200>,
      <abs ABSG = 5 
       data hash MD5: 16K
       21 FC 61 C3 C2 2A 32 5A D2 8D 13 4F D5 46 EA 05>)
$$ ##END=
$$ 
$$ hash MD5
$$ BB D1 29 A1 71 23 52 4C 77 10 8E 27 6A D6 B9 4D
##$RELAX= 
##$RELAX= 
##$RELAX= 
##$RELAX= 
##$RELAX= 
##$RELAX= 
$$ Bruker specific parameters
$$ --------------------------
##$DU= <F:/spectra>
##$EXPNO= 1
##$NAME= <H-F>
##$PROCNO= 1
##$TYPE= <nmr>
##$USER= <she>
##$AMP= (0..31)
100 100 100 100 100 100 100 100 100 100 100 100 100 100 100 100 100 100 
100 100 100 100 100 100 100 100 100 100 100 100 100 100 
##$AQSEQ= 0
##$AQ_mod= 1
##$AUNM= <au_zg>
##$AUTOPOS= <>
##$BF1= 200.13
##$BF2= 200.13
##$BF3= 200.13
##$BF4= 200.13
##$BF5= 200.13
##$BF6= 200.13
##$BF7= 200.13
##$BF8= 200.13
##$BYTORDA= 1
##$CFDGTYP= 0
##$CFRGTYP= 5
##$CHEMSTR= <none>
##$CNST= (0..31)
1 1 145 1 1 1 1 1 1 1 1 1 1 1 1 1 1 1 1 1 1 1 1 1 1 1 1 1 1 1 1 1 
##$CPDPRG= <>
##$CPDPRG1= <>
##$CPDPRG2= <>
##$CPDPRG3= <>
##$CPDPRG4= <mlev>
##$CPDPRG5= <mlev>
##$CPDPRG6= <mlev>
##$CPDPRG7= <mlev>
##$CPDPRG8= <mlev>
##$CPDPRGB= <>
##$CPDPRGT= <>
##$D= (0..31)
0 1.2 0 0 0 0 0 0 0 0.06 0 0.03 0 0 0 0 0.0002 0 0 0 0 0 0 0 0 0 0 0 0 
0 0 0 
##$DATE= 1664358923
##$DBL= (0..7)
120 120 120 120 120 120 120 120 
##$DBP= (0..7)
150 150 150 150 150 150 150 150 
##$DBP07= 0
##$DBPNAM0= <>
##$DBPNAM1= <>
##$DBPNAM2= <>
##$DBPNAM3= <>
##$DBPNAM4= <>
$$ [...]
##$SUBNAM3= <"">
##$SUBNAM4= <"">
##$SUBNAM5= <"">
##$SUBNAM6= <"">
##$SUBNAM7= <"">
##$SUBNAM8= <"">
##$SUBNAM9= <"">
##$SW= 18.0517283424941
##$SWIBOX= (0..15)
0 0 2 0 0 0 0 0 0 0 0 0 0 0 0 0 
##$SW_h= 3612.71676300578
##$TD= 16384
##$TD0= 1
##$TE= 0
##$TE2= 300
##$TE3= 300
##$TEG= 300
##$TL= (0..7)
0 120 120 120 120 120 120 120 
##$TP= (0..7)
150 150 150 150 150 150 150 150 
##$TP07= 0
##$TPNAME0= <>
##$TPNAME1= <>
##$TPNAME2= <>
##$TPNAME3= <>
##$TPNAME4= <>
##$TPNAME5= <>
##$TPNAME6= <>
##$TPNAME7= <>
##$TPOAL= (0..7)
0.5 0.5 0.5 0.5 0.5 0.5 0.5 0.5 
##$TPOFFS= (0..7)
0 0 0 0 0 0 0 0 
##$TUNHIN= 0
##$TUNHOUT= 0
##$TUNXOUT= 0
##$USERA1= <user>
##$USERA2= <user>
##$USERA3= <user>
##$USERA4= <user>
##$USERA5= <user>
##$V9= 5
##$VALIST= <valist>
##$VCLIST= <CCCCCCCCCCCCCCC>
##$VD= 0
##$VDLIST= <DDDDDDDDDDDDDDD>
##$VPLIST= <PPPPPPPPPPPPPPP>
##$VTLIST= <TTTTTTTTTTTTTTT>
##$WBST= 1024
##$WBSW= 4
##$XGAIN= (0..3)
0 0 0 0 
##$XL= 0
##$YL= 0
##$YMAX_a= 744016
##$YMIN_a= -883331
##$ZGOPTNS= <>
##$ZL1= 120
##$ZL2= 120
##$ZL3= 120
##$ZL4= 120
##$ABSF1= 15.75129
##$ABSF2= -2.300559
##$ABSG= 5
##$ABSL= 3
##$ALPHA= 0
##$AQORDER= 0
##$ASSFAC= 0
##$ASSFACI= 0
##$ASSFACX= 0
##$ASSWID= 0
##$AUNMP= <proc_1d>
##$AZFE= 0.1
##$AZFW= 0.1
##$BCFW= 0
##$BC_mod= 2
##$BYTORDP= 0
##$COROFFS= 0
##$CY= -3
##$DATMOD= 1
##$DC= 0
##$DFILT= <>
##$DTYPP= 0
##$F1P= 0
##$F2P= 0
##$FCOR= 1
##$FTSIZE= 16384
##$FT_mod= 6
##$GAMMA= 0
##$GB= 0
##$INTBC= 1
##$INTSCL= 3.70164e-10
##$ISEN= 128
##$LB= 0.24
##$LEV0= 0
##$LPBIN= 0
##$MAXI= 10000
##$MC2= 0
##$MEAN= 0
##$ME_mod= 0
##$MI= 1.114404
##$NCOEF= 0
##$NC_proc= -5
##$NLEV= 6
##$NOISF1= 3.799351
##$NOISF2= 2.8
##$NSP= 0
##$NTH_PI= 0
##$NZP= 0
##$OFFSET= 15.75681
##$PC= 1
##$PHC0= -18032.33
##$PHC1= 8.600689
##$PH_mod= 1
##$PKNL= yes
##$PPARMOD= 0
##$PSCAL= 0
##$PSIGN= 0
##$REVERSE= no
##$SF= 200.130002947566
##$SI= 16384
##$SIGF1= 3
##$SIGF2= 2
##$SINO= 5.538805
##$SIOLD= 16384
##$SREGLST= <1H.CDCl3>
##$SSB= 0
##$STSI= 16384
##$STSR= 0
##$SW_p= 3612.71676300578
##$SYMM= 0
##$S_DEV= 0
##$TDeff= 16384
##$TDoff= 0
##$TI= <>
##$TILT= no
##$TM1= 0
##$TM2= 0
##$TOPLEV= 0
##$USERP1= <user>
##$USERP2= <user>
##$USERP3= <user>
##$USERP4= <user>
##$USERP5= <user>
##$WDW= 1
##$XDIM= 16384
##$YMAX_p= 286842995
##$YMIN_p= -332973
$$ End of Bruker specific parameters
$$ ---------------------------------
##NTUPLES= NMR SPECTRUM
##VAR_NAME=  FREQUENCY,     SPECTRUM/REAL,   SPECTRUM/IMAG
##SYMBOL=    X,             R,               I
##VAR_TYPE=  INDEPENDENT,   DEPENDENT,       DEPENDENT
##VAR_FORM=  AFFN,          ASDF,            ASDF
##VAR_DIM=   16384,         16384,           16384
##UNITS=     HZ,            ARBITRARY UNITS, ARBITRARY UNITS
##FACTOR=    0.220516191357247, 1,           1
##FIRST=     3153.41046942741, 0,            0
##LAST=      -459.306293578373, 0,           0
##MIN=       -459.306293578373, -332973,     0
##MAX=       3153.41046942741, 286842995,    0
$$ Real data points
##PAGE= N=1
##DATA TABLE= (X++(R..R)), XYDATA
$$ [...]
6215A380649R924j2693n3491M2735R927k1506p121m952R212k2096M4428r326J0782
6202A376472l359p051L8734K0026k528K8789O2798N7899P3783m9666k3974J6572
6190A588495N0975P743j6888o012O968K6599L4424r33M1191L672j0380j2195k2339
6177A691320j11j6967J4643l8214L6564L2530L2273N3297j8271k3603L9035J05865
6165A908361M9377J35K3053J7433m2779J0797l0767l6987l5132n8848m7788l4177
6153A722678n3218k828L2094n242q1253m3387N0514n1125r487j2170M7609j6557
6141A577628j0195K8N8730J02767J2718K051M6329K5037Q696o4866m7907q1199
6129A629817r4820q910l5212l2191j1233n8114m235n6323m8665l3147m7506j4463
$$ plain form
6215 1380649 1390573 1377880 1324389 1367124 1377051 1355545 1348424 1343472 1352684 1330588 1375016 1365690 1376472
6202 1376472 1373113 1366062 1404796 1424822 1422294 1451083 1513881 1571780 1645563 1595897 1571923 1588495
6190 1588495 1639470 1647213 1630325 1624313 1631281 1657880 1692304 1691371 1732562 1736234 1725854 1713659 1691320
6177 1691320 1691209 1674242 1688885 1650671 1687235 1719765 1752038 1805335 1787064 1763461 1802496 1908361
6165 1908361 1957738 1957873 1980926 1998359 1955580 1966377 1935610 1898623 1863491 1804643 1756855 1722678
6153 1722678 1669460 1666632 1698726 1693484 1612231 1568844 1619358 1568233 1558746 1546576 1594185 1577628
6141 1577628 1567433 1567461 1626191 1728958 1741676 1743727 1790056 1815093 1823789 1758923 1711016 1629817
6129 1629817 1534997 1526087 1490875 1458684 1447451 1389337 1385102 1328779 1280114 1246967 1199461 1184998
6117A184998n1227L448o5081R83r043j7070L5446L8360L5788L9064j0191L4830
6105A220305M3765n0820m2638r6984q7403j1091m2734k3206o2000k3364j2078
6094H11752m9259O7167j9751o1994l1668N063k5716M0925k3734n1111k586o884
6082F52204K3890j1076n357n268K7282k5040j4354k1540L8195r779o4908m5028
6070E39221J316l2420J0681j5850l5709J6189J3327K7254J1181k436j7797k083
6058E12874m805o2181m6255K2460o562j5620J4031j8633J0179L2665k7303K4035
6046D34885M644j8118j7172m7657m318P7195K7037n4290j9083l3266K3700j1975
6034C61582K7855J2634j4238j494l3121Q453L7265O8O85Q987L2795l7157j4934
$$ plain form
6117 1184998 1133771 1137219 1072138 1073121 1064078 1047008 1082454 1120814 1156602 1195666 1185475 1220305
6105 1220305 1264070 1213250 1170612 1073628 986225 975134 932400 909194 847194 823830 811752
6094 811752 762493 829660 809909 747915 716247 721310 695594 736519 712785 661674 659088 652204
6082 652204 676094 665018 659661 654393 681675 656635 642281 620741 658936 649157 584249 539221
6070 539221 540537 508117 518798 502948 467239 483428 496755 524009 535190 532754 514957 512874
6058 512874 508069 445888 399633 422093 415531 399911 413942 395309 405488 438153 410850 434885
6046 434885 439529 421411 404239 356582 352264 429459 456496 402206 383123 349857 373557 361582
6034 361582 389437 402071 387833 386339 353218 361671 398936 399004 399689 408676 441471 404314 389380
6021C89380P1946m3967o7671k9524K1053M0111L2940j9893L587k5407K5039l0305
6009C67289o247l1935L7582r726p3092K1324j4637K4501Q44k2844J8570J8677
5997C30306P695k0420n631N7370k7098k2233J0415m2876J2338j6213K7536J2524
5985C23713o011l6657J2164L0319l6549K6052k4933J079k1251r275M5852J6136
5973C20639l1080K475J5226k926J4929k9331p74R473k5608j6428L2205l7873k282
5960B48645N4637J7957o9677j7634j5845J777N2657J1034L1677r92j4536j8211
5948B81489K701R948O230J3073l0232j0481L6892j6163N701r768k8638j9198L8614
5935B80168K096K9424P7067O0017P5155O965K8936K6452K2880M108o6059j4519
$$ plain form
6021 389380 461326 417359 349688 320164 341217 381328 414268 394375 397962 372555 397594 367289
6009 367289 361042 329107 366689 356963 283871 305195 290558 315059 315903 293059 311629 330306
5997 330306 338001 317581 311950 369320 342222 319989 330404 287528 299866 283653 311189 323713
5985 323713 317702 281045 293209 323528 286979 313031 288098 289177 267926 258651 304503 320639
5973 320639 289559 292034 307260 304334 319263 289932 289158 298631 273023 256595 288800 250927 248645
5960 248645 303282 321239 251562 233928 218083 219860 272517 283551 315228 314236 299700 281489
5948 281489 284190 294138 300368 313441 283209 272728 309620 293457 299158 289390 260752 241554 280168
5935 280168 282264 311688 388755 448772 523927 530892 559828 586280 609160 613268 547209 532690
5923E32690k1577l0498m9626m6375l3544l7557J2279l4436J7217j0594M098j923
5911C00154j3999O0965j0755o0027j4878J6525N7908K4091p2456J9008q457K0971
5899C19050L9956M6861m7498J7243r018m037j27k7447k8769M2332k5926k0760
5887C01860o480k173J8176J2817o212M2342L3015K3410n1790j0983J9611l3186
5875C40407n7739P040Q6540J1128k2931J404N9122j1459l988n3135l6196M4265
5863C64458N626l0651r835J5317N4273L2345K4419l8445j1382J4897Q336J5316
5851D44674l0935L3562O470O053Q0687N464j8441q0478Q177L4297l3416m7174
5839D08940M0212j4281K883m275J5081p536p478p614J4530k9883N4838J9029l8964
$$ plain form
5923 532690 511113 480615 430989 384614 351070 313513 325792 291356 308573 297979 302077 300154
5911 300154 286155 347120 336365 276338 261460 277985 335893 359984 287528 306536 298079 319050
5899 319050 359006 405867 358369 375612 366594 362557 362430 334983 306214 348546 322620 301860
5887 301860 295380 293207 311383 324200 317988 360330 393345 416755 364965 353982 373593 340407
5875 340407 282668 289708 376248 387376 364445 365849 424971 413512 409524 356389 320193 364458
5863 364458 370084 339433 329598 344915 399188 431533 455952 417507 406125 421022 429358 444674
5851 444674 413739 447301 453771 459824 540511 545975 527534 447056 455233 489530 456114 408940
5839 408940 449152 434871 437754 433479 448560 441024 433546 425932 440462 410579 465417 484446 445482
5826D45482K5439O8420L613K2726p275j7198N4940n8297M5647r614M2024J2122
5814F28029p9975P6749M0160K2064k6630j8843O596M1838M3871r682m310Q4739
5802H04606Q828J6552K1473O3106N7445N6495J09198J37723J43222J47902J94522
5791A761072K62320K81192K18506P2579j86973l14767l39763k61594k01652j39245
5781A151675r4776p5574q4147o0715k5295P522K2184J5680K9088m1682r3124J4600
5769G65436Q068k1675K60j0858r669L7862M443L5390M3470J6998j4198k6973l6447
5756G92107q8536l0515K2579m4532k5361j9924j9245K398L3381n8647j6704n700
5744E41301n0073j4568K176K6643K0909m2832N435O9045L4379o3260j7895O333
$$ plain form
5826 445482 470921 539341 542954 565680 558405 541207 596147 537850 583497 573883 615907 628029
5814 628029 548054 624803 664963 687027 660397 641554 648150 689988 733859 724177 719867 804606
5802 804606 813434 829986 851459 914565 972010 1028505 1137703 1275426 1418648 1566550 1761072
5791 1761072 2023392 2304584 2523090 2595669 2408696 2093929 1754166 1492572 1290920 1151675
5781 1151675 1056899 981325 897178 836463 811168 818690 840874 856554 885642 843960 750836 765436
5769 765436 773504 751829 752089 741231 731562 769424 773867 809257 852727 869725 855527 828554 792107
5756 792107 703571 673056 695635 651103 625742 605818 586573 588971 622352 563705 547001 541301
5744 541301 491228 476660 478836 505479 526388 483556 488991 558036 592415 529155 511260 517593
5732E17593j5951K0169n9130k5231M9428l94n1960j759O1468J1071k2452R080
5720D91932j8377j6661m5161k4258N4960J9571j6907p048M6432J2064L8194M837
5708E39578k7990k3647J909J7203K9237l1766N445o928J2371j5344K3381j549
5696E21900j8705O051N419o742L9013m595N435M5812J4656l6373n506n67m6569
5683E19229k3254O7671L6779l4617N4455l635J0246l0987l220O5663k0214n6670
5671E81446j9954l5812Q7540Q192R485K8520m0850l9269L7886j461j2723L0239
5659F33239J5570R767k7538k141N6859R598K8983O91J4903K9349j8242n6830K6340
5646G20548J1469L7185J6413N0529k1479k8503P45l0989J1523M5232M3311P539
$$ plain form
5732 517593 501642 521811 462681 437450 486878 486484 434524 432765 494233 505304 482852 491932
5720 491932 473555 456894 411733 387475 442435 462006 445099 438051 484483 496547 534741 539578
5708 539578 511588 487941 489850 507053 536290 504524 509969 503041 515412 500068 523449 521900
5696 521900 503195 509246 514665 507923 546936 542341 547776 593588 608244 571871 566365 565798 519229
5683 519229 495975 563646 600425 565808 620263 616628 626874 595887 592667 658330 638116 581446
5671 581446 561492 525680 613220 621412 630897 659417 618567 579298 617184 615723 603000 633239
5659 633239 648809 658576 631038 628897 685756 695354 724337 725028 739931 769280 751038 694208 720548
5646 720548 732017 769202 785615 836144 814665 786162 786907 755918 767441 812673 855984 863523
5634H63523l98m1690k2831o748r090L7271L5118M5698q308O2912j6329P500O4214
5621A010842K8290R6324O473j5495k295P5908L5343K3741J7969Q747N2959N1893
5609A390699L261Q442M4856L3362L485L2751J9310M2673R0792L0351L8793O7785
5597A806560J20341P5223J06844O5678P3207O4987N1255j3826O017K8982r147
5586B376121r2693r1318M2995p8601l5976J1569M3858r930n425J4278K477K1907
5574B199262q224M183N1975O0055J39986M7853N7365J3968M3447J27421P1032
5563B808323J41205J45599O5608J19327J55236R6672J36245J30650N5126P6325
5553C930316R7217Q9334J4746J34605P1141M1624M3855J3253Q1404P2220P5993
$$ plain form
5634 863523 863125 821435 798604 791856 782766 820037 855155 900853 892545 955457 939128 946628 1010842
5621 1010842 1039132 1135456 1141929 1126434 1124139 1200047 1235390 1259131 1277100 1285847 1338806 1390699
5609 1390699 1393960 1402402 1447258 1480620 1484105 1516856 1536166 1578839 1669631 1699982 1738775 1806560
5597 1806560 1926901 2002124 2108968 2174646 2247853 2312840 2364095 2350269 2356286 2385268 2376121
5586 2376121 2283428 2192110 2235105 2156504 2120528 2132097 2175955 2166025 2160600 2174878 2177355 2199262
5574 2199262 2191038 2195221 2247196 2307251 2447237 2495090 2552455 2566423 2609870 2737291 2808323
5563 2808323 2949528 3095127 3160735 3280062 3435298 3531970 3668215 3798865 3853991 3930316
5553 3930316 4027533 4116867 4131613 4266218 4337359 4378983 4422838 4436091 4517495 4589715 4665708
5542D665708J06315J63980K47501M29055M11996K15228j95791n38600n64842m33392
5532D507158l63909k25832j35614q9158J1700l6512m936K1421M4882L8911P1135
5521C839246J00260J15490J11372J13527J52875J19701J97402K18121J83501O8122
5511E219617n1446j09513m5936l2139j17288p1318q9665j49966q2523l4528k7855
5500D407440l3092q5803K5409O7910L361r94Q4026N0830r363Q4063J24784J48718
5488D867289J10276J65976J92279K61031K41823J88734O4594j65326k25204k76892
5478E424580k01540j74947j78943j41344q2692n108o6918o5767j06272o5515n8342
5467D277192l7487j3042p196L185k2173l3804o1658l4385L5056J01349J5274Q8172
$$ plain form
5542 4665708 4772023 4936003 5183504 5612559 6024555 6239783 6043992 5505392 4940550 4507158
5532 4507158 4143249 3917417 3781803 3692645 3704345 3667833 3662897 3684318 3729200 3768111 3839246
5521 3839246 3939506 4054996 4166368 4279895 4432770 4552471 4749873 4967994 5151495 5219617
5511 5219617 5168171 5058658 5012722 4980583 4863295 4791977 4702312 4552346 4469823 4435295 4407440
5500 4407440 4374348 4288545 4313954 4381864 4385225 4384231 4468257 4519087 4509724 4593787 4718571 4867289
5488 4867289 4977565 5143541 5335820 5596851 5838674 6027408 6092002 5926676 5701472 5424580
5478 5424580 5223040 5048093 4869150 4727806 4645114 4640006 4573088 4507321 4401049 4335534 4277192
5467 4277192 4239705 4226663 4219467 4222652 4200479 4166675 4105017 4070632 4105688 4207037 4222311 4310483
5455D310483R3250Q7125M1331K2996j7097j45154r1622p3252k0139l9492J791
5444D170220k5894j6236k3528p4058o9328k445K678p7767N721R777J5129n8824
5432C855445l5220l1780M7308P1913L4965J05816O3127P195L4535k6282L369M6774
5420D177165O9496J06275P7572N1803K2231M4152M3704K4797j2303O143L4809
5409D645844Q3384Q595k6122l0431K874Q9404K0490K0734L327M9771J03754R6697
5397E068321Q8281J13822O9977n9171o2595k2485J8646K3696M3141J06902L1378
5386E419913m9386j11508j05465j38688r2845n23m4507l0389P2641J08894J8410
5375E046547R3882P5709J04115O0268J8822K6462L6210O2942J9897O806O7182
$$ plain form
5455 4310483 4403733 4490858 4532189 4555185 4538088 4392934 4301312 4228060 4207921 4168429 4170220
5444 4170220 4144326 4128090 4104562 4030504 3961176 3958731 3961409 3883642 3889363 3899140 3914269 3855445
5432 3855445 3820225 3788445 3835753 3907666 3942631 4048447 4111574 4118769 4153304 4127022 4130391 4177165
5420 4177165 4246661 4352936 4430508 4482311 4504542 4548694 4592398 4617195 4604892 4611035 4645844
5409 4645844 4729228 4737823 4711701 4681270 4684144 4773548 4794038 4814772 4818099 4867870 4971624 5068321
5397 5068321 5156602 5270424 5340401 5281230 5218635 5196150 5214796 5238492 5281633 5388535 5419913
5386 5419913 5370527 5259019 5153554 5014866 4922021 4921498 4876991 4846602 4919243 5028137 5046547
5375 5046547 5140429 5216138 5320253 5380521 5399343 5425805 5462015 5524957 5544854 5551660 5618842
5364E618842O1784M221K9622P1353R7717J30263J20900J14276K7541O9402L8851
5353F384772J133J05679J96958J80536K50316L60889L88689M88456N80386O58306
5343I596120Q01121R13634J044447J046458Q15077K86642k82934n24578n27723
5334A3168264l76706j51134j26513j19227j33323r0473k21291l59344k98780k09638
5324A1081835j03229M5400J27201K56967L51664L78906N84449P52754R53067J160613
5314A5589627J392380J679696J840788J695639J384043R16189P06805M92213J33112
5305B5830492j05240J06243M34068Q53150J099806R94071m3935j433091k321206
5296B5414358k553875k304735j923344j432716j005980o43683m33628k61129j27940
$$ plain form
5364 5618842 5680626 5684847 5714469 5785822 5883539 6013802 6134702 6248978 6276519 6345921 6384772
5353 6384772 6385905 6491584 6688542 6869078 7119394 7480283 7868972 8357428 8937814 9596120
5343 9596120 10397241 11310875 12355322 13401780 14216857 14503499 14220565 13695987 13168264
5334 13168264 12791558 12640424 12513911 12394684 12261361 12170888 11949597 11590253 11291473 11081835
5324 11081835 10978606 11024006 11151207 11408174 11759838 12138744 12723193 13475947 14429014 15589627
5314 15589627 16982007 18661703 20502491 22198130 23582173 24498362 25205167 25697380 25830492
5305 25830492 25725252 25831495 26265563 27118713 28218519 29212590 29168655 27735564 25414358
5296 25414358 22860483 20555748 18632404 17199688 16193708 15550025 15116397 14855268 14727328
5287A4727328N1453K03667L79812N00032P16138Q89112R71625J078219Q07087
5278B0324473L91733R3842K36047N56748R24267J102648P94518N7147r82593j788576
5268B1710254k010252j950650j667318j244811j016453p73237n52322m41252l48212
5259A1705747k78786k74507k03407j64418o6975k1367J4462R0713J58794J73063
5249A1133319K63347L65994N17526N83855O72551Q23159J064183J316619J489900
5240A8230453J852532J949559J859730J350633L36590p98997j368060j340440
5232B2072000j061608o52330k28607q2067l34998q19991j061899j017109p77774
5223A6035617n21363k95964O3062K46129N32362Q18113R64740J190630J458546
$$ plain form
5287 14727328 14778781 14982448 15362260 15862292 16578430 17467542 18439167 19517386 20324473
5278 20324473 20716206 20810048 21046095 21602843 22527110 23629758 24424276 24481423 23498830 21710254
5268 21710254 19700002 17749352 16082034 14837223 13820770 13047533 12495211 12053959 11705747
5259 11705747 11426961 11152454 10949047 10784629 10717654 10696287 10710749 10801462 10960256 11133319
5249 11133319 11396666 11762660 12280186 12864041 13536592 14359751 15423934 16740553 18230453
5240 18230453 20082985 22032544 23892274 25242907 25579497 24780500 23412440 22072000
5232 22072000 21010392 20358062 20129455 20047388 19712390 18892399 17830500 16813391 16035617
5223 16035617 15514254 15218290 15281352 15527481 16059843 16877956 17842696 19033326 20491872
5214B0491872J727058J766432J564943Q87943m3808o61751q83985q20763n98387
5205B3429554m32606j95156l55298p23582r18693p76136m81983l19560m26782
5196A8799758q81461j233885j424637j309400j179757q24662n54441m06782k23760
5187A0760973j94848j22960L4777J20591J44263K13045J37656Q2666P5116R3298
5177A1344577J68740J69608K83168L61457L62636J84055l09667q69790j093202
5168A0601582j107790r32331p28451n38516m63686l75737k67611k39881j79401
5159E768178j02158r5172j55359k10622j43873j41265j27249q3149l9589k9923
5149D639819q2413k3016m7498o8238K5417J598M1624M0192K5800R7423J57641
$$ plain form
5214 20491872 22218930 23985362 25550305 26438248 26394440 25732689 24848704 24027941 23429554
5205 23429554 22996948 22801792 22446494 21722912 20804219 20028083 19546100 19226540 18799758
5196 18799758 17918297 16684412 15259775 13950375 12770618 11945956 11391515 10984733 10760973
5187 10760973 10566125 10443165 10477942 10598533 10742796 10955841 11093497 11176163 11251279 11344577
5177 11344577 11513317 11682925 11966093 12327550 12690186 12874241 12564574 11694784 10601582
5168 10601582 9493792 8561461 7833010 7294494 6830808 6455071 6187460 5947579 5768178
5159 5768178 5666020 5570848 5415489 5204867 5060994 4919729 4792480 4709331 4669742 4639819
5149 4639819 4557406 4534390 4486892 4418654 4444071 4445669 4487293 4527485 4553285 4650708 4808349
5138D808349J34430J46989J60411J85826J62129Q4393J21353J96863K72673M00358
5128F673774M56654N09375O48017P12080N68932K95226j30072l39212k85243p8549
5118I030982J18062L23859N63485Q88250J174803J292448J339614R38282j35928
5109A5533857j385119j891199j782545j503997j210603r11667o84462n47319m68293
5100E148653l70394l07098k92107j94048j52075j88044j80948j32801j18893j08287
5090C103958o1593r4738r7345m6872m4688m1447l5666n8780K5882j9754j1111
5079B617846l7471k8285l1953J3043l6756m6859O927p5815o5242m5023o2734l4701
5067B172977j1548l0742l0089p929l3653K840o4061k684o290K9067M861l5189
$$ plain form
5138 4808349 4942779 5089768 5250179 5436005 5598134 5682527 5803880 6000743 6273416 6673774
5128 6673774 7130428 7639803 8287820 8999900 9568832 9864058 9733986 9394774 9109531 9030982
5118 9030982 9149044 9472903 10036388 10924638 12099441 13391889 14731503 15669785 15533857
5109 15533857 14148738 12257539 10474994 8970997 7760394 6848727 6164265 5616946 5148653
5100 5148653 4778259 4471161 4179054 3985006 3832931 3644887 3463939 3331138 3212245 3103958
5090 3103958 3042365 2947627 2850282 2803410 2758722 2717275 2681609 2622829 2648711 2628957 2617846
5079 2617846 2580375 2552090 2520137 2533180 2496424 2449565 2456492 2380677 2315435 2270412 2207678 2172977
5067 2172977 2161429 2130687 2100598 2092669 2059016 2061856 1997795 1995111 1988821 2017888 2022749 1987560
5055A987560K1938j1201M1891M8181R2991Q4443J03466J65076L2116m6816j85374
5044B334271j43406j43754j53721n9101p0783q5723q3363j1937o066L297M67n5551
5032A524630l0391k3877q028J1992n78k5431k8716K2097M7098j7929o9437l828
5020A397602K3990M6128j2980l9983K988M1995l4723l5060l6869K0695n1365n3419
5008A268999r977K2332Q30n1756K4072k2197P601o591j7744j6376L0975L4393
4996A264561l219J4482q150k6409J5451M1822j9475J5348M5380L2103O2953J6921
4984A451768k1580k4277q316j9036P814N1557m6423r026j003k3820j6295J5334
4972A356697L9996J103M8262j4766l5094K0621K0197N3724L422O949J3960J2471
$$ plain form
5055 1987560 2009498 1998297 2040188 2088369 2181360 2265803 2369269 2534345 2566461 2519645 2334271
5044 2334271 2190865 2047111 1893390 1834289 1763506 1677783 1594420 1582483 1576417 1579714 1580181 1524630
5032 1524630 1494239 1470362 1462334 1474326 1473748 1448317 1419601 1441698 1488796 1470867 1401430 1397602
5020 1397602 1421592 1467720 1454740 1414757 1417745 1459740 1425017 1389957 1353088 1373783 1322418 1268999
5008 1268999 1259022 1281354 1282184 1230428 1254500 1232303 1239904 1233313 1215569 1199193 1230168 1264561
4996 1264561 1261342 1275824 1267674 1241265 1256716 1298538 1279063 1294411 1339791 1371894 1434847 1451768
4984 1451768 1430188 1405911 1397595 1378559 1386373 1437930 1391507 1382481 1381478 1357658 1341363 1356697
4972 1356697 1396693 1397796 1446058 1431292 1396198 1416819 1437016 1490740 1494162 1501111 1515071 1527542
4960A527542K3717l0861l847k85K0477j2358l0076K7045P46j2913L0411J9551
4948A559149j3477P0766m867L3901K4550K0446J36522R009O84K6699R441O1227
4936A934050P0094J0091j7288L6318N2216P7309Q0027k6061N9320J37234P9486
4925B492796O0272M4698K8900n0596j6298J8842L3707P3753R6878M1722M0772
4914B865446m6532k6094J3530j2772J4026l47M145P4879P072j4769P6843R5131
4902C050558P7903O3907M5628P1011Q3473Q8056R3297J06722J7737J7375J05359
4891C821026P6123J1478J15724Q3067Q1777Q0308J06238P9346L6857N9892P4384
4880D626220J871p894K3612j8866j0722J4204L0647P6344J01757R4502P6339P0629
$$ plain form
4960 1527542 1551259 1520398 1516551 1516266 1536743 1524385 1494309 1521354 1522100 1509187 1539598 1559149
4948 1559149 1545672 1616438 1611571 1645472 1670022 1690468 1826990 1835999 1836683 1863382 1872823 1934050
4936 1934050 2004144 2014235 1996947 2033265 2085481 2162790 2242817 2216756 2276076 2413310 2492796
4925 2492796 2553068 2597766 2626666 2576070 2559772 2578614 2612321 2686074 2782952 2824674 2865446
4914 2865446 2818914 2792820 2806350 2793578 2807604 2807257 2811402 2886281 2893353 2878584 2955427 3050558
4902 3050558 3128461 3192368 3237996 3309007 3392480 3480536 3573833 3680555 3698292 3715667 3821026
4891 3821026 3897149 3908627 4024351 4107418 4189195 4269503 4375741 4455087 4491944 4551836 4626220
4880 4626220 4628091 4620197 4643809 4624943 4614221 4628425 4659072 4735416 4837173 4931675 5008014 5078643
4868E078643N5487P9300J42394J40879J57329K06469K23763K60454K54258K49768
4858F848744K87871K80725K91166J91018K57172K87445K33533L32017M54567M84009
4848I948267M88003N02726N03479N17085N14782M72770O06449P35959Q39941Q84866
4838A6014327R79719J075306J264929J513663J885228K339688K906347L416997
4830C1396204M251853N224242O644026Q599391J0915117J2834577J5756953J6911183
4822A12533546R666606r289751k1145824j8949440j5062236j1045076p795613
4815C8912212n597206m351561l255366k583289k099448j806688j573027j343695
4807A6301932j141690j040580p86754n98689m99314m89520m31538n29213m16267
$$ plain form
4868 5078643 5134130 5213430 5355824 5496703 5654032 5860501 6084264 6344718 6598976 6848744
4858 6848744 7136615 7417340 7708506 7899524 8156696 8444141 8677674 9009691 9464258 9948267
4848 9948267 10436270 10938996 11442475 11959560 12474342 12947112 13553561 14289520 15129461 16014327
4838 16014327 16994046 18069352 19334281 20847944 22733172 25072860 27979207 31396204
4830 31396204 35648057 40872299 47516325 56115716 67030833 79865410 95622363 112533546
4822 112533546 122200152 112910401 91764577 72815137 57752901 46707825 38912212
4815 38912212 33315006 28963445 25708079 23124790 21025342 19218654 17645627 16301932
4807 16301932 15160242 14119662 13332908 12734219 12234905 11745385 11313847 10784634 10368367
4798A0368367l01178k92397k41766j42880j36479j83362k39581k06539j45174
4789H479011j97785j75245o7213k239L0634N4489N1339R5407K27383K54766L43484
4778I094031M28653M84198P00822Q67654J108404J440628J884198K309077K278550
4769B0596215J329793q0919j532574k716406k904446k255428j658574j264910
4761I512751q70054o47281m68959m03066l98096l78770l05104k85866k21367j95636
4751E338552j38751j40674r6644j06711p9851k7593p1899r1604l3486k1423p4891
4740D455025O7076k6329n9447l7177K0879L8700m6800l8012j5211K7161L0586
4729D416451N4607k7206M996J00920O0460L446N716J07853M6280P8141J09166
$$ plain form
4798 10368367 10067189 9774792 9533026 9390146 9253667 9070305 8830724 8624185 8479011
4789 8479011 8281226 8105981 8038768 8036529 8067163 8121652 8172991 8268398 8495781 8750547 9094031
4778 9094031 9522684 10006882 10707704 11575358 12683762 14124390 16008588 18317665 20596215
4769 20596215 21926008 21845089 20312515 17596109 14691663 12436235 10777661 9512751
4761 9512751 8642697 7995416 7526457 7123391 6725295 6346525 6041421 5755555 5534188 5338552
4751 5338552 5199801 5059127 4962483 4855772 4775921 4748328 4676429 4584825 4551339 4529916 4455025
4740 4455025 4522101 4495772 4436325 4399148 4420027 4458727 4411927 4373915 4358704 4385865 4416451
4729 4416451 4471058 4443852 4448848 4549768 4610228 4613674 4619390 4727243 4773523 4851664 4960830
4718D960830P9942J72875J49926J46532J46721K33560K36594L56279M43714N63654
4708G490627O30368P98053J024435J278823J615558K007468K248013J669499L98778
4699A9161622k80943j038760k258446k631835k035363j512480j140998p99964
4691G462833n92500m70460m44040l38013k95957k54889j72742j41928j20490j03388
4681D528426q0316l8685q3982n0746p5776n1370l0908m3150p5170o2479m7545
4670C888299k9421p4907l780n1693m7329n3539j0683o823P9553K8242k9625M8786
4658C737080K5191n8204O1474K3394M0913L0574o5697k0626Q678p19J9440J8518
4646C820016L2267K9146L8345O0280l831P61k243L1150k1237M5958K0048O854
$$ plain form
4718 4960830 5040772 5213647 5363573 5510105 5656826 5890386 6126980 6483259 6926973 7490627
4708 7490627 8120995 8919048 9943483 11222306 12837864 14845332 17093345 18762844 19161622
4699 19161622 18880679 17841919 15583473 12951638 10916275 9403795 8262797 7462833
4691 7462833 6870333 6399873 5955833 5617820 5321863 5066974 4894232 4752304 4631814 4528426
4681 4528426 4448110 4409425 4325443 4274697 4198921 4147551 4116643 4073493 3998323 3935844 3888299
4670 3888299 3858878 3783971 3780191 3728498 3681169 3627630 3616947 3610124 3689677 3717919 3688294 3737080
4658 3737080 3762271 3704067 3765541 3788935 3829848 3860422 3794725 3774099 3782777 3782058 3801498 3820016
4646 3820016 3852283 3881429 3919774 3980054 3976223 3976984 3974741 4005891 3984654 4030612 4050660 4057514
4634D057514l1748k1950M0230k988J2264M448N400M0531M9047M4328L5823P0677
4622D303576P4725R7283M0839O5077Q0883K70R4059P2612R8218J37266Q1030M4972
4610E190810R6271J55582J23892R0752J60980K30212J45169J44312K17761K47365
4600F803106K48542L48002L86419L54671L74784N96902P48433Q31837R61192J230634
4590A2884522J547977J831247K265534K639251L153680L597208L458238J496731
4582C2874388k111449m330941m365275l677324k825721k172729j636622j257511
4574A0496816r35328p58298o45548n17574m94113m40981l34307l07314k45453
4565E817900k21089k07104k12970j77756j30672j38648j02031j23392j01699q9922
$$ plain form
4634 4057514 4025766 4003816 4044046 4041058 4053322 4057770 4063170 4103701 4152748 4197076 4232899 4303576
4622 4303576 4378301 4475584 4516423 4581500 4662383 4662653 4756712 4829324 4927542 5064808 5145838 5190810
4610 5190810 5287081 5442663 5566555 5657307 5818287 6048499 6193668 6337980 6555741 6803106
4600 6803106 7051648 7399650 7786069 8140740 8515524 9112426 9860859 10692696 11653888 12884522
4590 12884522 14432499 16263746 18529280 21168531 24322211 27919419 31377657 32874388
4582 32874388 30762939 26431998 22066723 18389399 15563678 13390949 11754327 10496816
4574 10496816 9561488 8803190 8157642 7640068 7145955 6704974 6370667 6063353 5817900
4565 5817900 5596811 5389707 5176737 4998981 4868309 4729661 4627630 4504238 4402539 4312617
4555D312617r5081q3492j22002q8719q7162j04170l9852J183o5037j13796o4728
4544C449761l2333o8740l3631k5626l8304n1380p4185l8376k1954k5651j9485
4533C020096j0954p2288j2644l7240q719j5324j8638q6489r999K857l9242J1119
4521B722535k2796j4861m7915J4246l549k1700k6111l3983L3089k0234Q9137k2614
4509B645244n832O6025O8052J5255N5311m1418j27533j41993o4469p7131n2338
4498B339173k2398q2541n2463n6697m1558L0005N627n2520L249l1665j3951q663
4486B015598m8306j4006Q518N887k774m8654K6629l468O645k9095n540J71J3176
4473A924781j6221k7086K0607J3381J5326k3877j3593K3753j8284P0954k5314
$$ plain form
4555 4312617 4217536 4134044 4012042 3923323 3836161 3731991 3692139 3693322 3628285 3514489 3449761
4544 3449761 3417428 3348688 3315057 3289431 3251127 3199747 3125562 3087186 3065232 3039581 3020096
4533 3020096 3009142 2936854 2924210 2886970 2878251 2862927 2844289 2757800 2747801 2750658 2711416 2722535
4521 2722535 2699739 2684878 2636963 2651209 2647660 2625960 2599849 2565866 2598955 2578721 2667858 2645244
4509 2645244 2639412 2705437 2773489 2788744 2844055 2802637 2675104 2533111 2468642 2391511 2339173
4498 2339173 2316775 2234234 2181771 2125074 2083516 2113521 2119148 2066628 2069877 2038212 2024261 2015598
4486 2015598 1967292 1953286 1961804 1967691 1964917 1916263 1942892 1939424 1946069 1916974 1911434 1911605 1924781
4473 1924781 1908560 1881474 1902081 1915462 1930788 1906911 1893318 1917071 1898787 1969741 1944427
4462A944427M7813M1901K174m0652O58L73J843L0201l4263n5321n5631p1467p690
4449A804366M7533l8877M2829k7769m5703j5591J7364m7747J8697J5274o3112
4438A707264r846L6758o367k1741J8194l8209j9019P1523l2834J787k2675J3078
4426A697913l6108K2310M5051j1210m12m77j8751l4377l1106l7295P2885p417
4414A661006j0367J1201K7018k5064j3334k9195M9684j426k5258O112J7275K4770
4402A692422l6775l9916J2754l592O782n1186k4198K7104k0664k4608k4065Q455
4390A522513K0551P2333l625k0556L125N4336K1382k2647N6536n8082n1697K4078
4378A618247j7836k6536L7004K2788J9025j79J1757n3088k9487M066O8526J794
$$ plain form
4462 1944427 1992240 2034141 2036315 1995663 1996321 1996694 1998537 2028738 1994475 1939154 1883523 1812056 1804366
4449 1804366 1851899 1813022 1855851 1828082 1782379 1766788 1784152 1736405 1755102 1770376 1707264
4438 1707264 1697418 1734176 1727809 1706068 1724262 1686053 1667034 1738557 1705723 1707510 1684835 1697913
4426 1697913 1661805 1684115 1729166 1717956 1717544 1717067 1698316 1663939 1632833 1595538 1668423 1661006
4414 1661006 1650639 1661840 1688858 1663794 1650460 1621265 1670949 1669523 1644265 1650377 1667652 1692422
4402 1692422 1655647 1615731 1628485 1624893 1631675 1580489 1556291 1583395 1562731 1538123 1514058 1522513
4390 1522513 1543064 1615397 1611772 1591216 1594341 1648677 1670059 1647412 1703948 1645866 1594169 1618247
4378 1618247 1600411 1573875 1610879 1633667 1652692 1652513 1664270 1611182 1581695 1585761 1654287 1656081
4366A656081K1618m554m7551O4683k1347M623O3604N7780p996L1408J6606k2775
4354A812180J3895J2749M7407j8593J1086L8910K4511K4993Q206l070o6702O9422
4342A974994J5305L3225M6157k7603L6794J6957j5004J4027K7880M7834M4859
4331B215425P2838m395K9179J4529L1226P7394P9770P4904J4302L0653p00L8084
4319B673209L8736M183L4689K3155j2496J7857j8662l8646m796O6238N4782k6243
4307B812006J5849M4582K5344Q0565M4765M1454L0523L6418P3843M3077m715J5634
4295C259345N8326M8335O1870K3523M0103L5587Q8417N5986J00033L4944L5459
4284C841928Q1060J36009J71023P8448J30789J37771J23997R5902J44887J50858
$$ plain form
4366 1656081 1677699 1673145 1625594 1690277 1668930 1673553 1737157 1794937 1786941 1818349 1834955 1812180
4354 1812180 1826075 1838824 1886231 1867638 1878724 1917634 1942145 1967138 1975344 1972274 1905572 1974994
4342 1974994 1990299 2023524 2069681 2042078 2078872 2095829 2080825 2094852 2122732 2170566 2215425
4331 2215425 2288263 2283868 2313047 2327576 2358802 2436196 2515966 2590870 2605172 2635825 2635125 2673209
4319 2673209 2711945 2716128 2750817 2773972 2761476 2779333 2760671 2722025 2717229 2783467 2838249 2812006
4307 2812006 2827855 2872437 2897781 2978346 3023111 3064565 3095088 3131506 3205349 3248426 3243711 3259345
4295 3259345 3317671 3366006 3427876 3451399 3491502 3527089 3615506 3671492 3771525 3806469 3841928
4284 3841928 3922988 4058997 4230020 4308468 4439257 4577028 4701025 4796927 4941814 5092672
4274E092672Q4250J35886J63749J08224J01099J08990J18850K11310J05667L6763
4264F267460Q2758P8823Q5782M2824J10096K7880O7783J27349J16349J27808J48210
4253G283122J48948J34061J10068R7292J12690J24282R4221J53024P1408L8061
4243H367177P7295N6536R0516L7051M1871J0497N0731M4216Q794m7827q2557K3991
4231H678291L877o5392m2182m2850k9299r6490m5046k9828j603m3496q0471j20396
4219H085115o8209r8551j38799j61168j30099j00412l5975l0558m9652r9817p6386
4208G095489k4991p1069l5056j33122j33347o1364p1205j35786r2703m7933p4018
4197F214895o7818o4779k622m8063p8391K7152K4959J4324J24372J42861J31269
$$ plain form
4274 5092672 5176922 5312808 5476557 5584781 5685880 5794870 5913720 6125030 6230697 6267460
4264 6267460 6350218 6429041 6514823 6557647 6667743 6695623 6763406 6890755 7007104 7134912 7283122
4253 7283122 7432070 7566131 7676199 7773491 7886181 8010463 8104684 8257708 8329116 8367177
4243 8367177 8444472 8501008 8591524 8628575 8670446 8680943 8731674 8775890 8784684 8736857 8654300 8678291
4231 8678291 8682168 8616776 8574594 8531744 8502445 8405955 8360909 8331081 8329478 8285982 8205511 8085115
4219 8085115 8016906 7918355 7779556 7618388 7488289 7387877 7351902 7321344 7271692 7171875 7095489
4208 7095489 7070498 6999429 6964373 6831251 6697904 6636540 6565335 6429549 6336846 6288913 6214895
4197 6214895 6147077 6082298 6079676 6031613 5953222 5980374 6005333 6019657 6144029 6286890 6418159
4186F418159J43539J19658l2873j57417j65421j48351j40813r1650p9186j79930
4176E685715l3979N023N6839J17047J24222J11957J55384K26216K32051J02904
4166F783379N8174O809r5718j59022k01794k42667k12008q6469p1285p8409J5232
4155E716222K7656N7951J13598K01905J16261Q9073J1089r9153o1210m6216K2978
4144F150154J77229K00019L05666M23854M09139O05270P00763N48159j7005o75404
4134H827844q35155o79145m94285l72913k70164k17831k20846j97303j21651j64505
4124E254046j50745o0565J719q1472r4301k0650k8615l5730j2540k5115m9172
4113D696860K1477o3845p9492k278r0008l9896l2096L0504n5332o8922J3289O3893
$$ plain form
4186 6418159 6561698 6681356 6648483 6491066 6325645 6177294 6036481 5944831 5865645 5685715
4176 5685715 5651736 5656759 5713598 5830645 5954867 6066824 6222208 6448424 6680475 6783379
4166 6783379 6841553 6848362 6752644 6593622 6391828 6149161 5937153 5850684 5779399 5700990 5716222
4155 5716222 5743878 5801829 5915427 6117332 6233593 6322666 6333755 6234602 6173392 6127176 6150154
4144 6150154 6327383 6527402 6833068 7256922 7666061 8271331 8972094 9520253 9503248 8827844
4134 8827844 7992689 7313544 6819259 6446346 6176182 5958351 5737505 5540202 5418551 5254046
4124 5254046 5103301 5042736 5044455 4962983 4868682 4848032 4819417 4783687 4771147 4746032 4696860
4113 4696860 4718337 4654492 4575000 4572722 4482714 4442818 4410722 4441226 4385894 4316972 4330261 4394154
4101D394154O1688P601k8745P6254N7995J9675J4571k3728N0323K6389L7022j798
4089D691401M9285K6520L1268O1403M202j0961M4855N6810O8869L1198K4024M8478
4077E127352J8320J6883N6700M9037M8911M6284J0733L6550O0306J11576R1378
4066E674030O1706R2961Q0124O9731J00827J01408J05974J83591J79036K10731
4056F860119J54316J33630l2605O549K9341J02475O7317J29213Q4919J63801J71765
4045G870840J79707J78629K20666K11771J89589K55793K80060K37772K87368L54995
4035A0267190L47616L20513L72837M45133L93503M40275M27161M95515M34559
4026A3944302N38834N89531O40697O50381P33446P59686P39709P68089Q34692
$$ plain form
4101 4394154 4455842 4463443 4434698 4510952 4568947 4588622 4603193 4579465 4629788 4656177 4693199 4691401
4089 4691401 4740686 4767206 4798474 4859877 4864079 4853118 4897973 4954783 5023652 5054850 5078874 5127352
4077 5127352 5145672 5162555 5219255 5268292 5317203 5363487 5374220 5410770 5471076 5582652 5674030
4066 5674030 5735736 5828697 5908821 5978552 6079379 6180787 6286761 6470352 6649388 6860119
4056 6860119 7014435 7148065 7115460 7122009 7151350 7253825 7321142 7450355 7535274 7699075 7870840
4045 7870840 8050547 8229176 8449842 8661613 8851202 9106995 9387055 9624827 9912195 10267190
4035 10267190 10614806 10935319 11308156 11753289 12146792 12587067 13014228 13509743 13944302
4026 13944302 14483136 15072667 15713364 16363745 17097191 17856877 18596586 19364675 20199367
4017B0199367R17725Q87991R01294R10616R50868R59415R47427R85753J025020
4008B8685476J026660J067136J025481J099752J115946J119788J064197J023624
4000C7228060R57524Q64090Q50999P96410O94360O37289O09528N62479N77983
3991D3778722N18246M72182L53571L46990K95868J21079l4298j89271k41764k98488
3981D5122837m46280n04455n19960o00367n86500o23201o62041p36898q02122
3972C9641013q10177r00064j001467j088902j019311j099821j145820j131016
3964C1444435j098240j091512j040119j050125j000476r32613r59073r64538q55312
3955B2452427q76647q43620q51190r03783p68472o75937o75596n91081o15673
$$ plain form
4017 20199367 21117092 22005083 22906377 23816993 24767861 25727276 26674703 27660456 28685476
4008 28685476 29712136 30779272 31804753 32904505 34020451 35140239 36204436 37228060
4000 37228060 38185584 39049674 39900673 40697083 41391443 42028732 42638260 43200739 43778722
3991 43778722 44296968 44769150 45122721 45469711 45765579 45886658 45852360 45663089 45421325 45122837
3981 45122837 44676557 44172102 43652142 43051775 42465275 41842074 41180033 40443135 39641013
3972 39641013 38830836 37930772 36929305 35840403 34821092 33721271 32575451 31444435
3964 31444435 30346195 29254683 28214564 27164439 26163963 25231350 24272277 23307739 22452427
3955 22452427 21575780 20732160 19880970 18977187 18208715 17532778 16857182 16266101 15650428
3946A5650428n12934m53154m20253l91046l49306k67425k64805l11168l33834
3937A2346503l55514l11443k87235k23888k05519j47739j30414r0660o5869j8868
3927A0509354k2827M9484r78L8883P4892O4218J21035j7471L3478P4818P4175
3916A0999061J2232k8257k4431k8812m2299l3362q3355o5995k5904n9269k0474
3905A0599135k0349K5984k0218r7617j20469j90409k50859j79657j58980j67739
3895I418822q5660q3726n8161l2832k1095m6294j2598N9011O4523M9032R7343
3884I348365M9934J88826K18882J78861K46591K89539K81003L49659L41963M11407
3874A1905030M25452L98373L74864M53855M18679M17017L29075L02519J74542
$$ plain form
3946 15650428 15137494 14684340 14264087 13873041 13523735 13256310 12991505 12680337 12346503
3937 12346503 11990989 11679546 11392311 11168423 10962904 10815165 10684751 10594091 10528222 10509354
3927 10509354 10486527 10536011 10535033 10573916 10648808 10713026 10834061 10816590 10850068 10924886 10999061
3916 10999061 11011293 10983036 10958605 10929793 10887494 10854132 10770777 10704782 10678878 10619609 10599135
3905 10599135 10578786 10604770 10584552 10486935 10366466 10176057 9925198 9745541 9586561 9418822
3895 9418822 9333162 9249436 9191275 9158443 9137348 9091054 9078456 9137467 9201990 9251022 9348365
3884 9348365 9398299 9587125 9806007 9984868 10231459 10520998 10802001 11151660 11493623 11905030
3874 11905030 12330482 12728855 13103719 13557574 13976253 14393270 14722345 15024864 15199406
3865A5199406J24388Q3953N5896o545o7392l0826n1597q8788j35273j34979j87730
3854A4760513j52819j99368k68336m00538m49545l97024m59948m75968m65392
3845A1491575m70351m36192m07438l83243l31495k90459l18020k65391k56672
3836H332314k24777j50666j52177j63344j47748p6477p9873j14392q6816J2557
3826G148601r8346r0686n1806m7616r3048o1253k805n7912l0364l910o623M279
3814F608511N266k3973J5756j7566k8399n5349k3038M0913J0638l4905O0590N6945
3802F615389O4935Q4640P0405O9995M3316J13472J46163J00682J3960n4958j25273
3791G142726m6135j0541k8383M2013J5847O4744J39220J32400J80892J36801J34726
$$ plain form
3865 15199406 15323794 15407747 15463643 15457098 15389706 15358880 15307283 15218495 15083222 14948243 14760513
3854 14760513 14607694 14408326 14139990 13739452 13289907 12892883 12432935 11956967 11491575
3845 11491575 11021224 10585032 10177594 9794351 9462856 9172397 8854377 8588986 8332314
3836 8332314 8107537 7956871 7804694 7641350 7493602 7417125 7337252 7222860 7136044 7148601
3826 7148601 7050255 6959569 6907763 6860147 6767099 6705846 6703041 6645129 6614765 6610855 6604232 6608511
3814 6608511 6613777 6589804 6605560 6587994 6559595 6504246 6481208 6522121 6532759 6497854 6558444 6615389
3802 6615389 6680324 6764964 6835369 6905364 6948680 7062152 7208315 7308997 7322957 7267999 7142726
3791 7142726 7096591 7086050 7057667 7099680 7115527 7180271 7319491 7451891 7632783 7769584 7904310
3780G904310P3321L1680O1887m9256o1477j3174N0359K664R8209J49474J65991
3769H413988K05831L51444L96259L68871K29901M6165l01543l92105k53385j77715
3759H887711j32929m0849M8004J6279M0655L0844J01093N9368M9131O8893m76
3748I127724l0317r8634j40200j13779j03683o0080K6728J9729L4139Q3187J09722
3737H854536L0797L5872M2133M861j49355j36314j4317r8262l3605K7423L8277
3726H602046J5905R6037R3064L4377L7779J13965J52241R1320J17723P4506J11586
3715I540549J39671J51535J53451J15483R9552J43210J66848J61052K21524J66523
3705A1059398J12647J22591J85835J97274J60311Q8939J18365J90855J96784K18328
$$ plain form
3780 7904310 7977631 8009311 8071198 8021942 7960465 7947291 7997650 8000314 8098523 8247997 8413988
3769 8413988 8619819 8971263 9367522 9736393 9966294 10012459 9710916 9318811 9065426 8887711
3759 8887711 8754782 8713933 8761937 8778216 8818871 8849715 8950808 9010176 9059307 9128200 9127724
3748 9127724 9097407 8998773 8858573 8744794 8641111 8581031 8607759 8627488 8661627 8744814 8854536
3737 8854536 8885333 8921205 8963338 8968199 8818844 8682530 8668213 8569951 8536346 8563769 8602046
3726 8602046 8617951 8713988 8807052 8841429 8879208 8993173 9145414 9236734 9354457 9428963 9540549
3715 9540549 9680220 9831755 9985206 10100689 10200241 10343451 10510299 10671351 10892875 11059398
3705 11059398 11172045 11294636 11480471 11677745 11838056 11926995 12045360 12236215 12432999 12651327
3695A2651327J32601J34189J80124J66977J30716J46314J29013J97936J58150
3686A4027347K09470K54384J79605K16356K89078K51061L04872K79880K83512
3677A6295565K75586K80924L26383L37667L74486K80869L79703M31962M84195
3668A9467340N53534N33892N22321O05377O66134P17722P05036P85418Q25579
3659B5382353Q10195Q62800Q66386Q71208Q94096Q37035P79914Q24722P99191
3650C2927900O62173P41052O28301N77006N58353O08136N23341N35290M50358
3641C8211910L59472L18276K39329K13128J34722N460k6037r7700j26577k08548
3631C9023435j99114j28396j82549j82530j98157j42415j33424j26617j39250
$$ plain form
3695 12651327 12783928 12918117 13098241 13265218 13395934 13542248 13671261 13869197 14027347
3686 14027347 14236817 14491201 14670806 14887162 15176240 15427301 15732173 16012053 16295565
3677 16295565 16571151 16852075 17178458 17516125 17890611 18171480 18551183 18983145 19467340
3668 19467340 20020874 20554766 21077087 21682464 22348598 23066320 23771356 24556774 25382353
3659 25382353 26192548 27055348 27921734 28792942 29687038 30524073 31303987 32128709 32927900
3650 32927900 33590073 34331125 34959426 35536432 36094785 36702921 37226262 37761552 38211910
3641 38211910 38571382 38889658 39128987 39342115 39476837 39482297 39456260 39358560 39231983 39023435
3631 39023435 38824321 38695925 38513376 38330846 38132689 37990274 37856850 37730233 37590983
3622C7590983j82341j68889j00241l5400Q1369K9974J49536J75515J73986K91739
3612C8006231L36904M11893N01743O17847O75246P86959Q49918R29830J058096
3603D4174667J111083J174823J337943J282023J379356J391588J329017J310739
3595E4491239J200899J145910J079032J073906J028036R74713Q67570R51800R43234
3586F3756339Q46237P47139N85371M68019K29141J7554j57914m01105m61936n90743
3576F5038102p13872p26662o37455p43527o52868p11106p70191o84957o72549
3567E8724915p03915o72348n94080n45060m57167l06101k84368q835J43325K57101
3557E5553467M15860N54434O31157O45911P71367Q11437Q35572P86301P46232
$$ plain form
3622 37590983 37408642 37239753 37139512 37104112 37185481 37215455 37364991 37540506 37714492 38006231
3612 38006231 38343135 38755028 39256771 39874618 40549864 41336823 42186741 43116571 44174667
3603 44174667 45285750 46460573 47798516 49080539 50459895 51851483 53180500 54491239
3595 54491239 55692138 56838048 57917080 58990986 60019022 60993735 61861305 62813105 63756339
3586 63756339 64602576 65349715 65935086 66403105 66632246 66649800 66491886 66090781 65628845 65038102
3576 65038102 64324230 63597568 62960113 62216586 61563718 60852612 60082421 59397464 58724915
3567 58724915 58021000 57348652 56754572 56209512 55752345 55446244 55161876 55153041 55296366 55553467
3557 55553467 55969327 56523761 57154918 57800829 58572196 59383633 60219205 61005506 61751738
3548F1751738O96798P09005P46481P57990P29352P80575P28198O41421N75732
3539F8117290N24700M56393K49896M4185j84584l61141m06025n87412p17240q28005
3529F6308057r34735j035971j061707j095226j061457j034072r61188r10724q67307
3520E7345670q23848r10140r82680j074318j062008j015177r26406q71852p26347
3511D8952894n50861l94189k44791q8648M7446J78346L69112M26322N91730P33180
3501E0020541Q73188R46509J051626J208424J288715J375339J434224J389693
3493E9588259J398320J418266J467310J544415J583627J604438J773810J952130
3485G2330575K201563K397842K559833K889133L175997L464074L853239M290245
$$ plain form
3548 61751738 62448536 63157541 63904022 64662012 65391364 66171939 66900137 67541558 68117290
3539 68117290 68641990 69098383 69348279 69392464 69207880 68846739 68440714 67853302 67136062 66308057
3529 66308057 65373322 64337351 63275644 62180418 61118961 60084889 59123701 58212977 57345670
3520 57345670 56521822 55611682 54629002 53554684 52492676 51477499 50551093 49679241 48952894
3511 48952894 48402033 48007844 47763053 47674405 47721851 47900197 48269309 48695631 49287361 50020541
3501 50020541 50893729 51840238 52891864 54100288 55389003 56764342 58198566 59588259
3493 59588259 60986579 62404845 63872155 65416570 67000197 68604635 70378445 72330575
3485 72330575 74532138 76929980 79489813 82378946 85554943 89019017 92872256 97162501
3477I7162501M699393N041270N348090N376916N030941M494938L721728K616476
3469A33492253J471434L42559o81979j374514j872452j925750j724323j525299
3461A26201929j270378j040124j073813j188829j656666k489832l542786m618208
3453A09321293n595623o339048o765433o904263o739282o290842n669811m981142
3445F0035849m263796l599991l164113k763835k440016k111769j766118j589781
3437C8336430j413764j296092j091847j076961r43700q32310p43290o99052o66661
3428B9572753o62930o22344n20442n25415n25290m84508m70256m11239l57891
3419B4992438l93187l23869l44638k96644k87188k68489k40651k50262k07289
$$ plain form
3477 97162501 101861894 106903164 112251254 117628170 122659111 127154049 130875777 133492253
3469 133492253 134963687 135306246 134624267 133249753 131377301 129451551 127727228 126201929
3461 126201929 124931551 123891427 122817614 121628785 119972119 117482287 113939501 109321293
3453 109321293 103725670 97386622 90621189 83716926 76977644 70686802 65016991 60035849
3445 60035849 55772053 52172062 49007949 46244114 43804098 41692329 39926211 38336430
3437 38336430 36922666 35626574 34534727 33457766 32514066 31681756 30938466 30239414 29572753
3428 29572753 28909823 28287479 27767037 27241622 26716332 26231824 25761568 25350329 24992438
3419 24992438 24599251 24275382 23930744 23634100 23346912 23078423 22837772 22587510 22380221
3410B2380221k19864k09359k03948k00710j58713j19627j88370j47865r0264j61086
3400B0680415j24364j34234p61j25111j50537j00858j22242r2548o8473l291n2494
3389A9705502m7678j5929k4154J3729L256J0284l7040K6721N9487k1501P96q559
3377A9664914N0211J18114J11318J251M3993R0896O3807K7281J05594R2589M8646
3366B0418614J24271J21114J18798J52000J32667N1368J64267J65874O0290J26521
3356B1635784J45646J16930J91557J71959J28265K06642K11531J69619J83790
3347B3161723K26599K23050J92359J51432J99611J95389K11812K07017K35374
3338B5004366J94124K33066K28203K38554K68332K79238K82246K84507K67712
$$ plain form
3410 22380221 22160357 21950998 21747050 21546340 21387627 21268000 21079630 20931765 20841501 20680415
3400 20680415 20556051 20421817 20421056 20295945 20145408 20044550 19922308 19829760 19761287 19757996 19705502
3389 19705502 19657824 19641895 19617741 19631470 19634726 19645010 19607970 19634691 19694178 19672677 19673473 19664914
3377 19664914 19715125 19833239 19944557 19945808 19989801 20080697 20144504 20171785 20277379 20369968 20418614
3366 20418614 20542885 20663999 20782797 20934797 21067464 21118832 21283099 21448973 21509263 21635784
3356 21635784 21781430 21898360 22089917 22261876 22390141 22596783 22808314 22977933 23161723
3347 23161723 23388322 23611372 23803731 23955163 24154774 24350163 24561975 24768992 25004366
3338 25004366 25198490 25431556 25659759 25898313 26166645 26445883 26728129 27012636 27280348
3329B7280348L68375K75452K81583K60674K41868K94396K54829L63946K77055
3320B9898526K76737L01567L78302L88063L81587M32565M44376M54379M49975
3311C3406077M45140M87979N13082N78874N02819N20967O09521N96102N30087
3302C8190648N91476O18883N53301O37467O93375O82155O93691P06580P44151
3293D4111727P54510P46831O79179P15252P73290Q00043P67845Q39727R27467
3284E1115871Q98003R81418R64243R80639J040894J060509J062627J103709J101431
3275F0309344J122226J139461J185601J155043J158646J175691J181186J250504
3267F9677702J337919J342166J445750J539884J537714J612416J709074J774171
$$ plain form
3329 27280348 27648723 27924175 28205758 28466432 28708300 29002696 29257525 29621471 29898526
3320 29898526 30175263 30476830 30855132 31243195 31624782 32057347 32501723 32956102 33406077
3311 33406077 33851217 34339196 34852278 35431152 35933971 36454938 37064459 37660561 38190648
3302 38190648 38782124 39401007 39954308 40591775 41285150 41967305 42660996 43367576 44111727
3293 44111727 44866237 45613068 46292247 47007499 47780789 48580832 49348677 50188404 51115871
3284 51115871 52013874 52995292 53959535 54940174 55981068 57041577 58104204 59207913 60309344
3275 60309344 61431570 62571031 63756632 64911675 66070321 67246012 68427198 69677702
3267 69677702 71015621 72357787 73803537 75343421 76881135 78493551 80202625 81976796
3259H1976796J813449J849876J982258K064510K161113K258308K304888K375217
3251I8786415K565221K726478K833231K928719L082953L332200L653206L950087
3243A23858510M291495M728017N154612N643968O160191O746548P369990Q188859
3235A72142190Q782876R434661J0242830J0950120J1472950J1900029J1896145
3228B46821801J1574465J0575091Q843264O202088K826286j251729n567665r415926
3220B70607675j2051490j3230187j3053225j2248481j1029787r915895q831747
3213A90246863p872626p023155o271333n715550n188397m657167m234990l872665
3205A45410980l460770l166106k950939k825400k474776k314274k072048k024142
$$ plain form
3259 81976796 83790245 85640121 87622379 89686889 91848002 94106310 96411198 98786415
3251 98786415 101351636 104078114 106911345 109840064 112923017 116255217 119908423 123858510
3243 123858510 128150005 132878022 138032634 143676602 149836793 156583341 163953331 172142190
3235 172142190 180925066 190359727 200602557 211552677 223025627 234925656 246821801
3228 246821801 258396266 268971357 277814621 284016709 286842995 285591266 280023601 270607675
3220 270607675 258556185 245325998 232272773 220024292 208994505 199078610 190246863
3213 190246863 182374237 175351082 169079749 163364199 158175802 153518635 149283645 145410980
3205 145410980 141950210 138784104 135833165 133007765 130532989 128218715 126146667 124122525
3197A24122525j853299j836306j848876j828595j801010j819637j900181j905939
3189A09328682j922820k031007k113241k125719k156425k242892k164833k185209
3181I2386536k229319k159773k049478j993955j936367j903527j770860j693890
3173G6649367j601683j537736j435819j436760j319120j262864j248321j245274
3165F5561790j154085j109881j075113j061900j084837r60237r83727r77092r43386
3156E6211532r45476r15700q36745p42641p36884p96501p35397o76699p12338
3147D9113151o81009o05373n80119o16784o01511n58934n06526n37417n12989
3138D3912489m83569m70016m80648m61088m62594m99264m32842m02763l41631
$$ plain form
3197 124122525 122269226 120432920 118584044 116755449 114954439 113134802 111234621 109328682
3189 109328682 107405862 105374855 103261614 101135895 98979470 96736578 94571745 92386536
3181 92386536 90157217 87997444 85947966 83954011 82017644 80114117 78343257 76649367
3173 76649367 75047684 73509948 72074129 70637369 69318249 68055385 66807064 65561790
3165 65561790 64407705 63297824 62222711 61160811 60075974 59115737 58132010 57154918 56211532
3156 56211532 55266056 54350356 53513611 52770970 52034086 51237585 50502188 49825489 49113151
3147 49113151 48432142 47826769 47246650 46629866 46028355 45469421 44962895 44425478 43912489
3138 43912489 43428920 42958904 42478256 42017168 41554574 41055310 40622468 40219705 39878074
3129C9878074l81128m11453l70507l56199m09596k89779l65388l77503l72073
3120C6544448l46855l48374l33138l94079l62052k64216k43234k79382l30268
3111C3642850l65566k71674k82814l10483k72227k86979k38764k43054k50379
3102C1120910k20857k18801j85886j97748k19846j26395j37212k42996j64015
3093B9407154j94931k22146k07094j61157j50810j64772j40923j39627j51709
3084B7873985j53066j74782p9427j37796j85044r5466j44060j08796q0263j46455
3074B6568830r8479q9067r4441j56576q2535m1758l5336j05684r2481j08150r1546
3063B5572777p3555j38807m5075r7767p8735j05095j02519j41496j35729j52828
$$ plain form
3129 39878074 39496946 39085493 38714986 38358787 37949191 37659412 37294024 36916521 36544448
3120 36544448 36197593 35849219 35516081 35122002 34759950 34495734 34252500 33973118 33642850
3111 33642850 33277284 33005610 32722796 32412313 32140086 31853107 31614343 31371289 31120910
3102 31120910 30900053 30681252 30495366 30297618 30077772 29951377 29814165 29571169 29407154
3093 29407154 29212223 28990077 28782983 28621826 28471016 28306244 28165321 28025694 27873985
3084 27873985 27720919 27546137 27466710 27328914 27143870 27048404 26904344 26795548 26715285 26568830
3074 26568830 26470351 26381284 26286843 26130267 26047732 26005974 25970638 25864954 25772473 25664323 25572777
3063 25572777 25499222 25360415 25315340 25217573 25138838 25033743 24931224 24789728 24653999 24501171
3053B4501171j56500j43262j05140j64711j63826k32957j48901j58440j71811
3044B3055623j86797j53346j44259j82908j78783j59351j50427p0342j28336j54854
3034B1546220j19168o3363j23728j33181j22522j25473j22058j48265j06153j56398
3024B0325911j36540j74444k07859j98618j59955k18909k45000j72719j88398
3015A8623469j63478k13736j51409q8364p8951j38925m1241m1256j52452o4809
3005A7488848o2454j2421m4477p300N17j1396J9691m575L8960L8898J1678O3908
2993A7519877K133Q2955M2196M1013k3511j0455n0461R4133R1533N3109J24101
2982A7966623O1732J07592R5277J45507R4513J26509J48214R3208N6074J47130
$$ plain form
3053 24501171 24344671 24201409 24096269 23931558 23767732 23534775 23385874 23227434 23055623
3044 23055623 22868826 22715480 22571221 22388313 22209530 22050179 21899752 21829410 21701074 21546220
3034 21546220 21427052 21363689 21239961 21106780 20984258 20858785 20736727 20588462 20482309 20325911
3024 20325911 20189371 20014927 19807068 19608450 19448495 19229586 18984586 18811867 18623469
3015 18623469 18459991 18246255 18094846 18006482 17927531 17788606 17747365 17706109 17553657 17488848
3005 17488848 17426394 17413973 17369496 17362196 17362713 17351317 17371008 17366433 17405393 17444291 17455969 17519877
2993 17519877 17522010 17604965 17647161 17688174 17664663 17654208 17603747 17697880 17789413 17842522 17966623
2982 17966623 18028355 18135947 18231224 18376731 18471244 18597753 18745967 18839175 18895249 19042379
2972A9042379J09581L2545M1463Q6404J15662J03608J36282J84217J87154K08946
2962B0248241K28131L05937L29243K85845L07607K23152K11595K52013K44874
2953B2636638J72357J92102K15277K69051L02663L56935L55001L47558K74479
2944B5122061L07510L28687L28198K59996K99839K51596L41884M33332M18000
2935B8091103M40681M99351N35089N11157N52179N65346O71831P40993P61271
2926C3369001P32262Q63884R19405R76314J013379J120907J171075J277172J317299
2917D2760698J351273J384131J436516J387072J306685J196351J126681J011135
2909E2960542Q24327O44691N75345N58386M86430N36185O13051O52371O98512
$$ plain form
2972 19042379 19151960 19184505 19225968 19312372 19428034 19531642 19667924 19852141 20039295 20248241
2962 20248241 20476372 20782309 21111552 21397397 21705004 21928156 22139751 22391764 22636638
2953 22636638 22808995 23001097 23216374 23485425 23788088 24145023 24500024 24847582 25122061
2944 25122061 25429571 25758258 26086456 26346452 26646291 26897887 27239771 27673103 28091103
2935 28091103 28531784 29031135 29566224 30077381 30629560 31194906 31866737 32607730 33369001
2926 33369001 34101263 34965147 35884552 36860866 37874245 38995152 40166227 41443399 42760698
2917 42760698 44111971 45496102 46932618 48319690 49626375 50822726 51949407 52960542
2909 52960542 53784869 54429560 55004905 55563291 56049721 56585906 57198957 57851328 58549840
2900E8549840Q16424J008943J109990J312710J556989J746809K007549K321387
2892G0430641K580778K782667L029452L282371L456179L538597L653873L516588
2884I6271146L114906K198107R69099l85261j699429k744437l395674l509299
2876I0819158l097988k432589j859622j199593o11237k7971L76561P26639J140712
2867H3834070J494770J772043K015599K362448K468011K502515K588177K491297
2859A01528930K387111K165704J749897J104001J90421p12127j558225k264419
2851A04591293k813505l307616l741518m092832l960657l443734k915798k341274
2843G7974359j795078j358533r82607n56747k48923Q0915K04992L24518M09050
$$ plain form
2900 58549840 59366264 60375207 61485197 62797907 64354896 66101705 68109254 70430641
2892 70430641 73011419 75794086 78823538 82105909 85562088 89100685 92754558 96271146
2884 96271146 99386052 101584159 102553258 102167997 100468568 97724131 94328457 90819158
2876 90819158 87721170 85288581 83428959 82229366 81618129 81590158 81966719 82693358 83834070
2867 83834070 85328840 87100883 89116482 91478930 93946941 96449456 99037633 101528930
2859 101528930 103916041 106081745 107831642 108935643 109126064 108413937 106855712 104591293
2851 104591293 101777788 98470172 94728654 90635822 86675165 83231431 80315633 77974359
2843 77974359 76179281 74820748 73838141 73281394 73032471 73113386 73318378 73642896 74051946
2834G4051946L17573P3318j97502n37906r10311j339006j668797k030393k462606
2825F5296316k813615l054756l010772k823397k570232k339736k032460j934778
2817D4716570j755302j581335j510037j376867j181268j099337j022779r03041
2809C4286604q75734p58470o78036o61004o05367o15989o17664o46014p26590
2800B8101736p95169q36793q97738p90517p46633p39643o83038o50917o34000
2791B1327288n29646n18935n01716m59585m64431m26779m77774m19340m10257
2782A7118825m54797m15982l31398k98604l00671k91381k28002k30111j84162
2773A4383717k44632k10360j49621j29312j55696j56918j98574k11664k41801
$$ plain form
2834 74051946 74369519 74442837 74245335 73707429 72797118 71458112 69789315 67758922 65296316
2825 65296316 62482701 59427945 56417173 53593776 51023544 48683808 46651348 44716570
2817 44716570 42961268 41379933 39869896 38493029 37311761 36212424 35189645 34286604
2809 34286604 33410870 32652400 31974364 31313360 30707993 30092004 29474340 28828326 28101736
2800 28101736 27306567 26469774 25572036 24781519 24034886 23295243 22612205 21961288 21327288
2791 21327288 20797642 20278707 19776991 19317406 18852975 18426196 17948422 17529082 17118825
2782 17118825 16664028 16248046 15916648 15618044 15317373 15025992 14797990 14567879 14383717
2773 14383717 14139085 13928725 13779104 13649792 13494096 13337178 13138604 12926940 12685139
2764A2685139k18786k83569l04857j94906k76932k09729k46271k39091j93332
2755A0517666j96432k29453k00289k05113j84121k02186j92066j15539j60679
2746H831788j32312p1045q6506j21769m5700l7946q2977o3670o3021j38210j38974
2735G849658j29125j47215j67643j63855k01265j73240j04594j70096j03829j26297
2725F362499j52205p4856q7964r7214j08067j40813r9695q8588j21267o2160m6422
2714E283248o2837r1575q3438k9335p7285j00425r1297r0228m3620n9882k4062
2703D529264j15264o7167j3984q4018o9806j9712n4054n6873m1279k5690j19009
2692C862408k8334J8846l1091o6527q8225j1905j4982n4708j7290p156q444l0879
$$ plain form
2764 12685139 12466353 12182784 11877927 11683021 11406089 11196360 10950089 10710998 10517666
2755 10517666 10321234 10091781 9891492 9686379 9502258 9300072 9108006 8992467 8831788
2746 8831788 8699476 8628431 8541925 8420156 8374456 8336510 8253533 8189863 8126842 7988632 7849658
2735 7849658 7720533 7573318 7405675 7241820 7040555 6867315 6762721 6592625 6488796 6362499
2725 6362499 6210294 6135438 6047474 5950260 5842193 5701380 5601685 5513097 5391830 5329670 5283248
2714 5283248 5220411 5128836 5045398 5016063 4938778 4838353 4747056 4656828 4613208 4553326 4529264
2703 4529264 4414000 4346833 4332849 4248831 4179025 4159313 4105259 4048386 4007107 3981417 3862408
2692 3862408 3834074 3852920 3821829 3755302 3667077 3655172 3640190 3585482 3568192 3561036 3552592 3521713
2680C521713n8581J9692o2612o2496K9483j2560o6180r72n1478m0999n1001l2659
2668C131350j6757l6195n0898J4658j3855o3183k8515k3915l068j437K8467j1555
2656B925097o7076n0863m5112L733P802K1423p3491q1085q912J096k8029k2140
2644B582443k2738N9341j7380n1133J7927k6893j3942N6011J2438j0076k9106
2633B556892R165l9123k1927L8783m2336L981m8446j4698l9894N3241m3665m9328
2621B362645N4620P244k4248r0240J5382L5170L343l6872K8267k7415j6387M7373
2609B358882L5194J1090L8768j2166J5308J8657L9923K9091J8395M8119m5082
2598B556179l4310J2850k7765l5036j9477j4367n1747l1757m758l1576m7008l5505
$$ plain form
2680 3521713 3463132 3482824 3420212 3357716 3387199 3374639 3308459 3307487 3256009 3215010 3164009 3131350
2668 3131350 3114593 3078398 3027500 3042158 3028303 2965120 2936605 2912690 2909622 2908185 2936652 2925097
2656 2925097 2858021 2807158 2762046 2765779 2773581 2795004 2721513 2640428 2631516 2632612 2604583 2582443
2644 2582443 2559705 2619046 2601666 2550533 2568460 2541567 2527625 2583636 2596074 2585998 2556892
2633 2556892 2566057 2526934 2505007 2543790 2501454 2505435 2456989 2442291 2402397 2455638 2411973 2362645
2621 2362645 2417265 2424509 2400261 2310021 2325403 2360573 2363916 2327044 2355311 2327896 2311509 2358882
2609 2358882 2394076 2405166 2443934 2431768 2447076 2465733 2505656 2534747 2553142 2601261 2556179
2598 2556179 2521869 2534719 2506954 2471918 2452441 2438074 2386327 2354570 2349812 2318236 2271228 2235723
2586B235723L4364M1610n6238l9267O2259R616K5801k3113L7003r079N1617q361
2574B361935o981L5479R7407q213k881k0273k9747M527j8521j6307l9427k6413
2562B330585m4490n2369j01796r032j0380j8836K0045l6510q696k5241M367K0472
2550B068119k0202q0213k947L6816l2502l5000J2411k0521m4947k9123m7989P876
2538A811778o5954l4764r228l1334j1984O558L7969O211l9059O52l6423m9542
2526A584880O676n1314m3411N030n5803l1350j5368n3615n500j988J7949l4326
2514A321860j8500m575l4488m29L2038m7778l4586J2492l5231M115L17o019k469
2501A186747l9535m0301P507j8813r817j9133J9362l5928k8231j8500P936l5897
$$ plain form
2586 2235723 2270087 2311697 2255459 2216192 2278451 2288067 2313868 2290755 2327758 2318679 2370296 2361935
2574 2361935 2354954 2390433 2487840 2479627 2476746 2456473 2426726 2431253 2412732 2396425 2356998 2330585
2562 2330585 2286095 2233726 2131930 2122898 2112518 2093682 2113727 2077217 2068521 2043280 2047647 2068119
2550 2068119 2047917 1967704 1964757 2001573 1969071 1934071 1946482 1925961 1881014 1851891 1803902 1811778
2538 1811778 1745824 1711060 1701832 1670498 1658514 1665072 1703041 1709252 1670193 1670845 1634422 1584880
2526 1584880 1591556 1540242 1496831 1501861 1446058 1414708 1399340 1345725 1340225 1338237 1356186 1321860
2514 1321860 1303360 1298785 1264297 1263868 1295906 1248128 1213542 1226034 1190803 1194918 1195235 1189216 1186747
2501 1186747 1147212 1106911 1114418 1095605 1085788 1066655 1086017 1050089 1021858 1003358 1011294 975397
2489I75397j7927k0626j8805j7176l8610l98p968n7182j67L5768M2955k9124n4823
2476G91314J4803J2463k5234o4328j7543p123K0060k0711j5034N4002L705n8272
2464F88102J2913j9167K3636q191n9495j8593L0000L9099k1743M6886k5785n5434
2452F32228j3609o564J9414m5107q110P58R701J2109n7895n0812N974P782L2095
2439E37964P27k1997m8961l7690L4434j460K4755q3191L3703j1103j4483K0584
2427D33282k9400K1763l9246K5410m0276q457J8053r858P154n523P607M669q017
2414C77161l5813j871n3348o5441L2400O2638K2033k5327n5932j7781J9126L881
2402B61726J1748k5556L956k7221k1770L7587r162J3424m8990K8668L547j1056
$$ plain form
2489 975397 957470 936844 918039 900863 862253 861855 853887 796705 796538 832306 875261 846137 791314
2476 791314 806117 818580 793346 729018 711475 704352 724412 703701 688667 742669 746374 688102
2464 688102 701015 681848 705484 697293 637798 619205 649205 688304 666561 713447 687662 632228
2452 632228 618619 612055 631469 586362 578252 579010 588711 600820 542925 492113 498087 505869 537964
2439 537964 538691 516694 467733 430043 464477 463017 487772 404581 438284 427181 412698 433282
2427 433282 403882 425645 386399 411809 371533 363076 381129 371271 378425 372902 380509 385178 377161
2414 377161 341348 339477 286129 220688 253088 315726 337759 312432 256500 238719 257845 261726
2402 261726 273474 247918 251874 224653 202883 240470 231308 244732 195742 224410 227957 216901
2390B16901k5745J2179l4770J5411M9103j3962K1916n2377K431M1273k7153j9169
2378A86038r631l5985k089l230J2841K0261K6928p8715j6933J0597L4053j7364
2366A26771j5320l165M017m237j933r683j7597j1395L0122L4423O50m3500j5931
2353G3222M1044j258K8944O705K5206k2291o835K8279l6762o2218k6650O5487
2341A12873m5775r69P0469n864m2474n3643L3796K0408l4093l2452K2453P357
2329E2086k2074J7647J0122m1451J9258j0403j2000L3495j6613Q438n893k1444
2317A1168p517k995J7055R664j6970K9116l4538k0043J3848M254l4536M6546K6951
2304D2003r9j6923O925k3842l1072j3661l2055O0878M5913l2724o5125n783L3536
$$ plain form
2390 216901 191156 203335 168565 183976 233079 219117 241033 188656 191087 232360 205207 186038
2378 186038 176407 140422 138333 135103 147944 168205 195133 116418 99485 110082 144135 126771
2366 126771 111451 108286 112303 108066 106133 96450 78853 67458 97580 132003 132653 89153 73222
2353 73222 114266 113008 141952 148657 173863 151572 144737 173016 136254 74036 47386 112873
2341 112873 67098 66129 136598 130734 88260 34617 68413 88821 54728 22276 44729 52086
2329 52086 30012 47659 57781 16330 35588 25185 13185 46680 30067 38505 32612 11168
2317 11168 3651 656 17711 27375 10405 39521 4983 -15060 -1212 3042 -31494 15052 42003
2304 42003 41904 24981 31906 8064 -23008 -36669 -68724 -7846 38067 5343 -59782 -65565 -32029
2291c2029R452M2881l3647M1847l0471n529K4690m0830M1614J5633J4008j6889
2279C0730O022k0621n5480m0040j9447K2443L6773n7546L4256k4043J2169L0923
2267d3861L744M5675L3876k3936o7736M5746K0238o1198k8313j6544J5606L6463
2255d0240j6026j6297L695O587N059L5764O0719o1456O913l2226K8104n990k6468
2242e1862k0636K6800P200R43K4704k7473k3436J530L5057L7095m9052R832K1836
2229g462M8402k6891l5991l5309N7903K4747O823o2590n6357N1012j3094o232
2217e5039J3537K1349k1677j1948j0710J3727K2029K0292l618N071m2356J1917
2205c7426l688M3125m5790L7325K267j2309n538O002M7190o210J3950K1324K809
$$ plain form
2291 -32029 -22577 20304 -13343 28504 -1967 -7496 17194 -23636 17978 33611 47619 30730
2279 30730 36752 16131 -39349 -79389 -98836 -76393 -39620 -97166 -62910 -86953 -74784 -43861
2267 -43861 -40117 5558 39434 15498 -52238 -6492 13746 -47452 -75765 -92309 -76703 -40240
2255 -40240 -56266 -72563 -68868 -62281 -57222 -21458 39261 -22195 -15282 -47508 -19404 -25394 -51862
2242 -51862 -72498 -45698 -38498 -37555 -12851 -40324 -63760 -62230 -27173 9922 -39130 -29298 -7462
2229 -7462 40940 14049 -21942 -57251 652 25399 32222 -30368 -86725 -35713 -48807 -55039
2217 -55039 -41502 -20153 -41830 -53778 -64488 -50761 -28732 -8440 -12058 -6987 -49343 -37426
2205 -37426 -41114 2011 -43779 -6454 -4187 -16496 -22034 -16032 31158 24948 38898 60222 63031
2192F3031L743q576K7363j1861p9313m068L4724o8706K4517Q9220J9745j0997
2180G8822K3674l319k2843L7262P772K8386M420J1501O605l1110k6344J0255j1304
2167A13777k7923P7252j1078J6304K0677L6812j391j4770l7161J8098L1043O2532
2155B84172K563n9725J5466P265M266N8875J3399l6898K6435K5462L5136M1791
2143D18207N4563j8341l3145K5928j3670j5446M8043j0650j0991M2363Q613J1011
2131E06485j1869M4385j7319M701L9095J9356N5397K0904L8101R3935M8808j4251
2119H27728P7411O3668N7465M6490M6813L9950K2302M3177Q5055J08737Q1578
2108A500374P7161J55907J16697N2039J28027J37967J21465K24573K09061K69002
$$ plain form
2192 63031 66774 58198 85561 73700 -5613 -9681 25043 -43663 -19146 70074 89819 78822
2180 78822 102496 99177 76334 113596 121368 149754 154174 165675 172280 141170 114826 125081 113777
2167 113777 85854 163106 152028 168332 189009 225821 224430 209660 172499 190597 221640 284172
2155 284172 286735 227010 242476 249741 254007 312882 326281 289383 315818 341280 376416 418207
2143 418207 472770 454429 421284 447212 433542 418096 466139 455489 444498 486861 495474 506485
2131 506485 494616 539001 521682 526383 565478 584834 640231 661135 699236 793171 841979 827728
2119 827728 905139 968807 1026272 1072762 1119575 1159525 1181827 1225004 1310059 1418796 1500374
2108 1500374 1577535 1733442 1850139 1902178 2030205 2168172 2289637 2514210 2723271 2992273
2098B992273K35174K23613J61937J92042L02047M21955N65961P34452Q25591J153526
2088G808571J478468J921953K139653K844095L289409K192029j857861m368539
2080A5447778l348436k561267j885947j353810q69716p62224n35420l94079l40987
2071C395892l02438k02731j04507j49341k24159k69448j59863j25449j31001j12616
2061A614339j48546q0589n7526o0420r2217j7755j15476o672l5623p9366q4080
2050H36069o1709p5521q3353K6596K1556l7483n73l1053j8293L1610j09k2521
2038E85216n7360l6532N221n1604l8099N9103p7774L0277p536o7386R871J3761
2026C67158k287n1669r184l0524l3458l1454J8476k8038j5400o849O255l880l7540
$$ plain form
2098 2992273 3227447 3451060 3612997 3805039 4107086 4529041 5095002 5829454 6655045 7808571
2088 7808571 9287039 11208992 13348645 16192740 19482149 21674178 19816317 15447778
2080 15447778 12099342 9538075 7652128 6298318 5428602 4666378 4130958 3736879 3395892
2071 3395892 3093454 2890723 2786216 2636875 2412716 2143268 1983405 1857956 1726955 1614339
2061 1614339 1465793 1385204 1327678 1267258 1175041 1157286 1041810 1035138 999515 920149 836069
2050 836069 774360 698839 615486 642082 663638 626155 625582 594529 576236 607846 607737 585216
2038 585216 527856 491324 496545 444941 406842 465945 388171 418448 410912 343526 353397 367158
2026 367158 364871 313202 304018 273494 240036 208582 227058 199020 183620 176771 183026 179146 141606
2013A41606K146J1532K5340l4082j3250j3947j7108L2185k5793J939l1506k284
2001G6778j5481m571N7541L004N221n0796K4021j7959K5447M523m3802j4572k2528
1988B6826M291m1244M4744N9586k3969l7994k1705L596L9695R980j9777n4815
1976a0786M7777O103o4248M7811j5219K3485K7631m6228l1499j0735p100k4426
1964e7434K5094K9881M2690Q373k2016N3o6438L0795n269O617j4665J5508J6043
1951I232m6836r154M3195L9247p633m1072k0318n007l3760J3367L8796n3020L0838
1938d2125J9914L3552L3911R747q386m2867n2333N429J0785J2390J8923j0393
1926a1453J5024K2104K8470n1162l7527p1m8967J0229J3783k3388n839j4247P4294
$$ plain form
2013 141606 143752 155284 180624 146542 133292 119345 102237 134422 108629 110568 79062 76778
2001 76778 61297 56726 114267 117271 122492 71696 95717 77758 103205 107728 63926 49354 26826
1988 26826 31117 -10127 34617 94203 70234 32240 10535 14131 53826 63806 44029 -10786
1976 -10786 36991 43094 -21154 26657 11438 34923 62554 16326 -15173 -25908 -33008 -57434
1964 -57434 -32340 -2459 40231 48604 26588 26641 -39797 -9002 -14271 -7654 -22319 -6811 9232
1951 9232 -37604 -46758 -3563 35684 28051 -13021 -33339 -38346 -72106 -58739 -19943 -72963 -42125
1938 -42125 -22211 11341 45252 54999 46613 3746 -48587 -43158 -32373 -19983 -1060 -11453
1926 -11453 3571 25675 54145 2983 -34544 -34615 -83582 -73353 -59570 -82958 -88797 -103044 -28750
1913b8750j6823j8757j8312K9115K6507k0398L5882K5899n4844k327l3746J4265
1901f2289Q5537j7296m1572l6285O4275L921p7435j0745L0394J9267M5278Q96
1889C946l5638l7004l0731o012K2440L6347k7492J5145j9453O702n095Q030j4311
1876h3126k693L7906K6354K1141k2915l7098K2486o8k2335j4060J4460O096j3679
1863f7531J0780J9115l0920m9262k5050M1941K5820N4066M3396j5818l8841n0720
1851h3024k4369J2843J214K5461j8044M114K4791l4252L2887n741l5691K722L6805
1838f0284J1711O570O947J11P924l2540l0283L4121k3133M2309j2056o5005N5032
1825e8576J6064l0658L7003J2578K459j6661O590j0066k5155J875L6763K6082
$$ plain form
1913 -28750 -45573 -64330 -82642 -53527 -27020 -47418 -11536 14363 -40481 -42808 -76554 -62289
1901 -62289 23248 5952 -35620 -71905 -7630 -3709 -81144 -91889 -61495 -42228 3050 3946
1889 3946 -31692 -68696 -99427 -105439 -82999 -46652 -74144 -58999 -78452 -71750 -76845 -68815 -83126
1876 -83126 -85819 -47913 -21559 -418 -23333 -60431 -37945 -38013 -60348 -74408 -59948 -53852 -67531
1863 -67531 -56751 -37636 -68556 -117818 -142868 -100927 -75107 -21041 22355 6537 -32304 -83024
1851 -83024 -107393 -94550 -93336 -67875 -85919 -81805 -57014 -91266 -58379 -64120 -99811 -97089 -60284
1838 -60284 -48573 -42003 -35056 -34945 -27021 -59561 -89844 -55723 -78856 -36547 -48603 -113608 -58576
1825 -58576 -42512 -73170 -36167 -23589 -21130 -37791 -31201 -41267 -66422 -64547 -27784 -1702
1813a702k8991o7K9025p248j8110J0762l3588O957Q826k4092k4005J2547J039
1800f8647j935J2996l0891J7418k3042l9595k3324N9087K4193j4692J0962m600
1788h2070J4498k3143M0529K8740j9104k0156j7683M0649m1688J2861O505j5797
1776g5859k3640j1401K2556J5134L4756j9437J8830L864m4510m2769K1314J7136
1764h4026R512o719j9487n870J1434l1701J6509N6347k6893j5945j5935O4023
1752d8751L1640l1029o946k6207q03o806l2281J3137j9793J6801N3718M4978N233
1739g109j2414J4379l6644o9862M5826K4435l0074k9153J0112k385M6788j9658
1727f5759m346K4638K8617n769J3515N0910m8628o209m2578q623k6825k43p380
$$ plain form
1813 -1702 -30693 -30760 -1735 -8983 -27093 -16331 -49919 -42962 -34136 -58228 -82233 -69686 -68647
1800 -68647 -70582 -57586 -88477 -71059 -94101 -133696 -157020 -97933 -73740 -88432 -77470 -82070
1788 -82070 -67572 -90715 -50186 -21446 -40550 -60706 -78389 -37740 -79428 -66567 -60062 -75859
1776 -75859 -99499 -110900 -88344 -73210 -38454 -57891 -39061 -35197 -79707 -122476 -101162 -84026
1764 -84026 -74514 -81233 -100720 -106590 -95156 -126857 -110348 -54001 -80894 -96839 -112774 -48751
1752 -48751 -17111 -48140 -55086 -81293 -82096 -88902 -121183 -108046 -127839 -111038 -57320 -12342 -7109
1739 -7109 -19523 -5144 -41788 -111650 -65824 -41389 -71463 -100616 -90504 -92889 -46101 -65759
1727 -65759 -70105 -45467 -16850 -22619 -9104 41806 -6822 -13031 -55609 -64232 -91057 -91300 -98680
1714i8680M1325K0663j4576o0403J6587K6695j4283J0091q30M559j691j1139J0267
1701g1415L877m9752J5747K4498m704n7003K1762P5265J8028k6060K3470J3684
1689a2603o5360P610m3616K3080N9359n114m4018K0300O6350j3255m8546o3083
1677a18896o08N5470l5805k446K8473K8018k7010k8504J9559m943K4803K7943
1665c3946n9249J3943j8113j0660K4772M360K1291j3469K8728j9438k6334M3109
1653d5006O40j4492l3897N760O225l2245J6635K1885l9918J3617M0754k9793J8502
1640g1333M7870k1462j5183o639j402k1163K4643K3334K780J0488J5760K5156
1628A2849j9125l0463J4291L0632n0317J7788L321j0344k9670k075K4582J8940
$$ plain form
1714 -98680 -57355 -36692 -51268 -111671 -95084 -68389 -82672 -72581 -73411 -68852 -70543 -81682 -71415
1701 -71415 -67538 -117290 -101543 -77045 -81749 -138752 -116990 -41725 -23697 -49757 -26287 -12603
1689 -12603 -77963 -70353 -113969 -90889 -31530 -36644 -80662 -60362 5988 -7267 -55813 -118896
1677 -118896 -119504 -64034 -99839 -102285 -73812 -45794 -72804 -101308 -81749 -86692 -61889 -33946
1665 -33946 -93195 -79252 -97365 -108025 -83253 -78893 -57602 -71071 -42343 -61781 -88115 -45006
1653 -45006 -44366 -58858 -92755 -86995 -80770 -113015 -96380 -74495 -114413 -100796 -60042 -89835 -71333
1640 -71333 -23463 -44925 -60108 -66747 -68149 -89312 -64669 -41335 -38555 -28067 -12307 12849
1628 12849 -6276 -36739 -22448 8184 -42133 -24345 -21024 -31368 -61038 -63113 -38531 -19591
1616a9591l0784l1050j0838L9036m7115J05K4449j1617l4617K69O9099L1552J403
1603a9699k4179k4134N1145j665l1871j4172p292p569K2047J3846j1511j6401
1591g1455j4924K7392P609m851K6367r290l870l5491p013L3993N4480k1337n7243
1578g5633J8682k3202L0002K1518k7373R922M48K8674m7406p424R105q859L0748
1565d0798j847J6957l7293j3455m1q667j817M9439J828l3274J7741M6287o8699
1552g3639L6593M234Q07l8429j5558M5057M8777k5676k8647L3841q2023j460j1907
1539a08030m277J330P6076o0709L507M9030k1216k7835m0723P4532o092M773J2184
1526d7450p044J0696P973l5891j5103J5849P435k1239K1308j2749N0288q971r761
$$ plain form
1616 -19591 -50375 -81425 -92263 -53227 -100342 -100237 -75788 -87405 -122022 -121753 -52654 -21102 -19699
1603 -19699 -43878 -68012 -16867 -18532 -50403 -64575 -71867 -79436 -57389 -43543 -55054 -71455
1591 -71455 -86379 -58987 -51378 -56229 -29862 -39152 -43022 -78513 -85526 -51533 2947 -18390 -75633
1578 -75633 -56951 -80153 -50151 -28633 -56006 -46084 -45636 -16962 -64368 -71792 -62687 -71546 -40798
1565 -40798 -42645 -25688 -62981 -76436 -76477 -85144 -86961 -37522 -35694 -68968 -51227 -4940 -73639
1552 -73639 -37046 -32812 -32005 -70434 -85992 -40935 7842 -17834 -46481 -12640 -94663 -96123 -108030
1539 -108030 -112307 -110977 -34901 -95610 -92103 -43073 -64289 -92124 -132847 -58315 -64407 -59634 -47450
1526 -47450 -54494 -43798 -35825 -71716 -86819 -70970 -63535 -84774 -63466 -76215 -25927 -34898 -44659
1513d4659L0087j2737j4984K1135j8424l055j2205R018j9840j6723q234L2582
1501e8039l6608J4709L4629J8706K9798k2436K946j9874L6976o5360N337K2529
1489c6687N03o443J581j3018L4369k0825l5242m5046R928K2696N0090N4503l4107
1476a7698j0180j7959j356M3705l1614L1803K1269j0352j9033m8075k0111J1449
1464f8152J0696K9210k5998j6887L5299J3316l9849k0553m2053M0149L6003j2804
1452f1623M1233J790j0442l6268k4936J2791J228J9550P8934r584o6606j2757
1440f6690O6615l8456k2046K917j7867k6103N1889J1773J6291N2631l9371m9825
1428e8242J2239k9598k8998K0583J7220l1719Q247M0705l9629L8290K2610J7840
$$ plain form
1513 -44659 -14572 -27309 -42293 -21158 -39582 -42637 -54842 -45824 -65664 -82387 -90621 -58039
1501 -58039 -94647 -79938 -45309 -26603 3195 -19241 -16295 -36169 807 -64553 -59216 -36687
1489 -36687 -36184 -42627 -41046 -54064 -19695 -40520 -75762 -120808 -110880 -88184 -38094 16409 -17698
1476 -17698 -27878 -45837 -47193 -3488 -35102 -3299 17970 7618 -11415 -59490 -79601 -68152
1464 -68152 -57456 -28246 -54244 -71131 -35832 -22516 -62365 -82918 -124971 -84822 -48819 -61623
1452 -61623 -20390 -18600 -29042 -65310 -90246 -77455 -76227 -56677 22257 12673 -53933 -66690
1440 -66690 -75 -38531 -60577 -57660 -75527 -101630 -49741 -37968 -21677 30954 -8417 -58242
1428 -58242 -46003 -75601 -104599 -84016 -66796 -98515 -90268 -49563 -89192 -50902 -28292 -10452
1416a0452o135M145m8141K8410j6292m6133L1371J0507k6757P2078J900j3159
1404a8658m711k7046L3128j96l7946J7954j7589K503J936j5046J8191J2705M1990
1391G215n6623L3261L2089j3218m9878J9838P61K7281l0453j5800k646J7838K6478
1378c857J1951k1652l5926R668J0006k0025j4643J9798Q781l2873J6629J1031
1366d1112J5358n167K8010k1918n0128p0365Q2575K6113k2100j8521Q0941J4883
1354A8569m7273j422O717k6614r540K1697L6696j5599n0836o630J5463M6118j2867
1341b5521k9744m3490L5085j6011K1227m2978J6618k8834P4878q209O0530M3972
1329E7523k0521l4475k5859j5507K3359L4236l4161J5623o525k2828l2722j2307
$$ plain form
1416 -10452 -16587 -12442 -60583 -32173 -48465 -94598 -63227 -52720 -79477 -7399 -5499 -18658
1404 -18658 -23369 -50415 -17287 -17483 -55429 -37475 -55064 -52561 -50625 -65671 -47480 -34775 7215
1391 7215 -49408 -16147 15942 2724 -47154 -27316 -26555 726 -29727 -45527 -48173 -30335 -3857
1378 -3857 8094 -13558 -49484 -39816 -29810 -49835 -64478 -44680 -35899 -68772 -52143 -41112
1366 -41112 -25754 -30921 -2911 -24829 -74957 -145322 -62747 -36634 -58734 -77255 3686 18569
1354 18569 -28704 -30126 -23409 -50023 -59563 -37866 -1170 -16769 -67605 -74235 -58772 -12654 -25521
1341 -25521 -55265 -98755 -63670 -79681 -58454 -101432 -84814 -113648 -38770 -46979 13551 57523
1329 57523 37002 2527 -23332 -38839 -15480 18756 -15405 218 -6307 -29135 -61857 -74164
1317g4164K5459L6716K9467m1546J4856l9585K3584M0208J667p7616o611J4739
1305e2826N8363K9887k2283k4518k7565J0974J9931q3711m941O5342q732J711
1293c8368j4283L1017L4165K1972K9326j8527j0917K761m2257Q172j4173L3885
1281B2773j2703j3415o780j8058k175M8218q280o455J0685J1865n2661o598J812
1268c1772Q398K1422L0339l5361J7898m2589j6673L8836J4553J60K4179m9756
1256b0366K5163J5968n0736k5869n221N4003R978L978m6j798o5012j7239L5832
1243d1365K9329j9337l6052J6251j213K9176R740k5709K2508l4305L1955O634
1231a2388J4225j6375K8961q339K5120j1108k4281n770J602l832k0310l5698r566
$$ plain form
1317 -74164 -48705 -11989 17478 -24068 -9212 -48797 -25213 14995 16662 -60954 -67565 -52826
1305 -52826 5537 35424 13141 -11377 -38942 -27968 -8037 -91748 -96689 -31347 -40079 -38368
1293 -38368 -52651 -21634 12531 34503 63829 45302 34385 37146 -5111 3061 -11112 22773
1281 22773 10070 -3345 -10125 -28183 -30358 17860 9580 3125 13810 25675 -26986 -33584 -31772
1268 -31772 -23374 -1952 28387 -6974 10924 -31665 -48338 -9502 5051 5211 29390 -20366
1256 -20366 4797 20765 -29971 -55840 -61061 -7058 2920 6898 6852 5054 -59958 -77197 -41365
1243 -41365 -12036 -31373 -67425 -51174 -52387 -23211 -13471 -39180 -16672 -50977 -19022 -12388
1231 -12388 1837 -14538 14423 6084 31204 20096 -4185 -9955 -8353 -12185 -32495 -68193 -77759
1218g7759P3925L1876k4354m2211J4973k1266j8244K2659J4417Q127O6596m0367
1206H372m0261L1037J0110j7180j6046q255J8375k6455L6464J3170m8012k2841
1194f1522M2154l2057p73K0450l1818k9916k733K4878L8622L1217k7859Q614k0595
1181d1338j1061L222J7811k0629k7380L4625p478k067J6568j5575K1655M0943
1169I296k6509J0363L2718j7268r576m7442K9987j6114m0830P8115K1798l4663
1157a0125K17J7920J4992n2656k9426M112j114q827k222J7400J8363L0704K1984
1144B1322J0014m1070k3578K568N518j3032K4709r387l3764j0115K6916J0358
1132b9541m9203M0689J1910K9711J6846k0210J3377J3853m9687K3877L0346l7236
$$ plain form
1218 -77759 -3834 28042 3688 -38523 -23550 -44816 -63060 -40401 -25984 -17857 48739 8372
1206 8372 -31889 -852 9258 -7922 -23968 -32223 -13848 -40303 -3839 9331 -38681 -61522
1194 -61522 -19368 -51425 -52198 -31748 -63566 -93482 -96215 -71337 -32715 -1498 -29357 -20743 -41338
1181 -41338 -52399 -49177 -31366 -51995 -79375 -44750 -52228 -54295 -37727 -53302 -31647 9296
1169 9296 -17213 -6850 25868 8600 -976 -48418 -18431 -34545 -75375 2740 24538 -10125
1157 -10125 -9908 8012 23004 -29652 -59078 -54966 -56080 -64907 -67129 -49729 -31366 -662 21322
1144 21322 31336 -9734 -33312 -30744 -25226 -38258 -13549 -22936 -56700 -66815 -39899 -29541
1132 -29541 -78744 -38055 -26145 3566 20412 202 13579 27432 -22255 1622 31968 -5268
1120e268q5595J6661Q4645Q657k5165k9989k0093M1043p530k5184J7378J2883
1108a7557k5754K490L8895K3885k8734L442m582k3851l710J8804M2234k9143j4523
1095a8104J120L9795k5735J5359J2137m8444J2826j65o462J7448j1135M9782j8032
1082B0390O939M7470j6426n5444k9769N0868k6214k645L1749p3287q022J0672
1070d3719j0842N65M3910O521k1586k1284l4096R8590M559p212q755J8176N3335
1057G8162l9277m5409m339K9743R563j0611J0427k1367m8106J2632J0586J2916
1045e080J0069K9469J4940l0332q2307J9154J6652K7648M193k3851J5463k8484
1033c2466M1115K1178k5244k6631l887M2272L270n9009n717J0849m0L197K8618
$$ plain form
1120 -5268 -90863 -74202 10443 19100 -6065 -36054 -56147 -15104 -22634 -47818 -30440 -17557
1108 -17557 -43311 -40821 -1926 21959 -6775 -3333 -7915 -31766 -35476 -16672 25562 -3581 -18104
1095 -18104 -16984 22811 -2924 12435 24572 -23872 -11046 -11211 -17673 -225 -11360 38422 20390
1082 20390 27329 74799 58373 2929 -26840 24028 -2186 -4831 26918 -46369 -54391 -43719
1070 -43719 -54561 -53996 -10086 -3565 -25151 -46435 -80531 18059 22618 15406 6651 24827 78162
1057 78162 38885 -6524 -10863 18880 28443 17832 28259 6892 -41214 -28582 -17996 -5080
1045 -5080 4989 34458 49398 19066 -63241 -44087 -27435 213 4406 -19445 -3982 -32466
1033 -32466 8649 29827 4583 -22048 -25935 16337 19607 -39402 -45119 -34270 -34310 -31113 -2495
1020b495l2842M547J7147K2488J1319l092l0541J355k0915o705j7897J8193Q4457
1007D5019K8229m0554k4139L5626q841J9899l3472l1061n6270M6201L6451N3048
995G0136j2126m634m3583n0430L2295O9521k6161l4388J5279j8563N4467j0726
983D1087j5256J9219J4455k5655J4733r199J5144k0009k7018j1982L3159k6306
971B372m0595K9471L5959N3285j1601n6621j2134j0694N035j0169k7020P469K7857
958g386O1244k3614J8796q354o079j0822p806n7305L7430M5481l4486k7529k121
945b2551j9K5200j0373k3797L6624L7295o4875N613K6124K2211K6046k9895l5396
932g793l87N6494l6456M015j8566L9653p9901J3678J492m437J1735J8471Q911
$$ plain form
1020 -2495 -35337 -30790 -13643 8845 20164 17072 -13469 -12114 -33029 -39734 -57631 -39438 45019
1007 45019 73248 32694 8555 44181 35340 55239 21767 -9294 -65564 -19363 17088 70136
995 70136 58010 53376 9793 -40637 -8342 61179 35018 630 15909 -2654 51813 41087
983 41087 25831 45050 59505 33850 48583 39384 54528 34519 7501 -4481 28678 2372
971 2372 -38223 -8752 27207 80492 68891 12270 136 -10558 -5523 -15692 -42712 -35243 -7386
958 -7386 53858 30244 49040 40686 34607 23785 15979 -41326 -3896 41585 7099 -20430 -22551
945 -22551 -22570 2630 -7743 -31540 5084 42379 -22496 -16883 9241 31452 57498 27603 -7793
932 -7793 -8180 48314 11858 15873 -2693 36960 -42941 -29263 -27771 -32208 -20473 -2002 6909
919F909n585k3583K6981Q977k9475k9970J1291n511j3577O3046j569p784K969
906C119k6304j0285L4979J0060j2425j484J4347J5667L5178l9673p646K6822j6941
893B5414L6624l3503n2978M954N2347j7864l5135N6550J5953J4202n0839m7793
881c2068k3292L3526l4814L1086L6524J6964j0109l5800n205L4490M075Q400j2681
868A1096j0083L7601l5400L2285j4546m3330O2418j1802n320k697j0582k2990
856a3350j7266N5680O3347o297o5024K4307j2128m0627j6266o475N2542k4608
844f165j8621O823M3987l147j6397O290K2814M7828l7781K7782L955k6698p6592
831b5922K519j0719N7827K5259k8210j0137l600K3773L905J4089Q149l6817J2110
$$ plain form
919 6909 1324 -22259 4722 13699 -15776 -45746 -34455 -39966 -53543 9503 7934 150 3119
906 3119 -23185 -33470 1509 11569 -856 -2340 12007 27674 62852 23179 15533 42355 25414
893 25414 62038 28535 -24443 -19489 32858 14994 -20141 36409 52362 66564 15725 -32068
881 -32068 -55360 -21834 -56648 -25562 10962 27926 17817 -17983 -23188 11302 15377 23777 11096
868 11096 1013 38614 3214 35499 20953 -22377 40041 28239 22919 20222 9640 -13350
856 -13350 -30616 25064 88411 82114 17090 41397 29269 -11358 -27624 -34099 18443 -6165
844 -6165 -24786 -17963 26024 22877 6480 12770 35584 83412 45631 73413 77368 50670 -25922
831 -25922 -23403 -34122 23705 48964 20754 10617 7017 30790 34695 48784 56933 20116 32226
818C2226J9927j2432N810K9320j916k8176K2218m5570l0389l161J8046M011j6370
805f456l1628m558M5637K0600M8223M9484k5074l4586l9779J209l756P798L0400
792E7514n900L5295n2602m8264O7414L52o741O6043J1877n8451o3810j1870k7468
779c6611J0495M1385j9698r004M5411P6711q458n5982l7130J1890k310K6268o1279
766a8312k769M2275k4731M5480j7120j8295k3973P2125L6004j1720J1611n3905
754C6670J3143N0306p5135m4252L5193j9459M6253J559l2514K1731l9086k9351
742c4942L2399K2922m3186J6876P5290k3372k2769l3737N2062J4129k5368P778
730C8082J2224l5297J3792Q774K867M4403J029k1989j9018K3K0954m4l096m8942
$$ plain form
818 32226 52153 39721 45531 74851 72935 44759 66977 21407 -8982 -12143 5903 9914 -6456
805 -6456 -38084 -42642 2995 23595 71818 121302 96228 61642 21863 23072 19316 27114 57514
792 57514 51614 86909 34307 -13957 53457 53809 47068 113111 124988 66537 2727 -9143 -36611
779 -36611 -26116 15269 -4429 -13433 31978 108689 100231 44249 7119 19009 16699 42967 -18312
766 -18312 -21081 21194 -3537 41943 24823 6528 -17445 54680 90684 78964 90575 36670
754 36670 49813 100119 24984 -19268 15925 -3534 42719 44278 11764 33495 -5591 -34942
742 -34942 -2543 20379 -22807 -5931 69359 45987 23218 -10519 41543 55672 30304 38082
730 38082 50306 15009 28801 37575 40442 84845 85874 63885 44867 44890 65844 65800 62704 13762
716A3762j0914O0597K4500m7244o1346M8735L2174l1538k7013J4291J201K1710
704C8915l3883M0807N053J6062j9961N058q80k5772J6645j2609J8113j3223O908
691D1233Q770L2650j3157n0084l1198O3932M792m4255j2392K2988j1218q968L9694
678D2787J397l8509O43K3001K2566j5057J678k2026p445M1804j5922L5731j8776
665E1872j2480j7596m7588L1400K3965J1874r552L443K0713J0353K5175k6436
653F5143q552J617n0046j569P8353n264l8217K4583L9430m5085J2955m9650n5241
640c1543O3065L7617q753o1076l8855P357Q122P3437L234l5939K3980l0306l1811
627b1471m424L8515Q802k5959L3118K0993K6654j7656m3115m7871J0634O2659
$$ plain form
716 13762 2848 63445 87945 40701 -20645 28090 60264 28726 1713 16004 17205 38915
704 38915 5032 45839 50892 66954 46993 52051 51171 25399 42044 29435 47548 34325 41233
691 41233 50003 82653 69496 19412 -11786 52146 56938 12683 291 23279 12061 3093 42787
678 42787 44184 5675 6318 29319 51885 36828 38506 16480 9035 50839 34917 70648 51872
665 51872 39392 21796 -25792 5608 29573 41447 31895 35338 56051 66404 91579 65143
653 65143 56591 58208 8162 6593 84946 79682 41465 66048 105478 60393 73348 23698 -31543
640 -31543 31522 69139 60386 -690 -39545 -32188 -24066 49371 52605 16666 40646 10340 -21471
627 -21471 -25895 12620 21422 -4537 28581 49574 76228 58572 15457 -32414 -21780 40879
615D0879j1448n368M2804P405m3574L4215M6642j9381k57K3737l0384k1372j1200
602E2698k419L0265O530Q567p560k9880K8088q554n9471K099N9679j3684J5904
589H2262m9986L398N2194J8958n4898k2847n4284m7652P0973L1081K9151m296
577E4054L2640o913N228p3712L4707K85L216J0644o164L5897l4056k8794M0007
564F7039L1738j2001m1514k0566j0319M5303n0135j4104R2140k8541J1855n717
552F5178K5817K3763m5966L2225N56m2982m9758n680Q7198K751j8257j2828J8286
539H0303K7366J7625p1821j5105K3024L6409l0858n6195M2788L5251n6267l8708
527f188K8470N5374m170l4713J2699O572N469n380J0201J9888l0867j3802L6387
$$ plain form
615 40879 29431 24063 66867 74272 30698 64913 111555 92174 91917 115654 85270 63898 52698
602 52698 50279 80544 87074 95641 88081 58201 86289 77735 18264 20363 80042 66358 82262
589 82262 32276 35674 87868 106826 51928 29081 -25203 -72855 -1882 29199 58350 54054
577 54054 86694 79781 85009 11297 46004 46289 49505 60149 53985 89882 55826 27032 67039
564 67039 98777 86776 45262 24696 14377 59680 9545 -4559 87581 59040 70895 65178
552 65178 90995 114758 68792 101017 101573 58591 8833 3153 90351 93102 74845 62017 80303
539 80303 107669 125294 53473 38368 61392 97801 66943 10748 53536 88787 32520 -6188
527 -6188 22282 77656 73486 38773 51472 58044 63513 58133 68334 88222 57355 43553 79940
514G9940m4493o2531M1252O5447J9065l9290J4772l4751j423p528K8135j8303
502D0292M234k8902K839j2161Q903M6787n2888m0833P4540L0070k0018o699r287
489C6877O8031q301l4614N0777l6439n1118M6639j6180J8918l4177N525K2903
477F8841l8103J9034J6804J5373L9675l6880k0220J0888k604l8228Q835o866k8854
464G695k1330P9926k5531k3523N0052L277n8902j2577k0457K0513N2511J8730
452G0384l6502R830l6680l148M3466k2606l260K7237m2092P3614J2928m6152j3313
439C3706j2617J8209k321J4683K6040n689o67m4658m8150L2430M6497N766k8766
426C4463J03126j7725j1843l7512j3950J5807l398k1142p840q720m0147L5284
$$ plain form
514 79940 35447 -27084 14168 79615 98680 59390 74162 39411 37988 30460 58595 40292
502 40292 44526 15624 18463 6302 15205 61992 9104 -31729 42811 72881 52863 46164 36877
489 36877 104908 96607 61993 112770 76331 25213 71852 55672 74590 40413 45938 68841
477 68841 30738 49772 66576 81949 121624 84744 64524 75412 72808 34580 43415 36549 7695
464 7695 -13635 66291 40760 17237 67289 70566 11664 -913 -21370 -857 51654 70384
452 70384 33882 43712 7032 3884 47350 24744 21484 48721 6629 80243 93171 47019 33706
439 33706 21089 39298 36977 51660 77700 72011 71344 26686 -21464 10966 57463 63229 34463
426 34463 137589 119864 108021 70509 56559 72366 68968 47826 39986 31266 -8881 26403
414B6403M9609m727L8828o2501o0746M4869M9411n8862N1098L5963l9040L6045
402A06350n6206l807N9182J2140l3254Q83o757M9097k9015l6085L1035l9720k911
389E0932M1739o5401o786N8059l3327l9673K5560L0513J7291k6785L6133o539
377H1716o5819R355j3154P082K1109L3600m8436j0484K6631L215j4756L9524J7966
364H7549K9989m7286j469j7054m3671K2929N5185K1615k0547j504j6771K8221
352I7186J7590M494k3277K6950l9653m500j4177J3430j9262q690l1704M4699K8950
339I2036o0053k4001P5268K4k888K9816K3945L1281p2096O727K7741q174k7085
326I2541J3347m3110O810O218l8749j2529M6271M755J052k8160K5856M233J3227
$$ plain form
414 26403 76012 71285 110113 47612 -13134 31735 81146 22284 73382 109345 70305 106350
402 106350 50144 46337 105519 117659 84405 85288 78531 127628 98613 62528 93563 53843 50932
389 50932 92671 27270 20484 78543 45216 5543 31103 61616 78907 52122 88255 81716
377 81716 15897 25252 12098 19180 40289 73889 25453 14969 41600 44815 30059 69583 87549
364 87549 117538 70252 68783 51729 8058 30987 86172 107787 87240 85736 68965 97186
352 97186 114776 119270 95993 122943 83290 78790 64613 78043 58781 50091 18387 63086 92036
339 92036 31983 7982 83250 83274 80386 110202 134147 165428 93332 100059 127800 119626 92541
326 92541 105888 62778 69588 75806 37057 24528 70799 75554 76606 48446 74302 78535 91762
313I1762k517K5726l1243P929l2241l3588K9342M5708k9872P740M5347p5058p993
300D1042j2845Q129M1555o766l8204K297l3678O3861P702n7938J6461P25K2334
287E4675M1608l125q780K5671j5317R512j3343L4402K4052k9602m8734m7245M5421
274F9195L8781l5840j17356M4164M768R383L5448J0003j5800K3264j3596l0902
262B1512L2321l0213M091M5416j858J1737k2795k9182L969K3477Q591K0520l1672
249E5914j8549j7268M5948N6119n7279J9243j7001m0767P206J0194J8015J9023
237H0798k0537M9785l0194l9414n068j1261O1301l537j8499K5720n845r4j0486
224G2669R443J5198k5118k665j1806M2770R188J8188J3976o391J22m4057n2723
$$ plain form
313 91762 89245 114971 83728 91657 59416 25828 55170 100878 71006 78746 124093 49035 41042
300 41042 28197 36326 77881 71115 32911 35208 1530 65391 73093 15155 31616 32341 54675
287 54675 96283 93158 84378 110049 94732 104244 90901 125303 149355 119753 71019 23774 69195
274 69195 107976 72136 -45220 -1056 3712 13095 48543 58546 42746 66010 52414 21512
262 21512 53833 23620 27711 73127 71269 83006 60211 31029 34998 58475 67066 87586 55914
249 55914 37365 20097 66045 122164 64885 84128 67127 26360 33566 43760 61775 80798
237 80798 60261 110046 79852 40438 35370 24109 85410 81873 63374 89094 83249 83155 72669
224 72669 82112 97310 72192 69527 57721 100491 109679 127867 141843 135452 135574 91517 38794
211C8794P687L5905l0594l6479M4342O8368l2924l9417M1059k2444L75K351l1267
198D5756R584L0974k0694j0311Q695o22N9357K8002j1559m0997k1604K3233J3416
185A13230l749l5373o651r246K5230K693l2726P072j5271L166k4489K2272M5042
172I1200k049l9906J1910n890j5311L644M5651J2373o1447Q289M3050J6567r695
159I8386j6813l2445J4891K4251q766l3660j9959K5830K1830J2529q756j653J5949
146I1614l3525L0934J0963k1082m19k4999J3039K0890k4109J1324Q524k4631K160
133F0683n228j866N818M5128Q907p555l1008l1187j3827J1848K4042j5777o592
120D3386L8728J0250o4074k0721O1216J8834j1326k7462J6446j1592K5476O665
$$ plain form
211 38794 46481 82386 51792 15313 59655 128023 95099 55682 96741 74297 74672 77023 45756
198 45756 55340 86314 65620 55309 64004 63382 122739 150741 139182 98185 76581 99814 113230
185 113230 109481 74108 67457 58211 83441 86134 53408 60480 45209 48375 23886 46158 91200
172 91200 89151 49245 61155 55265 39954 43598 89249 101622 40175 48464 91514 108081 98386
159 98386 81573 49128 64019 88270 79504 45844 25885 51715 73545 86074 77318 75665 91614
146 91614 58089 89023 99986 78904 78485 53486 66525 87415 63306 74630 83154 58523 60683
133 60683 55455 53589 59407 104535 113442 105887 74879 43692 29865 41713 65755 49978 43386
120 43386 82114 92364 28290 7569 68785 87619 76293 48831 65277 53685 79161 85826
108H5826P132j4321O667j4583k8592L2288r620K5886j3173N052l1863k6605N619
95B9713j4779j8998K8988M4308R188n38K2235k2969j3087L4853R606J1447j7440
82A02527L215O833P033l1582q914P683O130n230J1726j7142P008m8303J1943K0069
68G2996m2978j564K9721M0577L0604j3139j2358l0065q479M22j2859R415j5953
55D6340M687k6951M0974l6722L9790J5388k7529J1845k553J0640l732J9849j3408
42G8618m09J0167k6835P867J187P093j0748R131M0166K741m0908j8602L282J9407
28H2157j5132j4243j7953j1754M9784Q970J3547O469l1820j2442K6995K0193k1492
15H3279J0687p819q378k1923L0423M47K0513K7467l4222l5014J2313k285m1439
$$ plain form
108 85826 92958 78637 85304 70721 42129 74417 64797 90683 77510 82562 50699 24094 29713
95 29713 14934 -4064 24924 69232 78420 77882 100117 77148 64061 98914 108520 119967 102527
82 102527 105742 112575 119608 88026 79112 86795 92925 87695 99421 82279 89287 40984 52927 72996
68 72996 30018 28454 58175 98752 129356 116217 103859 73794 65315 65737 52878 62293 46340
55 46340 51027 24076 65050 28328 68118 83506 55977 67822 65269 75909 72177 92026 78618
42 78618 78209 88376 61541 69408 70595 77688 66940 76071 116237 118978 78070 59468 62750 82157
28 82157 67025 52782 34829 23075 72859 81829 95376 101845 70025 57583 84578 104771 83279
15 83279 93966 86147 77769 55846 86269 86716 107229 134696 100474 65460 77773 75488 34049
2C4049r569k0236
0D244
$$ plain form
2 34049 24480 4244
0 4244
$$ Imaginary data points
##PAGE= N=2
##DATA TABLE= (X++(I..I)), XYDATA
16383b170670K8976L587K5463L1238M3541K1235k3969M4292N4616K5345k416K3778
16371a894984M5494M7347N6029J4492L556R481K6903K9246M2253k2930K0716L7826
16359a584571Q072Q563N1341O5977K8292K5832O8720R659N835K1313J8082k1405
16347a294290M278O7981N379M2937P0084O838J934L1463O622L7489J8660K5215
16335i75410M2089R488j2952J8883O9814j0183O2894M1703K444M434M7542L2834
16323f66420J1971L0318K1821J656L1981j0083L1025M5786R797L5949J1466L9606
$$ plain form
16383 -2170670 -2141694 -2138107 -2112644 -2081406 -2037865 -2016630 -2040599 -1996307 -1941691 -1916346 -1918762 -1894984
16371 -1894984 -1849490 -1802143 -1746114 -1731622 -1728066 -1718585 -1691682 -1662436 -1620183 -1643113 -1622397 -1584571
16359 -1584571 -1576499 -1567936 -1516595 -1450618 -1422326 -1396494 -1327774 -1318115 -1312280 -1290967 -1272885 -1294290
16347 -1294290 -1290012 -1222031 -1216652 -1173715 -1103631 -1096793 -1094859 -1063396 -1056774 -1019285 -1000625 -975410
16335 -975410 -933321 -923833 -936785 -917902 -848088 -858271 -795377 -753674 -751230 -746796 -699254 -666420
16323 -666420 -654449 -624131 -602310 -600654 -568673 -578756 -547731 -501945 -492148 -456199 -444733 -405127
$$ [...]
##END NTUPLES=NMR SPECTRUM
##END=
