##TITLE=1H_EC-3278(3)
 CDCl3
 8 sc, 
 21.09.2022
##JCAMPDX= 6.0         $$ Bruker NMR JCAMP-DX V2.0
##DATA TYPE= NMR SPECTRUM
##DATA CLASS= NTUPLES
##ORIGIN= UXNMR, Bruker Analytische Messtechnik GmbH
##OWNER= root
$$ XWIN-NMR		Version 3.5
$$ Wed Sep 21 12:16:16 2022 Russian Standard Time (UT+4h)  she@DPX200
##.OBSERVE FREQUENCY= 200.1313499994
##.OBSERVE NUCLEUS= ^1H
##.ACQUISITION MODE= SIMULTANEOUS
##.ACQUISITION SCHEME= undefined
##.AVERAGES= 8
##.DIGITISER RES= 18
##SPECTROMETER/DATA SYSTEM= spect
##.PULSE SEQUENCE= zg30
##.SOLVENT NAME= CDCl3
##.SHIFT REFERENCE= (INTERNAL, CDCl3, 0, 15.7623)
##AUDIT TRAIL= $$ (NUMBER, WHEN, WHO, WHERE, WHAT)
$$ ##TITLE= Audit trail, XWIN-NMR		Version 3.5
$$ ##JCAMPDX= 5.01
$$ ##ORIGIN= Bruker BioSpin GmbH
$$ ##OWNER= she
$$ F:/spectra/data/she/nmr/H-F/1/pdata/1/auditp.txt
$$ ##AUDIT TRAIL=  $$ (NUMBER, WHEN, WHO, WHERE, WHAT)
(   1,<2022-09-21 12:14:02.64 +0400>,<she>,<DPX200>,
      <created by zg, POWCHK disabled, PULCHK disabled
       configuration hash MD5:
       00 E9 B6 7A A2 85 ED C7 34 08 36 98 17 FE 4E 26
       data hash MD5: 16K
       2C 79 13 63 1B BD 89 6A C4 4E AA 40 97 C0 2E 41>)
(   2,<2022-09-21 12:14:05.82 +0400>,<she>,<DPX200>,
      <Start of raw data processing
       efp BC_mod = 2 LB = 0.24 FT_mod = 6 PKNL = 1 PHC0 = -18035.13 PHC1 = 13.60069 SI = 16K 
       data hash MD5: 16K
       41 B8 A3 46 71 29 C5 7B 05 3B 0E 87 97 C5 1E D5>)
(   3,<2022-09-21 12:14:31.26 +0400>,<she>,<DPX200>,
      <pk PHC0 = 1.691618 PHC1 = -3 
       data hash MD5: 16K
       BB F0 A1 A2 FE B2 54 7F 04 C6 80 02 A0 10 BF 5B>)
(   4,<2022-09-21 12:14:34.79 +0400>,<she>,<DPX200>,
      <abs ABSG = 5 
       data hash MD5: 16K
       B3 C5 CB 20 A8 49 1D 91 DD 10 CB 49 D2 BD 5C BD>)
$$ ##END=
$$ 
$$ hash MD5
$$ 74 3D E0 A6 29 A2 21 DB C1 81 14 BB 9C A2 BE 60
##$RELAX= 
##$RELAX= 
##$RELAX= 
##$RELAX= 
##$RELAX= 
##$RELAX= 
$$ Bruker specific parameters
$$ --------------------------
##$DU= <F:/spectra>
##$EXPNO= 1
##$NAME= <H-F>
##$PROCNO= 1
##$TYPE= <nmr>
##$USER= <she>
##$AMP= (0..31)
100 100 100 100 100 100 100 100 100 100 100 100 100 100 100 100 100 100 
100 100 100 100 100 100 100 100 100 100 100 100 100 100 
##$AQSEQ= 0
##$AQ_mod= 1
##$AUNM= <au_zg>
##$AUTOPOS= <>
##$BF1= 200.13
##$BF2= 200.13
##$BF3= 200.13
##$BF4= 200.13
##$BF5= 200.13
##$BF6= 200.13
##$BF7= 200.13
##$BF8= 200.13
##$BYTORDA= 1
##$CFDGTYP= 0
##$CFRGTYP= 5
##$CHEMSTR= <none>
##$CNST= (0..31)
1 1 145 1 1 1 1 1 1 1 1 1 1 1 1 1 1 1 1 1 1 1 1 1 1 1 1 1 1 1 1 1 
##$CPDPRG= <>
##$CPDPRG1= <>
##$CPDPRG2= <>
##$CPDPRG3= <>
##$CPDPRG4= <mlev>
##$CPDPRG5= <mlev>
##$CPDPRG6= <mlev>
##$CPDPRG7= <mlev>
##$CPDPRG8= <mlev>
##$CPDPRGB= <>
##$CPDPRGT= <>
##$D= (0..31)
0 1.2 0 0 0 0 0 0 0 0.06 0 0.03 0 0 0 0 0.0002 0 0 0 0 0 0 0 0 0 0 0 0 
0 0 0 
##$DATE= 1663748042
##$DBL= (0..7)
120 120 120 120 120 120 120 120 
##$DBP= (0..7)
150 150 150 150 150 150 150 150 
##$DBP07= 0
##$DBPNAM0= <>
##$DBPNAM1= <>
##$DBPNAM2= <>
##$DBPNAM3= <>
##$DBPNAM4= <>
$$ [...]
##$SUBNAM3= <"">
##$SUBNAM4= <"">
##$SUBNAM5= <"">
##$SUBNAM6= <"">
##$SUBNAM7= <"">
##$SUBNAM8= <"">
##$SUBNAM9= <"">
##$SW= 18.0517283424941
##$SWIBOX= (0..15)
0 0 2 0 0 0 0 0 0 0 0 0 0 0 0 0 
##$SW_h= 3612.71676300578
##$TD= 16384
##$TD0= 1
##$TE= 0
##$TE2= 300
##$TE3= 300
##$TEG= 300
##$TL= (0..7)
0 120 120 120 120 120 120 120 
##$TP= (0..7)
150 150 150 150 150 150 150 150 
##$TP07= 0
##$TPNAME0= <>
##$TPNAME1= <>
##$TPNAME2= <>
##$TPNAME3= <>
##$TPNAME4= <>
##$TPNAME5= <>
##$TPNAME6= <>
##$TPNAME7= <>
##$TPOAL= (0..7)
0.5 0.5 0.5 0.5 0.5 0.5 0.5 0.5 
##$TPOFFS= (0..7)
0 0 0 0 0 0 0 0 
##$TUNHIN= 0
##$TUNHOUT= 0
##$TUNXOUT= 0
##$USERA1= <user>
##$USERA2= <user>
##$USERA3= <user>
##$USERA4= <user>
##$USERA5= <user>
##$V9= 5
##$VALIST= <valist>
##$VCLIST= <CCCCCCCCCCCCCCC>
##$VD= 0
##$VDLIST= <DDDDDDDDDDDDDDD>
##$VPLIST= <PPPPPPPPPPPPPPP>
##$VTLIST= <TTTTTTTTTTTTTTT>
##$WBST= 1024
##$WBSW= 4
##$XGAIN= (0..3)
0 0 0 0 
##$XL= 0
##$YL= 0
##$YMAX_a= 452508
##$YMIN_a= -801426
##$ZGOPTNS= <>
##$ZL1= 120
##$ZL2= 120
##$ZL3= 120
##$ZL4= 120
##$ABSF1= 15.75901
##$ABSF2= -2.292839
##$ABSG= 5
##$ABSL= 3
##$ALPHA= 0
##$AQORDER= 0
##$ASSFAC= 0
##$ASSFACI= 0
##$ASSFACX= 0
##$ASSWID= 0
##$AUNMP= <proc_1d>
##$AZFE= 0.1
##$AZFW= 0.1
##$BCFW= 0
##$BC_mod= 2
##$BYTORDP= 0
##$COROFFS= 0
##$CY= -3
##$DATMOD= 1
##$DC= 0
##$DFILT= <>
##$DTYPP= 0
##$F1P= 0
##$F2P= 0
##$FCOR= 1
##$FTSIZE= 16384
##$FT_mod= 6
##$GAMMA= 0
##$GB= 0
##$INTBC= 1
##$INTSCL= 3.70164e-10
##$ISEN= 128
##$LB= 0.24
##$LEV0= 0
##$LPBIN= 0
##$MAXI= 10000
##$MC2= 0
##$MEAN= 0
##$ME_mod= 0
##$MI= 1.114404
##$NCOEF= 0
##$NC_proc= -6
##$NLEV= 6
##$NOISF1= 3.799351
##$NOISF2= 2.8
##$NSP= 0
##$NTH_PI= 0
##$NZP= 0
##$OFFSET= 15.76231
##$PC= 1
##$PHC0= -18033.44
##$PHC1= 10.60069
##$PH_mod= 1
##$PKNL= yes
##$PPARMOD= 0
##$PSCAL= 0
##$PSIGN= 0
##$REVERSE= no
##$SF= 200.130001845227
##$SI= 16384
##$SIGF1= 3
##$SIGF2= 2
##$SINO= 5.538805
##$SIOLD= 16384
##$SREGLST= <1H.CDCl3>
##$SSB= 0
##$STSI= 16384
##$STSR= 0
##$SW_p= 3612.71676300578
##$SYMM= 0
##$S_DEV= 0
##$TDeff= 16384
##$TDoff= 0
##$TI= <>
##$TILT= no
##$TM1= 0
##$TM2= 0
##$TOPLEV= 0
##$USERP1= <user>
##$USERP2= <user>
##$USERP3= <user>
##$USERP4= <user>
##$USERP5= <user>
##$WDW= 1
##$XDIM= 16384
##$YMAX_p= 348646363
##$YMIN_p= -416850
$$ End of Bruker specific parameters
$$ ---------------------------------
##NTUPLES= NMR SPECTRUM
##VAR_NAME=  FREQUENCY,     SPECTRUM/REAL,   SPECTRUM/IMAG
##SYMBOL=    X,             R,               I
##VAR_TYPE=  INDEPENDENT,   DEPENDENT,       DEPENDENT
##VAR_FORM=  AFFN,          ASDF,            ASDF
##VAR_DIM=   16384,         16384,           16384
##UNITS=     HZ,            ARBITRARY UNITS, ARBITRARY UNITS
##FACTOR=    0.220516191357247, 1,           1
##FIRST=     3154.51113500392, 0,            0
##LAST=      -458.205628001856, 0,           0
##MIN=       -458.205628001856, -416850,     0
##MAX=       3154.51113500392, 348646363,    0
$$ Real data points
##PAGE= N=1
##DATA TABLE= (X++(R..R)), XYDATA
$$ [...]
$$ plain form
6199 3442805 3565924 3641484 3709406 3691363 3816264 3915028 3851605 3798521 3971449 4014515 4068779
6188 4068779 4166875 4361244 4455240 4390264 4330676 4343051 4331013 4282339 4329023 4399853 4482595
6177 4482595 4535425 4495702 4605404 4680901 4737595 4862434 4994911 5088016 5146262 5135885 5187995
6166 5187995 5257362 5210205 5377411 5634464 5826404 6091358 6116003 6129649 6182775 6283788
6156 6283788 6344847 6269936 6333813 6322612 6169502 6085428 6093901 6022857 6078277 6219250 6263088
6145 6263088 6238085 6171645 6276063 6369716 6405595 6478185 6750242 6823952 6802092 6967876 6984221
6134 6984221 7123916 7161305 7261652 7500764 7732583 7625179 7560232 7643081 7605979 7518357
6124 7518357 7420267 7399732 7333789 7204070 7106570 7005577 6782731 6626050 6657646 6634706 6618546
$$ packed form
6199C442805J23119P5560O7922j8043J24901R8764o3423n3084J72928M3066N4264
6188D068779R8096J94369R3996o4976n9588J2375j2038m8674M6684P0830Q2742
6177D482595N2830l9723J09702P5497N6694J24839J32477R3105N8246j0377N2110
6166E187995O9367m7157J67206K57053J91940K64954K4645J3646N3126J01013
6156F283788O1059p4911O3877j1201j53110q4074Q473p1044N5420J40973M3838
6145F263088k5003o6440J04418R3653L5879P2590K72057P3710k1860J65784J6345
6134F984221J39695L7389J00347K39112K31819j07404o4947Q2849l7102q7622
6124G518357r8090k0535o5943j29719r7500j00993k22846j56681L1596k2940j6160
$$ plain form
6113 6618546 6531641 6383495 6178369 6226381 6364008 6430956 6361737 6528856 6683338 6529912
6103 6529912 6611778 6775390 6779471 6858947 7064138 7077111 7004583 6999447 7037914 7018151 7244134
6092 7244134 7347776 7307769 7217868 7077336 6999100 7115277 7080848 6998428 7072335 7127831 7186186
6081 7186186 7258413 7346787 7230210 7147757 7269874 7383148 7291312 7150631 7013033 6855670
6071 6855670 6813261 6630895 6456675 6213064 6015378 6081636 5740884 5578012 5701764 5609324
6061 5609324 5613273 5572424 5415742 5484307 5503259 5554432 5577079 5587457 5590495 5685435 5800404
6050 5800404 5929133 6169232 6199392 6486050 6589890 6665205 6751091 6916821 7147591 7297321
6040 7297321 7178485 7174975 7166436 7060809 7075690 6988870 6823718 6842320 6888474 6805437 6963675
$$ packed form
6113F618546q6905j48146k05126M8012J37627O6948o9219J67119J54482j53426
6103F529912Q1866J63612M081P9476K05191J2973p2528n136L8467j9763K25983
6092G244134J03642m0007q9901j40532p8236J16177l4429q2420P3907N5496N8355
6081G186186P2227Q8374j16577q2453J22117J13274r1836j40681j37598j57363
6071F855670m2409j82366j74220k43611j97686O6258l40752j62872J23752r2440
6061E609324L949m0849j56682O8565J8952N1173K2647J0378L038R4940J14969
6050E800404J28729K40099L0160K86658J03840P5315Q5886J65730K30770J49730
6040G297321j18836l510q539j05627J4881q6820j65152J8602M6154q3037J58238
$$ plain form
6029 6963675 6747468 6690112 6620208 6557323 6323258 6141038 6195081 6028175 5910018 5848919
6019 5848919 5651018 5421213 5302356 5105833 5084506 4816159 4739425 4812456 4842001 4848022 4772852
6008 4772852 4743699 4862231 4964356 4852100 5026055 4995933 4960000 5008379 5108934 5110977 5286480
5997 5286480 5439709 5467214 5471962 5521067 5687597 5722328 5686204 5608526 5642159 5492132 5399224
5986 5399224 5450143 5416844 5290047 5078578 4848028 4756170 4699503 4642705 4672696 4565658 4535429
5975 4535429 4621046 4533623 4351360 4347076 4336216 4444632 4513628 4440417 4399495 4576433 4586265
5964 4586265 4595841 4492822 4473569 4607548 4595760 4632933 4718561 4659075 4614515 4831968 4693260
5953 4693260 4540513 4538440 4648884 4462346 4605482 4684475 4757139 4788654 5034400 5180238
$$ packed form
6029F963675k16207n7356o9904o2885k34065j82220N4043j66906j18157o1099
6019E848919j97901k29805j18857j96523k1327k68347p6734P3031K9545O021p5170
6008D772852k9153J18532J02125j12256J73955l0122l5933M8379J00555K043J75503
5997E286480J53229K7505M748M9105J66530L4731l6124p7678L3633j50027r2908
5986E399224N0919l3299j26797k11469k30550r1858n6667n6798K9991j07038l0229
5975D535429Q5617q7423j82263m284j0860J08416O8996p3211m0922J76938R832
5964D586265R576j03019j9253J33979j1788L7173Q5628n9486m4560K17453j38708
5953D693260j52747k073J10444j86538J43136P8993P2664L1515K45746J45838
$$ plain form
5943 5180238 5320616 5436857 5655428 5851022 5951717 6236746 6740614 7128254 7285182 7663988
5933 7663988 7834321 8319972 8844843 9216384 9512173 9575830 9400576 9120802 8809045 8527423
5923 8527423 8112220 7842900 7417350 7207636 6943502 6518147 6238306 6112638 5960305 5716210
5913 5716210 5496723 5544060 5340910 5289300 5323172 5108874 5043478 5009658 5142710 5053049 5152140
5902 5152140 5108118 5117832 4914524 5002861 5238840 5412520 5534498 5651093 5690134 5656488 5822097
5891 5822097 5860266 5973574 6084179 6113351 6302818 6656026 6596029 6643819 6778903 6997386
5881 6997386 7102868 7234803 7489261 7965483 8471640 8715852 9126054 9562590 10021137 10489552
5871 10489552 10829798 11009062 10896536 10767523 10586208 10410593 9881905 9418379 9129084
$$ packed form
5943E180238J40378J16241K18571J95594J00695K85029N03868L87640J56928L78806
5933G663988J70333M85651N24871L71541K95789O3657j75254k79774l11757k81622
5923H527423m15203k69320m25550k09714k64134m25355k79841j25668j52333k44095
5913E716210k19487M7337k03150n1610L3872k14298o5396l3820J33052q9661R9091
5902E152140m4022R714k03308Q8337K35979J73680J21978J16595L9041l3646J65609
5891E822097L8169J13308J10605K9172J89467L53208n9997M7790J35084K18483
5881F997386J05482J31935K54458M76222N06157K44212M10202M36536M58547M68415
5871A0489552L40246J79264j12526j29013j81315j75615n28688m63526k89295
$$ plain form
5862 9129084 8781611 8511711 8201942 7977469 7612871 7240161 6883097 6590559 6348454 6189193
5852 6189193 6022389 5804920 5690952 5634683 5485792 5473236 5404866 5469459 5409952 5260061
5842 5260061 5383083 5491998 5613341 5648029 5793486 5810502 5680089 5819467 5882028 5817658
5832 5817658 5811515 5813304 5754400 5744125 5639777 5594749 5343719 5284607 5276289 5162443 5046574
5821 5046574 5010271 5123506 4970996 4969239 5123423 5246615 5272606 5382033 5602383 5718552
5811 5718552 5660970 5878411 6056708 6113742 6414944 6634571 6587355 6684887 6827139 6716152
5801 6716152 6538592 6602352 6660648 6741423 7013663 7237471 7576738 8039055 8360820 9043682
5791 9043682 9791953 10868603 12439415 14187709 15745717 16397712 15605641 13775006 11772345
$$ packed form
5862I129084l47473k69900l09769k24473l64598l72710l57064k92538k42105j59261
5852F189193j66804k17469j13968n6269j48891j2556o8370O4593n9507j49891
5842E260061J23022J08915J21343L4688J45457J7016j30413J39378O2561o4370
5832E817658o143J789n8904j0275j04348m5028k51030n9112q318j13846j15869
5821E046574l6303J13235j52510j757J54184J23192K5991J09427K20350J16169
5811E718552n7582K17441J78297N7034L01202K19627m7216R7532J42252j10987
5801F716152j77560O3760N8296Q0775K72240K23808L39267M62317L21765O82862
5791I043682P48271J076650J570812J748294J558008O51995p92071j830635k002661
$$ plain form
5782 11772345 10068678 9017009 8063707 7458881 7142300 6877271 6730146 6567592 6413516
5773 6413516 6163100 6243206 6210321 6212483 6033795 5786661 5858651 5674593 5501058 5515847 5531744
5762 5531744 5598557 5755057 5726303 5888132 5963780 6016410 6207266 6142002 5936080 5491256
5752 5491256 5250857 5174127 5033827 4945591 4838308 4913863 4806295 4684875 4687536 4570534
5742 4570534 4460169 4589901 4770187 4791457 4671313 4736488 4934447 5216097 5383516 5406196
5732 5406196 5403863 5370134 5588502 5942151 5958571 5926384 5939122 5895275 5968398 5952087 5959041
5721 5959041 5723578 5595500 5482761 5365031 5247249 5200845 5147066 4938434 5022310 5121732
5711 5121732 5126210 5020136 4963816 5031218 5002304 4964559 4988327 5058104 5219382 5457840 5387754
$$ packed form
5782A1772345j703667j051669r53302o04826l16581k65029j47125j62554j54076
5773F413516k50416Q0106l2885K162j78688k47134P1990j84058j73535J4789J5897
5762E531744O6813J56500k8754J61829P5648N2630J90856o5264k05922m44824
5752E491256k40399p6730j40300q8236j07283P5555j07568j21420K661j17002
5742D570534j10365J29732J80286K1270j20144O5175J97959K81650J67419K2680
5732E406196k333l3729K18368L53649J6420l2187J2738m3847P3123j6311O954
5721E959041k35463j28078j12739j17730j17782m6404n3779k08632Q3876R9422
5711E121732M478j06074n6320O7402k8914l7745K3768O9777J61278K38458p0086
$$ plain form
5700 5387754 5272179 5256552 5322203 5791118 5924213 5874204 5982889 6093511 6188856 6337210
5690 6337210 6383805 6709099 6711809 6623101 6676998 6691090 6566446 6583504 6744395 6698954 6761100
5679 6761100 6836698 6940630 7001077 7234959 7506511 7858205 8194690 8456009 8772540 9016005
5669 9016005 9136847 9344652 9420740 9301736 9103082 8890255 8794471 8563862 8211757 8011292
5659 8011292 7793777 7699328 7619078 7609476 7665825 7465993 7502655 7469824 7503523 7320269 7136333
5648 7136333 7028832 7048737 7249975 7383704 7459374 7512793 7484117 7554214 7598839 7702823 7911440
5637 7911440 8040345 8142662 8230887 8607090 8626735 8903008 9096793 9106941 9034063 9076921
5627 9076921 9488033 9770404 9892720 9969541 9958369 9892981 9940689 9590328 9512336 9289483
$$ packed form
5700E387754j15575j5627O5651M68915J33095n0009J08685J10622R5345J48354
5690F337210M6595L25294K710q8708N3897J4092j24644J7058J60891m5441O2146
5679F761100P5598J03932O0447K33882K71552L51694L36485K61319L16531K43465
5669I016005J20842K07805P6088j19004j98654k12827r5784k30609l52105k00465
5659H011292k17515r4449q0250r602N6349j99832L6662l2831L3699j83254j83936
5648G136333j07501J9905K01238J33729P5670N3419k8676P0097M4625J03984K08617
5637G911440J28905J02317Q8225L76203J9645K76273J93785J0148p2878M2858
5627I076921M11112K82371J22316P6821j1172o5388M7708l50361p7992k22853
$$ plain form
5617 9289483 8952223 8803316 8416758 8216417 7991057 7815741 7818070 7788924 7818713 7774003
5607 7774003 7804753 7913204 7786576 7928992 8040370 8158933 8221726 8281800 8260926 8193987
5597 8193987 8283025 8358398 8406472 8622775 8495638 8552025 8678731 8871521 9044925 9020077
5587 9020077 9046900 9181645 9422601 9484788 9675033 9893121 9994057 10127620 10136558 10226353
5577 10226353 10483117 10687062 10927878 11208576 11433000 11864100 12199358 12587997 12896070
5568 12896070 13360132 13821663 14174915 14526799 14748010 14893043 15166379 15301399 15403867
5559 15403867 15584531 15723960 15958376 16070702 16301415 16644495 16885013 17000847 17189666
5550 17189666 17381747 17817258 18148232 18416224 18697943 19154364 19442502 19861923 20309540
$$ packed form
5617I289483l37260j48907l86558k00341k25360j75316K329k9146K9789m4710
5607G774003L0750J08451j26628J42416J11378J18563O2793O0074k0874o6939
5597H193987Q9038P5373M8074K16303j27137N6387J26706J92790J73404k4848
5587I020077K6823J34745K40956O2187J90245K18088J00936J33563Q938Q9795
5577A0226353K56764K03945K40816K80698K24424M31100L35258L88639L08073
5568A2896070M64062M61531L53252L51884K21211J45033K73336J35020J02468
5559A5403867J80664J39429K34416J12326K30713L43080K40518J15834J88819
5550A7189666J92081M35511L30974K67992K81719M56421K88138M19421M47617
$$ plain form
5541 20309540 21040068 21906937 22963046 24266369 25996345 28208762 30910283 33924367
5533 33924367 36072760 36358958 34124880 31149662 28620436 26625677 25314529 24821104
5525 24821104 24297061 23810078 23704742 23681587 23758661 23588714 23665789 23731253 23704103 23688969
5515 23688969 23506215 23578375 23638144 23621238 23515797 23334139 23402674 23418574 23434854 23466230 23612804
5504 23612804 23780439 24015287 24053627 23827272 23322003 22867749 22258133 21933500 21690967 21437638
5494 21437638 21272268 21311672 21167919 21059138 20882030 20850739 20820724 20650615 20680165 20627492
5484 20627492 20732427 20737543 20841795 20890261 20982811 20936845 21055394 21112107 20978542 20971873 20715693
5473 20715693 20357550 20322966 20204559 20047008 19775828 19561804 19610902 19571677 19302742 19250942
$$ packed form
5541B0309540P30528Q66869J056109J303323J729976K212417K701521L014084
5533C3924367K148393K86198k234078k975218k529226j994759j311148m93425
5525B4821104n24043m86983j05336k3155P7074j69947P7075O5464k7150j5134
5515B3688969j82754P2160N9769j6906j05441j81658O8535J5900J6280L1376J46574
5504B3612804J67635K34848L8340k26355n05269m54254o09616l24633k42533k53329
5494B1437638j65370L9404j43753j08781j77108l1291l0015j70109K9550n2673
5484B0627492J04935N116J04252M8466R2550m5966J18549N6713j33565o669k56180
5473B0715693l58143l4584j18407j57551k71180k14024M9098l9225k68935n1800
$$ plain form
5463 19250942 19298640 19339973 19435774 19390096 19459614 19303102 19097937 18789230 18503195 18377528
5453 18377528 18318790 18242588 18197731 18248475 18306570 18419812 18490112 18484685 18475362 18542072 18643476
5442 18643476 18688252 18617713 18624586 18604953 18522680 18555479 18746548 18838270 18870099 18900019 19092234
5431 19092234 19341140 19564916 19826574 20193332 20424797 20516637 20364507 20231143 20086513 20159729
5421 20159729 20228742 20076743 20244693 20448679 20582552 20645102 20494882 20733247 20898812 20775870
5411 20775870 20759956 20658371 20861695 20862383 20657173 20615198 20645598 20509517 20491181 20498969 20641768
5400 20641768 20754101 20706216 20844317 20943698 21099188 21159762 21166978 21272861 21316802 21315009 21364395
5389 21364395 21345913 21380779 21352783 21405182 21430986 21516808 21600244 21684869 21727887 21880167 22053518
$$ packed form
5463A9250942M7698M1333R5801m5678O9518j56512k05165l08707k86035j25667
5453A8377528n8738p6202m4857N0744N8095J13242P0300n427r323O6710J01404
5442A8643476M4776p0539O873j9633q2273L2799J91069R1722L1829K9920J92215
5431A9092234K48906K23776K61658L66758K31465R1840j52130j33364j44630P3216
5421B0159729O9013j51999J67950K03986J33873O2550j50220K38365J65565j22942
5411B0775870j5914j01585K03324O88k05210m1975L0400j36081j8336P788J42799
5400B0641768J12333m7885J38101R9381J55490O0574P216J05883M3941j793M9386
5389B1364395j8482L4866k7996N2399K5804Q5822Q3436Q4625M3018J52280J73351
$$ plain form
5378 22053518 22041450 21968675 21959351 21736970 21658847 21516213 21630128 21728274 21691046 21799237 21779115
5367 21779115 21939708 22073729 22397885 22711041 22901830 23224203 23447069 23728151 24064987
5358 24064987 24440132 24867005 25257682 25907561 26486150 27167530 27848473 28664214 29475970
5349 29475970 30509729 31620755 32635946 33675342 35160779 36753515 38250698 39976753
5341 39976753 41229497 42335705 43106532 43721769 44255674 45057646 46406054 48213853 50318192
5332 50318192 52383092 53655169 53373226 52012079 49917781 48282570 47127355 46437070
5324 46437070 46008873 45457468 45151207 44690233 44018357 43020718 41890632 41164002 41059048
5315 41059048 41158900 41567626 42320599 43217094 44527974 46179316 48147348 50851233 54329361
$$ packed form
5378B2053518j2068p2775r324k22381p8123j42634J13915R8146l7228J08191k0122
5367B1779115J60593J34021L24156L13156J90789L22373K22866K81082L36836
5358B4064987L75145M26873L90677O49879N78589O81380O80943Q15741Q11756
5349B9475970J033759J111026J015191J039396J485437J592736J497183J726055
5341C9976753J252744J106208P70827O15237N33905Q01972J348408J807799K104339
5332E0318192K064900J272077k81943j361147k094298j635211j155215o90285
5324D6437070m28197n51405l06261m60974o71876r97639j130086p26630j04954
5315D1059048R9852M08726P52973Q96495J310880J651342J968032K703885L478128
$$ plain form
5306 54329361 58557815 63529132 68567408 73319379 77241271 80209403 82438498 83666978
5298 83666978 84091610 84593911 86101657 89062506 93323445 97898303 100902133 100799676 96934535
5289 96934535 91110966 85146457 79885045 75953930 73263191 71380649 70332550 70226333
5281 70226333 70931531 72310194 74258341 76817019 80038106 84058222 88612570 93331706
5273 93331706 97542831 100462934 101021324 99368833 96874398 94711058 93692464 93522875
5265 93522875 93599325 92851898 89942084 84641759 77725989 70545358 63970009 58430067 54253598
5256 54253598 50846089 48369289 46424709 44796651 43529039 42635213 41883312 41226039 40793886
5247 40793886 40644337 40499946 40459293 40678539 41022830 41412424 41995502 42827310 44192188
$$ packed form
5306E4329361M228454M971317N038276M751971L921892K968132K229095J228480
5298H3666978M24632N02301J507746K960849M260939M574858L003830j02457l865141
5289I6934535n823569n964509n261412l931115k690739j882542j048099j06217
5281G0226333P05198J378663J948147K558678L221087M020116M554348M719136
5273I3331706M211125K920103N58390j652491k494435k163340j018594j69589
5265I3522875P6450p47427k909814n300325o915770p180631o575349n539942m176469
5256E4253598l407509k476800j944580j628058j267612q93826p51901o57273m32153
5247D0793886j49549j44391m0653K19246L44291L89594N83078Q31808J364878
$$ plain form
5238 44192188 45849336 47838924 50448504 53475691 57373526 62332503 67949172 74109003
5230 74109003 79764080 83842867 84869572 82619605 78849334 75227218 72751483 71469771
5222 71469771 70967106 69717351 67112738 63532913 59872093 56492587 54032402 52550852
5214 52550852 52035027 52099040 52678094 53327348 54547962 56593624 59753198 63836285 68947015
5205 68947015 74058282 78352597 80614254 80414097 78588884 75983961 73616980 71856825
5197 71856825 71024008 70466794 69166425 66813428 64085779 61924368 60548983 59582606 58039248
5188 58039248 55179990 51444384 47271773 43803313 40793510 38354146 36720308 35552859
5180 35552859 34669412 34303598 34186543 34241822 34537600 35148202 35695959 36105945 36431670 36656347
$$ packed form
5238D4192188J657148J989588K609580L027187L897835M958977N616669O159831
5230G4109003N655077M078787J026705k249967l770271l622116k475735j281712
5222G1469771n02665j249755k604613l579825l660820l379506k460185j481550
5214E2550852n15825O4013N79054O49254J220614K045662L159574M083087N110730
5205F8947015N111267M294315K261657k00157j825213k604923k366981j760155
5197G1856825q32817n57214j300369k352997k727649k161411j375385r66377j543358
5188E8039248k859258l735606m172611l468460l009803k439364j633838j167449
5180C5552859q83447l65814j17055N5279K95778O10602N47757M09986L25725K24677
$$ plain form
5170 36656347 36953463 37556303 38255870 39238351 40455196 41709407 42021052 40785035 38260937
5161 38260937 34900874 31755355 29342429 27337350 25724082 24369176 23383489 22753778
5153 22753778 21972745 21476956 20988608 20557673 20207782 19965490 19562083 19448436 19175134
5144 19175134 19160716 19354381 19420777 19542934 19618434 19579521 19913484 20015805 20061404 20353837
5134 20353837 20732819 20981238 21148158 21104658 20823021 20689410 20528809 20302212 20280521 20226021
5124 20226021 20213068 20414239 20410831 20597758 20847979 21112905 21654544 22207341 22909587 23833657
5114 23833657 24909983 26176075 27279101 28586952 29538732 30080384 30373781 30645423 30868188
5105 30868188 30318415 28755044 26860453 24987702 23508189 22438943 21531482 20888789 20396642
$$ packed form
5170C6656347K97116O02840O99567R82481J216845J254211L11645j236017k524098
5161C8260937l360063l145519k412926k005079j613268j354906r85687o29711
5153B2753778p81033m95789m88348m30935l49891k42292m03407j13647k73302
5144A9175134j4418J93665O6396J22157P5500l8913L33963J02321M5599K92433
5134B0353837L78982K48419J66920m3500k81637j33611j60601k26597k1691n4500
5124B0226021j2953K01171l408J86927K50221K64926N41639N52797P02246R24070
5114B3833657J076326J266092J103026J307851R51780N41652K93397K71642K22765
5105C0868188n49773j563371j894591j872751j479513j069246r07461o42693m92147
$$ plain form
5096 20396642 20174094 19925532 19849379 19702685 19481005 19379615 19305036 19217887 19034389 18977468
5086 18977468 18890153 18571438 18512037 18522940 18397170 18253716 18180605 17821578 17575452 17500074
5076 17500074 16947398 16639788 16298798 16082167 15917785 15657060 15178633 14746981 14388707
5067 14388707 14205767 13817107 13617439 13455466 13325371 13397632 13558367 13489058 13420258 13199954
5057 13199954 13284565 13311490 13352498 13507246 13604896 13528243 13786923 13866455 14167208 14458780
5047 14458780 14578155 15026676 15411746 15981028 16807332 17966300 19579003 21299844 22346294
5038 22346294 22165786 20470187 18542921 16976169 15462829 14355142 13544782 12675280 12122011
5029 12122011 11513690 11155551 10830820 10597435 10392344 10089225 9798879 9658749 9635601 9651717
$$ packed form
5096B0396642k22548k48562p6153j46694k21680j01390p4579q7149j83498n6921
5086A8977468q7315l18715n9401J0903j25770j43454p3111l59027k46126p5378
5076A7500074n52676l07610l40990k16631j64382k60725m78427m31652l58274
5067A4388707j82940l88660j99668j61973j30095P2261J60735o9309o8800k20304
5057A3199954Q4611K6925M1008J54748R7650p6653K58680P9532L00753K91572
5047A4458780J19375M48521L85070N69282Q26304J158968J612703J720841J046450
5038B2346294j80508j695599j927266j566752j513340j107687q10360q69502n53269
5029A2122011o08321l58139l24731k33385k05091l03119k90346j40130k3148J6116
$$ plain form
5019 9651717 9241696 9140208 9013850 9009185 8832174 8452220 8318181 8194161 7850868 7741394
5009 7741394 7606053 7356638 7206203 7080141 7029831 6985129 6973028 6952484 6852003 6695832
4999 6695832 6628518 6677444 6775798 6751573 6560615 6434090 6334376 6317424 6458779 6663199 6651554
4988 6651554 6552604 6712843 6867005 6901422 6947711 6992962 6940352 7226040 7404967 7343567 7331246
4977 7331246 7200955 7171110 7103693 7089193 7083148 7269266 7387140 7189524 6958013 6920935 7084596
4966 7084596 7134407 7308518 7348500 7341676 7341343 7329384 7367198 7398281 7203713 7255436 7224791 7318998
4954 7318998 7387174 7354970 7470605 7682388 7890289 7714304 7898853 8131120 8267349 8385772
4944 8385772 8499012 8736931 9096324 9194147 9469225 9785235 10243298 10602543 10927306 11292311
$$ packed form
5019I651717m10021j01488j26358m665j77011l79954j34039j24020l43293j09474
5009G741394j35341k49415j50435j26062n0310m4702j2101k0544j00481j56171
4999F695832o7314M8926R8354k4225j90958j26525r9714j6952J41355K04420j1645
4988F651554r8950J60239J54162L4417M6289M5251n2610K85688J78927o1400j2321
4977G331246j30291k9845o7417j4500o045J86118J17874j97616k31511l7078J63661
4966G084596M9811J74111L9982o824l33j1959L7814L1083j94568N1723l0645R4207
4954G318998O8176l2204J15635K11783K07901j75985J84549K32267J36229J18423
4944H385772J13240K37919L59393R7823K75078L16010M58063L59245L24763L65005
$$ plain form
4934 11292311 11570593 11713701 11596814 11553108 11349988 11286404 11279107 11239263 11248815 11227026 11493422
4923 11493422 11746066 11840103 11788228 11668909 11525510 11296526 11047354 10873747 10636160 10662850
4913 10662850 10735316 10615518 10782171 10938596 11074150 11137553 11439736 11614902 11649700 12038946
4903 12038946 12328904 12538905 12841494 13300316 13596357 13609235 13793105 14233280 14488710 14876311
4893 14876311 15297448 15626275 15491831 15289714 15011189 14606401 14319174 14044137 13995713 13786864
4883 13786864 13613329 13607440 13581419 13534766 13596256 13676447 13781818 13887912 13962983 14021752 14225743
4872 14225743 14386918 14712328 14819187 15128132 15254175 15612485 16037557 16250358 16499861
4863 16499861 16877490 17204978 17541290 17918470 18442245 18919595 19490294 20067676 20715311
$$ packed form
4934A1292311K78282J43108j16887m3706k03120o3584p297l9844R552k1789K66396
4923A1493422K52644R4037n1875j19319j43399k28984k49172j73607k37587K6690
4913A0662850P2466j19798J66653J56425J35554O3403L02183J75166L4798L89246
4903A2038946K89958K10001L02589M58822K96041J2878J83870M40175K55430L87601
4893A4876311M21137L28827j34444k02117k78525m04788k87227k75037m8424k08849
4883A3786864j73535n889k6021m6653O1490Q0191J05371J06094P5071N8769K03991
4872A4225743J61175L25410J06859L08945J26043L58310M25072K12801K49503
4863A6499861L77629L27488L36312L77180N23775M77350N70699N77382O47635
$$ plain form
4854 20715311 21264796 21685972 22262881 22955796 23744168 24873508 25664963 26553168 27432121
4845 27432121 28429843 29455786 30676394 31899773 33311021 34663332 36324183 38060583
4837 38060583 39987689 42081158 44454899 46987326 50058004 53448500 57741591 62667708
4829 62667708 69706922 78869496 89371653 101011388 115549234 134679633 161786761
4822 161786761 198926301 245127458 295477749 334159987 332978117 283682047 226138113
4815 226138113 178330052 142495386 117839414 100115728 86729774 76173247 68008473
4808 68008473 61418396 55723126 50743831 46400504 42559415 39572807 37083337 35177082
4800 35177082 33180098 31812429 30581813 29177355 27954635 26923053 26030760 25147308
$$ packed form
4854B0715311N49485M21176N76909O92915P88372J129340P91455Q88205Q78953
4845B7432121R97722J025943J220608J223379J411248J352311J660851J736400
4837C8060583J927106K093469K373741K532427L070678L390496M293091M926117
4829F2667708P039214R162574J0502157J1639735J4537846J9130399K7107128
4822A61786761L7139540M6201157N0350291L8682238j181870m9296070n7543934
4815B26138113m7808061l5834666k4655972j7723686j3385954j0556527q164774
4808F8008473o590077n695270m979295m343327l841089k986608k489470j906255
4800C5177082j996984j367669j230616j404458j222720j031582q92293q83452
$$ plain form
4792 25147308 24173629 23212334 22351864 21511314 20775777 20302347 19712562 19025196 18253475
4783 18253475 17475438 16632225 16031884 15432134 14804917 14408771 14092758 13729201 13450828
4774 13450828 13324065 13075286 13028732 13060346 12668117 12660292 12851960 12612155 12386754 12429941
4764 12429941 12369830 12200880 12033891 12012149 11958201 12007567 11807194 11860071 11690357 11303887
4754 11303887 11192572 10991170 10614753 10662272 10566952 10395083 10142106 10164487 10149859 10059041
4744 10059041 9887274 9973260 9956771 9809474 9663053 9651489 9389640 9272543 9271518 9300311
4734 9300311 9233532 9208388 9047685 8844070 8977071 8946660 8954895 9021665 9237487 9243871 9321790
4723 9321790 9445967 9485852 9482539 9414033 9335288 9305382 9032444 9009929 9093354 9151517 9166306
$$ packed form
4792B5147308r73679r61295q60470q40550p35537m73430n89785o87366p71721
4783A8253475p78037q43213o00341n99750o27217l96146l16013l63557k78373
4774A3450828j26763k48779m6554L1614l92229p825J91668k39805k25401M3187
4764A2429941o0111j68950j66989k1742n3948M9366k00373N2877j69714l86470
4754A1303887j11315k01402l76417M7519r5320j71869k52977K2381j4628r0818
4744A0059041j71767Q5986j6489j47297j46421j1564k61849j17097j025K8793
4734I300311o6779k5144j60703k03615J33001l0411Q235O6770K15822O384P7919
4723I321790J24177L9885l313o8506p8745k9906k72938k2515Q3425N8163J4789
$$ plain form
4712 9166306 9164001 9204369 9115474 9019954 8953788 8967784 9061758 9226337 9145286 9230869 9275260
4701 9275260 9206212 9114321 9147671 9192895 9286269 9180685 9010380 8893185 8960046 9144812 8932772
4690 8932772 9119089 9195666 9451791 9600856 9666248 9757692 9719186 9834816 9904501 9884816 10081521
4679 10081521 10168386 10437383 10702508 10853876 10983556 11202447 11398546 11639742 11925170 12376372
4669 12376372 12788055 13089920 13525638 14020132 14363635 14644666 15326723 15647046 15922353
4660 15922353 16235473 16401957 16537192 16725922 16510887 16369391 16362678 16355523 16547205 16665230
4650 16665230 17028499 17379385 17746744 18237238 18676854 19045981 19724355 20402558 21150917
4641 21150917 22024336 22989904 24002790 24876673 26152576 27381411 28659119 30257522 32127587
$$ packed form
4712I166306k305M0368q8895r5520o6166J3996R3974J64579q1051Q5583M4391
4701I275260o9048r1891L3350M5224R3374j05584j70305j17195O6861J84766k12040
4690H932772J86317P6577K56125J49065O5392R1444l8506J15630O9685j9685J96705
4679A0081521Q6865K68997K65125J51368J29680K18891J96099K41196K85428M51202
4669A2376372M11683L01865M35718M94494L43503K81031O82057L20323K75307
4660A5922353L13120J66484J35235J88730k15035j41496o713p155J91682J18025
4650A6665230L63269L50886L67359M90494M39616L69127O78374O78203P48359
4641B1150917Q73419R65568J012886Q73883J275903J228835J277708J598403J870065
$$ plain form
4632 32127587 34196708 36672641 39582370 43519397 48345624 54186621 61019091 68810781
4624 68810781 78754865 91876259 108602864 128183879 149778394 169191235 177099442
4617 177099442 165397704 142206661 118062969 96969751 80564426 68361209 58976274
4610 58976274 51740378 46148082 41453519 37516401 34195192 31440817 29150796 27050231
4602 27050231 25272207 23856004 22612652 21690165 20760268 20051320 19182602 18499336 17970780
4593 17970780 17449827 16803430 16128731 15579321 14966621 14580868 14138546 13552768 13109050
4584 13109050 12864689 12451273 11949997 11682499 11165454 10833557 10583782 10445564 10158644
4575 10158644 10024084 9869452 9709605 9552239 9573439 9493817 9433423 9368854 9296309 9196562
$$ packed form
4632C2127587K069121K475933K909729L937027M826227N840997O832470P791690
4624F8810781R944084J3121394J6726605J9581015K1594515J9412841P908207
4617A77099442j1701738k3191043k4143692k1093218j6405325j2203217r384935
4610E8976274p235896n592296m694563l937118l321209k754375k290021k100565
4602B7050231j778024j416203j243352r22487r29897p08948q68718o83266n28556
4593A7970780n20953o46397o74699n49410o12700l85753m42322n85778m43718
4584A3109050k44361m13416n01276k67498n17045l31897k49775j38218k86920
4575A0158644j34560j54632j59847j57366K1200p9622o0394o4569p2545r9747
$$ plain form
4565 9196562 9020301 8915234 8967470 9019068 9011059 9100973 8964908 8834431 8673423 8646684 8557620
4554 8557620 8286986 8146328 8054371 7920920 7685169 7516023 7370455 7213098 7110330 7190372
4544 7190372 7093252 7011541 7031764 7022575 7039285 6978919 6839399 6895635 6803570 6658024 6622701
4533 6622701 6508555 6570360 6615435 6574236 6636009 6726587 6786675 6803442 6688851 6597805 6540580
4522 6540580 6606126 6457123 6457830 6540093 6574779 6478540 6510696 6602767 6581468 6644269 6695495 6665182
4510 6665182 6678361 6726969 6633416 6845868 7153374 7223374 7400973 7578179 7806010 7769607
4500 7769607 7428667 7275714 7100450 6922365 6809329 6728316 6717213 6698775 6650521 6698984
4490 6698984 6731284 6686183 6728619 6998798 7054858 7032664 7234006 7304739 7349205 7579826 7725156
$$ packed form
4565I196562j76261j05067N2236N1598q009Q9914j36065j30477j61008k6739q9064
4554H557620k70634j40658r1957j33451k35751j69146j45568j57357j02768Q0042
4544G190372r7120q1711K0223r189J6710o0366j39520N6236r2065j45546l5323
4533F622701j14146O1805M5075m1199O1773R0578O0088J6767j14591r1046n7225
4522F540580O5546j49003P07Q2263L4686r6239L2156R2071k1299O2801N1226l0313
4510F665182J3179M8608r3553K12452L07506P0000J77599J77206K27831l6403
4500G769607l40940j52953j75264j78085j13036q1013j1103j8438m8254M8463
4490F698984L2300m5101M2436K70179N6060k2194K01342P0733M4466K30621J45330
$$ plain form
4479 7725156 7849815 7944897 7957554 8078156 8210678 8452363 8625475 8872847 8991504 9250316
4469 9250316 9381548 9833843 10173519 10372237 10678754 11069697 11388459 11678468 12093660 12512486
4459 12512486 13048296 13750355 14160855 14431382 14434934 14062910 13899244 13724104 13629562 13488227
4449 13488227 13420448 13399031 13279481 13210007 13320610 13263208 13221157 13514260 13913967 14268638
4439 14268638 14744061 15391739 16010972 16531736 16670701 16718197 16590225 16168022 15783509 15376925
4429 15376925 15027139 14828512 14635702 14389894 14211898 14067127 13948485 13810619 13425870
4420 13425870 13028065 12925602 12878018 12721791 12507396 12519728 12414664 12364974 12296989 12224639
4410 12224639 12169658 12239572 12439944 12390250 12442507 12392231 12184574 12122616 12200920 12032026 11755594
$$ packed form
4479G725156J24659R5082J2657J20602J32522K41685J73112K47372J18657K58812
4469I250316J31232M52295L39676J98718L06517L90943L18762K90009M15192M18826
4459A2512486N35810P02059M10500K70527L552l72024j63666j75140r4542j41335
4449A3488227o7779k1417j19550o9474J10603n7402m2051K93103L99707L54671
4439A4268638M75423O47678O19233N20764J38965M7496j27972m22203l84513m06584
4429A5376925l49786j98627j92810k45808j77996j44771j18642j37866l84749
4420A3425870l97805j02463m7584j56227k14395J2332j05064m9690o7985p2350
4410A2224639n4981O9914K00372m9694N2257n0276k07657o1958P8304j68894k76432
$$ plain form
4399 11755594 11627739 11688744 11844862 11888744 12215601 12402583 12645698 12634125 12487735 12436304
4389 12436304 11924902 11465206 11075531 10633082 10610750 10498303 10364319 10410173 10653923 10772428
4379 10772428 10983591 10856358 10851756 11002010 10908237 10780379 10473456 10412232 10377742 10265677
4369 10265677 10027831 9841568 9537835 9510869 9542553 9394146 9424385 9404246 9423895 9278143
4359 9278143 9282124 9373893 9396356 9322532 9329549 9246227 9254535 9268172 9380895 9603949 9688927 9825256
4347 9825256 10027875 10359150 10683601 10945054 11204189 11586650 11948860 12296379 12398210 12367740
4337 12367740 12346394 12226413 12014370 11770328 11680968 11676737 11659911 11722129 11820170 11860833 11919456
4326 11919456 12007716 11997403 12282549 12547811 12657802 12907863 13207547 13288144 13482895 13738176
$$ packed form
4399A1755594j27855O1005J56118M3882L26857J86982K43115j1573j46390n1431
4389A2436304n11402m59696l89675m42449k2332j12447j33984M5854K43750J18505
4379A0772428K11163j27233m602J50254r3773j27858l06923o1224l4490j12065
4369A0265677k37846j86263l03733k6966L1684j48407L0239k0139J9649j45752
4359I278143L981R1769K2463p3824P017q3322Q308J3637J12723K23054Q4978J36329
4347I825256K02619L31275L24451K61453K59135L82461L62210L47519J01831l0470
4337A2367740k1346j19981k12043k44042q9360m231j6826O2218R8041M0663N8623
4326A1919456Q8260j0313K85146K65262J09991K50061K99684Q0597J94751K55281
$$ plain form
4316 13738176 13986010 14172263 14526044 14968891 15364304 15753239 16008808 16076753 16442016 16719202
4306 16719202 17135627 17665617 17974741 18345353 18752700 19309336 19769287 20197725 20826279
4297 20826279 21135815 21358609 21486344 21642310 21722261 21906936 22298139 22569689 22550512 22290036
4287 22290036 22094861 21783673 21512358 21438924 21664788 22025427 22446067 22945974 23692656 24702697
4277 24702697 25755948 26968926 28429823 29975488 31867289 34393416 37336870 40896621
4269 40896621 44631627 48007987 50087600 49867070 47149147 43283936 39221539 35744345
4261 35744345 32984939 30708697 29095590 27774628 26845753 26032038 25372831 24733085 24032862
4252 24032862 23325700 22775431 22545935 22155018 22015001 22065652 21986099 21977371 21933168 21969321
$$ packed form
4316A3738176K47834J86253L53781M42847L95413L88935K55569O7945L65263K77186
4306A6719202M16425N29990L09124L70612M07347N56636M59951M28438O28554
4297B0826279L09536K22794J27735J55966P9951J84675L91203K71550j9177k60476
4287B2290036j95175l11188k71315p3434K25864L60639M20640M99907P46682J010041
4277B4702697J053251J212978J460897J545665J891801K526127K943454L559751
4269D0896621L735006L376360K079613k20530k717923l865211m062397l477194
4261C5744345k759406k276242j613107j320962r28875q13715o59207o39746p00223
4252B4032862p07162n50269k29496l90917j40017N0651p9553q728m4203L6153
$$ plain form
4242 21969321 22094651 22226636 22183217 22118384 22139860 22307726 22439593 22664382 22680207 22973776
4232 22973776 22939999 23092131 23291324 23343634 23427751 23649466 23814322 23841338 23842487 23907882 24023501
4221 24023501 23958491 24193729 24645199 25102891 25770026 26252131 26826878 27127859 27175685 26861821
4211 26861821 26361269 25993800 25634946 25367355 25059902 24932057 24886919 24723744 24859162 24928516
4201 24928516 24899747 25227113 25624606 26026920 26114746 26138515 26046676 25745286 25283488 24733122
4191 24733122 24267520 23985063 23670223 23404191 23417823 23384724 23430358 23539309 23604575 23764562
4181 23764562 24083509 24351527 24668096 24978504 25186920 25497945 25715733 26019394 26092508 26167823
4171 26167823 26203718 26446827 26561221 26761753 27122347 27631561 28268480 29018453 29782930 30479477
$$ packed form
4242B1969321J25330J31985m3419o4833K1476J67866J31867K24789J5825K93569
4232B2973776l3777J52132J99193N2310Q4117K21715J64856K7016J149O5395J15619
4221B4023501o5010K35238M51470M57692O67135M82105N74747L00981M7826l13864
4211B6861821n00552l67469l58854k67591l07453j27845m5138j63175J35418O9354
4201B4928516k8769L27366L97493M02314Q7826K3769r1839l01390m61798n50366
4191B4733122m65602k82457l14840k66032J3632l3099M5634J08951O5266J59987
4181B3764562L18947K68018L16569L10408K08416L11025K17788L03661P3114P5315
4171B6167823L5895K43109J14394K00532L60594N09214O36919P49973P64477O96547
$$ plain form
4161 30479477 31281000 31953856 32985406 34193035 35680515 37521082 39624744 42337934
4153 42337934 45265014 48442412 51380283 53656302 54939240 55460883 55000157 53693696
4145 53693696 51796491 49733580 47917802 46405649 45367363 45312353 45391843 45995203 47173755
4136 47173755 48641982 50579371 52945767 55989165 59667425 63774946 67950615 72085244
4128 72085244 75781331 78676028 80498038 80651594 79290901 76428340 72230396 67093832
4120 67093832 61535503 55930462 50845277 46405067 42650844 39506255 36909810 34558958
4112 34558958 32446844 30830684 29356379 28124462 27034160 25985166 25070167 24411207
4104 24411207 23752266 23184889 22655134 22148482 21706706 21476810 20982303 20768688 20475945
$$ packed form
4161C0479477Q01523O72856J031550J207629J487480J840567K103662K713190
4153D2337934K927080L177398K937871K276019J282938N21643m60726j306461
4145E3693696j897205k062911j815778j512153j038286n5010P9490O03360J178552
4136D7173755J468227J937389K366396L043398L678260M107521M175669M134629
4128G2085244L696087K894697J822010J53556j360693k862561m197944n136564
4120F7093832n558329n605041n085185m440210l754223l144589k596445k350852
4112C4558958k112114j616160j474305j231917j090302j048994r14999o58960
4104B4411207o58941n67377n29755n06652m41776k29896m94507k13615k92743
$$ plain form
4095 20475945 20322077 20026839 19948338 19929286 19843970 19702233 19654757 19439945 19441351 19307898
4085 19307898 19124455 19142331 19101943 19186446 19400279 19321735 19447373 19637849 19590935 19710181
4075 19710181 19893277 20059442 20155124 20425076 20482697 20559057 20523496 20558069 20738342 20760101
4065 20760101 20989430 21008076 21150134 21273502 21485562 21789431 21994855 22085904 22374207 22608101
4055 22608101 22706319 22969021 23071022 23435566 23736899 23971330 24119471 24378652 24704624 25107279
4045 25107279 25521865 26017337 26439930 26805529 27175034 27666449 28143417 28657518 29212019
4036 29212019 29788321 30462128 31100468 31811690 32579868 33397532 34238368 35043698 35886081
4027 35886081 36709840 37711004 38852985 40010936 41204672 42447797 43579982 45102730
$$ packed form
4095B0475945j53868k95238p8501j9052q5316j41737m7476k14812J406j33453
4085A9307898j83443J7876m0388Q4503K13833p8544J25638J90476m6914J19246
4075A9710181J83096J66165R5682K69952N7621P6360l5561L4573J80273K1759
4065B0760101K29329J8646J42058J23368K12060L03869K05424R1049K88303K33894
4055B2608101R8218K62702J02001L64544L01333K34431J48141K59181L25972M02655
4045B5107279M14586M95472M22593L65599L69505M91415M76968N14101N54501
4036B9212019N76302O73807O38340P11222P68178Q17664Q40836Q05330Q42383
4027C5886081Q23759J001164J141981J157951J193736J243125J132185J522748
$$ plain form
4019 45102730 46604907 48123404 49753694 51437088 53430188 55417953 57343633 59542568
4011 59542568 61601841 64038004 66549739 68875639 71555772 74033260 76707703 79403661
4003 79403661 82032742 84932396 87682053 90612614 93739283 96921474 100113658 103108000
3995 103108000 106056505 108979022 111582379 114176870 116702661 118992351 121322640 123301118
3987 123301118 125434564 127322022 129141022 130982766 132651284 134260180 135517065 136567918
3979 136567918 137292292 137552322 137561028 137298429 136725063 136065694 135512573 134685384 133688405 132754981
3969 132754981 131536584 130335973 129085529 127379934 125541585 123480029 120977522 118706187
3961 118706187 116128148 113390634 110615210 107943906 105469728 102963650 100408102 97926541
$$ packed form
4019D5102730J502177J518497J630290J683394J993100J987765J925680K198935
4011E9542568K059273K436163K511735K325900K680133K477488K674443K695958
4003G9403661K629081K899654K749657K930561L126669L182191L192184K994342
3995A03108000K948505K922517K603357K594491K525791K289690K330289J978478
3987A23301118K133446J887458J819000J841744J668518J608896J256885J050853
3979A36567918P24374K60030Q706k62599n73366o59369n53121q27189r96979r33424
3969A32754981j218397j200611j250444j705595j838349k061556k502507k271335
3961A18706187k578039k737514k775424k671304k474178k506078k555548k481561
$$ plain form
3953 97926541 95479956 93038066 90568026 88183503 85702417 83180815 80619488 78080999
3945 78080999 75373915 72701918 70220299 67712440 65092776 62664471 60549030 58307234
3937 58307234 56217551 54497172 52699405 50908239 49238515 47298400 45591428 43908968
3929 43908968 42342471 40974822 39775122 38589521 37495868 36624970 35891459 35117465 34395359
3920 34395359 33791982 33161556 32579664 32024660 31357344 30737989 30180898 29536999 28941811
3911 28941811 28233013 27532371 27104761 26503286 25966311 25471204 25243840 24789994 24346720
3902 24346720 23970312 23787043 23503092 23373052 23338509 23112886 22813458 22405908 21817789 21204638
3892 21204638 20727803 19877318 19279997 18890183 18437578 18207040 18014330 17570877 17375261
$$ packed form
3953I7926541k446585k441890k470040k384523k481086k521602k561327k538489
3945G8080999k707084k671997k481619k507859k619664k428305k115441k241796
3937E8307234k089683j720379j797767j791166j669724j940115j706972j682460
3929D3908968j566497j367649j199700j185601j093653q70898p33511p73994p22106
3920C4395359o03377o30426n81892n55004o67316o19355n57091o43899n95188
3911B8941811p08798p00642m27610o01475n36975m95107k27364m53846m43274
3902B4346720l76408j83269k83951j30040l4543k25623k99428m07550n88119o13151
3892B1204638m76835q50485n97321l89814m52605k30538j92710m43453j95616
$$ plain form
3883 17375261 17171245 16906772 16740800 16629965 16443560 16089050 15900004 15723866 15592174
3874 15592174 15364411 15350801 15326292 15451200 15520908 15668525 15890347 15933900 16065609 16408005
3864 16408005 16735647 16955989 17340309 17553050 17852924 18106520 18375211 18622530 18746466
3855 18746466 19024255 19245400 19145092 19034115 18802130 18757680 18789014 18834897 18711382 18370735
3845 18370735 18252978 18086143 17902664 17784887 17678653 17541082 17055585 16860575 16598913
3836 16598913 16201599 15816167 15374114 14932144 14520580 14041181 13702050 13289931 12893549
3827 12893549 12658873 12522825 12177955 11842054 11762095 11628186 11402309 11198322 11020238 10822178
3817 10822178 10693574 10433301 10264591 10174696 10050510 9889759 9783746 9593103 9521413 9633887
$$ packed form
3883A7375261k04016k64473j65972j10835j86405l54510j89046j76138j31692
3874A5592174k27763j3610k4509J24908O9708J47617K21822M3553J31709L42396
3864A6408005L27642K20342L84320K12741K99874K53596K68691K47319J23936
3855A8746466K77789K21145j00308j10977k31985m4450L1334M5883j23515l40647
3845A8370735j17757j66835j83479j17777j06234j37571m85497j95010k61662
3836A6598913l97314l85432m42053m41970m11564m79399l39131m12119l96382
3827A2893549k34676j36048l44870l35901p9959j33909k25877k03987j78084j98060
3817A0822178j28604k60273j68710q9895j24186j60751j06013j90643p1690J12474
$$ plain form
3807 9633887 9504860 9437948 9517564 9447850 9212369 9250119 9374911 9258826 9195945 9211423 9175995
3796 9175995 9099456 9109960 8964049 8810147 8982099 8895951 8906256 8946620 8877010 8951022 8876504
3785 8876504 8779891 8775324 8897115 8844668 8698591 8632457 8769730 8662213 8708803 8705366 8747791
3774 8747791 8801220 8956171 8857188 8778288 8735440 8655125 8774136 8846078 8786975 8976134 9209540
3763 9209540 9215616 9393320 9661988 9689166 9594097 9720818 9909890 10096898 10154861 10200616 10510195
3752 10510195 10563898 10662780 10866815 11051991 11119572 11274681 11548075 11582349 11566477 11772554
3742 11772554 11952223 11990079 12070141 11964028 12194762 12357688 12408139 12415886 12689268 12729836
3732 12729836 12729058 12752889 12951373 13058759 13275369 13371402 13431416 13313357 13352230 13519308 13574532
$$ packed form
3807I633887j29027o6912P9616o9714k35481L7750J24792j16085o2881J5478l5428
3796I175995p6539J0504j45911j53902J71952q6148J0305M0364o9610P4012p4518
3785H876504r6613m567J21791n2447j46077o6134J37273j07517M6590l437M2425
3774H747791N3429J54951r8983p8900m2848q0315J19011P1942n9103J89159K33406
3763I209540O076J77704K68668K7178r5069J26721J89072J87008N7963M5755L09579
3752A0510195N3703R8882K04035J85176O7581J55109K73394L4274j5872K06077
3742A1772554J79669L7856Q0062j06113K30734J62926N0451P747K73382M0568
3732A2729836p78K3831J98484J07386K16610R6033O0014j18059L8873J67078N5224
$$ plain form
3721 13574532 13691620 13808873 13911551 14013108 14145215 14317363 14575027 14736508 14776371 14841184
3711 14841184 15091046 15416394 15690533 15817803 15992482 16163985 16418661 16744291 16810232 17062461
3701 17062461 17495009 17716695 18052641 18450783 18688500 19005345 19415380 19784789 20091464
3692 20091464 20590522 20895095 21114277 21589402 22119421 22515113 22750403 23347687 23760948
3683 23760948 24498134 24961176 25589795 26145979 26492148 27090195 27540893 28164309 28816570
3674 28816570 29418566 30025645 30759113 31470384 32046666 32808118 33458374 34330456 35046915
3665 35046915 35874392 36712498 37485884 38589177 39557615 40638833 41986420 43254141 44371115
3656 44371115 45823279 47352419 49023599 50691137 52492607 54423900 56337347 58123211
$$ packed form
3721A3574532J17088J17253J02678J01557J32107J72148K57664J61481L9863O4813
3711A4841184K49862L25348K74139J27270J74679J71503K54676L25630O5941K52229
3701A7062461M32548K21686L35946L98142K37717L16845M10035L69409L06675
3692B0091464M99058L04573K19182M75125N30019L95692K35290N97284M13261
3683B3760948P37186M63042O28619N56184L46169N98047M50698O23416O52261
3674B8816570O01996O07079P33468P11271N76282P61452O50256Q72082P16459
3665C5046915Q27477Q38106P73386J103293R68438J081218J347587J267721J116974
3656D4371115J452164J529140J671180J667538J801470J931293J913447J785864
$$ plain form
3648 58123211 60016215 62174576 64173064 66096279 67894874 69734495 71560785 73326274
3640 73326274 74906843 76514037 78301527 80008350 81648015 83320792 84802219 86236256
3632 86236256 87345085 88557624 89497415 90275127 91071146 91476701 91705211 91926898 92151444
3623 92151444 92250519 92441335 92804762 93026581 93188629 93451666 93827109 94111952 94438844 94679337
3613 94679337 95036785 95717693 96173939 96662081 97242472 98206583 99028151 100093821 101374792
3604 101374792 102956078 104834312 106811528 109306800 111749204 114404468 117429068 120649454
3596 120649454 124272115 128114259 131876427 135879508 139678308 143562895 147674412 151225625
3588 151225625 154758210 158158353 161251270 164467290 167791723 170919580 174041817 177165406
$$ packed form
3648E8123211J893004K158361J998488J923215J798595J839621J826290J765489
3640G3326274J580569J607194J787490J706823J639665J672777J481427J434037
3632H6236256J108829J212539R39791P77712P96019M05555K28510K21687K24546
3623I2151444R9075J90816L63427K21819J62048K63037L75443K84843L26892K40493
3613I4679337L57448O80908M56246M88142N80391R64111Q21568J065670J280971
3604A01374792J581286J878234J977216K495272K442404K655264L024600L220386
3596A20649454L622661L842144L762168M003081L798800L884587M111517L551213
3588A51225625L532585L400143L092917L216020L324433L127857L122237L123589
$$ plain form
3580 177165406 180015736 182595803 184863055 186472570 187945582 188556957 188613476 188175786 187434782
3571 187434782 186251082 185078413 183721457 182182969 180831041 179414164 177990320 176593343
3563 176593343 175170505 173674913 172095878 170433108 168766022 167379243 166123282 165164359
3555 165164359 164588153 164323446 164643631 165179388 166002580 167104569 168671369 170326647 172221774
3546 172221774 174063010 176045606 177922669 179697419 181138960 182391597 183772183 185088398
3538 185088398 186606479 188220355 189826374 191464496 192908409 194417694 195601400 196191290
3530 196191290 196303058 195926691 195080727 193847654 192052893 190095094 187994956 185343390
3522 185343390 182347727 179335585 176322480 173244816 170271253 167602305 165147493 162822615
$$ packed form
3580A77165406K850330K580067K267252J609515J473012O11375N6519m37690p41004
3571A87434782j183700j172669j356956j538488j351928j416877j423844j396977
3563A76593343j422838j495592j579035j662770j667086j386779j255961r58923
3555A65164359n76206k64707L20185N35757Q23192J101989J566800J655278J895127
3546A72221774J841236J982596J877063J774750J441541J252637J380586J316215
3538A85088398J518081J613876J606019J638122J443913J509285J183706N89890
3530A96191290J11768l76367q45964j233073j794761j957799k100138k651566
3522A85343390k995663l012142l013105l077664k973563k668948k454812k324878
$$ plain form
3514 162822615 160282671 157808792 155200670 152392086 149498331 146552994 143646439 140752375
3506 140752375 138278323 135784109 133932929 132238055 130976797 129904691 129119755 128567947
3498 128567947 128394677 128442016 128617956 129014265 129458655 130192290 131129345 132036249 133208113
3489 133208113 134451671 135911911 137470075 138939066 140674407 142769829 145453537 148153892
3481 148153892 151222186 154877237 159079150 163770675 168839622 174520304 180947133 187922013
3473 187922013 195665164 204687979 215101933 226954858 240461200 255469467 271576500
3466 271576500 287972958 304042545 318499066 330813655 340133547 346126299 348646363
3459 348646363 348033380 345181427 341207321 336981200 333171284 330243544 328409810 327229267
$$ packed form
3514A62822615k539944k473879k608122k808584k893755k945337k906555k894064
3506A40752375k474052k494214j851180j694874j261258j072106p84936n51808
3498A28567947j73270M7339J75940L96309M44390P33635R37055R06904J171864
3489A33208113J243558J460240J558164J468991J735341K095422K683708K700355
3481A48153892L068294L655051M201913M691525N068947N680682O426829O974880
3473A87922013P743151R022815J0413954J1852925J3506342J5008267J6107033
3466B71576500J6396458J6069587J4456521J2314589R319892N992752K520064
3459C48646363o12983k851953l974106m226121l809916k927740j833734j180543
$$ plain form
3451 327229267 326183832 324586862 321785533 316743399 308901009 297915109 283964453 268008238
3443 268008238 250691723 232853656 215567511 199494836 185190063 172906472 162288806
3436 162288806 153318717 145803992 139339528 133574156 128652064 124352447 120879579 117768971
3428 117768971 115019393 112908859 111387409 110186333 109273834 108605238 108131986 108033699 108070718
3419 108070718 108043957 108081357 107807520 107051300 106166301 104843881 103430498 101923202 100364651
3410 100364651 98542428 96800803 94971301 93150283 91510855 89712606 88037831 86052511
3402 86052511 83954939 81662579 79256652 76408323 73205314 69975788 66693538 63394703
3394 63394703 60209172 57092344 54247150 51641858 48999805 46818802 44729696 42781963
$$ packed form
3451C27229267j045435j596970k801329n042134p842390j0985900j3950656j5956215
3443B68008238j7316515j7838067j7286145j6072675j4304773j2283591j0617666
3436A62288806q970089p514725o464464n765372m922092m299617l472868l110608
3428A17768971k749578k110534j521450j201076r12499o68596m73252r8287L7019
3419A08070718k6761L7400k73837p56220q84999j322420j413383j507296j558551
3410A00364651j822223j741625j829502j821018j639428j798249j674775j985320
3402H6052511k097572k292360k405927k848329l203009l229526l282250l298835
3394F3394703l185531l116828k845194k605292k642053k181003k089106j947733
$$ plain form
3386 42781963 40999278 39405593 37853010 36379609 35096789 34017208 32791326 31665226
3378 31665226 30699018 29752574 28825353 27891960 27243616 26397436 25643634 25058114 24398838
3369 24398838 23734632 23298252 22655366 22234952 21766983 21237696 20808032 20343179 19772438
3360 19772438 19504879 19225747 18840221 18717517 18431246 18085420 17799520 17384256 17084074
3351 17084074 16821711 16505404 16277445 16153174 15791623 15665823 15497632 15380593 15072410
3342 15072410 14790512 14665006 14476444 14380189 14184310 14050651 13789794 13607474 13431295 13312671
3332 13312671 13159858 13012101 12931512 12888522 12693891 12667846 12552511 12390434 12209880 12409856
3322 12409856 12207735 12087502 12099609 11945191 11869277 11838359 11866818 11844471 11720543 11641560
$$ packed form
3386D2781963j782685j593685j552583j473401j282820j079581j225882j126100
3378C1665226r66208r46444r27221r33393o48344q46180p53802n85520o59276
3369B4398838o64206m36380o42886m20414m67969n29287m29664m64853n70741
3360A9772438k67559k79132l85526j22704k86271l45826k85900m15264l00182
3351A7084074k62363l16307k27959j24271l61551j25800j68191j17039l08183
3342A5072410k81898j25506j88562r6255j95879j33659k60857j82320j76179j18624
3332A3312671j52813j47757q0589m2990j94631k6045j15335j62077j80554J99976
3322A2409856k02121j20233J2107j54418p5914l0918K8459k2347j23928p8983
$$ plain form
3312 11641560 11626180 11499039 11492417 11580141 11527039 11464432 11435257 11487802 11454947 11542954 11675947
3301 11675947 11521235 11484474 11536975 11547658 11505111 11505516 11645399 11577358 11429265 11494854 11606840
3290 11606840 11684973 11689965 11770206 11693836 11740440 11673317 11649481 11873669 11968282 11892973 12014162
3279 12014162 11878038 12128317 12260047 12260458 12291521 12408690 12498101 12731148 12836300 13038490
3269 13038490 13327944 13484893 13643998 13639913 13852797 14077259 14323860 14504274 14605667 14750496
3259 14750496 14961564 15010166 15372608 15653731 15739457 16016104 16269776 16424339 16611153 17011481
3249 17011481 17298911 17484780 17809037 18129836 18591197 18887465 19374230 19865740 20215415
3240 20215415 20765417 21341623 21926706 22672171 23538380 24446359 25220457 26226859 27255595
$$ packed form
3312A1641560j5380j27141o622Q7724n3102o2607k9175N2545l2855Q8007J32993
3301A1675947j54712l6761N2501J0683m2547M05J39883o8041j48093O5589J11986
3290A1606840P8133M992Q0241p6370M6604o7123k3836K24188R4613p5309J21189
3279A2014162j36124K50279J31730M11L1063J17169Q9411K33047J05152K02190
3269A3038490K89454J56949J59105m085K12884K24462K46601J80414J01393J44829
3259A4750496K11068M8602L62442K81123Q5726K76647K53672J54563J86814M00328
3249A7011481K87430J85869L24257L20799M61361K96268M86765M91510L49675
3240B0215415N50002N76206N85083P45465Q66209R07979P74098J006402J028736
$$ plain form
3231 27255595 28536821 29880256 30971674 31895039 33296821 34806131 36393848 38239574
3223 38239574 40336910 42487655 44373082 46117171 47773181 48917105 49313173 49027391
3215 49027391 47909466 45941917 43490867 40858560 38244092 35843201 33585791 31608986
3207 31608986 30088680 28556416 27350645 26434495 25581999 24942009 24510775 24353964 24234931
3198 24234931 24062143 23358179 22176172 21025012 20350956 19799799 19201570 18733215 18479860
3189 18479860 18096904 17789341 17495556 17226011 16917952 16671336 16366930 16313901 15886243 15465229
3179 15465229 15285655 15023465 14873253 14603367 14452967 14125524 13866635 13739173 13714579 13554633
3169 13554633 13559581 13697443 13614047 13455566 13035442 12706733 12339492 11880887 11662981 11252810
$$ packed form
3231B7255595J281226J343435J091418R23365J401782J509310J587717J845726
3223C8239574K097336K150745J885427J744089J656010J143924L96068k85782
3215D9027391j117925j967549k451050k632307k614468k400891k257410j976805
3207C1608986j520306j532264j205771r16150q52496o39990m31234j56811j19033
3198B4234931j72788p03964j182007j151160o74056n51157n98229m68355k53355
3189A8479860l82956l07563k93785k69545l08059k46616l04406n3029m27658m21014
3179A5465229j79574k62190j50212k69886j50400l27443k58889j27462k4594j59946
3169A3554633M948J37862q3396j58481m20124l28709l67241m58605k17906m10171
$$ plain form
3159 11252810 11047961 10915107 10780020 10591184 10343036 10066805 9883487 9766662 9444046
3150 9444046 9012534 8931301 8748244 8420567 8223628 8084629 8023740 7625003 7557147 7452169
3140 7452169 7362518 7307223 7193474 7028245 6963478 6954038 6857319 6771110 6704517 6647354 6466551
3129 6466551 6440665 6391160 6205155 6166925 6072696 6146345 6222338 6004914 6029273 5972670 5790692
3118 5790692 5793056 5610442 5608697 5561650 5395590 5402251 5376284 5166825 5060947 5087664 5122744
3107 5122744 5103283 5018003 4991694 4928755 4858921 4733587 4565575 4511023 4599662 4662677 4547738
3096 4547738 4424602 4436611 4504514 4287247 4274769 4277476 4226590 4032104 4039848 3870240 3965967
3085 3965967 3904216 3887047 4122996 4086836 4067757 4009395 3971305 3864944 3869527 3824141 3803448
$$ packed form
3159A1252810k04849j32854j35087j88836k48148k76231j83318j16825l22616
3150I444046m31512q1233j83057l27677j96939j38999o0889l98737o7856j04978
3140G452169q9651n5295j13749j65229o4767r440r6719q6209o6593n7163j80803
3129F466551k5886m9505j86005l8230r4229P3649P5993k17424K4359n6603j81978
3118E790692K364j82614j745m7047j66060O661k5967k09459j05878K6717L5080
3107E122744j9461q5280k6309o2939o9834j25334j68012n4552Q8639O3015j14939
3096D547738j23136J2009O7903k17267j2478K707n0886j94486P744j69608R5727
3085C965967o1751j7169K35949l6160j9079n8362l8090j06361M583m5386k0693
$$ plain form
3074 3803448 3758970 3849534 3904337 3864131 3774141 3720495 3556041 3554171 3477187 3583638 3670666
3063 3670666 3555077 3474012 3497227 3456109 3352476 3325648 3386987 3290885 3331214 3241674 3172139
3052 3172139 3285023 3390612 3332286 3392371 3311732 3286175 3243098 2972690 2977514 2989571 2937334
3041 2937334 3006493 3029452 3121859 3209852 3099288 2917918 2952623 3009193 3028045 3040149 2889849
3030 2889849 2833809 2778309 2763022 2698959 2705785 2824276 2842334 2826978 2697337 2665745 2648847
3019 2648847 2631078 2692480 2667758 2536998 2487827 2455338 2627846 2503975 2462043 2487436 2415237
3008 2415237 2543152 2464378 2453144 2436241 2433442 2401490 2463322 2469555 2455548 2431721 2350453 2262374
2996 2262374 2217488 2337198 2410149 2392056 2510467 2545329 2390316 2350106 2221783 2232303 2284128
$$ packed form
3074C803448m4478R0564N4803m0206q9990n3646j64454j870p6984J06451Q7028
3063C670666j15589q1065K3215m1118j03633k6828O1339r6102M0329q9540o9535
3052C172139J12884J05589n8326O0085q0639k5557m3077k70408M824J2057n2237
3041B937334O9159K2959R2407Q7993j10564j81370L4705N6570J8852J2104j50300
3030B889849n6040n5500j5287o4063O826J18491J8058j5356j29641l1592j6898
3019B648847j7769O1402k4722j30760m9171l2489J72508j23871m1932K5393p2199
3008B415237J27915p8774j1234j6903k799l1952O1832O233j4007k3827q1268q8079
2996B262374m4886J19710P2951j8093J18411L4862j55013m0210j28323J0520N1825
$$ plain form
2985 2284128 2172772 2238375 2388933 2344384 2321233 2390445 2397852 2264336 2169531 2335869 2263174
2974 2263174 2349266 2319350 2221209 2194735 2326519 2435109 2465605 2472014 2469715 2449702 2343263
2963 2343263 2377117 2394248 2514768 2515164 2260885 2292032 2443836 2574182 2531862 2552704 2548034
2952 2548034 2543869 2594609 2606261 2672438 2844185 2827747 2785136 2851803 2932389 3060517 3096285
2941 3096285 3035704 3111074 3136803 3018910 3072988 3210642 3290287 3253465 3255301 3294476 3325618
2930 3325618 3164411 3354640 3503474 3409095 3431435 3546862 3650257 3898341 3989532 3893455
2920 3893455 3987936 4116903 4172383 4217485 4421089 4621562 4880911 4843199 4993031 5130551
2910 5130551 5334566 5499749 5550031 5743954 5844443 5960624 6070348 6236756 6371733 6327454
$$ packed form
2985B284128j11356O5603J50558m4549k3151O9212P407j33516r4805J66338p2695
2974B263174Q6092k9916r8141k6474J31784J08590L0496O409k299k0013j06439
2963B343263L3854J7131J20520L96k54279L1147J51804J30346m2320K0842m670
2952B548034m165N0740J1652O6177J71747j6438m2611O6667Q0586J28128L5768
2941C096285o0581P5370K5729j17893N4078J37654P9645l6822J836L9175L1142
2930C325618j61207J90229J48834r4379K2340J15427J03395K48084R1191r6077
2920C893455R4481J28967N5480M5102K03604K00473K59349l7712J49832J37520
2910E130551K04015J65183N0282J93923J00489J16181J09724J66408J34977m4279
$$ plain form
2900 6327454 6385749 6338598 6168024 6205525 6395157 6556410 6631935 6779479 6723601 6813715 7046402
2889 7046402 7229461 7480539 7769637 7974092 8222328 8560724 8997343 9319014 9642971 10091407
2879 10091407 10553381 10868982 11098971 11187371 11092109 10685417 10260675 9858379 9500053 8978688
2869 8978688 8834915 8597707 8590787 8590433 8414501 8440393 8448094 8617142 8785322 9022669 9163860
2858 9163860 9480189 9660668 10078877 10390210 10542799 10663005 10793923 10920833 11054693 11167035
2848 11167035 10958037 10873584 10597652 10215720 9925382 9421301 9138939 8666650 8241796 8191531
2838 8191531 8037298 7750580 7569410 7399605 7347151 7366717 7357531 7434497 7576225 7529197 7548452
2827 7548452 7545559 7514606 7496874 7323832 7065620 6899241 6705819 6464373 6229255 5878035
$$ packed form
2900F327454N8295m7151j70574L7501J89632J61253P5525J47544n5878R0114K32687
2889G046402J83059K51078K89098K04455K48236L38396M36619L21671L23957M48436
2879A0091407M61974L15601K29989Q8400r5262m06692m24742m02296l58326n21365
2869H978688j43773k37208o920l54j75932K5892P701J69048J68180K37347J41191
2858I163860L16329J80479M18209L11333J52589J20206J30918J26910J33860J12342
2848A1167035k08998q4453k75932l81932k90338n04081k82362m72289m24854n0265
2838H191531j54233k86718j81170j69805n2454J9566r186P6966J41728m7028J9255
2827G548452k893l0953j7732j73042k58212j66379j93422k41446k35118l51220
$$ plain form
2817 5878035 5542312 5251101 5122097 4836061 4561637 4326410 4316647 4333769 4269803 4103476
2807 4103476 3944432 3807101 3636693 3312284 3261711 3368035 3271202 3266777 3307718 3238121 3214866
2796 3214866 3075480 2715531 2680788 2549058 2610578 2633367 2424852 2557128 2468101 2328524
2786 2328524 2211611 2326463 2168344 2059805 2204228 2096626 2062624 1945659 1965221 1753811
2776 1753811 1800916 1773063 1873192 1851531 1554002 1565149 1652518 1772253 1715779 1573321 1368607
2765 1368607 1537756 1500616 1635127 1561509 1504857 1645390 1586579 1472208 1342854 1334833 1395652
2754 1395652 1360944 1281637 1237798 1181551 1073915 980802 972899 879194 1001754 861804 894799
2743 894799 1030548 1006330 1019285 1024043 1068635 1016948 904686 929982 794394 848027 869732
$$ packed form
2817E878035l35723k91211j29004k86036k74424k35227r763J7122o3966j66327
2807D103476j59044j37331j70408l24409n0573J06324r6833m425M0941o9597k3255
2796C214866j39386l59949l4743j31730O1520K2789k08515J32276q9027j39577
2786B328524j16913J14852j58119j08539J44423j07602l4002j16965J9562k11410
2776A753811M7105k7853J00129k1661k97529J1147Q7369J19735n6474j42458k04714
2765A368607J69149l7140J34511p3618n6652J40533n8811j14371j29354q021O0819
2754A395652l4708p9307m3839n6247j07636r3113p903r3705J22560j39950L2995
2743H94799J35749k4218J2955M758M4592n1687j12262K5296j35588N3633K1705
$$ plain form
2732 869732 981613 1009479 750720 717590 698559 635097 701155 719644 725578 783435 785535 800886
2720 800886 710733 652076 685311 618103 644240 818045 801243 838204 768076 664719 735111
2709 735111 498376 561800 568847 638643 700766 619775 367258 392251 497139 383268 383974
2698 383974 365414 469529 433666 505109 452794 517645 456282 402323 446837 524164 548194
2687 548194 555185 518712 537740 429972 516694 423891 336329 454884 360937 220713 177056
2676 177056 404693 451169 545722 445302 455241 375544 371232 343547 353267 390276 432475 359501
2664 359501 358040 411098 362979 488340 417136 374416 238068 256214 305219 345547 209353
2653 209353 164400 178453 292782 377257 267512 291498 408698 412080 451672 286308 216109
$$ packed form
2732H69732J11881K7866k58759l3130j9031o3462O6058J8489N934N7857K100J5351
2720H00886r0153n8657L3235o7208K6137J73805j6802L6961p0128j03357P0392
2709G35111k36735O3424P047O9796O2123q0991k52517K4993J04888j13871P06
2698C83974j8560J04115l5863P1443n2315O4851o1363n3959M4514P7327K4030
2687E48194O991l6473J9028j07768Q6722r2803q7562J18555r3947j40224m3657
2676A77056K27637M6476R4553j00420R939p9697m312k7685R720L7009M2199p2974
2664C59501j461N3058m8119J25361p1204m2720j36348J8146M9005M0328j36194
2653B09353m4953J4053J14329Q4475j09745K3986J17200L382L9592j65364p0199
$$ plain form
2642 216109 163159 240564 383827 485524 431531 413100 380043 387271 313222 264424 404052
2631 404052 254416 305081 248358 280323 234911 347188 461284 431625 413088 449882 413249
2620 413249 409692 429603 421941 329382 379207 419846 416084 403836 394991 371239 303091 430023
2608 430023 333504 275652 224420 433034 449445 385580 405601 435313 396857 145248 210989
2597 210989 302188 294303 379017 307576 338404 483890 451789 416331 239969 172907 85932
2586 85932 162983 247544 169125 300120 509485 510417 561628 306912 220060 198012 119899 220191
2574 220191 222078 407652 455996 528122 515508 418991 358542 322054 396991 400252 369028 484011
2562 484011 457884 453877 397782 363649 451206 330819 456413 484543 169391 213600 262591
$$ packed form
2642B16109n2950P7405J43263J01697n3993j8431l3057P228p4049m8798J39628
2631D04052j49636N0665n6723L1965m5412J12277J14096k9659j8537L6794l6633
2620D13249l557J9911p662r2559M9825M0639l762j2248q845k3752o8148J26932
2608D30023r6519n7852n1232K08614J6411o3865K0021K9712l8456k51609O5741
2597B10989R1199p885Q4714p1441L0828J45486l2101l5458j76362o7062q6975
2586H5932P7051Q4561p8419J30995K09365R32N1211k54716q6852k2048p8113J00292
2574B20191J887J85574M8344P2126j2614r6517o0449l6488P4937L261l1224J14983
2562D84011k6127m007n6095l4133Q7557j20387J25594K8130l15152M4209M8991
$$ plain form
2551 262591 305545 316062 338075 323025 219774 399249 304370 238117 301358 204694 144366
2540 144366 138786 39444 42009 150598 198293 205699 120708 113377 155010 313659 322173 291984
2528 291984 280726 348214 261596 123911 31483 -56621 221910 331613 283253 180420 189353
2517 189353 73252 -62892 112090 194315 164398 222745 240649 346339 442904 352279 282629
2506 282629 88149 71232 289031 205424 205600 189725 297539 132695 139555 254571 28299
2495 28299 243415 305044 203479 222987 207573 226289 218900 157594 107219 106604 110181 146684
2483 146684 174276 83417 98268 -16776 -8482 142495 154454 196295 90070 195918 347262
2472 347262 157129 253087 118505 61040 40518 57751 125180 158472 72200 113054 98980
$$ packed form
2551B62591M2954J0517K2013j5050j03251J79475r4879o6253O3241r6664o0328
2540A44366n580r9342K565J08589M7695P406q4991p331M1633J58649Q514l0189
2528B91984j1258O7488q6618j37685r2428q8104K78531J09703m8360j02833Q933
2517A89353j16101j36144J74982Q2225k9917N8347J7904J05690R6565r0625o9650
2506B82629j94480j6917K17799q3607J76j5875J07814j64844O860J15016k26272
2495B8299K15116O1629j01565J9508j5414J8716p389o1306n0375o15L577L6503
2483A46684K7592r0859J4851j15044Q294J50977J1959M1841j06225J05848J51344
2472C47262j90133R5958j34582n7465k0522J7233O7429L3292q6272M0854j4074
$$ plain form
2461 98980 87395 185520 234863 31891 63283 96512 -4887 -13577 124672 253667 77304
2450 77304 200679 113301 -43851 -23274 -79867 -33181 153161 190896 171587 125403 16925
2439 16925 24700 124927 232696 276505 144832 126817 114394 152368 202286 163829 15700
2428 15700 75925 27208 -71173 -6610 283936 236684 92089 -9143 55573 -132238 -120371
2417 -120371 -127987 -41343 76558 18371 86969 31524 39335 44683 67746 152396 248833 48640
2405 48640 55755 67111 52878 174162 270445 303225 203361 67897 115134 151825 48888
2394 48888 100438 60555 107318 93966 -51219 136284 82189 -63035 -53973 72203 68824
2383 68824 59287 84876 276568 214817 198501 -24097 -37415 95377 203132 288470 330119
$$ packed form
2461I8980j1585R8125M9343k02972L1392L3229j01399q690J38249J28995j76363
2450G7304J23375q7378j57152K0577n6593M6686J86342L7735j9309m6184j08478
2439A6925P775J00227J07769M3809j31673j8015j2423L7974M9918l8457j48129
2428A5700O0225m8717r8381O4563K90546m7252j44595j01232O4716j87811J1867
2417a20371p616Q6644J17901n8187O8598n5445P811N348K3063Q4650R6437k00193
2405D8640P115J1356j4233J21284R6283L2780r9864j35464M7237L6691j02937
2394D8888N1550l9883M6763j3352j45185J87503n4095j45224R062J26176l379
2383F8824r537K5589J91692o1751j6316k22598j3318J32792J07755Q5338M1649
$$ plain form
2372 330119 364524 129740 91583 215413 381081 155346 94379 89336 115036 184605 52039
2361 52039 18106 121918 41725 164337 202744 128821 -42766 -16506 94973 23407 80367
2350 80367 255668 340372 363822 333273 428783 451386 416616 330295 341516 332898 277876 426362
2338 426362 301581 329515 153008 91046 192367 144383 92140 160244 150445 228042 210584
2327 210584 138163 50563 50989 45321 -73458 -123169 -147677 51241 102271 96700 165817 193390
2315 193390 234688 125592 94934 139817 260063 95157 103853 116788 43607 -122273 78505
2304 78505 252583 129711 99419 100989 192562 107486 41003 180124 136412 9750 91687
2293 91687 360482 324738 301427 360759 115387 89433 28046 84686 58247 301130 427347
$$ packed form
2372C30119L4405k34784l8157J23830J65668k25735o0967n043K5700O9569j32566
2361E2039l3933J03812q0193J22612L8407p3923j71587K6260J11479p1566N6960
2350H0367J75301Q4704K3450l0549R5510K2603l4770q6321J1221q618n5022J48486
2338D26362j24781K7934j76507o1962J01321m7984n2243O8104r799P7597j7458
2327B10584p2421q7600M26n668j18779m9711k4508J98918N1030n571O9117K7573
2315A93390M1298j09096l0658M4883J20246j64906Q696J2935p3181j65880K00778
2304G8505J74078j22872l0292J570R1573q5076o6483J39121m3712j26662Q1937
2293I1687K68795l5744k3311N9332k45372k5954o1387N6640k6439K42883J26217
$$ plain form
2282 427347 84915 87218 25587 121136 137809 184994 296571 215530 162192 177273 228728
2271 228728 62879 90844 112995 290771 84926 92287 270821 420959 160698 140118 155118
2260 155118 262129 258727 278031 304274 289962 454960 336804 207015 97156 138862 208244
2249 208244 311654 254006 55193 248009 395784 172582 144541 288600 440829 314855
2239 314855 159146 266049 221889 131520 218755 257818 340459 445785 240971 103074 163884
2228 163884 66828 201015 271575 102340 40879 101242 195087 207845 335251 110327 248943
2217 248943 310107 110332 150410 265032 321972 342066 384772 279200 261813 237232 303491
2206 303491 170088 359465 400733 435173 469922 426908 418495 569786 330986 319748 232416
$$ packed form
2282D27347l42432K303o1631R5549J6673M7185J11577q1041n3338J5081N1455
2271B28728j65849K7965K2151J77776k05845P361J78534J50138k60261k0580J5000
2260A55118J07011l402J9304K6243j4312J64998j18156j29789j09859M1706O9382
2249B08244J03410n7648j98813J92816J47775k23202k8041J44059J52229j25974
2239C14855j55709J06903m4160r0369Q7235L9063Q2641J05326k04814j37897O0810
2228A63884r7056J34187P0560j69235o1461O0363R3845J2758J27406k24924J38616
2217B48943O1164j99775M0078J14622N6940K0094M2706j05572j7387k4581O6259
2206C03491j33403J89377M1268L4440L4749m3014q413J51291k38800j1238q7332
$$ plain form
2195 232416 262671 390968 491042 484713 396151 440623 380276 404907 209070 252752 294877
2184 294877 405384 508429 393216 512563 382516 427185 455888 456913 546332 583595 543799
2173 543799 506230 594200 666563 837847 648904 567636 594718 703306 855344 776968 790197
2162 790197 780367 782694 930866 936360 842304 911774 965198 937983 933064 981146 1075725 1139213
2150 1139213 1090185 1103662 1002540 1171009 1250649 1229228 1281304 1373824 1459056 1236629 1204237
2139 1204237 1401231 1461840 1377416 1388339 1512239 1713895 1735460 1719644 1681858 1694786 1744595
2128 1744595 1907567 2084946 2377804 2248679 2327472 2324430 2430150 2613825 2679044 2670117 2671184
2117 2671184 2944464 3171112 3338028 3439254 3544962 3814794 3694333 3849957 4200395 4532961
$$ packed form
2195B32416L0255J28297J00074o329q8562M4472o0347K4631j95837M3682M2125
2184B94877J10507J03045j15213J19347j30047M4669K8703J025Q9419L7263l9796
2173E43799l7569Q7970P2363J71284j88943q1268K7082J08588J52038p8376J3229
2162G90197r830K327J48172N494r4056O9470N3424k7215m919M8082R4579O3488
2150A139213m9028J3477j01122J68469P9640k1421N2076R2520Q5232k22427l2392
2139A204237J96994O0609q4424J0923J23900K01656K1565j5816l7786J2928M9809
2128A744595J62972J77379K92858j29125P8793l042J05720J83675O5219q927J067
2117B671184K73280K26648J66916J01226J05708K69832j20461J55624L50438L32566
$$ plain form
2107 4532961 4674972 4639976 4930053 5313634 5438460 5850722 6133187 6611983 6979798 7645079
2097 7645079 8169042 8662992 9101526 9959555 10840409 11243227 11597711 12255965 12878110 14307451
2087 14307451 16278782 18431799 20998661 23958177 28019966 33998281 41999351 52106079
2079 52106079 64142996 74346719 74594831 61526124 48208506 37477733 29617296 24718299
2071 24718299 21005612 17907722 15683723 13998734 12673902 11801134 11074003 10415204 9854355
2062 9854355 9114063 8359070 7557468 6860383 6384616 5915374 5821916 5477514 4988483 4737806
2052 4737806 4422152 4326806 4164087 3992859 3771573 3539749 3431420 3117306 3209187 3098309
2042 3098309 2835964 2677528 2475809 2452571 2352545 2306781 2345686 2292504 2083130 1881661
$$ packed form
2107D532961J42011l4996K90077L83581J24826M12262K82465M78796L67815O65281
2097G645079N23963M93950M38534Q58029Q80854M02818L54484O58254O22145J429341
2087A4307451J971331K153017K566862K959516M061789N978315Q001070J0106728
2079E2106079J2036917J0203723K48112j3068707j3317618j0730773p860437m898997
2071B4718299l712687l097890k223999j684989j324832q72768p27131o58799n60849
2062I854355p40292p54993q01602o97085m75767m69242r3458l44402m89031k50677
2052D737806l15654r5346j62719j71228k21286k31824j08329l14114R1881j10878
2042C098309k62345j58436k01719k3238j00026m5764L8905n3182k09374k01469
$$ plain form
2032 1881661 1916792 1923484 1955468 1940265 1962257 1705517 1696960 1694691 1788364 1701601 1668444 1535004
2020 1535004 1337772 1370866 1253655 1239842 1413167 1218802 1254335 1229806 1066827 1030710
2010 1030710 1038917 854889 847091 878514 825719 909194 904459 829086 957774 1036607 1047419 898435
1998 898435 789204 592170 681566 686470 574664 553505 594587 659332 637335 746321 728791
1987 728791 577837 554037 536851 432078 430041 486895 585730 517201 500978 582577 521172
1976 521172 424374 411322 437173 520148 498556 408690 583079 474090 370021 334978 340447
1965 340447 191072 358335 473873 290700 261328 177531 344077 364776 239979 298263
1955 298263 378733 417896 368996 272212 209100 163579 224232 218815 279146 320948 369278 321380
$$ packed form
2032A881661L5131O692L1984j5203K1992k56740q557k269R3673q6763l3157j33440
2020A535004j97232L3094j17211j3813J73325j94365L5533k4529j62979l6117
2010A030710Q207j84028p798L1423n2795Q3475m735p5373J28688P8833J0812j48984
1998H98435j09231j97034Q9396M904j11806k1159M1082O4745k1997J08986j7530
1987G28791j50954k3800j7186j04773k037N6854R8835o8529j6223Q1599o1405
1976E21172r6798j3052K5851Q2975k1592q9866J74389j08989j04069l5043N469
1965C40447j49375J67263J15538j83173k9372q3797J66546K0699j24797N8284
1955B98263Q0470L9163m8900r6784o3112m5521O0653n417O0331M1802M8330m7898
$$ plain form
1943 321380 390566 424710 288191 313880 338387 163737 215645 242045 276538 311016 269142
1932 269142 357038 400805 315081 205452 247812 269615 171846 189341 95589 59347 35129
1921 35129 82602 28550 69387 -33661 40723 111083 189316 321981 315858 187635 89160
1910 89160 134427 260872 259365 58712 -30745 34643 226083 291206 96219 133026 11170
1899 11170 34958 169113 176559 184168 121288 29250 -5753 113526 -48732 -37625 20278 -1512
1887 -1512 2347 -156276 -166462 -58565 -139811 -110052 73813 65296 115328 110021 176242 171297
1875 171297 158533 193180 232671 300875 283820 141069 133245 131088 174412 78264 -46212 -3804
1863 -3804 -116493 -115009 -163800 -139088 -75634 -5654 -41500 -50647 194632 52189 -118246 90880
$$ packed form
1943C21380O9186L4144j36519K5689K4507j74650N1908K6400L4493L4478m1874
1932B69142Q7896M3767q5724j09629M2360K1803r7769J7495r3752l6242k4218
1921C5129M7473n4052M0837j03048P4384P0360P8233J32665o123j28223r8475
1910H9160M5267J26445j507k00653q9457O5388J91440O5123j94987L6807j21856
1899A1170K3788J34155P446P609o2880r2038l5003J19279j62258J1107N7903k1790
1887a512L859j58623j0186J07897q1246K9759J83865q517N0032n307O6221m945
1875A71297j2764L4647L9491O8204j7055j42751p824k157M3324r6148j24476M2408
1863c804j12689J484m8791K4712O3454O9980l5846r147K45279j42443j70435K09126
$$ plain form
1851 90880 225981 241183 103261 56234 120546 134778 140404 109630 48051 177628 -13473
1840 -13473 -50074 -82897 153158 111605 50796 132753 53076 -12394 3080 112567 181108
1829 181108 29563 37644 117665 86061 -25816 -11419 15630 -64096 59530 177029 89905
1818 89905 56547 424 153945 146311 140640 211704 219878 361676 381924 376748 435565 523478
1806 523478 377285 241727 174375 96988 141759 148305 84876 38495 233940 245922 59151
1795 59151 -19733 -88572 34203 119762 16817 115707 60343 -18786 58389 15768 -56606
1784 -56606 -261829 -170640 -210139 -75746 37051 -88154 -111417 4061 64622 54460 27788
1773 27788 87382 -156337 -22455 53246 113730 3169 -59554 -10273 -101872 3814 114670
$$ packed form
1851I0880J35101J5202j37922m7027O4312J4232N626l0774o1579J29577j91101
1840a3473l6601l2823K36055m1553o0809Q1957p9677o5470J5474J09487O8541
1829A81108j51545Q081Q0021l1604j11877J4397K7049p9726J23626J17499q7124
1818H9905l3358n6123J53521p634n671P1064Q174J41798K0248n176N8817Q7913
1806E23478j46193j35558o7352p7387M4771O546o3429m6381J95445J1982j86771
1795E9151p8884o8839J22775Q5559j02945R8890n5364p9129P7175m2621p2374
1784e6606k05223R1189l9499J34393J12797j25205k3263J15478O0561j0162k6672
1773B7788N9594k43719J33882P5701O0484j10561o2723M9281r1599J05686J10856
$$ plain form
1762 114670 14373 -33750 10862 48613 157086 179169 85630 -72031 24059 89787 76385
1751 76385 16078 25000 -155316 -116343 -180755 36672 126624 -58491 -119667 -142583 -151363 -75486
1739 -75486 -14403 76993 48376 -21976 175863 97133 31400 -17340 18470 54666 96229 48047
1727 48047 43687 -53223 -62015 -127108 -129864 -17542 -156006 -133629 -35896 -83994 33190 108931
1715 108931 63868 -66487 -61963 -277831 -375052 -354616 -253701 -147231 -126206 -12868 159623
1704 159623 44187 6538 -138512 -282046 -90019 -63244 -98744 -4220 37559 50518 -100847
1693 -100847 65081 159722 142166 64590 -140662 -32480 -101581 68247 -8651 61505 64273
1682 64273 53656 15081 157085 154486 198568 73363 159472 -48118 -25115 128727 40850
$$ packed form
1762A14670j00297m8123M4612L7751J08473K2083r3539j57661R6090O5728j3402
1751G6385o0307Q922j80316L8973o4412K17427Q9952j85115o1176k2916q780P5877
1739g5486O1083R1396k8617p0352J97839p8730o5733m8740L5810L6196M1563m8182
1727D8047m360r6910q792o5093k756J12322j38464K2377R7733m8098J17184P5741
1715A08931m5063j30355M524k15868r7221K0436J00915J06470K1025J13338J72491
1704A59623j15436l7649j45050j43534J92027K6775l5500R4524M1779J2959j51365
1693a00847J65928R4641j7556p7576k05252J08182o9101J69828p6898P0156K768
1682F4273j0617l8575J42004k599M4082j25205Q6109k07590K3003J53842q7877
$$ plain form
1671 40850 -27124 -97338 -63042 -161085 -99836 -16437 57944 131041 15754 27425 12500 -135601
1659 -135601 -69452 -125292 2142 -32843 44686 -16710 -76815 -164135 -240936 -34381 25073
1648 25073 -52056 -101198 25691 13626 -15988 -45145 13254 -30394 -54902 -5497 -12647 202409
1636 202409 54386 50407 -34535 -140485 -167424 -119828 -37008 -78835 3039 -61594 -102699
1625 -102699 57859 82974 -46218 20114 12932 32561 10973 -202538 -112853 -77089 -243914
1614 -243914 -180532 -60279 -61537 -158212 -80076 96770 127675 5317 64862 6080 -181635
1603 -181635 -300003 -195388 99248 88673 74510 -12521 -152296 -148062 -139893 18764 94585
1592 94585 82256 86869 -127685 -113276 -114694 -65329 -9348 11981 57975 -41540 54254 105135
$$ packed form
1671D0850o7974p0214L4296r8043O1249Q3399P4381P3097j15287J1671j4925j48101
1659a35601O6149n5840J27434l4985P7529o1396o0105q7320p6801K06555N9454
1648B5073p7129m9142J26889j2065k9614k9157N8399m3648k4508M9405p150K15056
1636B02409j48023l979q4942j05950k6939M7596Q2820m1827Q1874o4633m1105
1625a02699J60558K5115j29192O6332p182J9629k1588k13511Q9685L5764j66825
1614b43914O3382J20253j258r6675P8136J76846L0905j22358N9545n8782j87715
1603a81635j18368J04615K94636j0575j4163q7031j39775M234Q169J58657P5821
1592I4585j2329M613k14554J4409j418M9365N5981K1329M5994r9515R5794N0881
$$ plain form
1580 105135 -11899 18557 134602 -12441 -40579 -154471 -176065 -112096 -169561 -126545 120011
1569 120011 195226 727 86671 252418 180902 73312 35726 -100781 -25459 -41909 -39340
1558 -39340 47066 125384 -112515 -118397 -76638 -20874 -26954 -17542 56634 -188003 -43795 -58784
1546 -58784 -325573 -248849 -205382 -359189 -165670 -167573 -94924 -12495 -171560 -143049 -4693
1535 -4693 18161 -24419 -37870 -114662 152359 148050 -85350 -89334 19142 -70260 -143694 11896
1523 11896 95075 138296 -5381 -172481 -153854 -111459 48907 157390 71404 -17659 167327
1512 167327 211813 109166 65626 16216 -83708 -169368 -77869 -94805 -23070 -97163 -13942
1501 -13942 57518 -94904 -33295 40552 17666 -110134 -145608 -14312 -101557 55891 157464
$$ packed form
1580A05135j17034L0456J16045j47043k8138j13892k1594O3969n7465M3016K46556
1569A20011P5215j94499Q5944J65747p1516j07590l7586j36507P5322j6450K569
1558c9340Q6406P8318k37899n882M1759N5764o080R412P4176k44637J44208j4989
1546e8784k66789P6724M3467j53807J93519j903P2649Q2429j59065K8511J38356
1535d693K2854m2580j3451p6792K67021m309k33400l984J08476q9402p3434J55590
1523A1896Q3179M3221j43677j67100J8627M2395J60366J08483q5986q9063J84986
1512A67327M4486j02647m3540m9410r9924q5660R1499j6936P1735p4093Q3221
1501a3942P1460j52422O1609P3847k2886j27800l5474J31296q7245J57448J01573
$$ plain form
1490 157464 109748 59814 90543 40852 9747 -40175 21873 -21545 16070 203740 -64987
1479 -64987 -25856 36939 -30538 -26698 45428 -30401 -30264 4019 -119630 -38608 98139 90352
1467 90352 -66960 -55163 63771 177822 8146 -40160 -108613 -6494 65180 -107623 -61624
1456 -61624 -31628 -144651 -114259 -16290 -198973 -134688 3262 -139162 -180885 -218740 -210288
1445 -210288 6226 -110491 -54135 35722 -73410 -102736 -247281 -157862 -12841 -16809 53441
1434 53441 216304 184830 132438 188570 57012 31149 -31972 33460 97239 46168 47416 56030
1422 56030 73115 197666 4170 -108392 -15169 -82657 42025 127196 -889 161989 38941
1411 38941 57243 108451 -31138 -66560 -33430 -90207 45358 151375 157648 119711 -99690
$$ packed form
1490A57464m7716m9934L0729m9691l1105m9922O2048m3418L7615J87670k68727
1479f4987L9131O2795o7477L840P2126p5829J37L4283j23649Q1022J36747p787
1467I0352j57312J1797J18934J14051j69676m8306o8453J02119P1674j72803M5999
1456f1624K9996j13023L0392R7969j82683O4285J37950j42424m1723l7855Q452
1445b10288K16514j16717N6356Q9857j09132k9326j44545Q9419J45021l968P0250
1434E3441J62863l1474n2392N6132j31558k5863o3121O5432O3779n1071J248Q614
1422E6030J7085J24551j93496j12562R3223o7488J24682Q5171j28085J62878j23048
1411C8941J8302N1208j39589l5422L3130n6777J35565J06017O273l7937k19401
$$ plain form
1400 -99690 -163945 -332164 -302336 -126687 -88988 -2387 -82724 -112335 8357 -74815 -173888
1389 -173888 -70369 -62044 -190108 35344 93119 -25178 -7955 41421 92005 69544 -90787
1378 -90787 -88304 -155348 -98918 -189860 -205279 -65949 -84689 113617 44496 -67751 -8244
1367 -8244 -59450 117581 233735 141964 64557 44210 34758 15726 -32328 -86444 -91724 -7566
1355 -7566 102071 32191 -144198 -55890 5556 84927 61345 80374 8370 16723 -38130 -163063
1343 -163063 -182424 -144520 49651 -1499 -119056 -138495 -39091 -75010 -21751 -33085 -89188
1332 -89188 20108 142097 51489 -136981 -71845 -141518 24346 93299 38983 -85712 -125208
1321 -125208 -88655 -19131 83867 148083 85578 -31322 -47780 -213710 -51173 -46294 -84338
$$ packed form
1400i9690o4255j68219K9828J75649L7699Q6601q0337k9611J20692q3172r9073
1389a73888J03519Q325j28064K25452N7775j18297J7223M9376N0584k2461j60331
1378i0787K483o7044N6430r0942j5419J39330j8740J98306o9121j12247N9507
1367h244n1206J77031J16154r1771p7407k0347r452j9032m8054n4116n280Q4158
1355g566J09637o9880j76389Q8308O1446P9371k3582J9029p2004Q353n4853j24933
1343a63063j9361L7904J94171n1150j17557j9439R9404l5919N3259j1334n6103
1332h9188J09296J21989r0608j88470O5136o9673J65864O8953n4316j24695l9496
1321a25208L6553O9524J02998O4216o2505j16900j6458j65930J62537M879l8044
$$ plain form
1310 -84338 -71981 -43341 51173 49194 -45092 -46812 -75821 83020 28561 36361 69613 -176367
1298 -176367 -224546 -20656 -93074 -97790 -138082 -82348 15491 -52793 58385 -1442 112442
1287 112442 222305 52227 -51921 45832 -38407 100269 201324 67066 20121 -23893
1277 -23893 61061 1121 -29533 -139090 -190599 -128382 -154285 -30763 -87284 -80408 -123404 -140083
1265 -140083 -3412 28267 24954 54504 103904 25079 -12712 57065 -18111 -68472 -47117 10083
1253 10083 -215658 -71779 206999 196112 85635 -8621 -144784 -135870 -15303 120823 110881
1242 110881 91052 185102 -46721 -29328 95601 -173041 -167135 53408 17976 21871 -148025
1231 -148025 -78811 -69107 -275342 -209755 -34036 -46190 -78638 -12170 81215 213875 70910
$$ packed form
1310h4338J2357K8640R4514j979r4286j720k9009J58841n4459P800L3252k45980
1298a76367m8179K03890p2418m716m0292N5734R7839o8284J11178n9827J13884
1287A12442J09863j70078j04148R7753q4239J38676J01055j34258m6945m4014
1277b3893Q4954n9940l0654j09557n1509O2217k5903J23522n6521O876m2996j6679
1265a40083J36671L1679l313K9550M9400p8825l7791O9777p5176n0361K1355N7200
1253A0083k25741J43879K78778j0887j10477r4256j36163Q914J20567J36126r942
1242A10881j9829R4050k31823J7393J24929k68642N906K20543l5432L895j69896
1231a48025O9214R704k06235O5587J75719j2154l2448O6468R3385J32660j42965
$$ plain form
1220 70910 51300 30476 -192774 -124983 16290 45630 -130086 -17022 -46520 -43238 -39411
1209 -39411 99458 138079 41236 -27512 -126016 -224530 -132071 -49697 -65385 -113303 -231766
1198 -231766 -85053 35104 -65749 5059 111615 86593 149286 131067 170204 102511 -12106
1187 -12106 7707 88406 70692 -65520 -18410 -104848 -45244 69812 -33243 15704 65834
1176 65834 -17164 -131609 -183911 -40042 165095 27236 -109761 -116054 -87930 -55248 7925
1165 7925 -82805 -168014 -160240 210 -72238 -96413 67997 20967 -78998 -92120 -13057 75118
1153 75118 -141285 -212975 -148899 -38763 -51357 -44634 -95538 -30089 -52069 -23681 -50389 -59981
1141 -59981 -72905 -60364 137982 36082 -72113 -96541 -154031 -32559 41018 -49656 -50099
$$ packed form
1220G0910j9610k0824k23250O7791J41273K9340j75716J13064k9498L282L827
1209c9411J38869L8621r6843o8748r8504r8514R2459Q2374j5688m7918j18463
1198b31766J46713J20157j00853P0808J06556k5022O2693j8219L9137o7693j14617
1187a2106J9813Q0699j7714j36212M7110q6438N9604J15056j03055M8947N0130
1176F5834q2998j14445n2302J43869K05137j37859j36997o293K8124L2682O3173
1165G925r0730q5209P774J60450p2448k4175J64410m7030r9965j3122P9063Q8175
1153G5118k16403p1690O4076J10136j2594O723n0904O5449k1980K8388k6708r592
1141e9981j2924J2541J98346j01900j08195k4428n7490J21472P3577r0674m43
$$ plain form
1130 -50099 -95392 -120472 -77583 -111807 -51043 -43352 -182731 -22307 58011 -139523 -74473
1119 -74473 53341 -63400 -106596 -6382 30886 -116526 517 12543 -31506 9125 9776
1108 9776 -33986 -92292 -38576 6157 -6009 52423 50480 -36884 -199850 -193590 -93853 -4611
1096 -4611 -45454 -16080 188595 55681 6531 -101217 -13666 37049 99849 122692 -35050
1085 -35050 -70031 55904 31980 -137471 -24896 -3127 -155721 -150179 -39419 -255679 -204130
1074 -204130 -10690 -77793 -116064 -135289 51094 61994 -79821 -75129 -204918 -170610 -229585
1063 -229585 2248 -54078 -5685 97154 93466 139525 110980 -49204 -80280 -21469 51769
1052 51769 -55069 179255 121612 -33498 -57013 -179189 -155126 -138630 -104802 -41173 -12268
$$ packed form
1130e0099m5293k5080M2889l4224O0764P691j39379J60424Q0318j97534O5050
1119g4473J27814j16741m3196J00214L7268j47412J17043J2026m4049M0631O51
1108I776m3762n8306N3716M4733j2166N8432j943q7364j62966O260R9737Q9242
1096d611m0843K9374K04675j32914m9150j07748Q7551N0715O2800K2843j57742
1085c5050l4981J25935k3924j69451J12575K1769j52594N542J10760k16260N1549
1074b04130J93440o7103l8271j9225J86383J0900j41815M692j29789L4308n8975
1063b29585K31833n6326M8393J02839l688M6059k8545j60184l1076N8811P3238
1052E1769j06838K34324n7643j55110k3515j22176K4063J6496L3828O3629K8905
$$ plain form
1041 -12268 -13490 -5593 -133493 -78445 -61460 -116663 -226148 -255115 -169883 -139751 -118334 22807
1029 22807 -207922 -172250 -301400 -98466 54596 51181 -63085 21772 25159 89773 69201
1018 69201 12595 -61791 102894 184259 -333 -55985 -44317 62806 -129900 -52089 44075
1007 44075 120484 26195 92136 68244 -49007 -38352 -30774 -30176 -43601 -146174 -138169 -165978
995 -165978 61407 201538 271679 190111 8742 60810 -87388 -68412 62482 -18893 -139852
984 -139852 -74671 -21080 86945 -18486 94163 101938 84592 212919 196410 19680 -121043
973 -121043 -148336 -176332 92757 -85714 -192315 -85599 21487 -44207 -34488 -166401 -302560
962 -302560 57727 148885 64122 111094 18186 16003 113097 25850 -57418 -8231 181355 13107
$$ packed form
1041a2268j222P897j27900N5048J6985n5203j09485k8967Q5232L0132K1417J41141
1029B2807k30729L5672j29150K02934J53062l415j14266Q4857L387O4614k0572
1018F9201n6606p4386J64685Q1365j84592n5652J1668J07123j92706P7811R6164
1007D4075P6409r4289O5941k3892j17251J0655P578N98j3425j02573Q005k7809
995a65978K27385J40131P0141q1568j81369N2068j48198J8976J30894q1375j20959
984a39852O5181N3591J08025j05431J12649P775j7346J28327j6509j76730j40723
973a21043k7293k7996K69089j78471j06601J06716J07086o5694R719j31913j36159
962c02560L60287R1158q4763M6972r2908k183R7094q7247q3268M9187J89586j68248
$$ plain form
950 13107 -178412 -250007 -167049 -216417 -228473 -118575 -48092 -67885 45223 22904 13626 78123
938 78123 -41008 -6024 45815 100448 26921 28432 22006 -156971 -229336 -6031 -69535 -32767
926 -32767 165518 181346 138431 37710 -72552 2743 61748 12103 11789 -91578 -171207 -102445
914 -102445 -117237 -100867 -124274 -71794 -8382 -8874 29840 -11160 -125577 -40712 88773 -22283
902 -22283 -26434 -48922 -48202 -31766 -131964 -94893 -27644 -103661 30952 78892 -114359 102966
890 102966 114090 -55064 69778 185033 127843 212412 123765 -2833 -93683 -69205 -22200
879 -22200 54455 88825 26750 79918 2338 -27334 -64029 38294 -37954 -91208 -255377 -76784
867 -76784 -57426 -17606 150587 160057 -21453 -17952 -34019 15230 51814 -137365 -162352 -83039
$$ packed form
950A3107j91519p1595Q2958m9368j2056J09898P0483j9793J13108k2319r278O4497
938G8123j19131L4984N1839N4633p3527J511o426j78977p2365K23305o3504L6768
926c2767J98285J5828m2915j00721j10262P5295N9005m9645l14j03367p9629O8762
914a02445j4792J6370k3407N2480O3412m92L8714m1000j14417Q4865J29485j11056
902b2283m151k2488P20J6436j00198L7071O7249p6017J34613M7940j93251K17325
890A02966J1124j69154J24842J15255n7190Q4569q8647j26598r0850K4478M7005
879b2200P6655L4370o2075N3168p7580k9672l6695J02323p6248n3254j64169J78593
867g6784J9358L9820J68193R470j81510L501j6067M9249L6584j89179k4987P9313
$$ plain form
855 -83039 133571 95489 4058 51414 160718 141707 58746 -137452 -121733 -33899 25217
844 25217 -123586 -187512 48147 -92239 -87811 -62736 9493 45259 30098 57452 -71237
833 -71237 -97042 -39869 -71455 16747 63535 -164450 -93542 33994 109570 -79513 45903
822 45903 11743 -1169 11969 -32780 -33800 30410 29613 67679 45855 -10189 -8315 -51874 9082
809 9082 51787 -78223 -179419 -113541 -99454 -177863 -25671 31840 -53300 -40462 -54004 41819
797 41819 -118474 62064 100982 10091 -52093 26749 26427 -3637 83333 -88293 -66094 36706
785 36706 116092 -13533 -66329 64814 -83028 -207666 -118705 10477 -111701 -25492 -3703
774 -3703 -81798 -85128 26554 28104 -116934 -119815 -15264 35954 56509 -39598 -76793 77179
$$ packed form
855h3039K16610l8082r1431M7356J09304j9011q2961j96198J5719Q7834N9116
844B5217j48803o3926K35659j40386M428K5075P2229L5766j5161K7354j28689
833g1237k5805N7173l1586Q8202M6788k27985P0908J27536P5576j89083J25416
822D5903l4160j2912J3138m4749j020O4210p97L8066k1824n6044J874m3559O0956
809I082M2705j30010j01196O5878J4087p8409J52192N7511q5140J2838j3542R5823
797D1819j60293J80538L8918r0891o2184P8842l22l0064Q6970j71626K2199J02800
785C6706P9386j29625n2796J31143j47842j24638Q8961J29182j22178Q6209K1789
774c703p8095l330J11682J550j45038k881J04551N1218K0555r6107l7195J53972
$$ plain form
762 77179 -29815 -172991 -13310 66666 17597 119665 156491 -48713 -72937 -87702 -164132
751 -164132 -181694 -26297 -25856 -46699 22238 116159 92845 17865 29131 54407 118838 142288
739 142288 85236 -43880 42047 32364 51663 96492 103011 9219 -122645 -208607 -85511 -172613
727 -172613 -211729 -39031 44081 -13950 -21773 -165315 -178558 -160669 -44020 33864 -3306
716 -3306 -12240 -99260 -51236 -43129 -78921 -62199 -55027 60890 18075 -157169 -68760 88221
704 88221 -13682 74023 38439 50497 -99154 -177525 -41628 91041 35744 18543 222483
693 222483 208238 60447 -91218 22348 33914 -114450 -62508 145977 26778 62108 134748
682 134748 17451 -98080 63709 91716 109142 75041 100090 -81001 63614 120258 91098
$$ packed form
762G7179j06994j43176J59681P9976m9069J02068L6826k05204k4224j4765p6430
751a64132j7562J55397M41k0843O8937R3921k3314p4980J1266K5276O4431K3450
739A42288n7052j29116Q5927r683J9299M4829O519r3792j31864q5962J23096q7102
727a72613l9116J72698Q3112n8031p823j43542j3243J7889J16649P7884l7170
716c306q934q7020M8024Q107l5792J6722P172J15917m2815j75244Q8409J56981
704H8221j01903Q7705l5584J2058j49651p8371J35897J32669n5297j7201K03940
693B22483j4245j47791j51665J13566J1566j48364N1942K08485j19199L5330P2640
682A34748j17297j15531J61789K8007J7426l4101K5049j81091J44615N6644k9160
$$ plain form
671 91098 165817 99307 -12234 121812 122533 175966 319425 -30999 -129615 -69926 -113100 -95529
659 -95529 -179982 -104281 47298 39485 -35582 -83907 148217 67126 28001 232838 251883 148244
647 148244 170 -94526 -80960 10563 28410 94557 51799 -53430 21718 -58445 43735
636 43735 -3129 54262 -3969 8784 -101043 -34353 6013 -6559 -7637 -62257 -143282 -225599
624 -225599 -179407 -5392 140546 106119 54477 -17766 96928 12985 90703 130166 3589
613 3589 -17260 77247 96335 204569 155523 -24878 -63882 25266 -13792 -43499 122875 152577
601 152577 81536 117283 32691 96652 157394 -98415 -152448 -37484 -147609 -127022 -28285
590 -28285 8772 -143380 -140413 46497 -54872 25966 31654 10068 22816 27565 46450 72985
$$ packed form
671I1098P4719o6510j11541J34046P21N3433J43459l50424r8616N9689m3174J7571
659i5529q4453P5701J51579p813p5067m8325K32124q1091l9125K04837J9045j03639
647A48244j48074r4696J3566R1523J7847O6147m2758j05229P5148q0163J02180
636D3735m6864N7391n8231J2753j09827O6690M0366j2572j078n4620q1025q2317
624b25599M6192J74015J45938l4427n1642p2243J14694q3943P7718L9463j26577
613C589k0849R4507J9088J08234m9046j80401l9004Q9148l9058k9707J66374K9702
601A52577p1041L5747q4592O3961O0742k55809n4033J14964j10125K0587R8737
590b8285L7057j52152K967J86910j01369Q0838N688k1586J2748M749J8885K6535
$$ plain form
578 72985 63656 21110 100397 -36916 -48194 1064 58900 -69042 -244796 -100939 -184498
567 -184498 -119477 109120 108325 55391 -46794 -76036 32813 -11111 -188063 -145588 49840
556 49840 -61 5730 -46393 -114226 -88826 -73411 27077 135096 148343 39970 49959 61087
544 61087 44598 -43427 35663 33423 37459 58103 78083 130612 41947 20220 -19018 -41505
532 -41505 -185746 -240906 -151522 -93075 -5481 119136 25139 -141238 -41087 18174 60693
521 60693 34727 -59851 1155 8643 150178 45217 -23426 75130 169221 123736 13020 -108069
509 -108069 -103300 -84157 -143518 -202410 -84392 22940 50476 45460 -197226 -197175 -150511 43354
497 43354 99781 34504 3883 -124428 -41473 3403 25567 -63510 -48323 -56485 -52274 -8129
$$ packed form
578G2985r329m2546P9287j37313j1278M9258N7836j27942j75754J43857q3559
567a84498O5021K28597p95n2934j02185k9242J08849m3924j76952M2475J95428
556D9840m9901N791n2123o7833K5400J5415J00488J08019J3247j08373R989J1128
544F1087j6489q8025P9090k240M036K0644J9980N2529q8665k1727l9238k2487
532d1505j44241n5160Q9384N8447Q7594J24617r3997j66377J00151N9261M2519
521F0693k5966r4578O1006P488J41535j04961o8643R8556R4091m5485j10716j21089
509a08069M769J9143n9361n8892J18018J07332K7536n016k42686N1M6664J93865
497D3354N6427o5277l0621j28311Q2955M4876K2164q9077J5187q162M211M4145
$$ plain form
485 -8129 89752 63464 -21449 -23530 -195758 -131204 -170332 -14208 94775 166308 52649 -126452
473 -126452 -32692 114769 138496 176323 74441 -146058 -93363 -133219 -193735 -106900 3308
462 3308 136704 95136 98189 26603 -23546 17156 -36156 -145515 -66533 84467 8171 50945
450 50945 -10897 55194 109268 175434 72801 36560 58347 -120863 -189094 -369882 -213028
439 -213028 -172650 -169045 -99431 -142056 -2167 -25088 59646 116005 36847 38346 74277 -123186
427 -123186 -128980 152540 68651 27980 147748 155808 145749 118772 42892 28414 23917 -124469
415 -124469 -50576 -200 -151322 -25094 23579 -127779 -5945 -37929 -129722 -65036 237187
404 237187 45212 -225107 -93477 6600 -143854 -128787 -40123 -77230 -143699 -238562 -173381
$$ packed form
485h129R7881k6288q4913k081j72228O4554l9128J56124J08983P1533j13659j79101
473a26452R3760J47461K3727L7827j01882k20499N2695l9856o0516Q6835J10208
462C308J33396m1568L053p1586n0149M0702n3312j09359P8982J51000p6296M2774
450E0945o1842O6091N4074O6166j02633l6241K1787j79210o8231j80788J56854
439b13028M0378L605O9614m2625J39889k2921Q4734N6359p9158J499L5931j97463
427a23186n794K81520q3889m0671J19768Q060j0059k6977p5880j4478m497j48386
415a24469P3893N0376j51122J26228M8673j51358J21834l1984r1793O4686L02223
404B37187j91975k70319J31630J00077j50454J5067Q8664l7107o6469r4863O5181
$$ plain form
393 -173381 -179348 -113321 -162464 -149422 -138229 -209459 -397956 -212990 -264178 -144839 -74848
382 -74848 -28664 -34905 -106583 -128197 -35493 74107 71763 -37150 -87752 -154308 -183373 -98803
370 -98803 -68038 11237 101103 76563 28669 96678 108041 5673 -116564 -95579 -68133 40475
358 40475 -96458 -95461 -173847 -362375 -202114 -95216 -242515 -187073 -121212 -65237 -17904
347 -17904 59878 36180 -79694 -6893 -70547 -180930 13273 -11501 -84952 -45296 -106178
336 -106178 -59445 -31822 -76830 -45878 11020 -38734 -63386 69675 33864 55380 34324 -19596
324 -19596 -47190 -170080 -271754 -133832 -151576 -217343 -228731 -295354 -329218 -291194 -132322
$$ packed form
393a73381n967O6027m9143J3042J1193p1230j88497J84966n1188J19339O9991
382g4848M6184o241p1678k1614R2704J09600k344j08913n0602o6556k9065Q4570
370i8803L0765P9275Q9866k4540m7894O8009J1363j02368j22237K0985K7446J08608
358D0475j36933R97p8386j88528J60261J06898j47299N5442O5861N5975M7333
347a7904P7782k3698j15874P2801o3654j10383J94203k4774p3451L9656o0882
336a06178M6733K7623m5008L0952N6898m9754k4652J33061l5811K1516k1056n3920
324a9596k7594j22890j01674J37922j7744o5767j1388o6623l3864L8024J58872
$$ [...]
##END NTUPLES=NMR SPECTRUM
##END=
