##TITLE=1H_EC-3278(2)
 CDCl3
 8 sc, 
 21.09.2022
##JCAMPDX= 6.0         $$ Bruker NMR JCAMP-DX V2.0
##DATA TYPE= NMR SPECTRUM
##DATA CLASS= NTUPLES
##ORIGIN= UXNMR, Bruker Analytische Messtechnik GmbH
##OWNER= root
$$ XWIN-NMR		Version 3.5
$$ Wed Sep 21 12:09:03 2022 Russian Standard Time (UT+4h)  she@DPX200
##.OBSERVE FREQUENCY= 200.1313499994
##.OBSERVE NUCLEUS= ^1H
##.ACQUISITION MODE= SIMULTANEOUS
##.ACQUISITION SCHEME= undefined
##.AVERAGES= 8
##.DIGITISER RES= 18
##SPECTROMETER/DATA SYSTEM= spect
##.PULSE SEQUENCE= zg30
##.SOLVENT NAME= CDCl3
##.SHIFT REFERENCE= (INTERNAL, CDCl3, 0, 15.759)
##AUDIT TRAIL= $$ (NUMBER, WHEN, WHO, WHERE, WHAT)
$$ ##TITLE= Audit trail, XWIN-NMR		Version 3.5
$$ ##JCAMPDX= 5.01
$$ ##ORIGIN= Bruker BioSpin GmbH
$$ ##OWNER= she
$$ F:/spectra/data/she/nmr/H-F/1/pdata/1/auditp.txt
$$ ##AUDIT TRAIL=  $$ (NUMBER, WHEN, WHO, WHERE, WHAT)
(   1,<2022-09-21 12:07:36.85 +0400>,<she>,<DPX200>,
      <created by zg, POWCHK disabled, PULCHK disabled
       configuration hash MD5:
       00 E9 B6 7A A2 85 ED C7 34 08 36 98 17 FE 4E 26
       data hash MD5: 16K
       0D 74 D1 D1 4E C1 69 DD 57 28 A1 26 70 40 BC 0F>)
(   2,<2022-09-21 12:07:52.85 +0400>,<she>,<DPX200>,
      <Start of raw data processing
       efp BC_mod = 2 LB = 0.24 FT_mod = 6 PKNL = 1 PHC0 = -18034.91 PHC1 = 13.60069 SI = 16K 
       data hash MD5: 16K
       7D 01 1B 5A 8F 36 43 AC 3E AE 2B 5A 69 5D 75 03>)
(   3,<2022-09-21 12:08:10.73 +0400>,<she>,<DPX200>,
      <pk PHC0 = -0.2199687 PHC1 = 0 
       data hash MD5: 16K
       7F 00 3D FE 88 4C 11 D5 62 1D 68 55 F9 61 60 18>)
(   4,<2022-09-21 12:08:14.20 +0400>,<she>,<DPX200>,
      <abs ABSG = 5 
       data hash MD5: 16K
       6A 0C A1 D0 C9 90 7A 55 63 9A 25 8F 05 63 D8 D1>)
$$ ##END=
$$ 
$$ hash MD5
$$ 60 30 12 30 A8 2B FE 58 79 3B D0 79 AE 10 34 73
##$RELAX= 
##$RELAX= 
##$RELAX= 
##$RELAX= 
##$RELAX= 
##$RELAX= 
$$ Bruker specific parameters
$$ --------------------------
##$DU= <F:/spectra>
##$EXPNO= 1
##$NAME= <H-F>
##$PROCNO= 1
##$TYPE= <nmr>
##$USER= <she>
##$AMP= (0..31)
100 100 100 100 100 100 100 100 100 100 100 100 100 100 100 100 100 100 
100 100 100 100 100 100 100 100 100 100 100 100 100 100 
##$AQSEQ= 0
##$AQ_mod= 1
##$AUNM= <au_zg>
##$AUTOPOS= <>
##$BF1= 200.13
##$BF2= 200.13
##$BF3= 200.13
##$BF4= 200.13
##$BF5= 200.13
##$BF6= 200.13
##$BF7= 200.13
##$BF8= 200.13
##$BYTORDA= 1
##$CFDGTYP= 0
##$CFRGTYP= 5
##$CHEMSTR= <none>
##$CNST= (0..31)
1 1 145 1 1 1 1 1 1 1 1 1 1 1 1 1 1 1 1 1 1 1 1 1 1 1 1 1 1 1 1 1 
##$CPDPRG= <>
##$CPDPRG1= <>
##$CPDPRG2= <>
##$CPDPRG3= <>
##$CPDPRG4= <mlev>
##$CPDPRG5= <mlev>
##$CPDPRG6= <mlev>
##$CPDPRG7= <mlev>
##$CPDPRG8= <mlev>
##$CPDPRGB= <>
##$CPDPRGT= <>
##$D= (0..31)
0 1.2 0 0 0 0 0 0 0 0.06 0 0.03 0 0 0 0 0.0002 0 0 0 0 0 0 0 0 0 0 0 0 
0 0 0 
##$DATE= 1663747656
##$DBL= (0..7)
120 120 120 120 120 120 120 120 
##$DBP= (0..7)
150 150 150 150 150 150 150 150 
##$DBP07= 0
##$DBPNAM0= <>
##$DBPNAM1= <>
##$DBPNAM2= <>
##$DBPNAM3= <>
##$DBPNAM4= <>
$$ [...]
##$SUBNAM3= <"">
##$SUBNAM4= <"">
##$SUBNAM5= <"">
##$SUBNAM6= <"">
##$SUBNAM7= <"">
##$SUBNAM8= <"">
##$SUBNAM9= <"">
##$SW= 18.0517283424941
##$SWIBOX= (0..15)
0 0 2 0 0 0 0 0 0 0 0 0 0 0 0 0 
##$SW_h= 3612.71676300578
##$TD= 16384
##$TD0= 1
##$TE= 0
##$TE2= 300
##$TE3= 300
##$TEG= 300
##$TL= (0..7)
0 120 120 120 120 120 120 120 
##$TP= (0..7)
150 150 150 150 150 150 150 150 
##$TP07= 0
##$TPNAME0= <>
##$TPNAME1= <>
##$TPNAME2= <>
##$TPNAME3= <>
##$TPNAME4= <>
##$TPNAME5= <>
##$TPNAME6= <>
##$TPNAME7= <>
##$TPOAL= (0..7)
0.5 0.5 0.5 0.5 0.5 0.5 0.5 0.5 
##$TPOFFS= (0..7)
0 0 0 0 0 0 0 0 
##$TUNHIN= 0
##$TUNHOUT= 0
##$TUNXOUT= 0
##$USERA1= <user>
##$USERA2= <user>
##$USERA3= <user>
##$USERA4= <user>
##$USERA5= <user>
##$V9= 5
##$VALIST= <valist>
##$VCLIST= <CCCCCCCCCCCCCCC>
##$VD= 0
##$VDLIST= <DDDDDDDDDDDDDDD>
##$VPLIST= <PPPPPPPPPPPPPPP>
##$VTLIST= <TTTTTTTTTTTTTTT>
##$WBST= 1024
##$WBSW= 4
##$XGAIN= (0..3)
0 0 0 0 
##$XL= 0
##$YL= 0
##$YMAX_a= 502097
##$YMIN_a= -896015
##$ZGOPTNS= <>
##$ZL1= 120
##$ZL2= 120
##$ZL3= 120
##$ZL4= 120
##$ABSF1= 15.75129
##$ABSF2= -2.300559
##$ABSG= 5
##$ABSL= 3
##$ALPHA= 0
##$AQORDER= 0
##$ASSFAC= 0
##$ASSFACI= 0
##$ASSFACX= 0
##$ASSWID= 0
##$AUNMP= <proc_1d>
##$AZFE= 0.1
##$AZFW= 0.1
##$BCFW= 0
##$BC_mod= 2
##$BYTORDP= 0
##$COROFFS= 0
##$CY= -3
##$DATMOD= 1
##$DC= 0
##$DFILT= <>
##$DTYPP= 0
##$F1P= 0
##$F2P= 0
##$FCOR= 1
##$FTSIZE= 16384
##$FT_mod= 6
##$GAMMA= 0
##$GB= 0
##$INTBC= 1
##$INTSCL= 3.70164e-10
##$ISEN= 128
##$LB= 0.24
##$LEV0= 0
##$LPBIN= 0
##$MAXI= 10000
##$MC2= 0
##$MEAN= 0
##$ME_mod= 0
##$MI= 1.114404
##$NCOEF= 0
##$NC_proc= -6
##$NLEV= 6
##$NOISF1= 3.799351
##$NOISF2= 2.8
##$NSP= 0
##$NTH_PI= 0
##$NZP= 0
##$OFFSET= 15.75901
##$PC= 1
##$PHC0= -18035.13
##$PHC1= 13.60069
##$PH_mod= 1
##$PKNL= yes
##$PPARMOD= 0
##$PSCAL= 0
##$PSIGN= 0
##$REVERSE= no
##$SF= 200.130002506539
##$SI= 16384
##$SIGF1= 3
##$SIGF2= 2
##$SINO= 5.538805
##$SIOLD= 16384
##$SREGLST= <1H.CDCl3>
##$SSB= 0
##$STSI= 16384
##$STSR= 0
##$SW_p= 3612.71676300578
##$SYMM= 0
##$S_DEV= 0
##$TDeff= 16384
##$TDoff= 0
##$TI= <>
##$TILT= no
##$TM1= 0
##$TM2= 0
##$TOPLEV= 0
##$USERP1= <user>
##$USERP2= <user>
##$USERP3= <user>
##$USERP4= <user>
##$USERP5= <user>
##$WDW= 1
##$XDIM= 16384
##$YMAX_p= 435882283
##$YMIN_p= -475045
$$ End of Bruker specific parameters
$$ ---------------------------------
##NTUPLES= NMR SPECTRUM
##VAR_NAME=  FREQUENCY,     SPECTRUM/REAL,   SPECTRUM/IMAG
##SYMBOL=    X,             R,               I
##VAR_TYPE=  INDEPENDENT,   DEPENDENT,       DEPENDENT
##VAR_FORM=  AFFN,          ASDF,            ASDF
##VAR_DIM=   16384,         16384,           16384
##UNITS=     HZ,            ARBITRARY UNITS, ARBITRARY UNITS
##FACTOR=    0.220516191357247, 1,           1
##FIRST=     3153.8507738298, 0,             0
##LAST=      -458.865989175983, 0,           0
##MIN=       -458.865989175983, -475045,     0
##MAX=       3153.8507738298, 435882283,     0
$$ Real data points
##PAGE= N=1
##DATA TABLE= (X++(R..R)), XYDATA
$$ [...]
8493 617181 604571 489034 530143 618711 659925 777700 653032 639842 503748 495648 536163
8482 536163 573863 644944 683720 483708 354901 525437 560297 607377 687896 629362 591892
8471 591892 616950 547264 400954 586185 553773 560817 595493 545034 628132 629898 640104 439962
8459 439962 372922 491819 468552 542249 464310 398773 403523 461881 433273 420966 486885 675062
8447 675062 761009 668563 568542 474549 490250 498929 423422 396453 326498 329768 434911 527134
8435 527134 459801 384147 296508 343234 285288 385841 327508 242256 389168 477479 400722
8424 400722 549266 676724 517500 389833 297258 250624 163954 301588 469189 392942
8414 392942 319657 392208 325074 371193 377858 388285 446787 487547 362458 231019 291242
8403 291242 334220 281604 292471 134742 446189 527910 364509 258954 280840 259182 309991
8392 309991 447940 418596 406875 232161 310025 452103 211148 331694 334087 196979 115450
8381 115450 206226 342102 167323 148628 355425 364684 240775 293862 271008 359883 227587
8370 227587 65281 152256 223391 330869 328881 343389 206778 129491 237234 129321 184903
8359 184903 263768 327536 411573 215628 394581 475185 441219 459090 286690 344120 277202
8348 277202 272633 310576 326143 372731 233652 347874 333645 235504 364058 345922 190618
8337 190618 232240 108299 26027 177511 290774 247324 289376 297087 249403 271710 339142
8326 339142 320401 343761 294661 178864 323789 321698 258361 235419 412742 530550 475740
8315 475740 465221 308281 298317 491706 383045 411151 309633 303048 280886 196779 232602
8304 232602 305919 68623 218166 325853 279023 39940 118830 179902 133428 213810 297506
8293 297506 357206 193990 102381 191678 237044 99486 94903 95755 209256 243892 198212 190177
8281 190177 232272 166217 328344 343202 305522 338081 147663 204525 95873 97416 308623
8270 308623 228584 196477 176395 124104 45652 192776 169816 149789 138181 175557 190509
8259 190509 205584 309087 196797 104494 113485 145570 114285 309417 298955 168261 203381
8248 203381 104309 215235 211431 297460 400033 274871 101361 223758 74982 -51597
8238 -51597 188219 223654 214553 151935 225749 247140 237871 227820 256711 252906 397220 603371
8226 603371 597838 594764 616467 797794 871180 856626 623415 528418 545072 594396 616363 488349
8214 488349 458022 516151 596166 757648 643544 522772 623970 631860 528526 343673 307396
8203 307396 183519 205585 237581 160633 98447 167789 60439 -109856 -233886 -8481 -288292
8192 -288292 1373544 1641047 616014 600851 509478 584996 465520 471244 278895 315999
8182 315999 262337 381781 248594 296606 292186 560085 488229 492271 397021 410591 437355
8171 437355 342996 294405 365364 244750 76852 92391 108922 117533 126319 11704 155002
8160 155002 278942 107268 118870 217239 203869 160060 224454 63058 134893 276814 231225
8149 231225 49308 -64985 92013 88868 64171 200850 180174 80256 51577 18067 -110801
8138 -110801 28698 108571 19839 -80978 -83193 -53095 79825 11815 -83101 57559 -82669
8127 -82669 -109955 -38352 -230266 -149540 -125640 -11306 110051 116144 134632 60415 -46125
8116 -46125 -102172 -12569 -60525 -57964 73871 155813 39576 39762 110356 41769 -27531 145268
8104 145268 204350 90050 19291 -34548 -14415 -39714 -34019 -94551 -59599 -9957 -78119 39013
8092 39013 113546 204162 127966 -31768 12251 -34092 35932 -105090 -88698 -132986 30855
8081 30855 122001 -3779 16683 -47176 -101348 -107842 -82503 -55110 -11306 -54890 53573 103302
8069 103302 -19981 -77524 25847 150153 128788 -5371 -50070 -116095 -121226 -85649 88128
8058 88128 143668 119173 91814 94376 67370 87779 46509 25127 -48714 37892 51585 19712
8046 19712 -93058 -79674 -27148 -101595 -19221 -184777 -11081 183514 137627 107013 118177
8035 118177 69291 37923 -31433 -82147 -1365 -7587 -91129 46470 -59579 -73155 38110
8024 38110 -73037 -28633 -1171 -76744 -20533 -79836 -169199 4248 7199 46591 -64295
8013 -64295 12433 -3026 90134 44295 13391 70787 44987 1220 -39332 -2646 -65529 -83780
8001 -83780 -49186 36047 -132285 -230675 -192696 89415 15515 63658 42187 12574 -41588
7990 -41588 24246 52623 145557 -26080 -5112 -60463 -22625 113629 60959 172179 69386
7979 69386 23924 114359 -150018 -26578 104059 82844 86614 83432 144114 73700 21740 -109157
7967 -109157 61862 22724 80889 -55245 -74797 -65359 -74118 -101840 -2373 -77262 -239136
7956 -239136 -94989 58528 6901 135065 23236 21949 10924 -28205 -117350 -64388 182308
7945 182308 67464 17001 -12424 156301 109458 65005 2063 72249 128854 -58823 -70995
7934 -70995 -65911 15259 -40029 57875 37919 -47965 69921 -31747 -4011 54244 94924 67448
7922 67448 88509 120899 115275 113979 60927 -67280 94292 177805 207632 5652 -59897 18777
7910 18777 20806 -18709 -139226 16427 -108812 -180312 -228034 -107495 -79311 -103682 25318
7899 25318 136431 140004 22680 140165 56574 27716 101020 -60180 -82446 33377 40234
7888 40234 -72569 6492 147869 160594 91245 161675 60165 60849 4936 118440 180822
7877 180822 143672 141401 119488 51888 147948 40957 -114345 -119801 -10551 10475 -9495
7866 -9495 2926 101104 112065 1977 -13353 44645 162017 131590 62748 15720 44522 118779
7854 118779 -72868 -73634 56766 157164 48811 -27560 12077 81578 151798 194319 169099
7843 169099 134747 131406 139081 150277 77368 105612 150211 319800 170021 237827 204740 211111
7831 211111 278276 213212 234959 290874 231927 324869 274843 124493 78266 50628 10621
7820 10621 136783 203893 90712 30035 92109 23091 152199 46811 148647 210283 178505
7809 178505 319250 258915 282566 221139 220819 399016 332272 297732 160521 99727 270289
7798 270289 382191 253227 262501 329852 211798 294639 349672 309078 235671 103027 215278
7787 215278 183847 123465 143795 255670 222126 232710 173611 231975 60200 129430 200434
7776 200434 192500 45903 -182813 -163483 -78566 1046 -128627 38381 115394 122654 126668
7765 126668 -6626 -97541 -55707 16658 11661 -33665 -11632 -22321 -42202 -104197 37389
7754 37389 -77904 -103910 94514 42542 -18142 82784 119605 48183 85735 90416 159976
7743 159976 302390 57564 -132 73119 44536 81018 116934 78962 265262 388218 198006
7732 198006 128407 213966 203478 223528 108011 -3092 -109721 -19606 91637 181866 44921
7721 44921 87286 44565 168143 154513 173072 36217 130481 175190 105023 166096 126055
7710 126055 36683 221549 282918 96523 151345 316414 380746 351280 368440 320102 91335
7699 91335 162007 103568 58335 186550 299650 195695 252802 303036 173339 27241 137845
7688 137845 176702 141184 153787 262215 362580 166089 103646 187011 282670 265944 196802
7677 196802 189758 254669 173626 57227 -36380 4508 -97033 46412 191123 314067 327227
7666 327227 342875 315754 137214 -4721 110448 101291 189023 63591 127041 151204 162536
7655 162536 216805 207570 101860 190429 185824 247728 237352 286443 225477 34372 -74444
7644 -74444 25110 104369 38011 48042 70401 33710 232145 331718 231046 75689 127955
7633 127955 183711 252478 291796 271316 160728 201357 125314 -11535 114144 200238 243119
7622 243119 323023 202963 326875 429103 279785 413354 429643 239227 165733 267833
7612 267833 290648 190278 91705 77020 194739 281529 368526 237724 103027 80852 99214
7601 99214 94814 -31543 116319 157988 261190 170096 68927 180140 202157 249988 320434
7590 320434 315600 179532 175400 214107 124159 243334 202311 417319 366959 469862 667316
7579 667316 573978 382125 316395 315525 196114 40183 123218 222732 221216 185284 65596
7568 65596 -96237 225363 359079 195871 94654 216416 270742 167507 168272 195420 41100
7557 41100 166987 165778 145573 104281 219339 296473 193417 110148 -19625 20617 109580
7546 109580 266108 297015 281614 163921 -48358 22125 157570 84125 308260 248592 148923
7535 148923 30031 -66981 33457 136107 93116 205098 176571 9712 -2458 151817
7525 151817 35207 36614 282190 93863 -47596 37994 163095 104568 108960 114379 123890
7514 123890 285081 308381 187565 -40713 -72441 30996 92879 67067 168676 122770 6361
7503 6361 151878 159169 145193 101965 73044 75261 100292 110277 -7263 -29947 54341 31794
7491 31794 137458 177439 141200 313645 257212 224370 205451 256965 191853 244675 252288 324611
7479 324611 373709 285112 178248 156112 171509 145281 14196 172149 158630 87374 36364
7468 36364 104116 140370 6418 44027 180960 361185 360797 286520 240908 313951 293236 203766
7456 203766 135172 77986 176348 96457 264551 393017 239186 181108 169593 133247 132927
7445 132927 125715 185484 166829 119964 322932 193979 136135 112965 279358 313421 457217
7434 457217 431216 333474 136407 284757 244382 302612 191953 288668 179602 50054 162339
7423 162339 278997 259647 270194 281403 221685 166064 185779 460151 486471 339553 350523
7412 350523 284617 231833 384668 419812 387888 406148 387324 285656 326828 218912 381649
7401 381649 463919 374037 323265 254942 334027 336063 236192 438197 406970 386026 353564 543304
7389 543304 502724 526077 436371 262129 242309 305675 437393 552970 583714 605326 467297
7378 467297 409005 456004 479550 721686 710922 719625 710710 815793 978094 871584 957714
7367 957714 946253 894550 850110 1048201 1021440 899770 1007705 1013384 1093855 1030888 1084286
7356 1084286 1278925 1277672 1504768 1428349 1495579 1616179 1674925 1746260 1739448 1818145 1888472
7345 1888472 2089346 2144143 2212302 2295496 2365102 2387451 2389842 2483080 2630325 2716140 2810473
7334 2810473 2787075 2858589 2923738 2939011 3229153 3359293 3254208 3292425 3418789 3518391 3667680
7323 3667680 3812343 3838005 3892105 3869447 3941071 3959074 3978834 4060485 4173316 4241131 4387502
7312 4387502 4370001 4360146 4494059 4414154 4409959 4524871 4627140 4776830 4681101 4755725 4888895
7301 4888895 4922524 5111982 5326436 5503915 5296834 5132444 5048135 4894002 5081638 4952848
7291 4952848 4885020 4920285 4598046 4490305 4667811 4718873 4561369 4630958 4839983 4736765
7281 4736765 4630026 4580148 4544658 4674472 4582261 4545044 4527236 4204447 4080781 4013225 3926232
7270 3926232 3910491 3907323 3918205 3811113 3761052 3875038 3834905 3607976 3572951 3447917 3237289
7259 3237289 3143699 3097717 3040029 2943156 2910647 2810446 2736332 2656192 2675165 2591516 2455462
7248 2455462 2465083 2482266 2378227 2392909 2463960 2458848 2360013 2313778 2205716 2099434 2091284
7237 2091284 1973589 1885058 1927844 1747379 1791683 1783571 1671102 1622835 1601853 1668455 1569576
7226 1569576 1599682 1508670 1473436 1621000 1618942 1718673 1632753 1662805 1614316 1659916 1794350
7215 1794350 1671859 1812107 1992697 2089938 2034387 1954856 2037838 2126549 2003974 2102415 1951614
7204 1951614 1987595 2090529 2085280 2025409 1944067 1944459 1966046 1884254 1795259 1989324 2005977 1742076
7192 1742076 1838864 1896227 2069506 2088241 2052224 2126978 2084631 2029867 2193325 2339225 2313375
7181 2313375 2542113 2583673 2682882 2758924 2706573 2695217 2520600 2496660 2462363 2466358 2487689
7170 2487689 2387112 2229665 2323348 2215208 2179973 2207600 1896031 1877174 1877809 1848673 1852476
7159 1852476 1888324 1969991 2015201 1950032 1941431 1997489 1957006 2015421 1939606 1832463 1751086
7148 1751086 1706415 1684289 1722552 1657348 1678205 1713217 1722758 1703686 1700042 1682074 1585374 1629161
7136 1629161 1696877 1626295 1685584 1676763 1599946 1467527 1318030 1261252 1279525 1279412 1027113
7125 1027113 1121657 1115127 967646 915762 1066533 1053814 1044404 1120901 961608 939197 913628
7114 913628 915500 864801 674302 780766 837721 849001 758624 710346 702300 795751 691390
7103 691390 640359 642353 688536 619973 717319 881444 791994 531873 415764 612833 701634
7092 701634 623018 710277 709926 738056 690217 566331 561674 595985 541016 748347 673569 614395
7080 614395 739459 606572 649284 559636 561486 722994 554753 392757 390676 582765 635293
7069 635293 480643 594508 726733 543336 321977 449472 512674 542070 647595 592975
7059 592975 479315 575792 514500 525196 451157 422917 430576 460741 506132 386285 630973
7048 630973 604534 551300 471357 380044 418028 413666 369616 409225 635905 407466 409115 382417
7036 382417 518656 533634 426544 352951 389290 347852 250073 476124 395560 363756 378529
7025 378529 418993 519668 469177 328164 176328 390417 318868 455831 566809 638519
7015 638519 522207 345361 347664 330057 412220 418934 233680 450179 616425 600767 437500
7004 437500 356266 501704 557080 377425 352182 454492 392680 499027 481983 456677 580259
6993 580259 629178 506819 322983 426221 525002 514384 530743 413042 522585 561512 455478
6982 455478 446848 597199 585139 584988 588315 536256 432173 550806 450298 455342 617624 637002
6970 637002 579523 617486 577613 620380 534644 569094 693361 621789 503242 492056 692811
6959 692811 685541 520127 568719 704034 650435 548439 595915 512969 491185 615425 525169
6948 525169 471628 607940 546393 559848 586698 581368 687462 766445 695710 659488 750332
6937 750332 759157 754755 759162 852819 761478 859739 877057 807755 915853 874994 912781 833822
6925 833822 980963 966613 720298 878706 931630 966644 848004 1001259 955611 965463 891195
6914 891195 758704 937579 902933 968051 918653 913421 862080 880911 903253 932314 875672
6903 875672 1031580 1070243 1103190 1207892 1036666 1074258 1065468 1115233 1190850 1208712 1261321
6892 1261321 1201669 1138233 1183213 1057815 865254 947724 1098457 1121967 1048467 1125885 1124266
6881 1124266 1255117 1241456 1306729 1422146 1331785 1280964 1325376 1357904 1272806 1259448 1473359
6870 1473359 1473264 1501947 1631961 1636464 1720129 1804780 1864859 1721961 1934762 1969960 2085161
6859 2085161 2259936 2368723 2541970 2562801 2531664 2594746 2562036 2781286 3049179 3148212
6849 3148212 3261217 3206388 3360246 3394845 3456630 3586223 3528089 3480889 3452224 3474354 3464195
6838 3464195 3480346 3385248 3420951 3266029 3298025 3285921 3140584 3106160 3227445 3245280 3244488
6827 3244488 3227950 3225590 3235696 3134127 3323944 3419451 3599381 3570972 3866404 4180673 3992348
6816 3992348 4054915 4066235 4255834 4540843 4761354 4754145 4732229 4763174 4707104 4787850 4751299
6805 4751299 4800888 5015819 5064747 5219009 5092925 5032776 5273182 5461315 5569376 5729363
6795 5729363 6001001 6264735 6313302 6487741 6925854 7099092 7401529 7655795 8002707 8454539
6785 8454539 8808520 9099798 9405067 9677944 10009552 10443329 10820798 10976801 11116648 11233093
6775 11233093 11291037 11213397 11106120 10904450 10676627 10802089 10705806 10468290 10334167 10308776
6765 10308776 10486398 10309714 10406458 10517160 10705147 11025821 11285693 11574756 12101720 12612411
6755 12612411 13322200 14255114 15221591 16352640 17228469 17982575 18303054 18139633 17718078
6746 17718078 17338616 17233872 17110849 17138393 17094390 17070830 17054102 17016066 17053120 17069716 17235100
6735 17235100 17624602 17957033 18508064 19441184 20627275 21855126 23743131 26219166 29203532
6726 29203532 32464007 35173137 37088683 37507848 36589722 34660247 32105495 29687664
6718 29687664 27782222 26434465 25515802 24852040 24322718 24223696 24406260 24431097 24726553
6709 24726553 25132334 25589108 26178968 26797546 27691119 29215053 31310559 34071315 37574701
6700 37574701 41682043 45629163 48816413 50679188 50253577 47150640 42898004 38326084
6692 38326084 33984632 30548140 27904406 25918672 24316165 23194039 22383931 21933771
6684 21933771 21830737 21667069 21898124 22108665 22625118 23483177 24458298 25725580 27155573
6675 27155573 29011309 31363708 33901106 36451076 38064084 38077664 36416396 33563056
6667 33563056 29935536 26209083 23008150 20215212 17923823 16229832 14774381 13728399
6659 13728399 12838504 11994961 11371851 10842169 10577282 10259345 10241568 10045896 9886205 10060255
6649 10060255 10466425 10812864 11197788 11683490 12184466 12643318 12603449 11842156 10712365
6640 10712365 9614045 8519046 7635647 7070945 6268071 5738502 5649628 5431048 4954703
6631 4954703 4582695 4401227 4376066 4318101 4169018 4031346 3958851 3746437 3644614 3695034
6621 3695034 3604483 3401674 3288679 3242573 2903662 2938027 2933049 2949761 2869265 2796698 2760142
6610 2760142 2571517 2696515 2802887 2631085 2547985 2493196 2383036 2422908 2372076 2348522
6600 2348522 2413050 2427376 2383384 2219543 2317995 2295489 2126325 2105544 2227005 2233574 2197248
6589 2197248 2309905 2140961 2028718 2109610 2030497 2016016 2167915 2169345 2241203 2217181 2113488
6578 2113488 1963196 1994980 2015741 2087595 1983725 1944743 1959269 1885804 1936398 1791831 1972407
6567 1972407 1900155 1758689 1867396 1964202 1907779 1803831 1720407 2001706 1970983 1864304
6557 1864304 1811929 1598763 1656326 1768876 1721720 1596998 1567157 1548194 1642527 1697926 1688528
6546 1688528 1690868 1852935 1728414 1684036 1723943 1740340 1811427 1747237 1788681 1899630 1755177
6535 1755177 1639649 1619638 1650896 1626164 1650789 1759204 1844842 1821974 1806273 2007436 1977555
6524 1977555 1859345 1877514 1789573 1677603 1784976 2010574 1888757 1894128 1831058 1656540
6514 1656540 1697496 1562098 1735520 1713233 1558934 1655605 1604582 1623986 1584342 1515936 1580078
6503 1580078 1741366 1821319 1715651 1672060 1647703 1733839 1878361 1758417 1892401 1923027
6493 1923027 1888979 2008020 2071822 2012121 2090736 2116720 2028557 1898726 1968548 1946260 1966879
6482 1966879 1965953 1862476 2042696 1893351 1994604 2032913 2123143 2106684 2155035 2215135 2044798
6471 2044798 2037907 1981663 2130135 2288175 2294775 2178798 2222065 2406910 2659097 2515174 2410053
6460 2410053 2376710 2370794 2554209 2612090 2614599 2591944 2509910 2746741 2947183 2910799 3038490
6449 3038490 3171672 2994104 3042207 3336483 3357464 3551978 3785562 3746087 3703500 3942299
6439 3942299 4048577 4268024 4579236 4760894 5078077 5507292 5837958 6303611 6720240 7114894
6429 7114894 7487873 8003374 8409389 8965390 9507371 9901880 10071823 9980928 9909243 9863212
6419 9863212 9635243 9716796 9608685 9458674 9174905 9064111 9059681 9167608 9427667 9521682
6409 9521682 9615799 9808674 10014077 10239948 10225499 10122696 10113193 9995851 9869195 9567230
6399 9567230 9157241 8701828 8385806 8001053 7769357 7562969 7162782 6838133 6594070 6156070
6389 6156070 5905685 5861846 5638609 5567359 5260349 5136172 5237548 5212389 5100552 5166981
6379 5166981 5218342 5163939 5286386 5152693 5227418 5313563 5381144 5453492 5641364 5735127 5954184
6368 5954184 6031749 6344457 6618280 6821393 7084075 7332524 7444949 7626992 7799924 7833147
6358 7833147 7995461 8048434 7975881 7905958 7931797 7907125 7810421 7658526 7447331 7370209 7399381
6347 7399381 7343405 7402997 7458151 7416768 7373279 7442566 7486251 7593592 7788916 7721980 7526921
6336 7526921 7308568 7078485 6746845 6572720 6284762 5925814 5629877 5440861 5117707 5010788
6326 5010788 4939533 4832112 4544076 4353075 4233843 4454279 4442111 4279266 4229124 4251798
6316 4251798 4266049 4258296 4334423 4423466 4602538 4711737 4807263 4795704 4781413 4820652 4793001
6305 4793001 4754394 4814637 4629501 4439522 4412513 4406879 4384557 4376160 4405806 4340120 4072264
6294 4072264 3897330 3743928 3959006 3849101 3680171 3939925 3983091 4057849 4166481 4239019
6284 4239019 4417667 4512756 4578644 4612943 4756490 4510813 4261599 4220308 4340741 4240157
6274 4240157 4247304 4160466 4131147 4024032 4019373 4128687 4029688 4070794 4159773 4012997 3972956
6263 3972956 3983671 3856320 3728393 3691351 3595539 3644509 3506879 3566620 3598011 3525270 3634528
6252 3634528 3676519 3801645 3787315 3901555 4048655 4045862 4008656 4166337 4134554 4120742 4242994
6241 4242994 4368917 4328227 4147735 4301922 4159856 3985415 4074069 4138909 4002238 3920101
6231 3920101 4004173 4097697 4244621 4244751 4431369 4514506 4606030 4651590 4617813 4697750 4859309
6220 4859309 4882772 4947178 5052915 5237645 5292995 5284020 5196916 5103002 5098521 4883880 4809075
6209 4809075 4825053 4915191 4915382 5044415 5136950 5095638 5012869 4945932 5054548 5105984 5165629
6198 5165629 5103050 5278377 5296386 5451418 5503124 5309083 5593709 5672156 5629622 5695220 5795958
6187 5795958 5784746 5765073 5777836 5930617 6072329 6223267 6363415 6063154 6086905 6103944
6177 6103944 6391623 6505305 6375638 6651907 6854294 6763766 6807961 6786097 6883796 7071323
6167 7071323 7045638 6919430 6905304 6893514 6948628 6847061 6732207 6920514 6846907 6794044 6674325
6156 6674325 6554059 6509506 6404422 6519653 6620696 6564764 6515132 6554161 6398062 6446462
6146 6446462 6489222 6368770 6320359 6142351 6138386 6269566 6247954 6332051 6379305 6432252 6610142
6135 6610142 6598054 6369756 6180930 6109875 6045443 5864423 5483606 5443372 5253655 5113006
6125 5113006 5070531 5083989 5085567 4883007 4719084 4798845 4648924 4676803 4626289 4429059 4408308
6114 4408308 4490038 4270515 4033903 3999050 4103141 4041923 3964212 3987502 3954794 3909721 3745396
6103 3745396 3746672 3713584 3579896 3348051 3440314 3428852 3291264 3302510 3121821 2965649 2962934
6092 2962934 2786376 2739374 2589430 2546591 2399001 2414859 2365088 2296131 2349209 2137787 2212844
6081 2212844 2151858 2038339 1981964 1917040 1934625 1970560 1923117 1985095 1974957 1818618 1756696
6070 1756696 1798213 1858646 1897929 1819850 1713957 1630204 1610178 1617216 1563508 1442462 1510057
6059 1510057 1514005 1492750 1439092 1257568 1293927 1331722 1263439 1179161 1351446 1207058 1155941
6048 1155941 1221561 1318817 1333623 1387875 1391965 1202063 1157169 1219329 1239666 1250482 1132883
6037 1132883 1044793 992014 959512 1019986 1034052 996019 723388 736587 782239 835011 878417
6026 878417 966054 975943 1021317 1054435 952268 1072106 1073344 943650 857106 799604 867733
6015 867733 840380 764474 753694 884108 941883 848735 697348 790272 855902 967011 1110191
6004 1110191 1098504 979597 936037 1083168 1103475 1095639 1088297 988014 886600 913309 934322
5993 934322 662818 706117 783357 770851 791757 729469 778250 930357 860684 825627 759599
5982 759599 694746 876760 793862 786959 917125 758625 804032 836163 800216 825724 580007
5971 580007 817751 926412 765523 843901 907020 739502 717644 819551 904874 926723 1075177
5960 1075177 870092 762734 854950 800975 907459 853203 849886 888459 802809 809077 735869
5949 735869 779203 864273 652965 614854 643012 599466 745081 764359 830823 856158 701579
5938 701579 629178 808004 768101 722709 745981 834095 965513 905985 1089978 1002875 1104168
5927 1104168 1152020 992053 1070319 998087 822081 911147 958480 845164 794624 837303 885950
5916 885950 905466 981215 929057 798560 821193 1012032 1029050 969082 877733 958431 929617
5905 929617 904369 843552 970634 1138828 1187126 1131675 1100331 1026488 945980 828100 879575
5894 879575 883961 917674 923890 822427 780763 931459 1017815 936657 865140 818152 976064
5883 976064 939008 807123 881203 773089 775811 936008 999838 1032458 1008432 1004020 1077068
5872 1077068 1045194 996092 1102562 955697 757442 731437 926838 807737 812419 865702 879199
5861 879199 870234 869540 916629 965463 863626 1053691 1130382 1171882 1162125 1279454 1309628 1264544
5849 1264544 1121097 1075467 1121649 1144009 1195378 1199420 1055664 960470 1040088 1047936 1065249
5838 1065249 1230005 1183829 1181634 1132847 1220727 1198077 1193277 1235969 1357893 1470002 1395213
5827 1395213 1285779 1389374 1477489 1454558 1438555 1441487 1499721 1505020 1387441 1333160 1518283
5816 1518283 1750986 1759969 1639907 1698582 1893163 2158703 2116130 2254045 2325113 2417769 2478509
5805 2478509 2708721 2730253 2697190 2846940 2816578 3044807 3474821 3766676 4104599 4531480
5795 4531480 5180241 6124214 7222459 8507564 9968302 10866354 10677016 9651542 8263958
5786 8263958 6786433 5863563 5022790 4634448 4107526 3814785 3448575 3040836 2925958
5777 2925958 2828596 2756718 2713490 2501008 2540112 2501354 2395786 2388108 2140896 2190186 2172239
5766 2172239 2258786 2229181 2164900 2306709 2360933 2362349 2375958 2314482 2306662 2184831 2021931
5755 2021931 2078205 2060510 1814268 1552213 1597639 1513315 1407296 1394687 1339353 1387325 1397843
5744 1397843 1325550 1312386 1435577 1386206 1280806 1136130 1165101 1166539 1240340 1070120 1105354
5733 1105354 1138426 1179203 1298950 1300583 1275885 1109842 1259057 1301630 1231152 1197176 1240302
5722 1240302 1286370 1303237 1204286 1182136 1350865 1151968 1115746 1240912 1282592 1010983 999834
5711 999834 1179399 1094342 1221124 1279682 1213472 1184816 1295985 1176021 1197709 1171570 1227527
5700 1227527 1253095 1317853 1245312 1137559 1173946 1174076 1267470 1183998 1187568 1161463 1309661 1430198
5688 1430198 1307139 1384948 1372717 1380341 1465256 1301103 1528696 1512290 1471064 1402635 1551201
5677 1551201 1534763 1552287 1483585 1234328 1542325 1560364 1481805 1412010 1506491 1635251 1624233
5666 1624233 1656094 1683077 1610404 1632129 1656930 1681118 1666822 1720642 1755769 1703430 1747362
5655 1747362 1948340 1992563 2135471 2084320 2005035 2174401 2074724 2135959 2258189 2342065 2277699
5644 2277699 2427316 2043964 2187086 2353379 2531838 2601164 2514211 2402208 2399761 2574383
5634 2574383 2471996 2304630 2641390 2850365 2730102 2766889 2890989 2905285 2693888 2845960
5624 2845960 2999523 3142959 3189993 3388660 3496249 3620995 3522138 3574055 3640563 3672899
5614 3672899 3660268 3862519 3888683 3936948 4235278 4318786 4375733 4557710 4575607 4679344 4798818
5603 4798818 5138797 5305067 5399507 5767678 6058158 6280074 6676223 7085949 7314020 7700964
5593 7700964 8160385 8581039 8876314 9082838 9217019 9101272 9026163 8993058 8819298 8687931
5583 8687931 8424026 8210484 8091074 7973036 7833003 7519866 7570056 7639846 7481144 7474709
5573 7474709 7508555 7628704 7684413 7926304 8192486 8413431 8600286 8783394 9027689 9410291
5563 9410291 9832081 10369108 10839835 11319784 11944771 12720090 13140978 13633807 14112191 14505012
5553 14505012 14903611 15336839 15669338 15997905 16425918 16742504 17201623 17467896 17889819
5544 17889819 18209795 18600719 19023065 19767257 21068304 22645670 24352868 25420552 24669345
5535 24669345 22103358 19457252 17242621 15402647 14098105 13153841 12523964 11997478 11715189
5526 11715189 11417078 11370234 11347085 11272452 11315114 11456624 11594077 11855397 12099542 12259631
5516 12259631 12605570 13015327 13208421 13478770 13734242 13991925 13829984 13711517 13650480 13504278
5506 13504278 13150396 12581547 12083332 11468818 10902878 10446198 10092122 9704808 9515749
5497 9515749 9251026 9122441 8908970 8795100 8751322 8814998 8743262 8625587 8765556 8926590
5487 8926590 9022166 9002229 8893963 9130719 9247578 9321561 9575340 9515289 9185551 8853555
5477 8853555 8572205 8421276 8296483 8039486 7824762 7599768 7445809 7588541 7624312 7537828
5467 7537828 7396684 7491218 7697767 7809050 7902908 7781086 7890056 8014607 8162230 8246588
5457 8246588 8438892 8470296 8673787 8927227 9198774 9397576 9603887 9881658 9935185 9901537
5447 9901537 9992851 10122086 10251561 10254231 10221914 10284242 10360710 10513540 10257701 10064956 9819881
5436 9819881 9737542 9401382 9327016 9241392 9147050 9201743 9109941 9164506 9292843 9401389 9493561
5425 9493561 9284088 9390343 9504568 9430719 9581420 9795080 9972020 10171257 10392773 10438147
5415 10438147 10629563 10886364 10959315 11064184 11338179 11632049 11558037 11632712 11663850 11810998
5405 11810998 11965590 11968568 11968800 11859717 11876388 11928307 12190210 12395904 12759737 13088255 13327727
5394 13327727 13347394 13345067 13663320 13814960 13792434 13891751 14050270 14080460 13978051 13974805 13540498
5383 13540498 13295596 13190776 13105179 13088628 13065443 13201091 13413372 13503112 13625311 13947491
5373 13947491 14225720 14464553 14702355 15071153 15634589 15849854 16082804 16417580 16463264 16602459
5363 16602459 16808353 17061982 17079013 17314740 17489441 17723240 17875149 18060518 18270250 18566146
5353 18566146 18765319 19072547 19733421 20386253 21314774 22124360 23196947 24296248 25617918
5344 25617918 27212366 29254558 31750927 34928911 38495115 42107464 45403656 47167550
5336 47167550 46974209 45457287 43715208 42360179 41583103 41177208 40744196 40614991 40408687
5327 40408687 39608880 38366918 37232798 36348616 35780483 35701928 36061017 36834249 37672862
5318 37672862 38965122 40666604 42704597 45720075 49278132 53795815 59421865 65670438
5310 65670438 71855415 77360976 81407423 84476899 86503503 87447328 87713514 88149595 89669447
5301 89669447 92539154 96574701 100184311 101316412 98593655 91662244 83000780 74594689
5293 74594689 67336969 61962855 57703570 54807087 52546340 51155330 50424759 50253503
5285 50253503 50644040 51523896 53119388 55374648 58460707 62116230 65584440 68728370
5277 68728370 70369579 70922113 71590202 73148004 76096070 79804017 83049019 84442118
5269 84442118 82467564 77390601 70922733 64052815 57939694 53304998 49576139 46543162
5261 46543162 44178117 42286250 40988611 39839711 38659659 37881510 37468515 37045717 36664878
5252 36664878 36353974 36442045 36583792 36937468 37625690 38471296 39567978 40984054 42606639
5243 42606639 44614157 47329888 50836865 55211763 60621389 67118333 73943419 80473438
5235 80473438 85378372 86961300 84877454 80406028 75468310 71469746 69058017 67777747
5227 67777747 66927562 65446738 62654386 59152353 55655160 53221492 51359586 50340752
5219 50340752 50377896 51036585 52435374 54649974 57858459 61856209 66843992 72870611 79296629
5210 79296629 84837914 88257949 89021375 87370448 84428683 81766772 79843904 78496812
5202 78496812 77655232 76354256 73932259 70882460 68251187 66437709 64874136 63011972
5194 63011972 60207234 56049132 51236543 46624266 42767457 39749433 37613077 36212213
5186 36212213 35043640 34255979 33941815 34071895 34469951 35172375 35970579 36483400 36994323
5177 36994323 37250069 37768911 38453417 39215175 40190893 41589680 43155336 43914754 43036667
5168 43036667 40404840 36805245 33057599 29807638 27074476 24890483 23133921 21954544
5160 21954544 20982594 20019390 19340396 18862469 18321849 17894094 17415892 17020730 16635189
5151 16635189 16447707 16278521 16255415 16137211 16160239 16222698 16344296 16474446 16640913 17016509
5141 17016509 17381037 17919006 18458111 19045149 19857874 20750602 21185341 21793226 22473299
5132 22473299 23577305 25073604 26707495 29012243 31930266 35145136 38437007 40988507
5124 40988507 42247001 41694976 40506212 39391418 39055663 39769500 41825750 45251675 50270211
5115 50270211 56892676 63926000 70019671 72588025 69319529 61517098 52550583 44267298
5107 44267298 37813565 32767106 28869849 25702514 23121210 21020537 19330005 17776254
5099 17776254 16586533 15644277 14731092 13877327 13216225 12707186 12219674 11704098 11301545
5090 11301545 11012031 10850856 10706120 10428677 9925375 9685298 9495492 9127516 9031966 9126977
5080 9126977 9236760 9257787 9241804 9108495 8937190 8714298 8256803 7901823 7676326 7470079
5070 7470079 7115661 6883406 6651580 6529365 6364326 6147571 6158929 5880910 5684747 5586700
5060 5586700 5491093 5687399 5787759 5817583 5734689 5647442 5472127 5373313 5507962 5769003
5050 5769003 6157899 6465806 6828060 7036553 7327894 7009854 6595317 5964668 5630345 5411158
5040 5411158 5043156 4828004 4539988 4411164 4273335 4199302 4001208 4113999 4132393 4097765
5030 4097765 3993156 3913259 3802784 3893377 3984275 4081457 3925541 3934836 3781221 3668358 3677585
5019 3677585 3595968 3549920 3439842 3514732 3391114 3186624 3087944 3074519 3123913 2968609 2987096
5008 2987096 2919875 2962064 3023330 2852647 3014530 3009571 3049149 3227435 3275001 3356028 3222401
4997 3222401 3171295 3384226 3450893 3656020 3590985 3515719 3544328 3638439 3665246 3641231 3743386
4986 3743386 3688905 3519439 3640039 3620352 3657645 3746613 3861020 3767876 3698590 3628010 3747745
4975 3747745 3525992 3665858 3783825 3602561 3600262 3541715 3548081 3622300 3643514 3540137 3484468
4964 3484468 3622920 3574523 3607610 3604722 3662999 3790014 3894455 3968980 4069987 4068534 4006706
4953 4006706 3974431 4066392 4097672 4119690 4239130 4285416 4326929 4469928 4447080 4496125 4263504
4942 4263504 4222294 4387442 4573096 4787539 4888598 5086393 5185838 5472650 5710195 5923909
4932 5923909 5995174 5935537 6032810 5979822 6124810 6217091 6416403 6841673 7123805 7351887
4922 7351887 7349786 7315582 7350099 7516632 7566349 7636788 7853269 8025256 7923617 7654652 7474438
4911 7474438 7417396 7294222 7279564 7291287 7250237 7263423 7314186 7425574 7516491 7679101 8109140
4900 8109140 8212157 8419617 8802654 9029091 9311380 9395233 9597235 9901354 9901297 10054456
4890 10054456 10435026 10721431 10818689 11007231 11227401 11498283 11561491 11805012 11967571 12178723
4880 12178723 12375987 12603170 12972361 13323080 13507193 13845021 13923419 14238497 14328187 14498075
4870 14498075 14604482 14936930 15345305 15836514 16097926 16435134 16829166 17263584 17911947
4861 17911947 18572289 19343150 20217895 21092629 21862678 22571829 23640072 24686772 25954659
4852 25954659 26907592 27978191 29040324 30512597 32114762 33863411 35553117 37621424
4844 37621424 39600214 41764637 43797818 46230215 48883952 52261427 55912236 60273430
4836 60273430 65036346 70913441 77505277 85700433 95224753 107257354 121581892 140043919
4828 140043919 165414511 201879106 249636584 305603860 362527259 404241338 402271656
4821 402271656 345151876 277541373 220126770 177047476 146550867 124282063 106881680
4814 106881680 92808028 81519455 72429036 64773625 58555896 53757014 49738152 46250454
4806 46250454 43224715 40551958 38075707 36042264 34299554 32859925 31380525 30013276
4798 30013276 28707844 27532122 26199102 25278956 24430526 23314822 22230772 21535846 20853872
4789 20853872 20272470 19520285 18798080 18062243 17474572 16897161 16208130 15587811 14891859
4780 14891859 14403177 13783061 13255108 12789187 12397862 12130252 11714842 11550422 11270794
4771 11270794 10955021 10676066 10446517 10174143 9912516 9501557 9397987 9227471 8937828
4762 8937828 8739652 8644146 8366670 8199307 7909284 7717833 7440855 7220249 7016062 6802423
4752 6802423 6666745 6551906 6471073 6406979 6381183 6358837 6293662 6138286 6180239 6177990 5991383
4741 5991383 6059814 6003334 5739102 5760575 5799630 5718511 5571352 5520680 5384653 5190370 5138070
4730 5138070 5227796 5190076 5186103 5113422 5028127 5033375 4876827 4830102 4704697 4700637 4474159
4719 4474159 4502637 4490530 4545880 4372597 4348290 4191067 4277462 4127573 4204934 4243010 4119659
4708 4119659 4116537 4034436 3969937 3989016 3992708 3988772 3994242 3918317 3988518 3918220 3915556 3988831
4696 3988831 4103676 4084876 4101274 4085781 4064501 3983878 3938651 4174038 4152804 4199514 4226744
4685 4226744 4264847 4118393 4089592 4081352 4033065 4022196 3937856 4037188 4067568 4199495 4213069
4674 4213069 4169257 4116463 4202236 4044960 4058913 4135778 4042931 4033835 4168446 4351561 4330295
4663 4330295 4262820 4150085 4282197 4196037 4239536 4234335 4281575 4326584 4375854 4417360 4606166
4652 4606166 4914152 5027246 5050448 5229645 5167633 5310224 5416308 5558289 5801117 5938074
4642 5938074 6171840 6258250 6379168 6523183 6515471 6456494 6650271 6677544 6741848 6617189 6705089
4631 6705089 6706032 6713672 6894052 7018450 6970322 7119170 7197424 7438898 7600818 7842961 8013848
4620 8013848 7975717 8005660 8108292 8185587 8357212 8534448 8596861 8770115 9002200 9224212
4610 9224212 9473160 9657511 9859836 10414634 10614805 10852726 11301275 11659624 12040537 12370238
4600 12370238 13016561 13636405 14092513 14533050 15150846 15865060 16452770 17192622 18025161
4591 18025161 18956156 19765256 20478914 21684545 23066883 24789936 26477412 28498251 30728597
4582 30728597 33581764 37142775 41451899 46555101 53331952 62161690 73753984 87687084
4574 87687084 103069076 117139444 124484605 118912791 103300375 86389602 71386971
4567 71386971 59619155 50953703 44236769 38895654 34750584 31493085 28815597 26601025
4559 26601025 24709730 23121401 21871044 20736033 19921190 19212713 18620086 18074408 17498629
4550 17498629 17117595 16692752 16251401 16076939 15672471 15317521 15117804 14981916 14623944
4541 14623944 14390916 14349717 14194453 14037797 13809512 13712834 13406693 13323045 13226166 12873697
4531 12873697 12855946 12913257 12768490 12751812 12593962 12318967 12322514 12289299 12352233 12373735 12313266
4520 12313266 12138107 12234867 12350436 12312531 12236710 12069426 12048436 12130139 12176407 12335392
4510 12335392 12459052 12735089 12997603 13357854 13310758 13144596 12986998 12525616 12030450 11935379
4500 11935379 11767199 11300144 11233799 11296754 11285333 11128843 10923966 10851171 10772951 10777662 10760757
4489 10760757 10655920 10471598 10451144 10417108 10426847 10367029 10177048 10063012 10001613 9972050 9921112
4478 9921112 9735331 9811362 9789433 9584725 9438276 9499375 9384732 9274606 9382288 9339411
4468 9339411 9120552 9066402 8956357 8875720 9111045 9121492 9083335 9157952 9017102 8914511
4458 8914511 8665121 8445957 8307143 8193747 8084033 7926841 7817442 7701647 7711155 7561984
4448 7561984 7525198 7299205 7099545 7226510 7093941 7124003 7128937 6958291 6881712 6664767
4438 6664767 6698010 6724833 6409394 6405108 6470432 6436190 6336745 6144962 5955886 6018789 6025708
4427 6025708 6055025 6030471 6037389 5880623 5894300 5847587 5700574 5542541 5471154 5520984 5607120
4416 5607120 5547631 5328815 5234780 5238888 5211271 5054308 5102657 5071166 5103432 5041543 4966332
4405 4966332 4755854 4800234 4605986 4559214 4670419 4699203 4726684 4622754 4556647 4617612 4701120
4394 4701120 4759267 4624341 4580437 4574165 4587673 4622128 4624415 4495717 4519748 4597268 4551100
4383 4551100 4502737 4467044 4385632 4466280 4302021 4214768 4277843 4209709 4130593 4204762 4457374
4372 4457374 4432391 4285609 4319824 4279181 4327608 4255307 4334783 4173618 4230768 4240977 4249761
4361 4249761 4230502 4194533 4103485 4116307 4154660 4103734 4182430 4134879 4170438 4280442 4416163
4350 4416163 4261209 4251330 4340730 4519607 4564881 4501485 4635967 4521393 4604391 4634294 4514429
4339 4514429 4524898 4639418 4814251 5024409 5089965 5058476 5042123 5060672 5220617 5335761
4329 5335761 5562619 5554112 5637640 5615681 5795895 5917024 5889068 5944735 6006385 6003678 5827271
4318 5827271 5979364 6134694 6273532 6472339 6579881 6559062 6697456 6965446 7046259 7159797
4308 7159797 7242557 7363654 7444398 7811534 8029059 8033146 8077124 8279209 8549628 8715945
4298 8715945 8873722 9065642 9328475 9374425 9509205 9541942 9720162 9855139 9968622 10077420
4288 10077420 10189126 10501897 10687149 10870036 10952532 11078238 11309947 11668726 11979466 12289386
4278 12289386 12584600 12995244 13302095 13610228 14131081 14725835 15261849 15693129 16119352
4269 16119352 16842789 17418296 18102418 18922884 19461102 19830351 20517637 21007383 21529377
4260 21529377 22188244 22609124 23118753 23703206 24363184 24905566 25459819 26233401 26910788
4251 26910788 27568950 28094818 28654575 29261430 29752019 30168726 30453972 30780698 31081054
4242 31081054 31291333 31610720 31762464 32076925 32255190 32385655 32275393 32118034 31965118
4233 31965118 31829861 31583388 31295183 30807777 30489982 30143568 29695816 29064419 28604963
4224 28604963 28091588 27380272 26922791 26260098 25640342 24877293 24343882 23727658 22935029
4215 22935029 22250114 21596278 21017549 20399435 19839428 19226983 18642810 17933729 17211132
4206 17211132 16933688 16592423 16204266 15801116 15495802 14946331 14456013 14124963 13798475
4197 13798475 13459693 13075259 12613288 12243756 11931038 11787513 11561597 11351543 11271722 11318098
4187 11318098 11267070 11323817 11413247 11518360 11709634 11406742 11118728 10846393 10498737 10242175
4177 10242175 10005242 9705041 9509718 9377990 9384597 9354786 9366751 9445065 9502056 9773661
4167 9773661 9998722 10112688 10084652 10181941 10022517 9824229 9524273 9390347 9025755 8682339
4157 8682339 8429484 8276223 8229836 8295535 8303519 8247087 8405027 8666163 8876397 9010764
4147 9010764 9052302 8830139 8575125 8561096 8283052 8293221 8328344 8303988 8465006 8698446
4137 8698446 8826419 9072809 8965086 8798418 8517328 8317009 8069971 7820925 7773535 7800639
4127 7800639 7673368 7654830 7555349 7573315 7546430 7505970 7496320 7479234 7709800 7673402 7623206
4116 7623206 7437198 7496146 7486089 7562543 7788081 7883995 7861313 7825338 7853778 8031505 8054892
4105 8054892 7960611 8094856 8191688 8354807 8650902 8840745 9002189 9118069 9266885 9304239
4095 9304239 9423589 9484493 9603430 9842998 10080461 10102280 10201270 10371900 10634260 10636167
4085 10636167 10748976 11119161 11298236 11414195 11661347 11699706 11727091 11867275 11998472 12113142
4075 12113142 12311314 12292266 12468277 12458586 12523099 12741332 13004278 12979925 13158160 13302962
4065 13302962 13514075 13710140 13924402 14182743 14368176 14606528 14919062 15131292 15388939
4056 15388939 15666008 15993305 16331726 16720735 16971282 17350560 17825949 18255190 18647491
4047 18647491 19186714 19734885 20322434 20933611 21337500 21976863 22571692 23291677 24032593
4038 24032593 24740243 25603603 26591020 27576195 28716326 29710245 30807125 32047527 33446079
4029 33446079 34884824 36357245 37928571 39531425 41370525 43259338 45152685 47388037
4021 47388037 49631643 52046230 54520889 56982582 59775875 62631253 65638862 68740186
4013 68740186 71881075 75029190 78245164 81611560 84817990 88234877 91822272 95415844
4005 95415844 99048297 102889775 106495046 110144250 114010646 117619452 121077344 124431355
3997 124431355 127669232 130601697 133243331 135730845 138221455 140409826 142496977 144470627
3989 144470627 146131433 147983572 149491824 150674599 151535069 152069911 152070834 151703562 150907377
3980 150907377 149757672 148209978 146712185 144892943 142945412 140910058 138706283 136492728
3972 136492728 134105043 131442549 128656931 125730275 122427501 118906115 115079236 111215441
3964 111215441 107310368 103291591 99462402 95625063 91943305 88524435 85177125 81881759
3956 81881759 78608587 75390515 72309945 69196768 66253428 63305625 60500128 57737383
3948 57737383 55236194 52999025 50748820 48621871 46694357 45085643 43597992 42236294
3940 42236294 40954939 39800247 38632864 37623502 36741411 35988083 35086115 34343205 33744926
3931 33744926 33217503 32927359 32725574 32552723 32660240 32763427 33043137 33316494 33568101
3922 33568101 34073169 34603778 35047734 35551619 36026180 36360317 36456933 36387255 36460342 36574152
3912 36574152 36537874 36526202 36300101 36063234 35979694 35784596 35671337 35437580 35148809 34856321
3902 34856321 34649281 34251610 33541947 33024257 32440764 31762532 31072392 30343378 29667338
3893 29667338 29109412 28724446 28351543 28207397 28125318 27913769 27720060 27829579 28314582 28653368
3883 28653368 28990985 29527853 29929725 30646675 31574003 32466849 33448342 34654734 36154186
3874 36154186 37651070 39072118 40834565 42961586 45035966 47151656 49311334 51439176
3866 51439176 53271929 55057543 56571179 57595941 58511562 58972407 59189428 59224459 59175819
3857 59175819 59272543 58873453 58655960 58406290 57839649 57056577 56076587 55070315 53782972
3848 53782972 52221482 50422834 48370820 46011054 43672672 41465883 39150475 36972410
3840 36972410 34831559 32836152 31057133 29474339 28042366 26640714 25477954 24508995
3832 24508995 23415781 22351288 21445463 20770960 20283992 19618300 19036255 18394612 17743319
3823 17743319 17297576 17136841 16716554 16380593 16094300 15761990 15374006 15087574 14810472
3814 14810472 14651488 14461480 14151245 13931129 13778273 13699177 13358346 13139818 13004796 12921398
3804 12921398 12779903 12650443 12424584 12362067 12249167 12027147 11927865 11967369 11998612 12009389
3794 12009389 12024499 12033036 12002562 11781431 11521994 11447807 11410953 11425888 11352903 11355601 11251137
3783 11251137 11305406 11452166 11560625 11585444 11537999 11630890 11667228 11670174 11722942 11752320 11847692
3772 11847692 11988361 12114690 12300892 12648385 12847841 13004537 13288583 13419956 13704214
3763 13704214 13960172 14055370 13907030 14059953 14197965 14203705 14401425 14589310 14798036 14971434
3753 14971434 15149254 15259533 15396070 15561485 15614471 15774867 15727584 15697727 15685124 15691255
3743 15691255 15818821 15710948 15644557 15721662 15675008 15616211 15690627 15991636 15978737 15883305 15913816
3732 15913816 15936109 16071786 16084948 16208653 16199495 16284768 16463455 16742147 17108908 17351599
3722 17351599 17691562 17904101 18387286 18827338 19162736 19482268 19866773 20213385 20715193
3713 20715193 21115260 21463766 21816664 22172010 22522419 22954466 23326834 23663371 24191690
3704 24191690 24594449 24742136 25158468 25627799 25953911 26349128 26631841 26909089 27321262
3695 27321262 27702608 27975345 28382684 28695761 29078671 29231781 29743672 30324620 30634880
3686 30634880 31058769 31433529 31853526 32449666 33126525 33638193 34164108 34966789 35767859
3677 35767859 36527631 37381258 38544018 39690206 40678019 41773939 43209766 44820184 46312329
3668 46312329 47884768 49698098 51487155 53389264 55517899 57717183 60067096 62625887
3660 62625887 65373245 68053952 71093343 74048319 76805376 79867305 82992634 85970663
3652 85970663 88861717 91710080 94502921 97151192 99507623 101607317 103600163 105467052
3644 105467052 107398908 109123891 110723603 112352458 113531823 114689966 115585320 116282100
3636 116282100 116649234 116702937 116459544 116141041 115518710 114776339 114087061 113276209 112343274
3627 112343274 111457840 110500997 109520658 108717405 107721915 106727941 105894342 104868167 104227844
3618 104227844 103532259 102897256 102500653 102212270 102229717 102396804 102577762 102814628 103606250
3609 103606250 104409819 105509259 106729623 108448545 110421914 112386800 115099583 117933177
3601 117933177 121129827 124811513 128783475 133049171 137128460 141566385 145931964 150104316
3593 150104316 154215073 158030446 161650800 165357676 168979665 172460854 175836383 179202420
3585 179202420 182437111 185472013 188427738 191027844 192965167 194359386 195201720 195241396
3577 195241396 194439682 193192397 191388929 189210170 186753546 184046407 181540016 179146674
3569 179146674 176617971 174161537 171598169 169112761 166706737 164184921 161773709 159578849
3561 159578849 157609958 155975072 154739729 154031242 153820164 154107478 155032693 156502373 158113044
3552 158113044 160085388 162625032 165273937 168083797 171042587 174039614 176763666 179411096
3544 179411096 181932515 184650064 187492369 190270296 193036604 195637379 197938474 200396414
3536 200396414 202346962 203692135 204649093 204618557 203948956 202984225 201417686 199461696 196963867
3527 196963867 193908274 190441556 186801539 182996039 178961451 175085688 171288332 167838615
3519 167838615 164386863 161033431 157829620 154505674 151002464 147191859 143472026 140077729
3511 140077729 136909259 134030533 131602814 129648270 128249169 127302164 126934665 127217239
3503 127217239 128079815 129326923 131158650 133608925 136587754 140049828 144095065 148471206
3495 148471206 153130520 158172317 163783448 169429531 175004714 180437388 185942926 191470299
3487 191470299 197085157 202775268 208831252 215279631 222108036 229607173 237682884 246686240
3479 246686240 256405307 266767692 278335842 291268679 305309394 320995082 337978038
3472 337978038 355880492 373887597 391269749 406768692 419670773 429170004 434643790
3465 434643790 435882283 433845389 429077901 422617616 415793331 409429620 403916128 399361062
3457 399361062 395822031 392625174 389010301 383950741 376226773 365398409 350593256 332290148
3449 332290148 311340155 288416362 264887548 241545475 219617737 199734843 182136809
3442 182136809 166939049 153825112 142448253 132359639 123583353 116194228 109399608
3435 109399608 103494162 98318360 93655686 89337455 85515187 81900950 78660818 75772447
3427 75772447 73166417 70655399 68291121 66106355 63962624 62050604 60089881 58173710
3419 58173710 56436353 55091219 53534611 52221956 50765950 49439291 48273436 47097638
3411 47097638 45961413 44746563 43761441 42857961 41858472 40807701 39978754 39332727 38412370
3402 38412370 37483653 36668825 36054084 35385832 34921922 34527017 33976305 33307227 32689566
3393 32689566 32289533 31945492 31578323 31183136 30851910 30377352 30020617 29564869 29241359
3384 29241359 28960296 28520401 28049517 27749946 27629830 27470591 27283632 27108750 26811672
3375 26811672 26797952 26605957 26382347 26279471 26061763 25816143 25757898 25795864 25840336 25723529
3365 25723529 25521130 25306569 25275777 25350877 25234433 25214968 25164582 25139592 25206521 25376912
3355 25376912 25240981 25075667 25124474 25263036 25232173 25228577 25341041 25414210 25504573 25399342
3345 25399342 25389279 25537676 25487691 25535929 25760575 25864320 25898071 26016440 26074096 26041012
3335 26041012 26234050 26414420 26603232 26581321 26538134 26611423 26883897 27241238 27350227 27554833
3325 27554833 27861994 27942790 28171218 28304585 28599217 28600268 28795271 29017437 29138628 29395172
3315 29395172 29697814 30010820 30302072 30678914 31088223 31345325 31859245 32304655 32521463
3306 32521463 32905011 33277936 33760664 34226081 34762194 35290824 35854303 36334410 36766046
3297 36766046 37316080 37809988 38457383 39164948 39756130 40304690 41104457 41863532 42442568
3288 42442568 43003056 43742829 44455664 44990740 45757807 46604783 47397330 48143039 49006980
3279 49006980 49718392 50484214 51421467 52453230 53191169 54100530 55307994 56392218 57335728
3270 57335728 58133027 59038080 60301662 61130761 62133816 63173339 64416330 65677384 66773891
3261 66773891 67975733 69259724 70496614 71963216 73514184 75121156 76721970 78346357
3253 78346357 80161057 82151864 84271930 86164654 88257963 90685418 93203545 95602606
3245 95602606 97992873 100753535 103833905 106968924 110478421 114583998 118675229 123192619
3237 123192619 128031226 133443997 139446829 146024556 153223109 161220926 169955949 179167938
3229 179167938 189182605 200041187 211579648 223774327 236287472 248325500 259498287
3222 259498287 269051110 275856688 278830569 277508982 271580012 261892519 249358488 235910855
3214 235910855 222621988 210081709 199074099 189136489 180251011 172391366 165339599 159107091
3206 159107091 153657924 148724514 144162985 140033552 136320137 133018550 130016560 127285062
3198 127285062 124747623 122452740 120379188 118436478 116508373 114799246 113216769 111621181
3190 111621181 109970673 108384329 106856031 105176766 103580984 101795199 99801518 97893167
3182 97893167 95959297 93836740 91609407 89730347 87689447 85752310 83826550 81541596
3174 81541596 79555233 77546094 75572175 74023870 72514660 70899039 69210019 67743937
3166 67743937 66363128 65178417 63876617 62577778 61518321 60356246 59113317 57946837
3158 57946837 57028817 55999718 55001941 53800039 52635981 51874292 50946354 50100334 49201713
3149 49201713 48422756 47624469 46876202 46272044 45593958 44859166 44138792 43623801 43110217
3140 43110217 42442041 41805703 41414636 41051186 40531457 40017808 39537247 39160976 38745321
3131 38745321 38295947 37794601 37493823 37038556 36631203 36448165 35909061 35527717 35147812
3122 35147812 34659149 34257925 33867904 33632150 33395590 32930741 32590008 32216947 31891840
3113 31891840 31692165 31197886 30863950 30628263 30209180 29968866 29924792 29623816 29303127 29018300
3103 29018300 28706447 28472520 28198359 27945263 27586386 27446522 27299566 27141841 26909327
3094 26909327 26611512 26407465 26363149 26175175 26096842 25883280 25798525 25705866 25510409 25421208
3084 25421208 25332857 25253680 25016144 25030891 24978201 24634651 24262781 24239467 24300725 24279315 24145025
3073 24145025 23979806 23837278 23678005 23565756 23526484 23573369 23485503 23333614 23297738 23244138
3063 23244138 23039999 23003200 22868931 22709736 22759011 22631165 22485917 22368588 22330724 22296603
3053 22296603 22034068 21974781 22007922 21837194 21775446 21612703 21473038 21387242 21261601 20920215
3043 20920215 20766185 20708730 20548247 20450458 20289907 20127927 20029272 19869613 19746201 19777289
3033 19777289 19727473 19402029 19205914 19142217 18992955 18901156 18727210 18584195 18604937 18552341
3023 18552341 18512922 18494920 18232085 18206110 17942473 17692533 17567011 17479813 17273696 17063406
3013 17063406 17070407 16790155 16535756 16471679 16194260 16118003 16040773 15899453 15883407 15608111
3003 15608111 15443717 15483993 15477813 15433740 15372073 15348680 15480040 15551982 15298806 15251206 15333429
2992 15333429 15449861 15512263 15602815 15638511 15687093 15710092 15617575 15593853 15716546 15774184 15672454
2981 15672454 15735806 15955035 15925530 16073062 16213951 16343629 16421160 16588341 16688049 16871571
2971 16871571 16952105 16735918 16808390 16829113 16839642 16989101 17043468 16897981 16943815 17049997
2961 17049997 17255624 17346370 17599089 17900805 18233337 18275594 18631763 18953415 19013238 19127142
2951 19127142 19477349 19877203 20045231 20215692 20580655 20651085 20987504 21308536 21703309 22217299
2941 22217299 22369143 22787170 23324621 23652740 23915081 24052829 24158310 24244204 24602226 24985855
2931 24985855 25118063 25619680 25991021 26270656 26669730 27335512 27874256 28232707 28856247
2922 28856247 29596738 30253474 31176384 32109670 33006619 34010180 35087073 36242111 37311167
2913 37311167 38445393 39647136 41068689 42111922 43122973 44234191 45153549 46010329
2905 46010329 46581573 47164383 47704171 48149708 48401275 48839140 49353716 50002076 50682843
2896 50682843 51325814 51989777 52820918 54246817 55598394 57167434 59051990 61011850 63374874
2887 63374874 65943506 68562256 71494861 74722269 78040698 81323009 84336520 86424544
2879 86424544 87271397 86972765 85816149 83550678 80890764 77819726 74946149 72604897
2871 72604897 70794752 69770878 69148328 68958977 69025730 69673923 70562747 71787081 73189352
2862 73189352 75059566 77107036 79309207 81648881 83944635 86256363 88740308 90915998
2854 90915998 92804386 94230923 94885916 94821451 93739126 91976548 89773189 86863640 83582833
2845 83582833 79953242 76309485 73053886 70464195 68338353 66543372 65267899 64302133
2837 64302133 63648975 63294262 63361404 63625935 64000291 64446221 64608376 64811289 65027988 64909918
2827 64909918 64545701 63704485 62654512 61121034 59027084 56806129 54187079 51422913
2819 51422913 48823206 46192581 44095393 42100004 40303611 38612618 36954827 35653693
2811 35653693 34393138 33257628 32182135 30961531 30212764 29531676 28766697 28322806 27762191
2802 27762191 27272947 26756759 26145240 25643220 25053454 24212935 23619723 22844825 22062387
2793 22062387 21316205 20716326 20151820 19575960 18963628 18472282 17963279 17636769 17342004
2784 17342004 16835887 16367221 15989564 15612915 15121911 14877685 14343062 14012967 13724916
2775 13724916 13589846 13414092 13121197 12911076 12654248 12554693 12412292 12210380 11972643 11904081
2765 11904081 11748814 11515947 11390063 11192315 10973656 10862297 10709831 10399089 10274915
2756 10274915 10155488 9713846 9432198 9336593 9154586 8936918 8699752 8586827 8437352 8341348
2746 8341348 8024280 7768852 7858886 7875172 7651377 7702386 7528043 7509134 7488720 7280007
2736 7280007 7236305 7216497 7177373 7092072 6954773 6745785 6615852 6498016 6417487 6280871
2726 6280871 6066066 5846057 5765783 5724974 5634516 5601002 5562217 5408203 5302181 5173617
2716 5173617 5066423 5034458 5052364 4829100 4722476 4758729 4694357 4612297 4556385 4634639 4656757
2705 4656757 4401936 4336023 4318614 4212067 4092257 4111799 4069200 4097470 4006318 4010358 4011045
2694 4011045 3928791 3936596 3796631 3785518 3663032 3480529 3473534 3371758 3414560 3428377 3316041
2683 3316041 3429349 3408958 3294410 3092611 3127084 3396802 3460871 3282649 3161706 3153987
2673 3153987 3273789 3213085 3137979 3254780 3187666 3191884 3207710 3221449 3164613 2973976 3020423
2662 3020423 2905915 2816408 2981922 3003763 2870951 2929945 3013215 2897094 2696970 2620673
2652 2620673 2651218 2491796 2502121 2623608 2743190 2743768 2794694 2787617 2739782 2676226 2620007
2641 2620007 2832402 2603311 2573589 2626009 2607642 2529472 2554855 2551910 2427272 2362853 2521357
2630 2521357 2553833 2456465 2401188 2525732 2614907 2565067 2563591 2714310 2731050 2828912 2951765
2619 2951765 2684296 2536281 2500326 2449665 2382356 2483940 2637958 2762540 2549318 2674864
2609 2674864 2760169 2750104 2551139 2585482 2679258 2760087 2818652 2925270 2893081 2892462 2920785
2598 2920785 2974349 3030204 2979969 2941509 2930069 2875022 2805951 2843285 2900536 2958530 2734181
2587 2734181 2716993 2646907 2681616 2716263 2837989 2886367 2799913 2817929 2776868 2706666 2705877 2744811
2575 2744811 2883724 2776088 2711147 2728198 2816177 2874768 2826503 2895177 3019831 3067324 3018309
2564 3018309 3117875 3017528 3016891 3107334 3186524 3187138 3075262 2880901 2864115 2746000 2784611
2553 2784611 2759425 2714385 2709501 2636943 2703596 2577817 2505662 2574830 2554873 2658360 2659617
2542 2659617 2423160 2485876 2478261 2411405 2360315 2353867 2298348 2334842 2222191 2322254 2310569
2531 2310569 2369737 2381324 2372628 2405374 2358276 2484489 2298996 2177277 2275159 2156550 2087742
2520 2087742 2177969 2099758 1984114 1942251 1885612 1827253 1808132 1798729 1725344 1600201 1675478
2509 1675478 1748141 1828419 1829260 1852149 1731933 1705134 1749187 1638937 1537932 1524268 1556073
2498 1556073 1396736 1442160 1429831 1412283 1547233 1643850 1638172 1481912 1315682 1306480 1394849
2487 1394849 1367544 1375009 1385307 1476334 1274025 1217266 1162563 1153381 1286619 1187066 1120040
2476 1120040 1280714 1235878 1214221 1142746 1049225 988327 1131185 1116895 1066293 1097721 971050
2465 971050 957149 813947 874580 960987 1164520 1072952 995844 1012437 1035894 930010 1019274
2454 1019274 1091113 1144665 1007947 926246 819392 851469 983057 954375 993160 1117202 932649
2443 932649 741077 953447 951600 910012 932519 888754 914400 743255 567804 723699 720387
2432 720387 758358 762900 745753 783356 798696 734592 712405 750590 745478 648200 536890 668668
2420 668668 705508 617537 710391 712525 604055 612240 621190 597264 659732 609325 526062 506233
2408 506233 592175 583605 647383 860572 839581 667719 689126 603318 552817 703662 695059
2397 695059 508733 557081 579440 598533 565326 566645 583993 432981 361718 606191 650691
2386 650691 566370 526351 623590 619428 414660 545678 467542 476694 485846 394852 449064 482367
2374 482367 390457 368559 524757 578494 682073 531754 567008 514790 601256 629835 548806
2363 548806 553754 471997 516408 422262 451841 428983 445191 329004 461415 496235 673116
2352 673116 673086 460422 618375 711368 771007 795765 556674 549138 684136 570210 599019
2341 599019 600463 552907 590921 557572 538224 328936 307645 362838 286357 301257 403352
2330 403352 474076 454597 479274 356875 360237 573261 422480 288009 360543 360848 211221
2319 211221 141126 243142 236680 237699 247500 447513 505408 570060 416829 274218 209677
2308 209677 441214 505329 318228 407060 392195 345764 341866 273691 151303 359472 428124
2297 428124 466314 428466 364045 414813 455212 443460 456116 527545 483124 378302 286418
2286 286418 358054 427208 414797 449546 268388 321549 375199 322973 321318 165342 233221
2275 233221 281691 235637 286293 282085 448370 437100 397621 408870 346807 301000 328579 313533
2263 313533 202620 276143 287462 252051 258811 174647 70297 34282 167543 316628 407552
2252 407552 514180 539122 474556 464746 535322 499067 594508 568627 356804 564945 526509
2241 526509 432868 557435 552528 615748 430209 342822 258774 237788 434752 568420 551117
2230 551117 424156 316309 372622 334988 271969 185781 326065 401559 320840 456080 436988
2219 436988 258170 515825 589312 421470 353770 472090 547115 566687 498887 443596 449568
2208 449568 353886 373578 444360 463134 398773 383062 540101 614054 700641 438466 503390
2197 503390 626080 635729 778681 735741 818800 699539 648080 622872 594450 579787 613790
2186 613790 577118 498107 406761 545643 524606 470908 509452 437759 466022 612581 638034
2175 638034 573612 685699 583862 609952 704727 760369 839665 852979 1008724 976819 848936
2164 848936 783064 875311 818074 981811 1071805 1065435 1004093 1097072 1208364 1172692 1178121 1245464
2152 1245464 1144900 1336251 1469974 1477106 1539023 1629394 1583328 1612575 1624944 1599295 1606277
2141 1606277 1766529 1799171 1618990 1628944 1779468 1897773 1813642 1871564 1993074 2155653
2131 2155653 2215568 2257101 2282898 2346179 2335135 2540251 2692263 2596172 2466607 2484294 2687858
2120 2687858 2826246 2982440 2992515 3146424 3455262 3539471 3699950 3903821 4009270 4150807
2110 4150807 4560748 4755215 4765161 5034245 5331433 5635804 6090303 6596641 6926303 7199506
2100 7199506 7667757 8373330 8878564 9630738 10352145 11096578 11726546 12303022 13297080 14125138
2090 14125138 15526333 17220628 19547740 21934032 25513108 30116748 37730347 46817263
2082 46817263 57613674 68257245 75307965 70878645 57202269 45350864 35747092 29269116
2074 29269116 24494806 21121631 18156799 15811361 14124473 12848840 11715788 11033474
2066 11033474 10634456 10201339 9507178 8766832 7899127 7368153 6865933 6480034 6022606
2057 6022606 5544699 5291849 5053761 4967556 4671457 4399355 4333418 4210848 4089783 3932873
2047 3932873 3705636 3601269 3459021 3177859 3145151 3064158 2825067 2764918 2756759 2600558
2037 2600558 2576886 2562537 2509140 2489631 2335863 2185371 2210460 2122043 1963828 1724958 1725470
2026 1725470 1665858 1725899 1830502 1748912 1574777 1521822 1484921 1330715 1467176 1346892
2016 1346892 1390642 1144658 1082568 1055490 1034552 1084170 1020423 1045000 1044008 1019087 1009598 1046981
2004 1046981 1077933 1023782 1057360 1171801 1106143 889980 887347 760055 712278 766041 822575
1993 822575 1005558 913439 830949 817079 729503 650452 655481 661056 735182 817811 795349 648976
1981 648976 643773 530205 620591 705138 677847 676972 642789 608654 525822 534157 614398 579772
1969 579772 423481 594103 683964 542924 504741 259022 439012 512475 424674 398753 333764
1958 333764 226433 309520 380579 350612 406516 326865 346798 255610 151064 343201 394739
1947 394739 284138 411839 427854 208338 312888 524363 525639 411840 291887 375470
1937 375470 426969 364732 211797 274315 369485 325833 142827 281067 245221 344040 200205
1926 200205 284646 428733 371636 392531 255790 200127 173144 151925 201517 133215 14989
1915 14989 52210 183812 128901 315063 244620 115031 116033 196316 279881 333613 361124
1904 361124 222413 241844 309356 262851 252779 270916 343530 416239 382635 249979 389674
1893 389674 441823 359021 305112 223233 112066 145339 242247 248107 292334 198850 111239 100112
1881 100112 264216 221726 183298 253882 257627 71836 211970 226875 182545 192666 308777
1870 308777 350223 272874 220671 167439 16797 55961 58615 208783 188687 193819 153218 332637
1858 332637 290882 60811 196128 285917 236721 257611 102121 154270 145401 156769 222334
1847 222334 321674 373508 167666 92824 81233 69015 133140 239825 286581 140524 155671
1836 155671 240127 246922 161188 82323 122942 182888 49230 33970 110224 229904 173532
1825 173532 152085 352096 261390 239296 200899 339654 158075 53649 176108 218063 209648
1814 209648 257215 405495 578327 526325 518944 313154 174677 161997 250635 378945 305929
1803 305929 174891 273888 140667 92202 88296 169456 231051 155813 165438 145946 36715
1792 36715 57985 43289 162903 231659 157109 167366 201921 214772 286457 365692 185046
1781 185046 174010 127548 129454 155709 249828 305464 156966 209366 212567 4964 56853 154623
1769 154623 -21476 52434 53317 56093 20918 -26595 -19509 104358 -25132 22749 -34440 31328
1757 31328 270765 227482 2976 130221 147883 60842 90193 -42849 -35973 99298 167430
1746 167430 125909 100732 22539 101814 81905 79600 -12910 -5797 -109480 13770 25418 129997
1734 129997 153540 232768 215894 126432 9236 129897 -6669 15514 112532 79915 141977
1723 141977 121319 134915 212826 137362 210782 185517 74506 94101 10614 -26848 -28708 139402
1711 139402 99034 43848 240359 371945 277914 240837 45648 -20767 108983 110040 -35359
1700 -35359 92235 109019 102524 111214 240218 245651 321614 352890 270788 310082 227097 127218
1688 127218 127471 149700 20689 25988 -35497 -58828 -18885 -135160 -131735 91765 122759 111406
1676 111406 -66678 -79533 -9599 180610 228340 -11362 -84268 -26249 -65227 -207621 -237391
1665 -237391 -52181 -156136 -110876 190763 72402 42232 -56191 136441 183393 -22322
1655 -22322 100220 174711 65460 -18239 -5379 121573 157354 151044 98568 136965 -11691
1644 -11691 -200794 49837 -11787 -86299 11173 -116002 -106529 -47398 128019 99164 159031
1633 159031 186194 161063 148426 211711 244881 218250 176572 60077 -81551 -88561 -48888
1622 -48888 -49368 -120751 -107412 -117605 -64116 10499 54548 31157 -121951 87103 40596 107188
1610 107188 89665 -33975 -84658 1054 -11571 -134674 -272787 -117483 31815 49854 -24716
1599 -24716 -85611 46439 136733 35526 -23727 150671 278732 181209 106305 5459 10918
1588 10918 19510 43627 144075 162111 215299 238191 106594 16364 26001 85879 26859 -96625
1576 -96625 54405 111439 179088 179190 286524 125348 -61460 130737 185820 23776 63709
1565 63709 98125 121306 142017 35407 96724 149783 89876 31270 116250 86922 23003 86838
1553 86838 113152 26286 -11374 -67468 -49464 36417 68601 11733 80180 214695 162116 277183
1541 277183 85854 121844 50532 -85805 -34409 -55894 -10492 17684 15014 -24260 -32220 69351
1529 69351 217173 318073 399172 219107 333200 304999 95647 113779 156050 11315 26926
1518 26926 192467 81551 -63071 -64480 122723 153490 181646 131915 102440 56369 30535
1507 30535 -99001 39180 82482 61632 50286 105235 38975 -117899 -35016 83239 61910
1496 61910 -27110 144777 37264 -133050 -129744 71305 50267 -645 -457 -50417 -38815 -91210
1484 -91210 -65347 -103576 -48581 40490 -39087 27123 72071 173435 232254 276780 125215
1473 125215 13824 -13734 -39591 83453 45204 -45505 -106268 -102755 -75577 49760 31970
1462 31970 -87460 -19788 -50169 -2594 57130 24659 -131488 -33423 104633 223240 167898
1451 167898 132967 223935 97247 17885 12353 6602 3684 186974 132684 91704 26225 10902
1439 10902 -46627 -177949 62413 -63698 -214693 23335 58961 -5933 85958 175130 151360
1428 151360 85009 -2443 61117 80166 -124817 -102866 -109651 66564 190499 84192 193930
1417 193930 269998 192152 277093 209914 156842 198280 93663 60479 54537 23891 -71527 -94804
1405 -94804 -69833 91533 55173 -150046 -133750 29794 203854 31626 89378 66590 21373
1394 21373 76955 51079 196536 -27598 -45613 71556 171767 136996 98890 15276 66718
1383 66718 24409 -48939 -19860 125619 104704 -297 -88621 -73679 -44271 63610 -62047
1372 -62047 -181730 -82959 -150013 -74155 68482 228736 147888 29544 -11057 -40648 6710
1361 6710 -14843 -74876 115632 214250 232121 119874 170539 80980 43947 84572 106665 40158
1349 40158 68307 38398 15591 -67249 -111402 41145 72452 61313 146987 -34073 2675
1338 2675 -23060 -23557 227247 184955 138018 247214 261212 30702 17622 17806 19911 -18984
1326 -18984 93585 85096 75364 32777 -33959 -8409 -41788 -38747 67261 68654 12496 -111792
1314 -111792 -101611 -50062 -29530 27089 114284 490 -75248 -3585 197165 140320 57401
1303 57401 -79235 40944 116204 75214 144022 95004 150740 103717 38198 117764 105815
1292 105815 156447 6215 30602 80085 15037 22929 69203 -85891 -250019 -85324 20558
1281 20558 186414 76533 83847 -16853 -3268 115870 -27774 -103087 47391 -24356 -40439
1270 -40439 123387 291111 185320 244026 233799 39102 7808 63108 132140 176742 80854
1259 80854 -31994 45801 65659 78841 189090 33711 -3891 24262 21412 58745 36606
1248 36606 -15839 -74806 -32579 -33841 -55792 -75358 -113833 -155885 -105573 -872 -32534 -44211
1236 -44211 -12073 99650 -8258 -23537 6058 -72111 -56484 -62627 17733 229255 271204
1225 271204 59598 -12327 15567 -58856 40208 -91683 -99913 -81359 -138611 -149033 -162857
1214 -162857 86439 69173 84935 -81953 88804 -50564 -61679 -63784 -59068 112585 131141
1203 131141 113597 -10028 -31223 -156831 -280218 -175760 -61098 -50721 94947 25496
1193 25496 28050 -18635 154124 56740 -43122 4616 9575 194936 144608 151323 32350 -54284
1181 -54284 -139277 -88864 4131 93202 17973 -55609 -80352 40970 168660 159929 132148 108865
1169 108865 172060 107072 -32594 -40456 98196 10468 -89443 -17403 17244 -35480 -24229
1158 -24229 -145447 72996 184548 -11712 82907 120388 -70633 43298 -32633 -71390 25027
1147 25027 95466 61678 -67319 14568 85569 109672 54058 -81741 30176 84977 -72719
1136 -72719 -65479 24548 54719 228517 191401 -92409 -40544 44704 9742 -65609 32465 -5151
1124 -5151 -29365 51690 82329 42213 -38194 -41056 75665 -92667 -104661 -37639 -14879 -183884
1112 -183884 -239624 -216816 -235945 -270864 -114673 3707 -85341 -141041 -67900 31252 5189
1101 5189 12325 -37880 -20916 -6917 84033 41654 -150466 -110335 -95042 -156590 -92468 -113453
1089 -113453 -84476 -63450 -65402 -30601 -61285 -19540 47862 -47183 36480 -39590 -32964 51096
1077 51096 52408 206208 220567 23342 100786 124322 204088 37538 -5118 89401 18558
1066 18558 62964 -169565 -91159 -151790 -91004 57054 48995 -38027 -129910 -83904 -47895 6661
1054 6661 95061 53230 -42224 31470 55947 -53256 -177812 -130533 -97085 -60347 26436 158971
1042 158971 115756 42361 46920 -13906 81297 148066 40719 86455 67881 94737 142102 217152
1030 217152 196831 64434 -5803 93837 135454 153725 110748 126302 189843 125787 71272
1019 71272 18819 87102 100135 -98665 27131 124629 92792 80411 39345 -42288 22291
1008 22291 160245 174503 105268 28723 67840 -112878 -69044 -82212 -51813 -190230 -84100
997 -84100 -9069 33765 -43363 -40483 98083 20028 19968 -22661 -110294 -105194 -156296 -132332 -98588
984 -98588 -55921 -48353 -26890 -143075 -105669 -38504 207207 71851 36326 36770 32972 178130
972 178130 6127 26624 53843 146 -24955 157276 -102744 -148185 -289921 -227795 -140865
961 -140865 -5026 102588 -6838 -182962 -129574 -2082 -22393 49230 95608 57557 -36315
950 -36315 22882 124770 151448 111550 15026 101001 58292 -39390 -160046 -87480 -96883 -80721
938 -80721 -23252 63250 23848 -76098 -136361 29150 5998 -168838 -77617 -22836 -15523 45011
926 45011 197504 78404 -12219 -115133 9183 62159 -179620 -177478 -139220 -53516 15207
915 15207 -30343 -9241 -83866 -159390 -225820 -116600 -98692 -62048 -35200 18265 -19863 -13925
903 -13925 73977 86064 -52141 -108077 -199105 -137339 -41557 -104918 -198350 -211862 -163941 -132182
891 -132182 -121019 -84511 -94775 -39656 -52434 -73417 -37344 -27937 -72546 48914 145277 147021
879 147021 89796 -12020 165874 130121 -5803 -54753 153987 98363 -7383 -55206 -206392
868 -206392 -147938 -4543 -46570 -25043 -102814 -130336 48632 81948 59660 -11217 4402
857 4402 22771 -97334 -183602 -39164 22451 166477 194746 -71399 -178490 -113724 -160517
846 -160517 -93020 115465 70063 -142548 -209722 -133644 -113640 -180425 -228710 -200932 -186778
835 -186778 -220550 -16993 -83811 -141160 -166570 -106573 142344 9515 7985 73359 89802
824 89802 -10288 -190725 -19329 1586 72370 115698 2600 -47707 -62460 39364 40966
813 40966 99900 173692 70094 58207 -47773 83173 147959 -4258 61845 28085 56869
802 56869 188260 237823 -37433 -31905 -35616 -37473 -48082 -178394 -100447 -22974 -97148 -101255
790 -101255 -129771 -104580 -55823 -11776 24196 -78884 -120987 142573 -39423 -132185 47793
779 47793 10777 13221 -10645 -119044 -50180 -29720 -111164 -188738 -18561 -34035 -65608 66546
767 66546 -50842 -70882 -91309 -139864 65542 226131 60304 -94346 -138233 -68388 36335
756 36335 -36326 67447 126712 81982 164201 145685 -16471 -185275 -254804 -157383 -54665
745 -54665 -37165 200554 39246 -94104 -56196 -93311 -18784 -102825 -213019 -258884 -227985
734 -227985 -120356 -89798 -27476 53495 69524 -16257 -61523 -112370 -192627 -133102 27273
723 27273 -18740 -101371 -64215 50586 -92047 -183308 -83424 -116624 -219132 -45402 -16112
712 -16112 -84725 -39078 10820 200943 217218 110415 128676 261488 116364 36685 105625
701 105625 35280 1890 36273 15923 -110986 301 -28323 70150 -5366 5422 -166717
690 -166717 -198203 -177839 3377 2684 -143394 -137857 -147811 -48892 -50880 112639 129557 32645
678 32645 9731 -141763 -241061 -76465 -27365 -68240 -129537 -100192 -97900 -148494 -80743 -34694
666 -34694 -109396 -187081 -156687 103919 9446 -14001 -78770 32376 117362 -9917 -82103
655 -82103 -131966 -152875 -227265 -149014 -125739 -63700 53541 -176371 -96174 -111911 -162299 -74931
643 -74931 -85782 -154034 126359 94295 159419 207441 94334 161126 123423 20700 -25243
632 -25243 97149 103888 90975 -15221 -2524 15103 -103425 -206935 -129708 -132384 -59223 -28947
620 -28947 -54417 10167 -38479 71714 98888 -41430 11314 22047 -15532 104551 68183
609 68183 -8421 139232 78948 -157199 -128788 -76556 69718 -68330 -168314 -91563 -194787
598 -194787 -198271 -132852 -95725 -157520 -113155 -100173 85 -107402 -57965 -17771 54809 -1511
586 -1511 -40540 -44445 62347 49431 -82049 -69833 -76066 -105264 -126229 -80025 -142693 -15529
574 -15529 -102391 27660 29411 -141615 -24893 23175 54831 -44851 -8382 -6810 -48065 64286
562 64286 -58146 -145987 -155664 -123577 -65036 -78824 -48017 30188 -10353 -948 43842 117576
550 117576 108794 -20046 -191678 -199504 -197514 -176118 -75410 -108407 -6597 -20763 -79839 50213
538 50213 -7053 -110794 -145683 -286255 -149833 -284060 -120776 7042 -16650 -23609 -94512
527 -94512 -52376 -56669 -199195 -143277 -227704 -218264 -245854 -254582 -89827 7707 47633 66977
515 66977 -33233 -14691 -22478 143582 78921 65973 54742 -81093 -48716 -77001 -57398 27200
503 27200 25989 34564 -80512 -257778 -236215 -210138 -206465 -167225 84141 165690 69386 -185233
491 -185233 -70454 -95446 15714 -39535 -113319 -114084 98220 139541 146870 -1102 7852 -97684
479 -97684 -48918 19981 115617 79196 37446 233357 198131 16445 22949 -31884 -150755 -47693
467 -47693 206824 40755 -21707 -67980 -131175 -95298 -154135 -194503 -186619 -102068 -91665 -139340
455 -139340 -162955 51979 51255 76214 61529 79920 147533 29067 -4746 -86991 -83587 -127498
443 -127498 -98596 -70499 -161645 -97586 -54458 -112178 -206394 -199279 -142954 -84760 13567 -119127
431 -119127 -113836 -29904 -90726 25013 -94382 -49612 -91072 63945 -146397 -225442 -299036
420 -299036 -222155 -259010 -350702 -286709 -164587 -19788 -37499 -125113 -111678 -80420 -71149 -81113
408 -81113 -218533 -187261 -15326 -85209 -129771 -179213 -205450 -34387 30760 -40850 -48346 -131543
396 -131543 -27824 110154 53484 -43668 46648 85956 -74172 -126765 -108353 -106845 -50575
385 -50575 36309 -106509 -58631 118774 -44276 -124743 -109712 -79842 -107351 -100159 -84650 -108763
373 -108763 -168273 -155448 16724 -202084 -260340 -127719 -105288 -121271 -267948 -238040 -98328
362 -98328 -21381 -57465 -123206 -159788 -170351 -35184 -29921 -52244 -136042 -72588 26191 -34398
350 -34398 -12134 105657 50076 108268 -10049 -132692 -99426 -64098 -58161 -11536 75100 -25595
338 -25595 -132859 -82503 -72511 -43397 -18615 -64245 -72768 -142131 -172726 -42293 -113181 -305480
326 -305480 -220828 -170674 -66763 -34390 -138923 -96111 -51061 -174217 -160735 -80229 -41070
315 -41070 -61318 -139409 -31431 -7455 -67508 -117449 75593 -48104 -154949 -197119 -141705
304 -141705 -93384 -99034 -207045 -300093 -236158 -85919 93856 74643 -97161 -153573 -125115
293 -125115 14941 -30481 -30436 52183 70941 29096 -193770 -198043 -4126 -4857 -212112 -184875
281 -184875 -93147 -78848 47072 -15239 -37028 109434 -120619 -149730 -95004 -30797 -96876
270 -96876 22925 -100101 -257161 -134793 -64592 -85964 -151847 -113600 -234345 -299576 -95030
259 -95030 28964 -203893 -199803 -111141 -88434 -164427 -118315 -172738 -231480 -20678 -98468 -161957
247 -161957 -150426 -99606 -32272 -68641 -65779 -9732 -81766 -39635 -85295 -157628 -150707 -127170
235 -127170 -184649 4637 38958 -37630 -70667 -159000 -241646 -189054 -21338 -131380 -152568
224 -152568 -152998 -163430 -166258 -144404 -105561 15659 -93440 -69804 53909 -38673 41390 11171
212 11171 -114697 -146625 -83390 -148648 -160364 -249251 -248170 -184969 -165943 -153232 -136122 -153287
200 -153287 -131096 -121698 -183028 -123654 -15434 -30492 -108064 -125018 -86740 -72492 -119141 -61364
188 -61364 -78649 -44166 9303 21681 -48341 -58438 46778 -54465 -154032 -257040 -179478
177 -179478 -77322 -334803 -219791 -1526 -104754 -164442 -137954 -34357 -82824 -100383 -14768
166 -14768 31494 75389 -29096 -104901 -194902 -69785 74904 -73321 -185271 -46826 21722
155 21722 -73174 -287656 -232494 -61022 -199411 -136666 -150674 -157033 -74272 -74927 -18572 42310
143 42310 -27447 28488 23264 -99572 -30211 -37225 -198173 -125272 -54075 -123452 -53669 -96991
131 -96991 -174614 -189277 -176740 -101312 -127797 -71406 21103 -34504 -156369 -207055 -173946 -148094
119 -148094 11905 -76803 -188673 -196487 -144261 -226817 -180412 -117508 -162612 -134621 -118978 -107211
107 -107211 -149456 -151268 -77703 -160530 -111946 -64988 -104534 -97511 -25228 -91064 -39683 -50797
95 -50797 -212600 -264979 -189702 -166045 -149362 -240925 -248237 -197471 -132286 -76344 -126442 -129071
83 -129071 -225042 -77784 -38252 -68145 -81350 -188711 -195742 -136357 -219738 -131411 -122937 -181101
71 -181101 -134953 -18020 -120037 -200763 -90733 4110 -152075 -302980 -209836 -34761 -38145
60 -38145 -113917 -212287 -179671 -110670 -74203 -57946 -133258 -94759 -111615 -112868 -68491 -4395
48 -4395 -27274 -99722 -72077 -95605 -107502 -63851 -52416 -25368 -50664 -105983 -19490 -81534
36 -81534 -140965 -90246 -88414 -113171 -195818 -140064 -83123 -214683 -211696 -150775 -261836 -134787
24 -134787 -119750 -132990 -124294 -228420 -192781 -89120 -137323 -170823 -137368 -81616 -53194 -163664
12 -163664 -130810 -57326 -55586 -192130 -158328 -237494 -254966 -134646 -123243 -56472 -36718 -65102
0 -65102
$$ Imaginary data points
##PAGE= N=2
##DATA TABLE= (X++(I..I)), XYDATA
16383 -3691128 -3575540 -3634509 -3491156 -3388725 -3396226 -3403214 -3348642 -3277187 -3281847 -3380204 -3302615
16372 -3302615 -3064255 -3052963 -3054471 -2981639 -2959437 -2888214 -2788888 -2850877 -2764588 -2700183 -2665505
16361 -2665505 -2609507 -2512262 -2435722 -2440316 -2522346 -2406743 -2333735 -2217186 -2152788 -2158634 -2122624
16350 -2122624 -2111437 -2107165 -2012549 -1911628 -1857074 -1862413 -1822050 -1823743 -1798369 -1688308 -1636987
16339 -1636987 -1693630 -1603863 -1484300 -1438215 -1285775 -1299574 -1403642 -1249459 -1245407 -1279187 -1241392
16328 -1241392 -1282190 -1172327 -986984 -1022533 -1055394 -1024472 -969277 -896564 -775410 -682998 -706310
16317 -706310 -699092 -672606 -645644 -606798 -549729 -494327 -469578 -563858 -472083 -244591 -196015
16306 -196015 -240487 -90066 -96954 -47774 37174 18808 -120215 -31354 50117 131774 114253
16295 114253 85423 140848 346873 371490 378643 386298 348281 322489 419329 505472 493662 514704
16283 514704 528325 607680 595574 615199 756832 679022 732675 861419 824181 791421 856387
16272 856387 922494 1106780 1008106 867646 1046203 1061434 1009729 1051257 1079394 1165270 1219671
16261 1219671 1297964 1309702 1239533 1285524 1422268 1486595 1476658 1523166 1572091 1581677 1563451
16250 1563451 1620941 1606657 1590373 1536453 1675342 1691145 1788018 1732947 1626960 1768183 1791937
16239 1791937 1810198 1957078 1972167 1959303 1990360 2017252 1949079 1981780 2049640 1988072 2087451
16228 2087451 2159657 2242460 2297273 2280054 2160000 2222518 2413754 2377994 2244013 2252610 2438594
16217 2438594 2285377 2219193 2149877 2244311 2476575 2544334 2463510 2484286 2656987 2707259 2563365
16206 2563365 2566669 2663567 2606837 2469853 2608783 2636236 2733771 2714629 2699226 2795315 2633718
16195 2633718 2669624 2761284 2868661 2824227 2830478 2819334 2833027 2913458 2936289 3023683 2981783
16184 2981783 3108514 3137789 3040096 3054473 3111032 3035958 2970299 2875015 3051319 3145849 3090745
16173 3090745 3134907 3093471 3028821 2994760 3122034 3124997 3073393 2967674 2969520 2992824 2902045
16162 2902045 2901958 3025554 2991703 3044787 3049575 3083118 3182266 3186776 3219017 3107131 3079934 3200496
16150 3200496 3275210 3336680 3162818 3099541 3297583 3412248 3405990 3473116 3577719 3500767 3425664
16139 3425664 3346280 3313429 3397192 3348201 3360474 3366177 3494693 3546494 3501573 3553152 3516921
16128 3516921 3375904 3300691 3340747 3373166 3482404 3584741 3551333 3518527 3603998 3609929 3493347
16117 3493347 3678185 3495205 3527125 3592909 3693931 3671605 3632627 3665699 3481953 3392595
16107 3392595 3398239 3495612 3698995 3688981 3694899 3653159 3483784 3572817 3526846 3508965 3714674
16096 3714674 3689843 3521281 3518139 3578273 3620297 3686854 3676082 3627939 3640324 3575761 3587723
16085 3587723 3741421 3854556 3791077 3667073 3658481 3577530 3568575 3691280 3572224 3596648 3600045
16074 3600045 3636804 3730242 3793086 3718878 3542163 3478770 3506227 3477958 3400628 3448511 3556583
16063 3556583 3721796 3748533 3621481 3783023 3785213 3626754 3515744 3659478 3528408 3577643
16053 3577643 3753748 3755954 3687367 3630488 3757785 3612034 3641721 3742242 3807658 3871771 3784615
16042 3784615 3840929 3678076 3654250 3641394 3727066 3854407 3694195 3699669 3691249 3561109 3379059
16031 3379059 3455252 3557247 3435996 3593080 3616528 3597513 3632462 3605790 3670315 3655108 3608989
16020 3608989 3667300 3841265 3833359 3797314 3774262 3787752 3756585 3725039 3717066 3709331 3873887
16009 3873887 3886418 3813851 3875117 3887391 3781405 3827307 3643985 3647512 3801630 3843926 3804520
15998 3804520 3741251 3654060 3667409 3766526 3654700 3760136 3628615 3671988 3774067 3749499
15988 3749499 3727039 3728840 3822820 3760724 3779112 3767403 3719495 3611284 3621744 3652132 3581531
15977 3581531 3722841 3690827 3558051 3437059 3451370 3585043 3719605 3696358 3777087 3838464
15967 3838464 3663091 3519840 3682961 3769625 3773637 3862599 3865385 3934577 3945756 3856839 3684357
15956 3684357 3642821 3665828 3660251 3795791 3749925 3712009 3625592 3638597 3630472 3627973 3612170 3625734
15944 3625734 3665959 3669496 3738050 3820115 3972629 3807186 3716708 3757417 3734620 3664431 3817767
15933 3817767 3793772 3784011 3851099 3838881 3913332 3807493 3684683 3703530 3803348 3916468 3807496
15922 3807496 3780047 3814465 3826959 3782928 3669427 3750007 3782988 3761525 3890584 3736660 3681606
15911 3681606 3794541 3723095 3700045 3679747 3780274 3554970 3574830 3870303 3789839 3721038
15901 3721038 3773680 3838387 3761455 3801323 3787318 3814244 3883720 3789220 3705400 3565912 3635967
15890 3635967 3637199 3755352 3850512 3867414 3796403 3757615 3786420 3884056 3687536 3654085 3587304
15879 3587304 3554337 3817325 3835951 3754074 3823020 3775279 3672413 3652107 3798502 3833866 3668361
15868 3668361 3640507 3580467 3517641 3578801 3591101 3811071 3746554 3686883 3937012 3869718 3804307
15857 3804307 3787238 3761249 3718626 3626705 3585764 3719089 3702153 3750343 3662366 3712611 3913984
15846 3913984 3832729 3719441 3852194 3684869 3548816 3615064 3817804 3666916 3730154 3813660
15836 3813660 3809495 3932183 4024655 3830354 3818865 3863553 3855618 3694182 3621704 3656077 3722804
15825 3722804 3769023 3834603 3879164 3715347 3741213 3768817 3902125 3914760 3785518 3782233 3753649
15814 3753649 3733531 3809288 3764835 3891699 3821596 3669842 3785033 3855085 3907163 3865666 3802969
15803 3802969 3792299 3749788 3751969 3659033 3793645 3891157 3887368 3948809 3821702 3815018 3762230
15792 3762230 3729177 3738599 3777238 3733702 3663800 3833885 3749923 3880635 3952911 3997380 3939889
15781 3939889 3948934 3762066 3752520 3844755 3816995 3860194 3840338 3878520 3922110 3811020 3684167
15770 3684167 3812713 3851109 3821127 3860189 3761302 3763220 3667495 3840721 3845514 3689134 3701732
15759 3701732 3685409 3621584 3663005 3717244 3730303 3620755 3741045 3913649 3843819 3720034
15749 3720034 3709819 3788909 3925636 3958623 3737488 3645917 3697432 3958171 3880493 3846900 3984715
15738 3984715 3970276 3928906 3898929 3668214 3645278 3662676 3620668 3679623 3763784 3854376 3788848
15727 3788848 3701741 3688598 3693691 3654060 3695026 3861699 3763467 3850771 3799813 3813105 3877845
15716 3877845 3836074 3761434 3819150 3858632 3829013 3689072 3828711 3803578 3765015 3751314 3756031
15705 3756031 3976011 3809276 3765779 3805867 3945220 3750413 3744398 3801826 3866194 3878160 3860630
15694 3860630 3902956 3813701 3830410 3851507 3887024 3900821 3855009 3840333 3860517 3746943 3895255
15683 3895255 4026929 4086084 3889539 3867875 3916672 3848264 3833934 3927205 3857722 3769853 3824108
15672 3824108 3912510 3854444 3885902 3858183 3926050 3905217 3871477 3910337 3684288 3765364 3908414
15661 3908414 3990678 4015275 3907289 3761697 3754841 3761113 3784032 3749591 3756063 3764577 3841206 3851308
15649 3851308 3829783 3804759 3786547 3777317 3878902 3947885 4007404 3857644 3770910 3934690 3810849
15638 3810849 3691565 3955843 4062425 3978173 3947331 3964706 4018323 3950426 3937144 3984997 3923033
15627 3923033 3969332 3925187 3937383 3936747 3898179 3813683 3794972 3818721 3897371 3883335 3930337 3868979
15615 3868979 3893732 3892745 3883358 3862311 3850721 3828986 3791862 3995853 3909160 3821262 3926020
15604 3926020 3932188 3895122 3886248 3767506 3657249 3790928 3736660 3839625 3808043 3791342 3852592
15593 3852592 3734270 3871021 4017590 4056807 4024142 3937545 3820037 3776492 3894510 3935772
15583 3935772 3937384 3847491 3843649 3850132 3854459 3829824 3784207 3908531 3911431 4005101 3946601 3881863
15571 3881863 3964892 3922847 3844373 3917378 4054702 4036619 4008421 3958062 3858201 3913478 3805902
15560 3805902 3887777 3825506 3688012 3599052 3768166 3886462 3746267 3812937 3918362 3813398
15550 3813398 3804311 3963842 3887504 3933298 3997094 3966896 4080018 4001005 3937510 3958205 3900578
15539 3900578 3787694 3872873 3806112 3854286 3842760 3714274 3630182 3837075 4004204 3928974
15529 3928974 3749703 3828607 3983070 3906574 3995860 3993270 3763379 3875121 3919582 3886179 3969131
15518 3969131 3991511 3941652 4121027 4116340 3948404 3832684 3846011 3796928 3844405 3927603 3847089
15507 3847089 3890232 3939005 3953334 3739586 3686737 3843062 3942604 3866896 3804065 3842945 3878388
15496 3878388 3968011 4134300 3967349 4026194 4025075 3935776 3843112 3821743 3918740 3855290 3803855
15485 3803855 3813327 3833134 3881785 3967942 3932478 3895596 3885515 3926857 3850958 3632507 3752202
15474 3752202 3812041 3716714 3783123 3898649 3949247 3900612 3761270 3765637 3813137 3809334 3746888
15463 3746888 3900365 3887043 3777407 3819939 3890643 3770805 3855953 3859845 3943229 3826278 3763623
15452 3763623 3897886 4033927 3898906 3716494 3967381 3993658 3853533 3822660 3723986 3723622
15442 3723622 3939163 4004459 3990910 3891855 3946859 3862888 3832777 3985926 3955460 3966564 4089791
15431 4089791 4187946 4128764 4067996 4001309 4044627 4009772 3915718 3907136 3844867 3744260 3775205
15420 3775205 3838249 3813542 3915149 3901181 3958007 3878167 3857598 3931899 3942130 3835071 3998985
15409 3998985 4062940 3986823 4030890 3809565 3948109 3912014 3809749 3838484 3840450 3787310 3836388
15398 3836388 3927931 4081455 4074757 3894357 4031496 3895240 3956987 3945177 3920445 4032102
15388 4032102 3984679 4005755 3982444 3929126 3941015 3953518 3895282 3882256 3917367 3977658 3850687
15377 3850687 3890443 4056080 4058884 4007957 4016823 3976736 4001891 3972409 3929261 4049360 4042526
15366 4042526 4168260 4149521 4014867 3976331 3892537 3901804 3810754 3717818 3827338 3830275 3886405
15355 3886405 3883744 3952356 3938166 3936771 3983226 3802662 3716784 3745059 3883053 4127134 4055035
15344 4055035 3959001 3961162 3976927 4034730 3937346 3879410 3918156 3871669 3974168 3926025 4067640
15333 4067640 4171800 4027757 3876865 3934136 3992174 4189359 4176355 4120833 4121482 4069610 4093647
15322 4093647 3958062 3914000 3977511 3957777 3916200 4032693 3959403 3918083 4005221 4109729 4038522
15311 4038522 3980143 3935965 3976007 3961338 3812039 3891242 4094823 3969784 4048016 4041035 4018472
15300 4018472 3889268 3919466 3923583 4040631 4003874 4004549 3893755 3987258 4235489 4065437 4033018
15289 4033018 4044866 4039262 3954023 3907653 3924791 4081921 4018306 3929283 3956099 3901095 3763919
15278 3763919 3928555 3911287 3929698 3954419 4002807 4065604 4092995 4060919 4012714 3934157 4002903
15267 4002903 4002561 3963986 3975149 3917880 3987841 4009569 4018929 4158110 4057496 3955190 3866510
15256 3866510 3912640 3988374 4075696 4158979 3987801 4112598 4042144 3899538 3959869 4027235 3855921
15245 3855921 3975265 4038292 4044120 4077848 3973424 4163522 4078805 4011815 3870654 3954901 4066137
15234 4066137 3946380 3934075 4016121 4021676 3882655 3896404 3992839 3919992 3727066 3784979 3851022
15223 3851022 3888052 3900515 3965521 4015860 3912988 4020930 4027202 3880582 3770714 3908490
15213 3908490 4083780 4023151 4019846 3961820 3910420 3970269 3902727 3893890 3877593 3839778 3862633
15202 3862633 3946313 3953465 3807502 4118935 4002860 3917856 3883721 3793918 3801147 3741990 3982780
15191 3982780 4055328 4004259 3943490 3795829 3864422 3830121 3884955 3983398 3948473 3930782 3887444
15180 3887444 4032534 4326681 4118775 3955230 3960421 3919652 3926693 4028884 3974712 4053653 3920211
15169 3920211 3996547 3951142 3881555 3965385 4077708 4159810 4146018 4050052 3988050 3840706 3834810
15158 3834810 4066793 3961418 3888216 3829270 3865729 3923493 4092935 3929673 4100378 3977425
15148 3977425 3893123 3969284 4014016 3946955 3894521 3940853 4033845 4087203 4051047 4192493 4211772
15137 4211772 3989090 4006041 3924181 3931450 3918764 3925718 4000905 4056244 4218503 4079199 4023213
15126 4023213 4093514 4144169 4060709 4107960 4045837 4028739 3861416 3803020 3884501 3924800 4023871
15115 4023871 3961536 3900817 4033148 4098198 4120049 4028149 4137341 4216740 4117711 4039368 4034585
15104 4034585 4006612 4072445 4141628 3836282 3807434 3856631 4002926 4180354 4136209 3972792
15094 3972792 4049669 4096359 4252932 4182810 4024411 3917613 4082457 4017367 4080169 4185832
15084 4185832 4120514 4058112 4074136 3975050 3982693 4109432 4068918 3997689 3968226 3861077 3902857
15073 3902857 4026932 4027774 4021914 3994848 3952448 4030539 3945823 3903750 3941549 3911573 3973047 3908892
15061 3908892 4074917 4019252 3843672 3929877 4037202 4060471 4063798 4062799 4072002 4136051 4211346
15050 4211346 4232028 4150299 4100506 4110891 4076448 3994936 4221877 4223910 3998051 4061935 3909366
15039 3909366 3921074 4057376 4202897 4151820 4160464 4141056 4139924 4022749 4097444 4226930 4362529
15028 4362529 4315091 4270239 4212001 4145660 4160718 4155008 4075048 4068267 4056157 4014757 4138064
15017 4138064 4073136 3948687 4052229 3986678 3951756 3908877 4045807 4094172 3996946 3950039 3954062
15006 3954062 3989063 4020613 4044629 4097798 4120465 3994254 4118790 4174837 4250698 4250493 4280381
14995 4280381 4192642 4012467 4146769 4111371 4006681 4115476 4147621 4172460 4163389 4105309 4177176
14984 4177176 4248534 3965189 4033764 3824263 3706129 4033537 4040091 4145104 4208176 4075448
14974 4075448 3902928 4018532 4173934 4173535 4042467 4014496 4048228 4024394 4013626 4009095 4128184
14963 4128184 4178341 4038519 4207053 4178411 4149711 4098639 4079821 4097749 4053291 4102434 4136805
14952 4136805 4284526 4045921 3997303 4122344 4072892 4012646 4043742 4109905 4055294 4150333 4168939
14941 4168939 4038964 3968202 3970663 4002203 4014285 4047478 3992733 4031686 4089514 4077344 4208788
14930 4208788 4352005 4251793 4089501 4049343 4035563 4106263 3973318 3821346 3917402 3887480
14920 3887480 3966240 4153901 4189490 4172510 4073057 4029486 4138932 4074172 4156521 4164347 4111513
14909 4111513 4065899 4253207 4224188 4105804 4141128 4058432 4142127 4016049 3976525 4096922
14899 4096922 4126063 4170278 4064654 4159930 4172951 4158976 4320945 4412418 4330705 4233460 4362772
14888 4362772 4137905 4157791 4252328 4151930 4151541 4033036 4063142 4199338 4175881 4063028 4087364
14877 4087364 4038223 4038535 3959046 3916058 3934354 3882087 4054080 4126775 4079676 4105370 4141891
14866 4141891 4129814 4126312 4040722 3985720 3926924 4072950 4176040 4046986 4117828 4185510 4142364
14855 4142364 4167360 4284745 4178398 4159239 4064658 4126879 4026426 4093330 4106768 3968157
14845 3968157 4047600 4131746 4167048 4203535 4268585 4155155 4139523 4139989 4159807 4141452 4090325
14834 4090325 4190201 4187500 4167275 4078251 4029027 3872338 3981745 4008231 4092840 4195895 4091319
14823 4091319 4088588 3991774 4060440 4237337 4239210 4102905 4239058 4183509 4148927 4082370 4175259
14812 4175259 4186599 4307034 4257790 4225805 4202921 4119255 4144984 4023960 4077559 3981944 4127304
14801 4127304 4363034 4094639 4067445 4122331 3925216 4050807 4072065 4054887 4060335 4045177 4060038
14790 4060038 4209173 4254785 4312423 4298110 4185750 4265099 4043788 4168126 4307918 4252921
14780 4252921 4087510 4142795 4216875 4104511 4027625 4082424 4093602 4122031 3988090 4079449 4115219
14769 4115219 4167678 4225537 4019868 3985521 4037366 4177730 4203677 4050989 4129206 4126515 4059951
14758 4059951 4027595 3963598 4073980 4103466 4106419 4211693 4053177 4076478 3992802 4025448 4192281
14747 4192281 4272628 4294118 4270869 4262880 4287064 4257133 4329053 4340369 4274081 4352659 4165230
14736 4165230 4320267 4156716 4246925 4263580 4138745 4071488 4093287 4138738 4130202 4269447 4169399
14725 4169399 4015422 4101087 4153732 4224352 4231421 4200637 4262046 4343633 4297811 4209093 4200740
14714 4200740 4316703 4254633 4097781 4164158 4160499 4252642 4176437 4179908 4211127 3980531 4019783
14703 4019783 4037957 4096175 4091112 4168194 4246201 4047617 4057904 4099534 4104727 4208996 4328547
14692 4328547 4314899 4253238 4242299 4191187 4157598 4057002 4011797 4131078 4139544 4158653 4192001
14681 4192001 4239728 4238336 4251348 4218976 4193980 4131694 4118312 4222617 4161197 4141033 4222733
14670 4222733 4180162 4246843 4308430 4254954 4267245 4386829 4349953 4260341 4315372 4139269 4119062
14659 4119062 4136957 4200067 4162458 4206907 4231114 4358768 4266546 4202711 4123776 4146548 4150328
14648 4150328 4093453 4079195 4120079 4139988 4175318 4164775 4101579 4240452 4314036 4329094 4237803
14637 4237803 4343744 4283003 4308602 4185230 4081233 4069505 4080399 4140891 4157403 4188585 4154754
14626 4154754 4130254 4210131 4438033 4493686 4310555 4210816 4095139 4081474 4305578 4296429 4254393
14615 4254393 4299461 4315179 4396827 4235132 4150179 4203077 4133506 4075992 4301063 4351024 4328730
14604 4328730 4376340 4223156 4241635 4343532 4334347 4279459 4292518 4286965 4347665 4218377 4120999
14593 4120999 4070393 4075917 4234754 4210958 4098010 4073077 4180070 4166453 4162280 4102403 4206129
14582 4206129 4397040 4444976 4327286 4267232 4283022 4322852 4320073 4293242 4200377 4165266 4165852
14571 4165852 4204917 4225778 4323695 4354118 4309483 4303199 4154894 4172607 4254279 4267986 4250248
14560 4250248 4160790 4177570 4252980 4370511 4376842 4379619 4428661 4410435 4533146 4282945 4178730
$$ [...]
##END NTUPLES=NMR SPECTRUM
##END=
