##TITLE=1H_EC-3278
 CDCl3
 8 sc, 
 21.09.2022
##JCAMPDX= 6.0         $$ Bruker NMR JCAMP-DX V2.0
##DATA TYPE= NMR SPECTRUM
##DATA CLASS= NTUPLES
##ORIGIN= UXNMR, Bruker Analytische Messtechnik GmbH
##OWNER= root
$$ XWIN-NMR		Version 3.5
$$ Wed Sep 21 12:01:58 2022 Russian Standard Time (UT+4h)  she@DPX200
##.OBSERVE FREQUENCY= 200.1313499994
##.OBSERVE NUCLEUS= ^1H
##.ACQUISITION MODE= SIMULTANEOUS
##.ACQUISITION SCHEME= undefined
##.AVERAGES= 8
##.DIGITISER RES= 18
##SPECTROMETER/DATA SYSTEM= spect
##.PULSE SEQUENCE= zg30
##.SOLVENT NAME= CDCl3
##.SHIFT REFERENCE= (INTERNAL, CDCl3, 0, 15.7513)
##AUDIT TRAIL= $$ (NUMBER, WHEN, WHO, WHERE, WHAT)
$$ ##TITLE= Audit trail, XWIN-NMR		Version 3.5
$$ ##JCAMPDX= 5.01
$$ ##ORIGIN= Bruker BioSpin GmbH
$$ ##OWNER= she
$$ F:/spectra/data/she/nmr/H-F/1/pdata/1/auditp.txt
$$ ##AUDIT TRAIL=  $$ (NUMBER, WHEN, WHO, WHERE, WHAT)
(   1,<2022-09-21 12:00:09.03 +0400>,<she>,<DPX200>,
      <created by zg, POWCHK disabled, PULCHK disabled
       configuration hash MD5:
       00 E9 B6 7A A2 85 ED C7 34 08 36 98 17 FE 4E 26
       data hash MD5: 16K
       06 61 17 07 AB 04 87 82 FD 4D 4F AD 20 E0 6B 79>)
(   2,<2022-09-21 12:00:24.07 +0400>,<she>,<DPX200>,
      <Start of raw data processing
       efp BC_mod = 2 LB = 0.24 FT_mod = 6 PKNL = 1 PHC0 = -18034.74 PHC1 = 12.40069 SI = 16K 
       data hash MD5: 16K
       AF B7 11 07 3D 43 F5 F1 1D 81 01 A4 3A 6A F6 8D>)
(   3,<2022-09-21 12:00:46.29 +0400>,<she>,<DPX200>,
      <pk PHC0 = -0.1703234 PHC1 = 1.2 
       data hash MD5: 16K
       92 01 A9 03 C9 3A 4C 94 B1 7F 22 B8 8B B0 9F 11>)
(   4,<2022-09-21 12:00:50.04 +0400>,<she>,<DPX200>,
      <abs ABSG = 5 
       data hash MD5: 16K
       BA 6A 3D 95 77 F1 BD B1 25 FF 74 D5 A2 4D 1B 71>)
$$ ##END=
$$ 
$$ hash MD5
$$ 7E EE C7 FE 6C 4F D9 55 9A F3 8C AE 63 D7 69 EE
##$RELAX= 
##$RELAX= 
##$RELAX= 
##$RELAX= 
##$RELAX= 
##$RELAX= 
$$ Bruker specific parameters
$$ --------------------------
##$DU= <F:/spectra>
##$EXPNO= 1
##$NAME= <H-F>
##$PROCNO= 1
##$TYPE= <nmr>
##$USER= <she>
##$AMP= (0..31)
100 100 100 100 100 100 100 100 100 100 100 100 100 100 100 100 100 100 
100 100 100 100 100 100 100 100 100 100 100 100 100 100 
##$AQSEQ= 0
##$AQ_mod= 1
##$AUNM= <au_zg>
##$AUTOPOS= <>
##$BF1= 200.13
##$BF2= 200.13
##$BF3= 200.13
##$BF4= 200.13
##$BF5= 200.13
##$BF6= 200.13
##$BF7= 200.13
##$BF8= 200.13
##$BYTORDA= 1
##$CFDGTYP= 0
##$CFRGTYP= 5
##$CHEMSTR= <none>
##$CNST= (0..31)
1 1 145 1 1 1 1 1 1 1 1 1 1 1 1 1 1 1 1 1 1 1 1 1 1 1 1 1 1 1 1 1 
##$CPDPRG= <>
##$CPDPRG1= <>
##$CPDPRG2= <>
##$CPDPRG3= <>
##$CPDPRG4= <mlev>
##$CPDPRG5= <mlev>
##$CPDPRG6= <mlev>
##$CPDPRG7= <mlev>
##$CPDPRG8= <mlev>
##$CPDPRGB= <>
##$CPDPRGT= <>
##$D= (0..31)
0 1.2 0 0 0 0 0 0 0 0.06 0 0.03 0 0 0 0 0.0002 0 0 0 0 0 0 0 0 0 0 0 0 
0 0 0 
##$DATE= 1663747208
##$DBL= (0..7)
120 120 120 120 120 120 120 120 
##$DBP= (0..7)
150 150 150 150 150 150 150 150 
##$DBP07= 0
##$DBPNAM0= <>
##$DBPNAM1= <>
##$DBPNAM2= <>
##$DBPNAM3= <>
##$DBPNAM4= <>
$$ [...]
##$SUBNAM3= <"">
##$SUBNAM4= <"">
##$SUBNAM5= <"">
##$SUBNAM6= <"">
##$SUBNAM7= <"">
##$SUBNAM8= <"">
##$SUBNAM9= <"">
##$SW= 18.0517283424941
##$SWIBOX= (0..15)
0 0 2 0 0 0 0 0 0 0 0 0 0 0 0 0 
##$SW_h= 3612.71676300578
##$TD= 16384
##$TD0= 1
##$TE= 0
##$TE2= 300
##$TE3= 300
##$TEG= 300
##$TL= (0..7)
0 120 120 120 120 120 120 120 
##$TP= (0..7)
150 150 150 150 150 150 150 150 
##$TP07= 0
##$TPNAME0= <>
##$TPNAME1= <>
##$TPNAME2= <>
##$TPNAME3= <>
##$TPNAME4= <>
##$TPNAME5= <>
##$TPNAME6= <>
##$TPNAME7= <>
##$TPOAL= (0..7)
0.5 0.5 0.5 0.5 0.5 0.5 0.5 0.5 
##$TPOFFS= (0..7)
0 0 0 0 0 0 0 0 
##$TUNHIN= 0
##$TUNHOUT= 0
##$TUNXOUT= 0
##$USERA1= <user>
##$USERA2= <user>
##$USERA3= <user>
##$USERA4= <user>
##$USERA5= <user>
##$V9= 5
##$VALIST= <valist>
##$VCLIST= <CCCCCCCCCCCCCCC>
##$VD= 0
##$VDLIST= <DDDDDDDDDDDDDDD>
##$VPLIST= <PPPPPPPPPPPPPPP>
##$VTLIST= <TTTTTTTTTTTTTTT>
##$WBST= 1024
##$WBSW= 4
##$XGAIN= (0..3)
0 0 0 0 
##$XL= 0
##$YL= 0
##$YMAX_a= 662970
##$YMIN_a= -923967
##$ZGOPTNS= <>
##$ZL1= 120
##$ZL2= 120
##$ZL3= 120
##$ZL4= 120
##$ABSF1= 15.87911
##$ABSF2= -2.172741
##$ABSG= 5
##$ABSL= 3
##$ALPHA= 0
##$AQORDER= 0
##$ASSFAC= 0
##$ASSFACI= 0
##$ASSFACX= 0
##$ASSWID= 0
##$AUNMP= <proc_1d>
##$AZFE= 0.1
##$AZFW= 0.1
##$BCFW= 0
##$BC_mod= 2
##$BYTORDP= 0
##$COROFFS= 0
##$CY= -3
##$DATMOD= 1
##$DC= 0
##$DFILT= <>
##$DTYPP= 0
##$F1P= 0
##$F2P= 0
##$FCOR= 1
##$FTSIZE= 16384
##$FT_mod= 6
##$GAMMA= 0
##$GB= 0
##$INTBC= 1
##$INTSCL= 3.70164e-10
##$ISEN= 128
##$LB= 0.24
##$LEV0= 0
##$LPBIN= 0
##$MAXI= 10000
##$MC2= 0
##$MEAN= 0
##$ME_mod= 0
##$MI= 1.114404
##$NCOEF= 0
##$NC_proc= -6
##$NLEV= 6
##$NOISF1= 3.799351
##$NOISF2= 2.8
##$NSP= 0
##$NTH_PI= 0
##$NZP= 0
##$OFFSET= 15.7513
##$PC= 1
##$PHC0= -18034.91
##$PHC1= 13.60069
##$PH_mod= 1
##$PKNL= yes
##$PPARMOD= 0
##$PSCAL= 0
##$PSIGN= 0
##$REVERSE= no
##$SF= 200.130004051321
##$SI= 16384
##$SIGF1= 3
##$SIGF2= 2
##$SINO= 5.538805
##$SIOLD= 16384
##$SREGLST= <1H.CDCl3>
##$SSB= 0
##$STSI= 16384
##$STSR= 0
##$SW_p= 3612.71676300578
##$SYMM= 0
##$S_DEV= 0
##$TDeff= 16384
##$TDoff= 0
##$TI= <>
##$TILT= no
##$TM1= 0
##$TM2= 0
##$TOPLEV= 0
##$USERP1= <user>
##$USERP2= <user>
##$USERP3= <user>
##$USERP4= <user>
##$USERP5= <user>
##$WDW= 1
##$XDIM= 16384
##$YMAX_p= 442590057
##$YMIN_p= -769186
$$ End of Bruker specific parameters
$$ ---------------------------------
##NTUPLES= NMR SPECTRUM
##VAR_NAME=  FREQUENCY,     SPECTRUM/REAL,   SPECTRUM/IMAG
##SYMBOL=    X,             R,               I
##VAR_TYPE=  INDEPENDENT,   DEPENDENT,       DEPENDENT
##VAR_FORM=  AFFN,          ASDF,            ASDF
##VAR_DIM=   16384,         16384,           16384
##UNITS=     HZ,            ARBITRARY UNITS, ARBITRARY UNITS
##FACTOR=    0.220516191357247, 1,           1
##FIRST=     3152.30770441378, 0,            0
##LAST=      -460.409058592003, 0,           0
##MIN=       -460.409058592003, -769186,     0
##MAX=       3152.30770441378, 442590057,    0
$$ Real data points
##PAGE= N=1
##DATA TABLE= (X++(R..R)), XYDATA
$$ [...]
6313A255535p5183K98434R4456j09119R970j9581M546J7395j9972K19879j33334
6302A543026M151L724k5520L5509j17286Q1251r0787j84280m5003J0439R0675
6291A305899J4994o7891P5954r2902l9115J32959K50344j44421o7839k8928J54013
6280A493067Q377L1411J39584q4059L8381j0971J62133L7849j9018j15806j80558
6269A500390O6948p3475j08641n1203j57391L3555j54737q6005J0534N6883j13137
6258I23721m4225m502P6654l6071J78871L5496l087q0946o0334J16987o6134J27684
6246A164114l7088o1124J8815R8712J27043o0727m001j00821M4420J08385K0633
6235A318361K189k759j16160L0523R4908q7368m1238l8622J11895J24419p1029
$$ plain form
6313 1255535 1180352 1478786 1573242 1464123 1474093 1454512 1459058 1476453 1456481 1676360 1543026
6302 1543026 1547177 1550901 1525381 1560890 1443604 1524855 1434068 1249788 1204785 1215224 1305899
6291 1305899 1320893 1253002 1328956 1236054 1196939 1329898 1580242 1435821 1367982 1339054 1493067
6280 1493067 1501444 1532855 1672439 1588380 1626761 1615790 1777923 1815772 1796754 1680948 1500390
6269 1500390 1567338 1493863 1385222 1334019 1176628 1210183 1055446 969441 979975 1036858 923721
6258 923721 879496 874994 951648 915577 1094448 1129944 1126857 1045911 985577 1102564 1036430 1164114
6246 1164114 1127026 1065902 1084717 1183429 1310472 1249745 1245744 1144923 1189343 1297728 1318361
6235 1318361 1320550 1317791 1201631 1232154 1327062 1239694 1198456 1159834 1271729 1396148 1325119
6224A325119j13264J54523L66p5108j19337N6333N5379L7872L0543l7636K31330
6213A546120J19608K8243p4265q2760m6920N5304n0464r2533J10585K3004J4845
6202A550767K4743m4441J2004K09702o3117o1130o7194J11682l0633k0996L572
6191A624959L4218M8887j3805J48293j91773N0214o6498q5576J10712N2526J45178
6180A857335j0389J95969j17801P8468J58207O0177k6309J08643N2082Q7065n3922
6169B389525q6891o5205k5155N4555p5325M2177Q2439O240j55166m3130p3198
6158B050866j02984Q8300J38972k423J303j8132o9545K01632J17711J41492l4278
6147B512914L1146L44424R8865P9858P9919J5004J8664p7867k71691j10434m6199
$$ plain form
6224 1325119 1211855 1366378 1366744 1291636 1172299 1228632 1284011 1321883 1352426 1314790 1546120
6213 1546120 1665728 1693971 1619706 1536946 1490026 1545330 1494866 1402333 1512918 1535922 1550767
6202 1550767 1575510 1531069 1543073 1752775 1689658 1628528 1561334 1673016 1642383 1621387 1624959
6191 1624959 1659177 1708064 1694259 1842552 1650779 1700993 1634495 1548919 1659631 1712157 1857335
6180 1857335 1846946 2042915 1925114 2003582 2161789 2221966 2195657 2304300 2356382 2443447 2389525
6169 2389525 2302634 2237429 2212274 2266829 2191504 2233681 2316120 2322360 2167194 2124064 2050866
6158 2050866 1947882 2036182 2175154 2172731 2174034 2155902 2086357 2287989 2405700 2547192 2512914
6147 2512914 2544060 2888484 2987349 3067207 3147126 3162130 3180794 3102927 2831236 2720802 2674603
6136B674603j17545j11524j39226n1509M1271j11624l2972j01922m8727L5178
6126B036003o8493n5028l9523J29877Q4623o5641K37837j37821M328R6666K5247
6115B248075k8663R1199N6885n9821j26480q1605q2269j01853M743O5761k00518
6104A785454j68662P8935m1478J12709j32363j43599M5595j19334R5965q9803
6094A423419r5559K88870j5014j04019k20810J64800k2096j42874O0971k8471
6084A309217J4984l9909O5907j19149j73112j34115J75389Q9326j59553j10349
6074I18636n21m9678P5166R5636p3058n9801J4085j48064l1415J15981J48741
6063A005708q8161J11871j03273j21450R5858j59120k5039l258K45320L3824j48936
$$ plain form
6136 2674603 2557058 2445534 2306308 2254799 2296070 2184446 2151474 2049552 2000825 2036003
6126 2036003 1967510 1912482 1872959 2002836 2087459 2021818 2259655 2121834 2126162 2222828 2248075
6115 2248075 2219412 2310611 2367496 2307675 2181195 2099590 2017321 1915468 1920211 1985972 1785454
6104 1785454 1616792 1695727 1654249 1766958 1634595 1490996 1536591 1417257 1513222 1423419
6094 1423419 1327860 1616730 1601716 1497697 1276887 1441687 1419591 1276717 1337688 1309217
6084 1309217 1324201 1284292 1350199 1231050 1057938 923823 1099212 1188538 1028985 918636
6074 918636 918115 868437 943603 1039239 966181 906380 920465 772401 740986 856967 1005708
6063 1005708 917547 1029418 926145 804695 900553 741433 716394 713136 958456 992280 843344
6052H43344o2582K9323q8365j6284J46967j49539j6126l5849J16138N7457k82907
6041E41577n4539N6207P3085p1930N4177Q1596q3292N8604j0856j0093L4746J31069
6029H00351J25546r5781j1076o6399r192j59682N6747N9024q6913p7183R2709
6018F28151L9217q2503o5261J07824k9301K1875J35380P2305J22882j75573j27637
6007F47359m4347j12436M569J15751N3685K7950j25754k0387L9804n0534N366
5996E41026p2737P1857l7002m1131o6647J62178K40432j83802r2887j21138N0683
5985D50832P3316l9139K3068q4710N7926o7466R5623Q3005P043k7745q7694o9888
5973D14171N8322L7876k7527J19760Q4522r356j18666l4555Q1428j11610p2885
$$ plain form
6052 843344 780762 810085 721720 705436 852403 702864 686738 650889 767027 824484 541577
6041 541577 487038 543245 616330 544400 598577 680173 596881 655485 644629 634536 669282 800351
6029 800351 925897 830116 819040 752641 743449 583767 640514 699538 612625 535442 628151
6018 628151 667368 584865 519604 627428 598127 620002 755382 827687 950569 774996 647359
6007 647359 603012 490576 495145 610896 664581 692531 566777 546390 586194 535660 541026
5996 541026 468289 540146 503144 462013 395366 557544 797976 614174 521287 400149 450832
5985 450832 524148 485009 508077 423367 481293 413827 509450 592455 599498 571753 484059 414171
5973 414171 472493 510369 482842 602602 687124 677768 559102 524547 605975 494365 421480
5962D21480J21191J8412j43434J5507P0020J8379K21190J2626l7744p6993L1203
5951F71837j15587R2872j5170M7767R7350j48427J03575j38274k5576J57980k9630
5940F98717r0282N2484K9644J94271M239l3098R9634N8362p4491n288n3495J07814
5928I88511j68321n0763N5724M5020m3271q2115q6661j31243L6861L9540M6363
5917F49645M4048J25161k53052k337O70l2833P1274J64178q8184r3797j27249
5906D57524L8448K37016q1860j2871Q5725j7316k3372j19150L7790J18950Q5320
5895H06204o6739R5435q370Q820j03926o6113l1316o7873l6480k9076n230J76128
5883F71464q7431j4939J76801Q097L1091p7774p1664q7544J98730L2053J8798
$$ plain form
5962 421480 542671 561083 417649 433156 503176 521555 742745 755371 717627 640634 671837
5951 671837 556250 649122 633952 681719 779069 630642 734217 595943 570367 728347 698717
5940 698717 608435 660919 690563 884834 889073 855975 955609 1013971 939480 934192 880697 988511
5928 988511 820190 769427 825151 870171 826900 744785 658124 526881 563742 603282 649645
5917 649645 693693 818854 565802 563465 564135 531302 602576 766754 678570 584773 457524
5906 457524 495972 732988 651128 638257 723982 706666 683294 564144 601934 720884 806204
5895 806204 739465 834900 826530 835350 731424 665311 633995 566122 529642 500566 495336 671464
5883 671464 584033 569094 745895 753992 785083 707309 635645 548101 746831 778884 797682
5872G97682o1607J00404j49806k13671K25601M7041j27666j18696L13785N4346
5862H67413j80030J554l6162j5626K00487l6691J813p0077q5573m2854P2958J06315
5850G83527J17939M0102j16765P6148j42178K20051p2155j49128J08402J6881
5840H82824q9977J09351Q3825j05506q6669p6346J08230q8326O3869J5370P1245
5829H87890L4755K2031O7376n1428M5622p4666O469J8356R0258K5281J49779l3448
5817A188275l641k5460p5276o8834N8440J30225P6749J32662K22380r8540J1952
5806A548932J90174P8961L43251J88830J94053K09709L18761M84325N38308N94756
5796D690060N26173K86119m58830o12268o52633n42490m28332k67165k30420l10443
$$ plain form
5872 797682 736075 836479 686673 473002 698603 745644 617978 499282 813067 867413
5862 867413 687383 688937 652775 637149 837636 800945 802758 732681 647108 604254 677212 783527
5850 783527 901466 941568 824803 900951 758773 978824 906669 757541 865943 882824
5840 882824 792847 902198 986023 880517 793848 717502 825732 737406 801275 816645 887890
5829 887890 922645 944676 1012052 960624 1006246 931580 938049 956405 1046663 1071944 1221723 1188275
5817 1188275 1184634 1159174 1083898 1015064 1073504 1203729 1280478 1413140 1635520 1536980 1548932
5806 1548932 1739106 1818067 2161318 2350148 2544201 2753910 3072671 3556996 4095304 4690060
5796 4690060 5216233 5502352 5043522 4431254 3778621 3236131 2807799 2540634 2310214 1999771
5786A999771j74464m3547j89620j37375O0335Q4371j59602j79074K0702M4502
5776A325999M5391j71681J4429K2848R2569L7245m4445J1651J04329O6943J549
5765A506827n5778k4153j41308n6150n5144j2987j34366M6662M3646j01754l2098
5754I83397j76845k0365j04925K9832N2168M4095L9014J61290p293j07978J67687
5743A060077j06634o7908j8016J88411o7958j74285L3629L3946j39806J8383l3364
5732G26475J8679k3132n5443J11036k04721k7481O7936J34180p960j7494q8080
5721F33995j3034o673N3687m5891L7186J18145j60764J67333J09532M9486J28687
5710A071689j42213K8391M4013O0594j77211j76176O8744M9821J1189K38531L8966
$$ plain form
5786 1999771 1825307 1781760 1592140 1454765 1515100 1599471 1439869 1260795 1281497 1325999
5776 1325999 1371390 1199709 1214138 1236986 1329555 1366800 1322355 1334006 1438335 1505278 1506827
5765 1506827 1451049 1426896 1285588 1229438 1174294 1161307 1026941 1073603 1117249 1015495 983397
5754 983397 806552 786187 681262 711094 763262 807357 846371 1007661 1000368 892390 1060077
5743 1060077 953443 885535 867519 1055930 987972 813687 847316 881262 741456 759839 726475
5732 726475 745154 722022 666579 777615 572894 545413 613349 747529 739569 722075 633995
5721 633995 620961 614288 667975 622084 659270 777415 616651 783984 893516 943002 1071689
5710 1071689 929476 957867 1001880 1062474 885263 709087 777831 827652 838841 1077372 1116338
5699A116338q7582j64535K6297J45400j07246J3039J1075P4235m2879L6893n8184
5688I62851J82405M3135j29496J08240J06700q9711k3269K9632M6427P1394K3749
5677A332057j24640o3656N3383J18842j94347R8210j7380Q028J05759m0000K0475
5666A296731q2595N1407L7806K4940J1348j09760J0336K03594k4671P171J15127
5655A541434R918j94301k2125J39441J39637p4219j7912p059K84646o0858l8282
5644A700320j22134r7014R857J0086k25167R7080K57429R6779q8661r0199K57698
5633A806074q8043j6481R1769M7524l0940L9940m4800L5744Q3327J13911R1425
5622B129450M9582L7251j5517L5880K9241r3392O1630J11643q4025J1818Q9957
$$ plain form
5699 1116338 1028756 864221 890518 1035918 928672 941711 952786 1027021 984142 1021035 962851
5688 962851 1145256 1188391 1058895 1167135 1273835 1184124 1160855 1190487 1236914 1308308 1332057
5677 1332057 1207417 1143761 1197144 1315986 1121639 1219849 1202469 1210497 1316256 1276256 1296731
5666 1296731 1214136 1265543 1303349 1328289 1339637 1229877 1240213 1443807 1419136 1426307 1541434
5655 1541434 1551352 1357051 1334926 1474367 1614004 1539785 1521873 1514814 1799460 1738602 1700320
5644 1700320 1578186 1481172 1491029 1501115 1275948 1373028 1630457 1727236 1638575 1548376 1806074
5633 1806074 1718031 1701550 1793319 1840843 1809903 1849843 1805043 1840787 1924114 2038025 2129450
5622 2129450 2179032 2216283 2200766 2236646 2265887 2172495 2234125 2345768 2261743 2273561 2363518
5611B363518Q3764R3781N9702K6825m6906J45591J10181R5383J1225J6516J23274
5600C082854J30278j00148M8355J21664K5861r0072K6833n4986q9750L8708J2835
5589C152432m8705L5065j0757O1919m4955p2884P9388R391J88764J05315O1220
5578C516193N460R5079J50429K23786R3389Q5684J56531n9636J94338J92583J42819
5567D796655K33993K82087K01911J40487J8383M8967J44619J60740K51435R8066
5557F377343K88498K67205K7918N3082J70704O9975K35210K53178M53044R52478
5547I148635Q06446P19186O06411k50842r35901j296357r20736m49311m09200
5538G018331j74027k24866k83328J859K1077q796O1155J73951K60666J22683K3708
$$ plain form
5611 2363518 2447282 2541063 2600765 2627590 2580684 2726275 2836456 2931839 2943064 2959580 3082854
5600 3082854 3213132 3112984 3161339 3283003 3308864 3218792 3245625 3190639 3100889 3139597 3152432
5589 3152432 3103727 3138792 3128035 3189954 3144999 3072115 3151503 3160894 3349658 3454973 3516193
5578 3516193 3521653 3616732 3767161 3990947 4084336 4170020 4326551 4266915 4461253 4653836 4796655
5567 4796655 5030648 5312735 5514646 5655133 5673516 5722483 5867102 6027842 6279277 6377343
5557 6377343 6665841 6933046 6960964 7014046 7184750 7254725 7489935 7743113 8196157 9148635
5547 9148635 9955081 10674267 11280678 11029836 10093935 8797578 7876842 7427531 7018331
5538 7018331 6844304 6619438 6336110 6337969 6359046 6350250 6411405 6585356 6846022 6968705 6992413
5527F992413J84861J58085K49839L15067K23280L46725M34586L47288P4109j1740
5517I314513j65945j8997M2484l33022k20988j32324q7661j09284k06612J9374
5507H101538P1535o6331K13923Q2893J33729J04396K57522O6023Q8161J49305
5497I202694K30546L60373K45408M08061M14923M76323N46309M25236P1701l33304
5487A2048270p56232m05178l47724j71469l73201m60953j57193m7783j11901L6674
5477I253310k41496j65271j39737k21581j06176j11161J36629o9045q8508j56885
5467H090079P2732q3355K12391J61788o9804o7388M0113J30562j12379k82190
5457H092549l95328j35335j73355j96718n5402O3930j06813k6551M7094P1510
$$ plain form
5527 6992413 7177274 7335359 7585198 7900265 8123545 8470270 8904856 9252144 9326253 9314513
5517 9314513 9148568 9129571 9172055 8839033 8618045 8485721 8398060 8288776 8082164 8101538
5507 8101538 8173073 8106742 8320665 8403558 8537287 8641683 8899205 8965228 9053389 9202694
5497 9202694 9433240 9793613 10039021 10447082 10862005 11338328 11884637 12309873 12381574 12048270
5487 12048270 11292038 10886860 10539136 10367667 9994466 9533513 9376320 9328537 9216636 9253310
5477 9253310 9011814 8846543 8706806 8485225 8379049 8267888 8404517 8335472 8246964 8090079
5467 8090079 8162811 8079456 8291847 8453635 8383831 8316443 8356556 8487118 8374739 8092549
5457 8092549 7697221 7561886 7388531 7191813 7136411 7200341 7093528 7066977 7114071 7185581
5447G185581J7091m1860J06435L28022L0645j94510M325m1479P3755m3939k3272
5436G400794K1858R4885K87523K52295p1919j43063j8109k59731k57906J1580
5426G318207J53027J47100J8067j248M9431q8081J07676j39341p8460J12327K34403
5415G833108J15856K32774J19734P6408K48966R3236J29061J88459K63736L07202
5405I608540L48875K73012K70211J48176J33000m1480j25830K395L6552J82399
5395A0835850J69332Q2879J6260n2627l60725j84788N5152p1195o3606q4844J24011
5384A0465699J20404L53981K64395K38673K24172K10106L52226J77284P811L43835
5374A2758586L60867K77341K66655L13096M09799P9925K96510M35749L43264L64177
$$ plain form
5447 7185581 7202672 7160812 7267247 7595269 7625914 7431404 7435729 7394250 7468005 7424066 7400794
5436 7400794 7422652 7517537 7805060 8057355 7985436 7842373 7824264 7564533 7306627 7318207
5426 7318207 7471234 7618334 7636401 7635153 7684584 7596503 7704179 7564838 7486378 7598705 7833108
5415 7833108 7948964 8181738 8301472 8377880 8626846 8720082 8849143 9037602 9301338 9608540
5405 9608540 9957415 10230427 10500638 10648814 10781814 10740334 10614504 10616899 10653451 10835850
5395 10835850 11005182 11088061 11104321 11051694 10690969 10506181 10561333 10490138 10426532 10341688 10465699
5384 10465699 10586103 10940084 11204479 11443152 11667324 11877430 12229656 12406940 12414751 12758586
5374 12758586 13119453 13396794 13663449 13976545 14386344 14466269 14762779 15198528 15541792 15905969
5364A5905969M61966M84115L98727K69803L96306L87666N26201Q58593P94681
5355B0484027J110624J254447J467386J573453K016503K533472L481914M083224
5347C8005050M059178L865481K410312M26961j445782k127695j920225j148391
5339D2124889n50431n89201m54916n26890o02374p48188j353359j168030q06917
5330C5324583m81013J12169N28170Q57653J281335J656289K160302K667938L390756
5321D7498182M420400N367897O326289O529432N840478M592814L212921K147399
5313H5935812R17119o2117l72663P77102K685331M327894M667604K595193j571497
5304I9899778o483613r251249r452008q256614o444961n006083l578256k484971
$$ plain form
5364 15905969 16367935 16852050 17250777 17520580 17916886 18304552 18830753 19689346 20484027
5355 20484027 21594651 22849098 24316484 25889937 27906440 30439912 33921826 38005050
5347 38005050 42064228 45929709 48340021 48766982 47321200 45193505 43273280 42124889
5339 42124889 41574458 40985257 40530341 40003451 39401077 38652889 37299530 36131500 35324583
5330 35324583 34843570 34955739 35483909 36341562 37622897 39279186 41439488 44107426 47498182
5321 47498182 51918582 57286479 63612768 70142200 75982678 80575492 83788413 85935812
5313 85935812 86852931 86790814 86418151 87195253 89880584 94208478 98876082 101471275 99899778
5304 99899778 93416165 84164916 74712908 66456294 60011333 55005250 51426994 48942023
5296D8942023j760355r74006l25492L25634P83233J470395K192318K910092L778813
5287E7342655M118791L792699K525075J051874O90759J506489K818804L956350
5279G7803496M059596K490486q51456m714203o993836p625330o931243n847759
5271E1389751m570005l468354k498481j968430j561432j139546q29297n33343
5263C4820863m64045k09242O5247R5687J34008K58720O27317Q69390J098758J397167
5253C8693870J589993J964718K577602L230510L975350M941322O262443P356995
5245G0592803P625541O694217M176705J01495l795677n482578m999911l342207
5237G1570388j714378p55593r50948k060728l213297l555630l110182k411881
$$ plain form
5296 48942023 47181668 46207662 45882170 46207804 46991037 48461432 50653750 53563842 57342655
5287 57342655 61461446 65254145 67779220 68831094 69521853 71028342 73847146 77803496
5279 77803496 81863092 84353578 83502122 78787919 71794083 64168753 57237510 51389751
5271 51389751 46819746 43351392 40852911 38884481 37323049 36183503 35354206 34820863
5263 34820863 34356818 34147576 34212823 34308510 34442518 34701238 35328555 36197945 37296703 38693870
5253 38693870 40283863 42248581 44826183 48056693 52032043 56973365 63235808 70592803
5245 70592803 78218344 84912561 89089266 89190761 85395084 79912506 74912595 71570388
5237 71570388 69856010 69100417 68149469 66088741 62875444 59319814 56209632 53797751
5229E3797751j379007m46650J49981J097258J881165K699882L789624M986098
5221F6576102O105790P065931O995169N234365K531121n95678k993302l366190
5213H7553308k849293j906439j130128j039317j949805l110279l235131k505254
5205F9827662j498126j270007k104580l778596n038052n266983m690168l726893
5197D2454257k926790j968490j158720j125958o32658k85446K50778M52916P69403
5188C5829292Q22130N60505Q9607L0043N84193P45424J032895J403340J481176
5179D2578605J223115K8266j829868l470022m312860l907995l316471k415159
5171B4577611j985843j630759j382499j049177q97319o63745q11100o57475n31375
$$ plain form
5229 53797751 52418744 51972094 52122075 53219333 55100498 57800380 61590004 66576102
5221 66576102 72681892 79747823 86742992 91977357 94508478 93912800 90919498 87553308
5213 87553308 84704015 82797576 81667448 80628131 78678326 75568047 72332916 69827662
5205 69827662 68329536 67059529 64954949 61176353 56138301 50871318 46181150 42454257
5197 42454257 39527467 37558977 36400257 35274299 34641641 34356195 34606973 35059889 35829292
5188 35829292 36651422 37211927 37301534 37331577 37915770 38661194 39694089 41097429 42578605
5179 42578605 43801720 43829986 42000118 38530096 34217236 30309241 26992770 24577611
5171 24577611 22591768 20961009 19578510 18529333 17632014 16968269 16157169 15499694 14968319
5162A4968319m64252n64780n36292m57559m07940l51582k03445q6799k96907k72365
5152A1326398l11992j17770j07058o2653p0169J67970P8475J24939J77753K40589
5142A1446482N01667L10287L19828J30343r2854j07226J67173L59717M85151N77325
5132A4097893K64454k59160o04594p81483n79990m13738k68381k4323k26407J52846
5122A1357117M31377M08489O38894R36696J551871J535640J709312J400798L45695
5113B0315889j493209k307033k119678j722540j423646j083661q99518o73559
5105H593045n47135o70458m09470k85785l10201k51537j38317m4968N8375j85936
5095E807613m01383k57815o2349K2274j81902j06304l7760j35390J4805m3643
$$ plain form
5162 14968319 14504067 13939287 13402995 12945436 12537496 12185914 11982469 11895670 11598763 11326398
5152 11326398 11014406 10896636 10789578 10726925 10656756 10824726 10903201 11028140 11205893 11446482
5142 11446482 11948149 12258436 12578264 12708607 12615753 12508527 12675700 13035417 13520568 14097893
5132 14097893 14362347 14103187 13498593 12717110 12137120 11723382 11455001 11430678 11204271 11357117
5122 11357117 11788494 12196983 12835877 13772573 15324444 16860084 18569396 19970194 20315889
5113 20315889 18822680 16515647 14395969 12673429 11249783 10166122 9266604 8593045
5105 8593045 8045910 7375452 6965982 6680197 6369996 6118459 5980142 5935174 5993549 5807613
5095 5807613 5406230 5148415 5086066 5108340 4926438 4820134 4782374 4646984 4661789 4618146
5085D618146r1246k00792j3765J55334J2846O8167j04442k82863p3396p964J76928
5074D256953J7747Q801O4949K180j82765K9452o712R9505k24624j18561k9626
5063C917299J07675j21729L20100Q2798J14220K38061J58788J12390M98999J58729
5053E587330K9727o651m48968m52415m01980k43599k15175l8803r200j91920r8269
5042C510077M4290n6174j58749j4336J35861k81850j53881J31549P1334m0736
5032C187385n8421j08093j13500q5147j50552j498J84667Q0688o4438K7328J09803
5021C008222j96495Q5657j42273r622j2435J73034k0580j66409j43919n0109K3523
5010B548594P2388J10707O564k81485R3226J18660n3978Q6986J54152N6975N1056
$$ plain form
5085 4618146 4526900 4326108 4312343 4467677 4480523 4548690 4444248 4161385 4087989 4080025 4256953
5074 4256953 4274700 4283501 4348450 4350630 4167865 4197317 4190605 4290110 4065486 3946925 3917299
5063 3917299 4024974 3903245 4223345 4306143 4420363 4658424 4817212 4929602 5428601 5587330
5053 5587330 5617057 5610406 5161438 4709023 4307043 4063444 3848269 3809466 3800266 3608346 3510077
5042 3510077 3554367 3498193 3339444 3325108 3460969 3179119 3025238 3156787 3228121 3187385
5032 3187385 3128964 3020871 2907371 2822224 2671672 2670174 2854841 2935529 2871091 2898419 3008222
5021 3008222 2811727 2897384 2755111 2745489 2733054 2906088 2885508 2719099 2575180 2525071 2548594
5010 2548594 2620982 2731689 2738253 2456768 2549994 2668654 2614676 2701662 2855814 2912789 2963845
4999B963845K348N6673Q6512p5498J08933M4644N7654l4635J56697O5778m0268
4988C392683K1323k5678r3741k6818j02097N006K89273m2182P6656m1599J6530
4977C469356J9094q2325N8186k3087J57859Q2408l740M786K7151K2804j01540
4966C630952L0428N8077k993L7699J78224J5514O4396j91366Q7327j777M2729
4955C949210j2844J21344J90192J915l5423N0227J148k8670J62700K8482J19649
4944D547930O1205J2928M1213J2515Q0964P0257J66257k8445j65990J1149J53929
4933D963912J8710m7391K14197J69138K41854J95L8774J36699N8617j6167J93568
4922E972106M5815J15616O00215J49190k5615O3588J16944K51244K67135L23500
$$ plain form
4999 2963845 2966193 3022866 3109378 3033880 3142813 3187457 3245111 3210476 3367173 3432951 3392683
4988 3392683 3414006 3388328 3294587 3267769 3165672 3170678 3459951 3417769 3494425 3452826 3469356
4977 3469356 3488450 3406125 3464311 3441224 3599083 3681491 3677751 3682537 3709688 3732492 3630952
4966 3630952 3661380 3719457 3716464 3754163 3932387 3947901 4012297 3820931 3908258 3906481 3949210
4955 3949210 3936366 4057710 4247902 4249817 4214394 4264621 4265769 4237099 4399799 4428281 4547930
4944 4547930 4609135 4622063 4663276 4675791 4756755 4827012 4993269 4964824 4798834 4809983 4963912
4933 4963912 4982622 4935231 5149428 5318566 5560420 5560615 5599389 5736088 5794705 5778538 5972106
4922 5972106 6017921 6133537 6733752 6882942 6857327 6920915 7037859 7289103 7556238 7879738
4912G879738P2384J21960o7793J59421K19281L10474L17193J84703M7694K85806
4902I530861L81018P6115m5332J88459K82623J50684J93774K9535J35245M20961
4892A1343943L42447J37109K19414J39672J37405L67022M74615J37583J68767
4883A3467977N04793J91614J40870K92677K82058L2123K31171M34545K68676L69347
4873A6215851L25322M50285P03294O60331N57212O73135O67174N78754J103513
4864B1934871Q64036R82384J015441J093266J206044J319260J123252J348994
4856C0887548J483592J592948J430372J392274J134664J204967J336326J485457
4848D1948148J881630K259137K531616K909928L068879L336389L823892M914347
$$ plain form
4912 7879738 7952122 8074082 8006289 8165710 8384991 8695465 9012658 9197361 9245055 9530861
4902 9530861 9911879 9987994 9942662 10131121 10413744 10564428 10758202 10787737 10922982 11343943
4892 11343943 11686390 11823499 12042913 12182585 12319990 12687012 13161627 13299210 13467977
4883 13467977 13972770 14164384 14305254 14597931 14879989 14912112 15143283 15577828 15846504 16215851
4873 16215851 16541173 16991458 17694752 18355083 18912295 19585430 20252604 20831358 21934871
4864 21934871 22798907 23781291 24796732 25889998 27096042 28415302 29538554 30887548
4856 30887548 32371140 33964088 35394460 36786734 37921398 39126365 40462691 41948148
4848 41948148 43829778 46088915 48620531 51530459 54599338 57935727 61759619 66673966
4840F6673966N677107O923352Q061400R672494J0968878J2399797J5507129K0815318
4832A56699441K8727625L9255803N1937553O2309927O2593675M1066033j8087887
4825D24502170p1399220p4148345o0333414m3372384l0378297k2963684j8101038
4818A03805788j4168966j1029733q351715o352205n100149m228228m060540l519638
4810D6994614k978436k589940k265673j872792j703420j886757j830132j877543
4802B9989921j709573j503373j575394j013465j069241q09876q55548o75362p26591
4793B0051498q46279q80122o32762n95954p07345n61984m82658j78220m25603
4784A4740571n01724m28406m27569l85092l61720l71232k69834j33209l03560
$$ plain form
4840 66673966 72351073 79274425 87335825 97008319 107977197 120376994 135884123 156699441
4832 156699441 185427066 224682869 276620422 338930349 401524024 442590057 424502170
4825 424502170 353102950 278954605 218621191 175248807 144870510 121906826 103805788
4818 103805788 89636822 78607089 70255374 63903169 58803020 54574792 50514252 46994614
4810 46994614 44016178 41426238 39160565 37287773 35584353 33697596 31867464 29989921
4802 29989921 28280348 26776975 25201581 24188116 23118875 22308999 21453451 20778089 20051498
4793 20051498 19205219 18325097 17692335 17096381 16389036 15827052 15344394 15166174 14740571
4784 14740571 14238847 13810441 13382872 12997780 12636060 12264828 11994994 11861785 11558225
4775A1558225l77346k59172r8636j66170k97524r7224q7053l45942k48475j19873
4765I460810n1041k22857j93492k05644j58179j81132j3455k47004k56895k53879
4755G677232j86881j50916o7995j94603J2566j80825k50385k21952o9063n9335
4745F307843k20916j71745r9092j93024k59672k18081K0091j9735j67644r5512
4735D882513P8897J72029q2610K3901k18052j33969P3250L0362L9554O0739j32356
4724D794258m0965p4095j54560P603j565m3409j02959P7522j51865r5725k16137
4713C998103j59165j1381r3115j60998Q2421J56108N1693R592j10776L6416O6533
4702C865431r8155l8862l1403k75453q2775j6108J4374j30982k8795J72144Q8595
$$ plain form
4775 11558225 11180879 10921707 10823071 10656901 10359377 10262153 10175100 9829158 9580683 9460810
4765 9460810 9409769 9186912 8993420 8787776 8629597 8448465 8435010 8188006 7931111 7677232
4755 7677232 7490351 7339435 7271440 7076837 7089403 6908578 6658193 6436241 6367178 6307843
4745 6307843 6086927 5915182 5816090 5623066 5363394 5145313 5165404 5145669 4978025 4882513
4735 4882513 4961410 5133439 5050829 5074730 4856678 4722709 4795959 4826321 4865875 4926614 4794258
4724 4794258 4753293 4679198 4524638 4532241 4530676 4487267 4384308 4461830 4309965 4214240 3998103
4713 3998103 3838938 3827557 3734442 3573444 3655865 3811973 3863666 3873258 3762482 3798898 3865431
4702 3865431 3767276 3728414 3697011 3421558 3338783 3322675 3337049 3206067 3177272 3349416 3438011
4691C438011N8112j39492j804J19203n789J38308N9496N3752l119o4597R4848
4680C746929j42509l3517J2042k06408J0665k6867k42855n0561J06784k1763L7063
4669C189003m290O7726M8035m5196L7233J10218r3327J04123L3865J17356n253
4658C559493M9389J2946k5102M2258M8553k5414M9572J62989J49508J83938r672
4647D198458J27272Q0275j09268j01915J48658J92153N6654n3162K7708M7569
4637D614402k1929J17627K5972J11042J80283M9286L63139O7176J64382J84444
4627E855824K4810J79721K04947L5620K29120K37604J90977L79796N50515M16112
4617H305046M82433O68807Q54505R36976J101352J556488J643555K284824L085140
$$ plain form
4691 3438011 3496123 3356631 3354827 3474030 3468241 3606549 3666045 3719797 3716678 3652081 3746929
4680 3746929 3604420 3570903 3582945 3376537 3387202 3360335 3117480 3066919 3173703 3151940 3189003
4669 3189003 3184713 3252439 3300474 3255278 3292511 3402729 3309402 3413525 3447390 3564746 3559493
4658 3559493 3608882 3621828 3596726 3638984 3687537 3662123 3711695 3874684 4024192 4208130 4198458
4647 4198458 4325730 4406005 4296737 4194822 4343480 4535633 4592287 4539125 4566833 4614402
4637 4614402 4592473 4710100 4736072 4847114 5027397 5076683 5439822 5506998 5671380 5855824
4627 5855824 5880634 6060355 6265302 6300922 6530042 6767646 6958623 7338419 7888934 8305046
4617 8305046 8787479 9456286 10310791 11247767 12349119 13905607 15549162 17833986 20919126
4608B0919126L842576M652586M817264L486239J19588m138081n552666n169393
4600B2977239m070018k765226k182980j831819j322640j050976r61255p09309
4592H083016n72204l38413m03437j92127l88177n67981k12962j39438j29545j10199
4582E028533j39785k01045j21604j94688k7129j29918j92388j422k20276o5504
4572C734774o5042j657M6845L994j90894m8k8528q6604k88l5636j08059N6995
4560C325852O175k08899M0167J86716J15680k05861J9180K7930j91097j8805l9771
4549C057267M3678q7580L2978P067j93652M9027Q0324K271O3509m3262l1080J63908
4537C144455j35429l1233M5900K5970J25146j7860k19719K025Q5362j4260P2949
$$ plain form
4608 20919126 24761702 29414288 34231552 37717791 37837379 33699298 28146632 22977239
4600 22977239 18907221 16141995 13959015 12127196 10804556 9753580 8792325 8083016
4592 8083016 7510812 7172399 6768962 6576835 6188658 5620677 5407715 5268277 5138732 5028533
4582 5028533 4888748 4687703 4566099 4371411 4344282 4214364 4021976 4020554 3800278 3734774
4572 3734774 3669732 3668075 3714920 3718914 3528020 3527972 3499444 3412840 3412552 3376916 3268857 3325852
4560 3325852 3332027 3123128 3163295 3350011 3465691 3259830 3279010 3306940 3115843 3097038 3057267
4549 3057267 3100945 3013365 3046343 3053410 2859758 2908785 2989109 2991380 3054889 3011627 2980547 3144455
4537 3144455 3009026 2977793 3023693 3049663 3174809 3156949 2937230 2939255 3024617 3010357 3083306
4526C083306J34841J06761J08214L1659n1550n124J41072M1912k7012J3281L45181
4515C922541P4755M31952K15263K57416L51446R2712l26308l58685m10937l62276
4505C887879J6540j02528j03977k53677k4594J1379j70775n1687J16910r7207
4495C228263J84583j49218r3364J10533r1473j7633J85312o8535r3820j97306
4485B997342R6984M3646J79291K68634R3529k63083j7604J10178M5775q6380N1125
4474C519437J45838j05319K83206J37563M1428J37525Q4071J20921M7810j04776
4464D307704j15836j6215j48079M1597Q9965l5255m6228J0087o7904l8203O6509
4453D048142K4770K6691M9578L8103L3491N853r3018j7729J09037L815n5529P760
$$ plain form
4526 3083306 3218147 3324908 3433122 3464781 3413231 3408107 3549179 3591091 3564079 3577360 3922541
4515 3922541 3997296 4429248 4644511 4901927 5253373 5346085 5019777 4661092 4250155 3887879
4505 3887879 3904419 3801891 3697914 3444237 3419643 3431022 3260247 3208560 3325470 3228263
4495 3228263 3412846 3263628 3170264 3280797 3189324 3171691 3357003 3288468 3194648 2997342
4485 2997342 3094326 3137972 3317263 3585897 3679426 3416343 3398739 3508917 3554692 3468312 3519437
4474 3519437 3665275 3559956 3843162 3980725 4022153 4159678 4243749 4364670 4412480 4307704
4464 4307704 4191868 4175653 4027574 4069171 4159136 4123881 4077653 4087740 4019836 3981633 4048142
4453 4048142 4072912 4099603 4149181 4187284 4220775 4226628 4133610 4115881 4224918 4228733 4173204 4180964
4441D180964K1105J07240j33921K36749L1680Q3494q4638j04115K6602K00953
4431D566113Q3704O3954j79841l9423Q327J23837J14372o1265J76133J07423q7929
4420D875405N6472Q6711l0285P4079J59742K8963j27363K5553k06336J00989O3752
4409E107682J83153J59527j07820p5543l0614J327O7523J4648o0508K05313L5166
4398E499854r5284K45292m1898R4341N2479R3594k91J07484K0265R2671L4780
4387F103287j8675J08816J84557q4076o3008J4776M6465J30765P3862J00406n6890
4376F540285k272N1154m4127M5426J66899J04841K09923j66693n8452J63891Q9740
4365G100615J33230J73516r8191O6313K50673Q5266j55135J47022l9990J25277
$$ plain form
4441 4180964 4202069 4309309 4175388 4412137 4443817 4527311 4442673 4338558 4365160 4566113
4431 4566113 4649817 4713771 4533930 4494507 4502834 4626671 4741043 4679778 4855911 4963334 4875405
4420 4875405 4931877 5018588 4988303 5062382 5222124 5251087 5123724 5149277 4942941 5043930 5107682
4409 5107682 5290835 5450362 5342542 5266999 5236385 5237712 5305235 5319883 5259375 5464688 5499854
4398 5499854 5404570 5649862 5607964 5702305 5754784 5848378 5848087 5955571 5975836 6068507 6103287
4387 6103287 6084612 6193428 6377985 6293909 6230901 6245677 6292142 6422907 6496769 6597175 6540285
4376 6540285 6538013 6589167 6545040 6590466 6757365 6862206 7072129 6905436 6846984 7010875 7100615
4365 7100615 7233845 7407361 7309170 7375483 7626156 7711422 7556287 7703309 7663319 7788596
4355G788596L6762O2846Q395j38548O9236J20620L1419J341j75567J21825L12359
4344H239284K15669o3277q7396J3235K51948N7293k0665L54769J29656r4356L532
4333H999692J68444P3839O0578O0039j46536J37308K16210J23133K47152J8943
4323I958802J65017p3706J3911j47806K660J09162Q3194J31689N2792N2960L5148
4312A0383823J00861Q7923M1640J7133Q1367J68219n6094k56534K925J07875r0240
4301A0588898o0485J11522J88644P5440q3161j93251J7926n8696j4996l4026R2342
4290A0630157N1077J10015J96062J53743J46714K36034J06984J62965L23880L2972
4280A2150603K53037L75748J84969N0648L37229K67126J14293K21464R0179P935
$$ plain form
4355 7788596 7825358 7888204 7896599 7758051 7827287 7947907 7979326 7980667 7805100 7926925 8239284
4344 8239284 8454953 8391676 8304280 8317515 8569463 8626756 8606091 8960860 9090516 8996160 8999692
4333 8999692 9168136 9241975 9302553 9362592 9216056 9353364 9569574 9692707 9939859 9958802
4323 9958802 10123819 10050113 10064024 9916218 9918878 10028040 10111234 10242923 10295715 10348675 10383823
4312 10383823 10484684 10572607 10614247 10631380 10712747 10880966 10824872 10568338 10571263 10679138 10588898
4301 10588898 10528413 10639935 10828579 10904019 10820858 10627607 10645533 10586837 10571841 10537815 10630157
4290 10630157 10681234 10791249 10987311 11141054 11287768 11523802 11630786 11793751 12117631 12150603
4280 12150603 12403640 12779388 12964357 13015005 13352234 13619360 13733653 13955117 14045296 14053231
4270A4053231m444J27980j08642j2050m9906k8985o0794N0032Q1159K28381N4599
4259A4330561N2178J17132P3962r8451q0847J555l0161K23432j33855M329m4816
4248A4415019M9056J52667J02156n2421k04041p549O4225j48629R1619o8575j66916
4237A4226611j07894j88171n4501k79906n6405j35319J7316P2645j82852R551
4227A3321075J6979j49606l17316j13928j69965j26616r0766j67424J06763n1112
4217A2258084j57668r3948o9258P387j50339k15281m4127j28598k09311o4073
4207A1132868q375j71682j11459k6470k46736O6118l8998M4233r0355q2084q297
4196A0458763J77150M8334J21329O482J69154M8445l8216k41268o1809j12381
$$ plain form
4270 14053231 14048787 14176767 14068125 14056075 14006169 13977184 13916390 13966422 14047581 14275962 14330561
4259 14330561 14382739 14499871 14573833 14475382 14394535 14396090 14365929 14589361 14455506 14459835 14415019
4248 14415019 14464075 14616742 14718898 14666477 14462436 14454887 14519112 14370483 14462102 14393527 14226611
4237 14226611 14118717 13930546 13876045 13596139 13539734 13404415 13421731 13494376 13311524 13321075
4227 13321075 13338054 13188448 12871132 12757204 12587239 12460623 12369857 12202433 12309196 12258084
4217 12258084 12100416 12006468 11937210 11944597 11794258 11578977 11534850 11406252 11196941 11132868
4207 11132868 11124493 10952811 10841352 10814882 10568146 10634264 10595266 10639499 10549144 10467060 10458763
4196 10458763 10635913 10684247 10805576 10812058 10981212 11029657 10991441 10750173 10688364 10575983
4186A0575983j89203M3270j2598l7347m0918J31367P1834J31931M4174K64202
4176A0982695K68316K69206K4460j41983j49288r4180o1172k82006k21974j83928
4166A0410146o8539j4412M4309J34214j7734Q6650o9950J83594M05582K79616
4156A1373476K4702j13855J81043J60686J26812K97138M64935P23822P99765J321626
4146A5360150J334193J398174J004186j82465j216620j599114j215583q04877
4138A4078044p10475o12811m64223n08225n04989k90334k00803m07708j78207
4129A0200269k22404n9525j31749k73442l3681l013k83186J5407N0798l2166Q7937
4118I315245j26747j79450o3736J30575j082N2849n8351n8266l3256R8323p1897
$$ plain form
4186 10575983 10386780 10430050 10417452 10380105 10339187 10470554 10542388 10674319 10718493 10982695
4176 10982695 11251011 11520217 11544677 11402694 11253406 11159226 11098054 10816048 10594074 10410146
4166 10410146 10341607 10327195 10371504 10505718 10487984 10574634 10504684 10688278 11093860 11373476
4156 11373476 11398178 11284323 11465366 11626052 11752864 12050002 12514937 13238759 14038524 15360150
4146 15360150 16694343 18092517 19096703 18914238 17697618 16098504 14882921 14078044
4138 14078044 13367569 12754758 12290535 11782310 11277321 10986987 10786184 10378476 10200269
4129 10200269 9977865 9918340 9786591 9513149 9479468 9476455 9193269 9208676 9259474 9227308 9315245
4118 9315245 9188498 9009048 8945312 9075887 9074805 9127654 9069303 9011037 8977781 9076104 9004207
4107I004207P4816N7383K59480N0546j4124M2036N9097L9755Q7552P0482n4972
4096I676258J45162j4279L0129O9849J18858K08082l1562R8887K5686M6494K2917
4085A0396481J00348L70221J69215M465J40717K23869J09219J01108K18664K75533
4075A2109840J93786Q2544R3965L38973J18672J68184L06949P8829K51636K92201
4065A4035579L88573K51957M16759L20078J72571L13313M31894L30348L91721
4056A7052793N16369L42786L65453N04169O73129N30092N85287N21976O90108
4047B1782162O45554O67559N97835P68492Q10324J124416R95940Q63620J271924
4038B9527826J181392J183673J431090J334302J427297J629738J629558J679928
$$ plain form
4107 9004207 9079023 9136406 9395886 9446432 9432308 9474344 9533441 9573196 9660748 9731230 9676258
4096 9676258 9821420 9807141 9837270 9907119 10025977 10234059 10202497 10301384 10327070 10373564 10396481
4085 10396481 10496829 10867050 11036265 11040730 11181447 11405316 11514535 11615643 11834307 12109840
4075 12109840 12303626 12386170 12480135 12819108 12937780 13105964 13412913 13491742 13743378 14035579
4065 14035579 14424152 14676109 15092868 15412946 15585517 15898830 16330724 16661072 17052793
4056 17052793 17569162 17911948 18277401 18781570 19454699 19984791 20570078 21092054 21782162
4047 21782162 22427716 23095275 23693110 24461602 25271926 26396342 27392282 28255902 29527826
4038 29527826 30709218 31892891 33323981 34658283 36085580 37715318 39344876 41024804
4030D1024804J796235J971830K220957K203296K452750K448482K680344K677593
4022E9476291K645972K686858K898283K892535K818700K945236K989976L339229
4014H2693080L292397L235412L303247L499291L435456L550854L522590L304787
4006A09837114K933703K691048K659312K323997K110485K248655J961885J996531
3998A28762730J863974J551774J620014J501528J180623O96870M07236j05311
3990A37479438m59067q41249j163720j331976j640033j639984j703586j924450
3982A26775373j776687k170237k220032k360254k689896k838641l278884l264673
3974A06176069l502743l650707l670771l550258l518893l528405l408808l264201
$$ plain form
4030 41024804 42821039 44792869 47013826 49217122 51669872 54118354 56798698 59476291
4022 59476291 62122263 64809121 67707404 70599939 73418639 76363875 79353851 82693080
4014 82693080 85985477 89220889 92524136 96023427 99458883 103009737 106532327 109837114
4006 109837114 112770817 115461865 118121177 120445174 122555659 124804314 126766199 128762730
3998 128762730 130626704 132178478 133798492 135300020 136480643 137177513 137584749 137479438
3990 137479438 137020371 136179122 135015402 133683426 132043393 130403409 128699823 126775373
3982 126775373 124998686 122828449 120608417 118248163 115558267 112719626 109440742 106176069
3974 106176069 102673326 99022619 95351848 91801590 88282697 84754292 81345484 78081283
3966G8081283l237156k970284k916836l063993k893330l030601k798381k841649
3958E4329053k503326k522711k566916k226111j987247k037071j850322j516715
3950C7118634j583185j348785j349865j378872j210990j092406j040357r70512
3942B7143662p29124q98506r26021o80875o84523o98448l93917l63952l76910
3933B1391386n93358l86860k04799j84138k38214j64655j71629j52315L6540k2745
3923A9309213r9830r1490L3343l43952j65200m6108l44071j54114M2139k61916
3913A7878014k92415k01315j16955j81102P3356j98301j95455l61766k67382j16511
3903A6020168o4416l22202j04452k52103k23422l14719k83363o3895J4993j87006
$$ plain form
3966 78081283 74844127 71873843 68957007 65893014 62999684 59969083 57170702 54329053
3958 54329053 51825727 49303016 46736100 44509989 42522742 40485671 38635349 37118634
3950 37118634 35535449 34186664 32836799 31457927 30246937 29154531 28114174 27143662
3942 27143662 26414538 25516032 24590011 23909136 23224613 22526165 22132248 21768296 21391386
3933 21391386 20798028 20411168 20206369 20022231 19784017 19619362 19447733 19295418 19331958 19309213
3923 19309213 19209383 19117893 19151236 18807284 18642084 18595976 18251905 18097791 18139930 17878014
3913 17878014 17585599 17384284 17267329 17086227 17159583 16961282 16765827 16404061 16136679 16020168
3903 16020168 15955752 15633550 15529098 15276995 15053573 14738854 14455491 14391596 14406589 14219583
3893A4219583k01407Q6540j79940j94156J23540J06082l430j61698J83432J03574
3883A4082120P1155J70996P4626J09091K62138L79388M01843J82943K45941K54934
3873A6235175O53173N29019N74594N51413L99244N02936L37274L24844L99367
3864B0507039K15378L0108R2990k1814M8894L5448j04111k64208N8084l9925j63236
3853B0394647j96795k04671m34130k92874m09480l77838o65346l49315m87187
3844A6977011o32536m82405n93978n18920l57948l50209k36268j06115j90472
3835A3508160k86981j01209j81904l2985l61957j78706j63956n8522k9529O3200
3825A2175611q9597j8354Q289q9527J6802j12510n4026M9097N4990J43753r5071
$$ plain form
3893 14219583 14018176 14104716 13924776 13730620 13854160 13960242 13956812 13795114 13978546 14082120
3883 14082120 14153275 14324271 14398897 14507988 14770126 15149514 15551357 15734300 15980241 16235175
3873 16235175 16888348 17417367 17991961 18543374 18942618 19445554 19782828 20107672 20507039
3864 20507039 20722417 20752525 20845515 20823701 20872595 20908043 20803932 20539724 20597808 20557883 20394647
3853 20394647 20197852 19993181 19559051 19266177 18856697 18478859 17813513 17464198 16977011
3844 16977011 16344475 15862070 15268092 14749172 14391224 14041015 13804747 13698632 13508160
3835 13508160 13221179 13119970 12938066 12905081 12543124 12364418 12200462 12141940 12112411 12175611
3825 12175611 12086014 12067660 12075949 11986422 12003224 11890714 11836688 11885785 11940775 12084528 11989457
3814A1989457J7663J21557J12792J05997J50224O2019P1599K01946J25365L55351
3804A3313970J86654L24479M52097p0918j39379j16282j44937k20668j2128P4146
3794A3647034K3148K86268K85425L16306L10306K54819K71665L32908p2099j10799
3784A5544981j8024M093q5146J2608R7206J90192J65301K22905O78192R65339
3774A7777647J003301J129549N29963q9292o75006q42490o03316l80599j35545
3765A7714212j8584M2931J35217K1938K03811J58063J11440O2913Q4054j9565
3755A8496430n1906k43526n4391j76307m17765j21133M665r1793J29084J52937
3745A7626295o798o514J18748k0646M2713l21578n14085m96084j53278m2768k16703
$$ plain form
3814 11989457 12007120 12128677 12241469 12347466 12497690 12559709 12631308 12833254 12958619 13313970
3804 13313970 13500624 13825103 14277200 14206282 14066903 13950621 13805684 13585016 13572888 13647034
3794 13647034 13670182 13956450 14241875 14558181 14868487 15123306 15394971 15727879 15655780 15544981
3784 15544981 15526957 15531050 15445904 15458512 15555718 15745910 15911211 16134116 16812308 17777647
3774 17777647 18780948 19910497 20440460 20351168 19676162 18833672 18230356 17849757 17714212
3765 17714212 17695628 17738559 17873776 17895714 18099525 18257588 18369028 18431941 18515995 18496430
3755 18496430 18444524 18200998 18146607 17970300 17552535 17431402 17436067 17344274 17473358 17626295
3745 17626295 17619497 17612983 17731731 17711085 17753798 17432220 16918135 16422051 16268773 16226005 16009302
3734A6009302K5178j56106J824J53752N7135o9137L09699O0345P7787J35453K66635
3723A6871867K23764K40398K68485K15032K10329K61142J14812J34972K82649
3714A8823450J52654J35126K15584K57391P3922J54724L01947K09815J79656L09898
3704B0814167K92500L37192L53132K33057L31411L84969K97482L91964L73774
3695B3809648L91500M46776N72767M28730N48002N51324O74830M45729L26776
3686B8196082Q89564O33075N12149Q13485R94952O07749Q17706R02941Q95333
3677C5263036Q91387O71575J076964J191763J096000R37747J294288J357053J408345
3668D5188158J522087J749423J852515J651755J833153J973716K064727J924474
$$ plain form
3734 16009302 16034480 15878374 15880198 16033950 16091085 16021948 16331647 16391992 16469779 16605232 16871867
3723 16871867 17095631 17336029 17604514 17819546 18029875 18291017 18405829 18540801 18823450
3714 18823450 18976104 19111230 19326814 19584205 19658127 19812851 20114798 20324613 20504269 20814167
3704 20814167 21106667 21443859 21796991 22030048 22361459 22746428 23043910 23435874 23809648
3695 23809648 24201148 24647924 25220691 25649421 26197423 26748747 27423577 27869306 28196082
3686 28196082 29085646 29718721 30230870 31044355 32039307 32647056 33464762 34367703 35263036
3677 35263036 36154423 36825998 37902962 39094725 40190725 41128472 42422760 43779813 45188158
3668 45188158 46710245 48459668 50312183 51963938 53797091 55770807 57835534 59760008
3660E9760008J966376K063645J951230J771885J805228J615209J456047J419455
3652G3809083J294597J554857J527895J357445J116587J092253Q42809P69453
3644H3364979M95499M06369J67112j09192k29727n17529l45675p61432n19369
3635H1951035n18737l32111l65160m39034l52147m55560k66496l33967j46235
3626G8741588l4446k34949l4753K42584K98196O56004R67521J022540J271863
3617H2896148J486027J825234K026392K313874K684566L004443L381187L884880
3609A03502751L976687M309420M645454M670318M740445M562204M599009M635143
3601A39641431M195551L941534L742795L683066L653122L600887L344915L071998
$$ plain form
3660 59760008 61726384 63790029 65741259 67513144 69318372 70933581 72389628 73809083
3652 73809083 75103680 76658537 78186432 79543877 80660464 81752717 82595526 83364979
3644 83364979 83860478 84266847 84433959 84324767 84095040 83577511 83231836 82470404 81951035
3635 81951035 81432298 81100187 80735027 80295993 79943846 79488286 79221790 78887823 78741588
3626 78741588 78707142 78472193 78437440 78680024 78978220 79634224 80601745 81624285 82896148
3617 82896148 84382175 86207409 88233801 90547675 93232241 96236684 99617871 103502751
3609 103502751 107479438 111788858 116434312 121104630 125845075 130407279 135006288 139641431
3601 139641431 143836982 147778516 151521311 155204377 158857499 162458386 165803301 168875299
3593A68875299L238107L224754K737303J976001J397938O63972J39776q31796
3585A81421354j414953k063704k320468k355528k648938k519000k398962k394294
3577A63305507k633551k301105k290998k659832k588433k540530k450269j986133
3569A43854656j638539j503062p26158k36852L27896Q19818J287446J815627K154904
3560A46155736K299363K603327K923215K797010K942090K826406K591179K595723
3552A67734049K485578K641359K891547K506155K495209K477699K371880K242302
3544A87845778J994610J146723M31490k66031o01236j181059j779654k090365
3536A85500256k745343l184017l400957l673522l750679l810351l502106l614407
$$ plain form
3593 168875299 172113406 175338160 178075463 180051464 181449402 182113374 182253150 181421354
3585 181421354 180006401 177942697 175622229 173266701 170617763 168098763 165699801 163305507
3577 163305507 160671956 158370851 156079853 153420021 150831588 148291058 145840789 143854656
3569 143854656 142216117 140713055 139986897 139750045 140077941 140897759 142185205 144000832 146155736
3560 146155736 148455099 151058426 153981641 156778651 159720741 162547147 165138326 167734049
3552 167734049 170219627 172860986 175752533 178258688 180753897 183231596 185603476 187845778
3544 187845778 189840388 190987111 191418601 191152570 190551334 189370275 187590621 185500256
3536 185500256 182754913 179570896 176169939 172496417 168745738 164935387 161433281 157818874
3528A57818874l250144l050910k956451l213769l427803l475180l763431l401169
3520A31280017l631071l326959k952286k236457j967757j378333r50250n60897
3512A14276007m1815K23116R44727J369140J447426J961537K297970K846373K797538
3503A28122019L012237L422410L452550L585251L990665M106811M334034M863351
3495A58889328N221198N838606O285395O750785P527386Q030419Q919484R642414
3487B17105015J0720838J2073585J3473668J5125622J7279689J9248855K0937453
3480C25964725K1706746K1277892J9971397J7218122J3770536R361919M887699
3473D34159036M30195l124497n125269n998234n984103n068917l757006k719617
$$ plain form
3528 157818874 154568730 151517820 148561369 145347600 141919797 138444617 134681186 131280017
3520 131280017 127648946 124321987 121369701 119133244 117165487 115787154 114836904 114276007
3512 114276007 114234192 114457308 115402035 116771175 118218601 120180138 122478108 125324481 128122019
3503 128122019 131134256 134556666 138009216 141594467 145585132 149691943 154025977 158889328
3495 158889328 164110526 169949132 176234527 182985312 190512698 198543117 207462601 217105015
3487 217105015 227825853 239899438 253373106 268498728 285778417 305027272 325964725
3480 325964725 347671471 368949363 388920760 406138882 419909418 429271337 434159036
3473 434159036 434589231 431464734 426339465 420341231 414357128 409288211 405531205 402811588
3465D02811588k061309k027824l477948n788649r321573j3397713j7545773k1109152
3457C28081647k3304244k4719774k4894628k3451134k1566273j9077104j6358380
3450A74710110j4230987j2084251j0235644r100669p911753o635111n958697n314933
3442A03238065m739499m180754l887237l616940l185441k960953k445773k403067
3434G5818401k470686k163303j792191j906838j676870j482771j532632j452368
3426F1340742j187380j228533j311667j051978r34789j084223q50103o90323q53947
3417E2147799p62132p33772q15318n70042o49930o57372l70245o47204n32948
3408D6408836m05341m61205n14685l22433m04520m05568o11460m03984l96983
$$ plain form
3465 402811588 400750279 398722455 395244507 389455858 380134285 366736572 349190799 328081647
3457 328081647 304777403 280057629 255163001 231711867 210145594 191068490 174710110
3450 174710110 160479123 148394872 138159228 129058559 121146806 114511695 108552998 103238065
3442 103238065 98498566 94317812 90430575 86813635 83628194 80667241 78221468 75818401
3434 75818401 73347715 71184412 69392221 67485383 65808513 64325742 62793110 61340742
3426 61340742 60153362 58924829 57613162 56561184 55626395 54542172 53692069 53001746 52147799
3417 52147799 51385667 50651895 49836577 49266535 48616605 47959233 47588988 46941784 46408836
3408 46408836 46003495 45542290 45027605 44705172 44300652 43895084 43283624 42879640 42482657
3399D2482657m36688l38534l41427l25478l63246l09091k36900k28295k97230
3390C9605768k97650k48679j93366j61855j57233j64669n4851j44682q8548k4301
3380C8069934m447j01721k1757l7091J3692L4919R3471P3386J1423r1288J02635
3369C8143156J23706J65348J60720J53803R4393J35928J50923J06533Q2712J65855
3359C9483077N7980N409L34292N9713K87266J94851J20144K06356K68712K4224
3349D1042024K15197J83192J59030J09297K59103K07928K68809L62322K33201
3340D3040103L91677K48981L52611L23643L15717N35455M35395L29974L91689
3331D6365245N70511K37565L39312L80297L83880O84969O03793M18093N11080
$$ plain form
3399 42482657 42045969 41707435 41366008 41040530 40677284 40368193 40131293 39902998 39605768
3390 39605768 39308118 39059439 38866073 38704218 38546985 38382316 38327465 38182783 38094235 38069934
3380 38069934 38065487 37963766 37942009 37904918 37918610 37953529 38047000 38120386 38131809 38040521 38143156
3369 38143156 38266862 38432210 38592930 38746733 38841126 38977054 39127977 39234510 39317222 39483077
3359 39483077 39541057 39546466 39880758 39940471 40227737 40422588 40542732 40749088 41017800 41042024
3349 41042024 41257221 41440413 41599443 41708740 41967843 42175771 42444580 42806902 43040103
3340 43040103 43431780 43680761 44033372 44357015 44672732 45208187 45643582 45973556 46365245
3331 46365245 46935756 47173321 47512633 47892930 48276810 48961779 49565572 49983665 50494745
3322E0494745O11626O67442O14448N75431P72562O79848R91903O38326R53466
3313E6999797P45850O98113P20060Q46180R17892Q68747P95700Q25165J064121
3304F4481625Q91150R54541J044009J181984J249494J086553J217978Q51186R33562
3295G3892082J150390J109673J222788J346647J298603J295732J370019J532999
3287H4218933J676402J632392J573718J621134J648393J817049J853798J577870
3279I7619689J831759J806923J661450J717403J852674J947680J914915J949074
3271A12301567K026336K433712K396472K580878K619681K539659K688400K766775
3263A32353480K961177K995820L134167L287457L551352L513046L883370L872559
$$ plain form
3322 50494745 51106371 51773813 52388261 52963692 53736254 54416102 55408005 56046331 56999797
3313 56999797 57745647 58443760 59163820 60010000 60927892 61796639 62592339 63417504 64481625
3304 64481625 65372775 66327316 67371325 68553309 69802803 70889356 72107334 72958520 73892082
3295 73892082 75042472 76152145 77374933 78721580 80020183 81315915 82685934 84218933
3287 84218933 85895335 87527727 89101445 90722579 92370972 94188021 96041819 97619689
3279 97619689 99451448 101258371 102919821 104637224 106489898 108437578 110352493 112301567
3271 112301567 114327903 116761615 119158087 121738965 124358646 126898305 129586705 132353480
3263 132353480 135314657 138310477 141444644 144732101 148283453 151796499 155679869 159552428
3255A59552428M035653L928113M247039M638871N062258N377318O061778O690222
3247A99593680P425103Q071482Q716728R317933J0325309J1446309J2294135J3558609
3239B80749288J4628592J5566137J6742769J7371731J7700472J7713983J6803601
3232C97276573J5298046J2151520P574425J652269m719044j1084130j6400238
3225D01749421j9215765k0131011j9214121j7671469j6006365j4251495j2686155
3218B82573040j1090854r938274r125596q055283p386607o730475n908109n549456
3210B18788386n091804m686206m291583l941038l472777l450940l056771k855765
3202A87941502k779409k633413k694726k568447k647722k577900k497883k888275
$$ plain form
3255 159552428 163588081 167516194 171763233 176402104 181464362 186841680 192903458 199593680
3247 199593680 207018783 215090265 223806993 233124926 243450235 254896544 267190679 280749288
3239 280749288 295377880 310944017 327686786 345058517 362758989 380472972 397276573
3232 397276573 412574619 424726139 432300564 433952833 429233789 418149659 401749421
3225 401749421 382533656 362402645 343188524 325517055 309510690 295259195 282573040
3218 282573040 271482186 261543912 252418316 244363033 236976426 230245951 224337842 218788386
3210 218788386 213696582 209010376 204718793 200777755 197304978 193854038 190797267 187941502
3202 187941502 185162093 182528680 179833954 177265507 174617785 172039885 169542002 166653727
3194A66653727k914054k934024l241110k992644l185531l144396l087460l175012
3186A41979496l182536l246475l147616k758890l097913k964410k684774k421217
3178A18475665k388886k338717k242511k026308j746734j891937j841659j902161
3170A02096752j762011j721234j539614j763612j553523j517436j481650j454513
3162H9303159j339077j444168j309139j254436j237817j174773j203266j035618
3154G9304865j032904j007439r62145j064939j016231j053600j160891o59852
3146G1346864p27330j000128p42370p25914p72369p19482p20198p73899n10334
3137F4654840o04850o19874o34239n27799m64330m64981o25677n32753o46890
$$ plain form
3194 166653727 163739673 160805649 157564539 154571895 151386364 148241968 145154508 141979496
3186 141979496 138796960 135550485 132402869 129643979 126546066 123581656 120896882 118475665
3178 118475665 116086779 113748062 111505551 109479243 107732509 105840572 103998913 102096752
3170 102096752 100334741 98613507 97073893 95310281 93756758 92239322 90757672 89303159
3162 89303159 87964082 86519914 85210775 83956339 82718522 81543749 80340483 79304865
3154 79304865 78271961 77264522 76302377 75237438 74221207 73167607 72006716 71346864
3146 71346864 70619534 69619406 68877036 68151122 67378753 66659271 65939073 65165174 64654840
3137 64654840 64049990 63430116 62795877 62268078 61803748 61338767 60713090 60180337 59533447
3128E9533447n96474p02995l99605l96797p50776m94630n65806o75035n03495
3119E4447834l93934n90072m62570m43365m97496l51666n67071o25277l32085
3110E0184298k37969m61178l59277m75684m86920k98356m07736l84757j67400
3101D6905021l57208l04076k67041j38239j49612n90933j88482k57119j67931
3092D4484380l15253k35960j38561q1075k41195l08110j24405k59924l59623k20893
3082D2199381k43757k14988j48377j9754K3795k18206k22966j15776j99456q4807
3072D0755089k15709j52541j03836o1358k40265q5339l11875k0067j68451l11450
3062C9084198j90077k65246j13639k19357j59423k00009k73170j97802k35631
$$ plain form
3128 59533447 58936973 58233978 57834373 57437576 56686800 56192170 55626364 54951329 54447834
3119 54447834 54053900 53463828 53001258 52557893 52060397 51708731 51141660 50516383 50184298
3110 50184298 49946329 49485151 49125874 48650190 48163270 47864914 47457178 47072421 46905021
3101 46905021 46547813 46243737 45976696 45838457 45688845 45097912 44909430 44652311 44484380
3092 44484380 44169127 43933167 43794606 43713531 43472336 43164226 43039821 42779897 42420274 42199381
3082 42199381 41955624 41740636 41592259 41572505 41596300 41378094 41155128 41039352 40839896 40755089
3072 40755089 40539380 40386839 40283003 40221645 39981380 39896041 39584166 39564099 39395648 39084198
3062 39084198 38894121 38628875 38515236 38295879 38136456 37936447 37663277 37465475 37229844
3053C7229844k53341l15103k92479j10830k20292k12027l39588k62123k26141
3044C4997920p0483j54086k76199j51113j46498N8852k11134j42800j95938l12039
3034C3396482j64196k03833p0256k56443m4177j52943k21464m28730m16198k35427
3024C1202815k56557l74202k82797k68235l4840l47950j73311j07919l81461n3811
3014B8921732j03537j46993o6357k7856r3181j04042P124R2557j08339q657Q2490
3003B8444941l6675m5926Q0562J6622P4045L9941O8570J38788P3762M998n2432
2992B8807196L9115J1999K3179M5901K10899O7819P5611K18338K55019L26931
2982C0082007J31426J36111K21789L2214J94645O5986R7999L55989J89837R183
$$ plain form
3053 37229844 36976503 36661400 36368921 36258091 36037799 35825772 35486184 35224061 34997920
3044 34997920 34927437 34773351 34497152 34346039 34199541 34258393 34047259 33904459 33708521 33396482
3034 33396482 33232286 33028453 32958197 32701754 32657577 32504634 32283170 31854440 31438242 31202815
3024 31202815 30946258 30572056 30289259 30021024 29986184 29638234 29464923 29357004 28975543 28921732
3014 28921732 28818195 28671202 28604845 28576989 28483808 28379766 28386890 28479447 28371108 28362451 28444941
3003 28444941 28408266 28362340 28442902 28459524 28533569 28573510 28642080 28780868 28854630 28859628 28807196
2992 28807196 28846311 28858310 28881489 28927390 29138289 29206108 29281719 29500057 29755076 30082007
2982 30082007 30213433 30349544 30571333 30603547 30798192 30864178 30962177 31318166 31508003 31517186
2972C1517186j0403K94415K71069M93534L90057L09686L29609N00241M55450M58756
2962C5009600M08565K81387L06536K93103K71112L53585L38606J90447O02332
2953C8055273N85059N39755M86853N17861L55066L94736O76052N95032O04001
2944D2809688N85151M41701M99200Q93012O05213O84297Q53316Q77317R23268
2935D9172163J009626J142862J246076J273465J149332J337119J589754J662907
2927E9583304J546534J852909K053005J894172J990533K332504J950636K210714
2919G5414311K171900J607585J746638J501540J109974J009390J022635Q80494
2911H6464467O65716Q14064P90099R15938J321638J279287J247630J692895J877856
$$ plain form
2972 31517186 31506783 31801198 32072267 32565801 32955858 33265544 33595153 34095394 34550844 35009600
2962 35009600 35418165 35699552 36006088 36299191 36570303 36923888 37262494 37452941 38055273
2953 38055273 38640332 39180087 39666940 40184801 40539867 40934603 41610655 42205687 42809688
2944 42809688 43394839 43836540 44335740 45228752 45833965 46518262 47371578 48248895 49172163
2935 49172163 50181789 51324651 52570727 53844192 54993524 56330643 57920397 59583304
2927 59583304 61129838 62982747 65035752 66929924 68920457 71252961 73203597 75414311
2919 75414311 77586211 79193796 80940434 82441974 83551948 84561338 85583973 86464467
2911 86464467 87130183 87944247 88734346 89650284 90971922 92251209 93498839 95191734 97069590
2902I7069590K336064K852833K949672L349579L858040M211128M552631M821221
2894A26000758N220027N570518N716831N517640M691813L462561J612380n77890
2886A57214638k710226m030761m876951n155308m939896m006079k934529k050651
2878A26510237j043878l62008M88651J042092J523508K106365K533282L049870
2870A35848119L566473L721590L867935L762474L813817L968764L490204K637548
2862A64676924J822577P96287p92395j962749k864224m145677n261011n839272
2854A46430460o200063o018697n623505m551074l606748k974338k269655j658652
2846A13527728r20138n66890K5617K31657N51689N22777N85828L04646k64989
$$ plain form
2902 97069590 99405654 102258487 105208159 108557738 112415778 116626906 121179537 126000758
2894 126000758 131220785 136791303 142508134 148025774 152717587 156180148 157792528 157214638
2886 157214638 154504412 150473651 145596700 140441392 135501496 131495417 128560888 126510237
2878 126510237 125466359 125104351 125593002 126635094 128158602 130264967 132798249 135848119
2870 135848119 139414592 143136182 147004117 150766591 154580408 158549172 162039376 164676924
2862 164676924 166499501 167295788 166503393 164540644 161676420 157530743 152269732 146430460
2854 146430460 140230397 134211700 128588195 124037121 120430373 117456035 115186380 113527728
2846 113527728 112607590 112040700 112066317 112297974 112849663 113372440 113958268 114262914 113997925
2837A13997925n87604j102067j705249k288151k829989l437501m155388m745843
2829I3146133m522770m290749m155737l443861l328075l094793k461472k489892
2821F5358784k253716k029081j943598j656751j542022j496311j283326j334647
2813E1819332j105463r52005q11495p16807r74661r68612j215749j339508j291004
2804D2444028j263423j160627j145093j093770j126738q59449j044498q40261
2796C3910169p96481p41049o81878p49549o74487r79617o37717n47913o29196
2787B7472282o18884o25999l35828l64910m69280n81689n15354k52098l22884
2778B3385356l29822k50341l32113j58768k11773k56498l78106l39965l99081
$$ plain form
2837 113997925 113410321 112308254 110603005 108314854 105484865 102047364 97891976 93146133
2829 93146133 88623363 84332614 80176877 76733016 73404941 70310148 67848676 65358784
2821 65358784 63105068 61075987 59132389 57475638 55933616 54437305 53153979 51819332
2813 51819332 50713869 49761864 48950369 48233562 47258901 46290289 45074540 43735032 42444028
2804 42444028 41180605 40019978 38874885 37781115 36654377 35794928 34750430 33910169
2796 33910169 33113688 32372639 31690761 30941212 30266725 29287108 28649391 28101478 27472282
2787 27472282 26853398 26227399 25891571 25526661 25057381 24475692 23960338 23708240 23385356
2778 23385356 23055534 22805193 22473080 22314312 22102539 21846041 21467935 21127970 20728889
2769B0728889k76050l93612l69115l37661k97079m17232l58879l11105m33233
2760A7534923n02013l77496k17202l07558k92839j46799k71669k63695l36940
2751A4818712j35268j21455k34177o6478o2999M0916j52958l65885k13402j33517
2741A3373489k51635k80573k17114r4340k45763j87776l09166j65998k54777k45925
2731A1120422l11423o7309k46381K1878j28558j75336j29002k91784j56237k37693
2721I398577j16104q1992j26282k21785j43855q2392p6310q8801k49161k54300
2711G957595k3195q0534j13044l5513p6492q6167P3514j40198j15670j20079k32966
2700G007251m7550P1181n4088q6352j89k07158o0171R902p2834r5860O9830N2433
$$ plain form
2769 20728889 20452839 20059227 19690112 19352451 19055372 18638140 18279261 17968156 17534923
2760 17534923 17032910 16655414 16438212 16130654 15837815 15691016 15419347 15155652 14818712
2751 14818712 14683444 14561989 14327812 14261334 14198335 14239251 14086293 13720408 13507006 13373489
2741 13373489 13121854 12841281 12624167 12529827 12284064 12096288 11787122 11621124 11366347 11120422
2731 11120422 10808999 10741690 10495309 10517187 10388629 10213293 10084291 9792507 9636270 9398577
2721 9398577 9282473 9200481 9074199 8852414 8708559 8626167 8549857 8461056 8211895 7957595
2711 7957595 7934400 7853866 7740822 7705309 7628817 7542650 7616164 7475966 7360296 7240217 7007251
2700 7007251 6959701 7030882 6976794 6890442 6890253 6683095 6622924 6632826 6559992 6464132 6533962 6586395
2688F586395j77975j00492L5277m2014k1672k2632n2110j69968P4062K0915Q0107
2677F209893K7398k36211q0289j1368j50535l1176j62613M0812o920Q16j64357
2666E435450j2611K09368k0605n6979j36403n5371q8651o3237j75199p5052R1016
2655E051726q722N4096j04535j6039K7437q3099j29009j2642J69256j37466O7616
2644D878619j17782j6752j04202P6542R4839J42506j51415j39043N833J34345
2634D803490O884o4515N8566m4059p4655O930j20694j4621J97508p4687j4282
2623D665865q4635l9981m3642j96657o5673J47564J08989J47833O0844j60626
2613D539881k9490J6857m6755M3451m0593m9931K21892J5259K3943P3500r3198
$$ plain form
2688 6586395 6408420 6307928 6343205 6301191 6279519 6256887 6204777 6034809 6108871 6129786 6209893
2677 6209893 6237291 6001080 5920791 5909423 5758888 5727712 5565099 5605911 5598991 5599807 5435450
2666 5435450 5422839 5632207 5611602 5554623 5418220 5362849 5274198 5210961 5035762 4960710 5051726
2655 5051726 5043004 5097100 4992565 4976526 5003963 4920864 4791855 4779213 4948469 4811003 4878619
2644 4878619 4760837 4744085 4639883 4716425 4811264 4953770 4802355 4663312 4669145 4803490
2634 4803490 4810374 4745859 4804425 4760366 4685711 4692641 4571947 4557326 4754834 4680147 4665865
2623 4665865 4581230 4541249 4497607 4300950 4235277 4382841 4491830 4639663 4700507 4539881
2613 4539881 4510391 4527248 4480493 4523944 4483351 4433420 4655312 4670571 4694514 4768014 4674816
2602D674816j25098j37535j07058R5151J35150k8101j28354j50912N0478n4779
2592D223758k2009r0224J3035Q3097M4740K3325j38883J49495K28604k42633j56409
2581D115896P1844K10488k2681j74279J37307j13236N400K2297q9039J60808l8809
2570D285996J4059n9570j98749M0845k41855j17297J43771P9489j34542j5131
2560C797016p9418p6694j7930r607J35784n1236J3312r5958j61928R7418M2430
2549C593189j98449o9761J0615J26679k27513J9117P7286k15456p4670J42867
2539C183904l8803k49620J70509q3842n1250J64974J00266j6100k66647O1557
2529B974948o9203j70394J5620m2303J132k1667k0199l7168K69830o5511p7681
$$ plain form
2602 4674816 4549718 4412183 4305125 4400276 4535426 4507325 4378971 4228059 4278537 4223758
2592 4223758 4201749 4111525 4124560 4207657 4252397 4275722 4136839 4286334 4514938 4272305 4115896
2581 4115896 4187740 4398228 4375547 4201268 4338575 4225339 4230739 4253036 4163997 4324805 4285996
2570 4285996 4300055 4240485 4041736 4082581 3840726 3723429 3867200 3946689 3812147 3797016
2560 3797016 3717598 3640904 3622974 3613367 3749151 3697915 3711227 3615269 3453341 3550759 3593189
2549 3593189 3394740 3324979 3335594 3462273 3234760 3253877 3331163 3115707 3041037 3183904
2539 3183904 3145101 2895481 3065990 2982148 2930898 3095872 3196138 3180038 2913391 2974948
2529 2974948 2905745 2735351 2750971 2708668 2709800 2688133 2667934 2630766 2900596 2835085 2757404
2518B757404n2025o1094j27990l2187K20397J5113L2601j53976l758o1834L6109
2507B568760Q6258k09948j49200J07813n4400j08727J38934j55481K9420J63285
2497B416714j32443l506j30565r2027q2301j52043Q2540K6691J9901J8847n9944
2486A911864k34104J2610J84997n3392o0093L9893j6869K9279J41673m2590k38500
2475A674768M2801Q0828K891O0999m2108P071j90917M4773j8758j10108o974p5624
2463A469642K8961K00754J9919j54584r6023Q5171m8693M20l6377N1578j8795
2452A501973n7223P657p9524r0620J41982L5821p3309L4610j6354K0200p5983
2441A349230L1006p6942N1580L2798j69134m0518O7747j16986P3688J65794L3934
$$ plain form
2518 2757404 2705379 2644285 2516295 2484108 2704505 2719618 2752219 2598243 2594485 2532651 2568760
2507 2568760 2655018 2445070 2295870 2403683 2349283 2240556 2379490 2224009 2253429 2416714
2497 2416714 2284271 2280765 2150200 2058173 1975872 1823829 1906369 1933060 1952961 1971808 1911864
2486 1911864 1677760 1690370 1875367 1821975 1761882 1801775 1784906 1814185 1955858 1913268 1674768
2475 1674768 1717569 1798397 1801288 1862287 1820179 1827250 1636333 1681106 1662348 1552240 1545266 1469642
2463 1469642 1498603 1699357 1719276 1564692 1468669 1553840 1505147 1505567 1469190 1520768 1501973
2452 1501973 1444750 1452407 1372883 1282263 1424245 1460066 1386757 1421367 1405013 1425213 1349230
2441 1349230 1380236 1303294 1354874 1387672 1218538 1178020 1245767 1128781 1202469 1368263 1402197
2430A402197j63150j37285O1791N7966P870p0225j36568n974l2564n0580O1092
2419I94570N7784j73555r8959Q1573O7958K8224R8375P3685o345j46310q854N7449
2407A025595p4611P8160j07673j36713L7666j09004N2699J17991P9432N4565j17867
2396I00240R2001J6766L0871K5887L9318j22584M8165q6686L6429q8521m5767
2385H46119O3323p9610K9710M9488j8179j62420J12785N7365q0959l86O115J7147
2373H40498K7188j46230l6731P8215m1070l494J4419P2877j53169o3511N0585
2362F39577m2861O3242J70782K26258j32571M0253M2260l8992p5157K3001q8821
2351H26971p2075j02226l0737j3535j3054q024M1388k4863L2318Q4381l67j88149
$$ plain form
2430 1402197 1239047 1101762 1163553 1221519 1229389 1159164 1022596 1016622 984058 933478 994570
2419 994570 1052354 878799 779840 861413 929371 957595 1055970 1129655 1123310 977000 968146 1025595
2407 1025595 950984 1029144 921471 784758 822424 713420 766119 884110 963542 1018107 900240
2396 900240 992241 1009007 1039878 1065765 1105083 982499 1030664 943978 980407 891886 846119
2385 846119 909442 829832 859542 909030 890851 728431 841216 898581 817622 817236 823351 840498
2373 840498 867686 721456 684725 762940 721870 718376 732795 805672 652503 588992 639577
2362 639577 596716 659958 830740 1056998 924427 964680 1006940 967948 892791 915792 826971
2351 826971 754896 652670 621933 608398 595344 587320 628708 603845 636163 720544 720177 532028
2339E32028J01039O7512p521k8067J26520j64211k52449J09383M1198M4232L7784
2328F07448o1924k1264j9474o5780O5171j64141M744R2732l2887p2461O1183O1521
2316D54868Q6294J7444N2843n870N1145J5990k65680J771J44699n6358o4581j09774
2304C22791J63844J79j29628n6812m664J21118R5391K5508P9010j21766N7940
2293E52911q3021j99733n1076J05258J39047o0048J8567k5653m671r3421p9067
2282B19093Q9992J62996N3669N1882K6066N638l5690j07629j64044N1173O6773
2271D19919q7212p3575o4506p2961J70640L4516J11366J19429o7436j14395j348
2260C74437p4355n5350K0461O971J26386k9561J09259Q1761j5887j3019l2634
$$ plain form
2339 532028 633067 700579 693058 664991 791511 627300 374851 484234 525432 569664 607448
2328 607448 545524 524260 504786 439006 504177 340036 344780 437512 404625 332164 393347 454868
2316 454868 541162 558606 611449 605579 656724 672714 407034 408805 553504 497146 432565 322791
2304 322791 486635 486814 357186 300374 295710 416828 512219 537727 616737 494971 552911
2293 552911 469890 270157 219081 324339 463386 403338 421905 396252 391581 298160 219093
2282 219093 309085 472081 525750 577632 603698 609336 573646 466017 301973 353146 419919
2271 419919 332707 259132 194626 121665 292305 326821 438187 557616 490180 375785 374437
2260 374437 300082 244732 265193 272164 398550 368989 478248 560009 544122 531103 498469
2249D98469n7383K4875K6229O9368l3594J6175j7824j5912k2347L4305P7968k9835
2237E70494P5308j24705j64452J8081M7847M8890R3051p3654J2821K2530k9445
2226D96766O3958k9789J3912Q9133n1465j53844R4836p6609j51169L2708J55466
2215D83903j31475n772j0845K7637J03185R5484J64972n4085k0695j8504q5215
2204E48590K7538j6878J14950p6485J19208j61001J0826j05156j7694R2466Q339
2193E44703R3503o0384J19571J5476l2117O4220p9783J80230J07469k46471N4069
2182G60486o7214J46102o4811J49965J20406m4043J1180M1873J0151j06479j17811
2171H39805J24682L3433M1541J21149O7290Q3138r0106K7883K0260j11606j9051
$$ plain form
2249 498469 441086 465961 492190 561558 527964 544139 526315 510403 488056 522361 600329 570494
2237 570494 645802 521097 356645 374726 422573 471463 564514 490860 503681 526211 496766
2226 496766 560724 530935 544847 633980 582515 428671 523507 446898 295729 328437 483903
2215 483903 352428 346656 335811 363448 466633 562117 727089 673004 652309 633805 548590
2204 548590 576128 559250 674200 597715 716923 555922 566748 461592 443898 536364 544703
2193 544703 638206 577822 697393 712869 680752 744972 665189 845419 952888 706417 760486
2182 760486 693272 839374 774563 924528 1044934 1000891 1012071 1053944 1064095 957616 839805
2171 839805 964487 997920 1039461 1160610 1227900 1311038 1220932 1248815 1269075 1157469 1138418
2160A138418J84873m6438l437K40425J44508J2887m3707J43212M8927J9730J19365
2149A958763J996j66701K3677l567J72725P0501R1675M5841O3760J95533q2431
2138B371772k1158j3969L6523M595K27760J53938q152P9674J29555K37716J23255
2127C321509K12524J13299J24946k2379J52861K80755K01367M9248K28876K96945
2117D959951L34733L11228L39234J01494L41536K35899M19871K95940L99310N81828
2107H321024O09935O25772Q03702R07934N91173N74946P25960R80204J370997
2098A5511647J732688J936210K499114L469913M704383O542153Q609432J0721438
2090E5726978J0982509P024220m911910j3870353j2196585r448023o100239m224766
$$ plain form
2160 1138418 1323291 1276853 1273416 1513841 1658349 1671236 1627529 1770741 1819668 1839398 1958763
2149 1958763 1960759 1794058 1817735 1814168 1986893 2057394 2149069 2194910 2258670 2454203 2371772
2138 2371772 2350614 2336645 2373168 2377763 2605523 2759461 2751309 2830983 2960538 3198254 3321509
2127 3321509 3534033 3647332 3772278 3749899 3902760 4183515 4384882 4434130 4663006 4959951
2117 4959951 5294684 5605912 5945146 6046640 6388176 6624075 7043946 7339886 7739196 8321024
2107 8321024 8930959 9556731 10360433 11268367 11859540 12434486 13160446 14140650 15511647
2098 15511647 17244335 19180545 21679659 25149572 29853955 36396108 45005540 55726978
2090 55726978 66709487 73733707 68821797 54951444 42754859 33306836 27206597 22981831
2082B2981831l608728k850617k014148j635102r83570p93775o25414m36271n38851
2073I495355o82528o37040p24167n02945l74112k91310l44330l43626k92867k88795
2063E013635m35093l61529k89505l9906k02088l14056Q159j51161q6665n2849
2053C088942j80001j4935n5066j14839j40353p4789k04146M9873L0849p6374N0018
2042B359179j99985l76818m4872N72P0895R542j77182q3947O5196Q8119j13920
2031A596779j85172k3265q003J02947n5493j27628P6258Q1213q9618J28352j9925
2020A476445r4055o4819j82394J90315l9479j48652k5510l2856l2812o4984p9035
2009I02164p6934K1934R3709n2248J08552j74563k06316p7243P0876n1626R3479
$$ plain form
2082 22981831 19373103 16522486 14508338 12873236 11889666 11095891 10470477 10034206 9495355
2073 9495355 8812827 8175787 7451620 6948675 6574563 6283253 5938923 5595297 5302430 5013635
2063 5013635 4578542 4217013 3927508 3887602 3685514 3371458 3379617 3228456 3141791 3088942
2053 3088942 2908941 2894006 2838940 2724101 2583748 2508959 2304813 2354686 2385535 2309161 2359179
2042 2359179 2159194 1782376 1737504 1738076 1808971 1818513 1641331 1557384 1622580 1710699 1596779
2031 1596779 1411607 1388342 1380339 1483286 1427793 1300165 1376423 1457636 1368018 1496370 1476445
2020 1476445 1382390 1317571 1135177 1325492 1286013 1137361 1111851 1078995 1046183 981199 902164
2009 902164 825230 847164 940873 888625 997177 822614 616298 539055 609931 558305 651784
1998F51784j9014k7712K62241J94235j92133j6123j23080q5797k31592k7287J33922
1987E19444M1013Q9554q2075K5057k0444k39579M7004J48117N0578j123l893k461
1975E71192J7134j14903P4893P3288l6279j64350R0071Q2790j02658M3713K6367
1964E61258m1220o9878P9773j29388o1162m0391Q862K5387P0180q1333j07761
1953B14327l678Q6563J81382L7923k31428k5638L4688M9023O6662M3067j12837
1942C40054j65620K68277k2615j02131M6944n1786l7286P5881r1677O1747L9J635
1930C23462J18644m4652K3538o6452l2081J3890j97245M0422K39771o0569o2707
1919B96021R472j3052m1190r9697j5465J59658n1358P378K1689l3180r8392L6975
$$ plain form
1998 651784 632770 605058 867299 1061534 869401 853278 730198 644401 412809 385522 519444
1987 519444 560457 650011 567936 592993 572549 332970 379974 528091 578669 577546 573653 571192
1975 571192 588326 473423 548316 621604 585325 420975 511046 593836 491178 534891 561258
1964 561258 520038 450160 529933 400545 339383 298992 307854 333241 403421 322088 214327
1953 214327 210649 297212 478594 516517 285089 259451 294139 343162 409824 452891 340054
1942 340054 174434 442711 420096 317965 364909 313123 275837 351718 260041 321788 321827 323462
1930 323462 442106 397454 420992 354540 322459 336349 139104 179526 419297 358728 296021
1919 296021 305493 292441 251251 151554 136089 295747 244389 251767 273456 240276 141884 178859
1907A78859l7587l6907M2936J22104J93734j22148p2806n4154N5628j28113L5885
1896A77431q8268j63324J68322J43048Q4804l9872l5679J0398K8512j86880J56658
1885B55150q0526j3452r130M4887m7450l0047j4788Q2621J1098l2472M5370l869
1873B07392P890P0023J10507j67207j79607J02074k8380L8455P8689q9091J00237
1862B50982j24396n0086Q4776L345P4133o7143j06689K8089L2589N9007j09506
1851G5101J10380j37162N5631k6732k23270J72389O3069J11036r0320r3739K05607
1840B21990J1488M95o3364j61663r7536N4318N3197N1820o0187J76629J34334
1829C21521l0891j20378K8704J43532J857P6636j0976l6676J3832J37553O0782
$$ plain form
1907 178859 141272 104365 147301 269405 463139 340991 268185 214031 269659 141546 177431
1896 177431 89163 -74161 94161 237209 322013 282141 246462 256860 285372 98492 255150
1885 255150 174624 161172 152042 196929 149479 119432 104644 187265 198363 165891 211261 207392
1873 207392 215282 285305 395812 228605 48998 151072 122692 161147 239836 150745 250982
1862 250982 126586 76500 161276 164621 238754 171611 64922 93011 125600 184607 75101
1851 75101 185481 48319 103950 77218 -146052 26337 89406 200442 110122 16383 221990
1840 221990 233478 233973 170609 8946 -88590 -34272 18925 70745 10558 187187 321521
1829 321521 290630 170252 198956 342488 344345 420981 410005 373329 387161 524714 585496
1818E85496L2611l2733j85474j27463L3335j21982j01525J07665O5478j35437
1808A19971j0064M2948r3927J47881J00443k35542m7036K14648M2879j34999k5444
1797A21758P995O1699J05668R920j32353Q4443r651j20045O5353P4463n2064k9614
1785A87572P7571j4753j03884j26599J48296J02504l9893k02626Q663J20805J28034
1774B85690r0546m1778m1699M0809J34889l4754L0321l952j22777L1173L2622
1763B19998r7270N4145O8625r5774k9036L6745q0032l9095J68274k8832r5898
1752H1850M1166p1566Q2746n6258q3506J95148n3032j28963J7698j7184N7052
1741F5151q073J19301K0J12997j6904r7363r383m1301j3976P0015l4540N2716
$$ plain form
1818 585496 618107 585374 399900 272437 305772 183790 82265 189930 255408 119971
1808 119971 109907 152855 58928 206809 307252 71710 24674 239322 282201 147202 121758
1797 121758 129753 191452 297120 307040 174687 259130 249479 129434 194787 269250 217186 187572
1785 187572 265143 250390 146506 19907 168203 270707 230814 28188 36851 157656 285690
1774 285690 195144 153366 111667 152476 287365 252611 282932 278980 156203 187376 219998
1763 219998 122728 176873 245498 149724 120688 157433 77401 38306 206580 177748 81850
1752 81850 123016 51450 134196 77938 -5568 189580 136548 7585 25283 8099 65151
1741 65151 57078 176379 176399 289396 272492 175129 165746 124445 110469 180484 145944 198660
1729A98660k5934M7273j3552l7684o643R1765Q2445k07256p9428L354P383J26549
1717A86932p2695M8263J24q6408m7242j7975R7689n5704j87824O0072P6601n5017
1705e3184K37846J9285k83143k4403M2121o5472P3361P5453p2932K7679n959M6960
1693A7612J03498O1595K9497j04424R5375p4780n355l2786p7915o3994J21715
1682G0038k527j16316J17997j2177N863n9676O4064j6708j01107J23723p3183
1671iQ7882j41205k5930n19p023J05516J43867J34998q0070J5320j67446j63279
1659i7898J13986N3755k3532k7955j186q1572O4941L1971Q0333j40532p550J19968
1647H4729l8746O8123j3580j7762R7690j19002j15675N1877Q1472J46232o4490
$$ plain form
1729 198660 172726 219999 206447 168763 162120 253885 336330 129074 49646 53000 60383 186932
1717 186932 114237 162500 162624 76216 28974 10999 108688 52984 -134840 -74768 1833 -53184
1705 -53184 184662 203947 -79196 -103599 -61478 -126950 -53589 21864 -51068 -23389 -29348 17612
1693 17612 121110 182705 212202 107778 203153 128373 123018 90232 12317 -51677 70038
1682 70038 67511 -48805 69192 57015 62878 3202 67266 50558 -50549 73174 -9
1671 -9 87873 -53332 -79262 -79781 -86804 18712 162579 297577 217507 232827 65381 -97898
1659 -97898 16088 69843 46311 18356 17170 -64402 539 32510 112843 -27689 -35239 84729
1647 84729 45983 114106 100526 82764 180454 61452 -54223 -2346 79126 225358 160868
1636A60868j04030J60065j58063j74766R5184J45788O7477k9657K9066j53018
1626C8914j64313J30568k3747j17065J34971K6921O5549l0953p3883r903P4699
1615E1758L1265o4201J6766J76482p4808j40421K31379l1720k18732J43873j11098
1604A0543L5370Q6327j16176m9933J5573l733j2797J39724L8825m4378K2453j66132
1592d4334K4306O8177k4858j43949j8243J61382k3317k5584J67953m0820M7148
1581A47861j15215k00475L7717L0575K10146m545l8237J37897o8269R3880k7834
1570B03501m1397n278j47121m5192N7932l8777R7774P8239L2979q7592p4247M6347
1558G7168k2615Q1225m9266K4854J7602r889m3905l3167j02019Q8031P6474J936
$$ plain form
1636 160868 56838 216903 58840 -115926 -20742 125046 192523 162866 191932 38914
1626 38914 -125399 5169 -18578 -135643 -672 26249 91798 60845 -13038 -22941 51758
1615 51758 83023 18822 35588 212070 137262 -3159 228220 196500 -22232 121641 10543
1604 10543 45913 132240 16064 -33869 -18296 -22029 -34826 104898 143723 99345 121798 -44334
1592 -44334 -20028 48149 23291 -120658 -138901 22481 -836 -26420 141533 100713 147861
1581 147861 32646 -167829 -130112 -99537 110609 106064 67827 205724 137455 231335 203501
1570 203501 162104 156826 9705 -35487 22445 -16332 81442 159681 192660 105068 30821 77168
1558 77168 54553 135778 86512 111366 128968 119079 75174 42007 -60012 28019 104493 106429
1546A06429q1455m1408J11496l9300o3092j8991N0639K3668J7670k27724J75357
1535A3289L5161j64292N5690Q9478q3399p9678J11160n7212k2906O3883R3413
1524E4587j19046J7912J1803q43j13373R8393N5299r887M555K3579j2817J34634
1512A44796K3987j26859n0508o9252p3229J49693j6066k3219J83407P8580j57527
1501F3803j32171Q8222K30q763J98393L8652k49336n9725J26492J47303Q9950
1490C03050j62950o3188M6399j33586q4724L3934J03694J36116l6079j32444l3593
1479b3371P9414l5767j10102j7995p0106O9529k7351K00625K18987l7229j66427
1468H0207n3095J15172o8782r3845l6574l452J9566r960J14028j11032K67996
$$ plain form
1546 106429 24974 -16434 95062 55762 -7330 -26321 24318 47986 65656 -162068 13289
1535 13289 48450 -115842 -60152 29326 -54073 -133751 -22591 -79803 -102709 -38826 54587
1524 54587 -64459 -46547 -34744 -35587 -148960 -50567 4732 -5155 -600 22979 10162 144796
1512 144796 168783 41924 -8584 -77836 -151065 -1372 -17438 -40657 142750 221330 63803
1501 63803 -68368 19854 20084 11321 209714 248366 -970 -60695 65797 213100 303050
1490 303050 140100 76912 123311 -10275 -94999 -61065 42629 178745 142666 10222 -23371
1479 -23371 56043 20276 -89826 -107821 -177927 -108398 -135749 64876 283863 246634 80207
1468 80207 27112 142284 73502 -20343 -56917 -60369 -40803 -50763 63265 -47767 220229
1457B20229m3496j58511l750L3998J2825q9739j14110M1139m9602K716J50382
1446B081J39759M7049k19312O7840o8924o4562l59l8561m3647J21458J25253M8832
1434A16907j04273J4004p2839R8545K2578L6172L9758j04856l0404P5639r7518
1423f287N9931K5334n0364J2769j69675J02129N4117N0691J48336k08682q2131
1412f3832J26476q8506j15308J14523N1917K3687J36351j18888J3186R635p3745
1401A5496m4646L0741J0673r9045j3754O5956J74075N5239J18849j40139k61796
1390h8351Q6748r532q2010O3031O8533N9710o0075k7639k0235J9668L0177o1458
1378b1433J08436n1959J25487j81380j0089J2982p5065M2719K6473k6778o1410
$$ plain form
1457 220229 176733 18222 14472 48470 61295 -28444 -142554 -101415 -151017 -148301 2081
1446 2081 141840 188889 -30423 37417 -31507 -96069 -96428 -134989 -178636 -57178 68075 116907
1434 116907 12634 26638 -46201 52344 74922 111094 150852 45996 15592 91231 -6287
1423 -6287 53644 78978 28614 41383 -128292 -26163 27954 78645 226981 18299 -63832
1412 -63832 62644 -25862 -141170 -26647 25270 48957 185308 66420 79606 89241 15496
1401 15496 -29150 1591 12264 -86781 -100535 -34579 139496 194735 313584 173445 -88351
1390 -88351 -1603 -11135 -93145 -30114 38419 98129 38054 10415 -9820 9848 40025 -21433
1378 -21433 87003 35044 160531 -20849 -30938 -17956 -93021 -50302 -23829 -50607 -112017
1367a12017O0628J8287M1640j41982J27904o1187p3865P2300o6283J35515j80782
1356a79842k3156J98938M6868q7864o7262J41889l5447j2440M1269J40109N2923
1345B15985p4797m2731P540N9625r0516j60895r4055J37112P8577j16516m1629
1334a22300k054M2334q4079J59627K3294m4881N2976P5188Q776o8593P1723j28664
1322a6653k8373J11402Q555j01726N7634j23903Q9608J9427K1713m874o0810p7650
1310a05650J4021J03458J07368r1832q2305K2198J19175N0224n5056J03765j35891
1299D9475Q6267m4412j29649J25347j9054J2733q6879P0545J44697k25139p2277
1288h8346J74334p3931O5957N6320n9490L13940q4411j76401p1716n315R4339
$$ plain form
1367 -112017 -51389 -33102 8538 -133444 -5540 -66727 -140592 -68292 -134575 940 -179842
1356 -179842 -202998 -4060 42808 -45056 -112318 29571 -5876 -18316 22953 163062 215985
1345 215985 141188 98457 105997 165622 75106 -85789 -179844 -42732 35845 -80671 -122300
1334 -122300 -124354 -82020 -166099 -6472 16822 -28059 24917 100105 108881 40288 112011 -16653
1322 -16653 -45026 66376 74931 -26795 30839 -93064 -3456 15971 37684 32810 -28000 -105650
1310 -105650 -91629 11829 119197 27365 -54940 -32742 86433 136657 81601 185366 49475
1299 49475 135742 91330 -38319 87028 67974 80707 -6172 64373 209070 -16069 -88346
1288 -88346 85988 12057 78014 134334 74844 388784 304373 127972 56256 50941 145280
1277A45280j32333l4550j6722O8631J05545m3475L4121M3432j21441L6568j4082
1266G0974j30905k5511O4794J33557N3246j07599n6310J30592j21767o6320J45128
1255H9879J12087o0394j12794o935l0842j7801K4246m4822p816N6995J51231m7293
1243A05741o4703J02075k2548p3648J3435k0473O443K8313m4307k1040m5070l9611
1231g5393J2882L1748R3712j12636O8087j5215J62008j97264k7442m5254J27944
1220B3177M8546r5365Q7865m7362J57518p5720J06554P34j10261q6044P5495n4626
1208C0511r9263J12941Q4818k4244j37540q139P5231R0182j77538p2720K1124
1197a04637J57938P6065j83248k4947J65555l4966M5952J38383o8158j0372k46767
$$ plain form
1277 145280 12947 -21603 -38325 30306 135851 92376 126497 169929 48488 85056 70974
1266 70974 -59931 -85442 -20648 112909 166155 58556 2246 132838 11071 -55249 89879
1255 89879 201966 141572 28778 21843 -8999 -26800 -2554 -47376 -55192 1803 153034 105741
1243 105741 41038 143113 120565 46917 60352 39879 46322 74635 30328 9288 -35782 -75393
1231 -75393 -62511 -30763 62949 -49687 18400 3185 165193 -32071 -59513 -104767 23177
1220 23177 71723 -23642 64223 16861 174379 98659 205213 205947 95686 9642 85137 30511
1208 30511 -68752 44189 129007 104763 -32777 -40916 34315 124497 -53041 -125761 -104637
1197 -104637 53301 129366 -53882 -78829 86726 51760 97712 236095 167937 157565 -89202
1186h9202j4130k008L1613j4254n4099l5296Q7761J916j23600P9836p7900J351
1174b08012O6002J41258N7766k0380j1020j210O1840j17223j69013k325L6744
1163a65573J36898j31341q2097J4254J32906O5787K8133K7724j03928j4764J74111
1152H2110o5666n6508K40765j88770m1881N9984J5121J1733K1703o4084L9492
1141E3999P2978p6077j38123K8321L6684P0112j78475k9j2526K91223p3421l9663
1129C5003j57371J5860N0065J67853N7975j98298P0413R1945L868N980K453k7391
1117A18355p4135o0938N6120p9949J5731p2747R4196N590K7693O0657k64482K3783
1105a50126N4508J38514J9861j14784J08925K3360J6201m9731j17353K1715J17333
$$ plain form
1186 -89202 -103332 -105340 -73727 -87981 -142080 -177376 -89615 -87699 -211299 -131463 -209363 -208012
1174 -208012 -142010 -752 57014 36634 25614 24404 86244 -30979 -199992 -202317 -165573
1163 -165573 -28675 -160016 -242113 -227859 -94953 -29166 -1033 26691 -77237 -92001 82110
1152 82110 16444 -40064 200701 11931 -29950 30034 45155 56888 78591 14507 53999
1141 53999 126977 50900 -87223 -58902 -22218 47894 -130581 -130610 -143136 148087 74666 35003
1129 35003 -122368 -106508 -56443 111410 169385 -28913 41500 133445 137313 143293 145746 118355
1117 118355 44220 -16718 39402 -40547 -24816 -97563 -3367 2223 29916 90573 -173909 -150126
1105 -150126 -95618 42896 62757 -52027 56898 80258 96459 46728 -70625 -48910 68423
1094F8423l9284k3779j35420Q458N1658L4882m217n1378L2283J21241M2431o8865
1082C6433o407j47277j3855L9931m4130O7401r4566J93529m6878j28993n0642
1071a95454l9215M7039N7402J1780O2298o1834P8095J38968n4167n4291J2024
1060B645Q8762j21564q8168R7490j56341j02629j21577K43273J07506Q8980N3414
1049I1791K5074r5573q5375K0738L9349l589j02102J6037N5260M9269q73j05707
1037i5701L1910P4472l5787p632L4748P4505j48998M1032p5420M4708L1975J4413
1025a5775J4968J03899P7503k35742J04465O0943K0275o8957j27591p4649P5524
1014f5137J01947m0337m2489J17516L5657q8676j11994O7075L3899j02811n0212
$$ plain form
1094 68423 29139 5360 -130060 -121602 -69944 -35062 -39279 -90657 -58374 62867 105298 36433
1082 36433 30026 -117251 -131106 -91175 -135305 -67904 -162470 31059 -15819 -144812 -195454
1071 -195454 -234669 -187630 -130228 -118448 -56150 -117984 -39889 99079 44912 -9379 2645
1060 2645 91407 -30157 -118325 -20835 -177176 -279805 -401382 -158109 -50603 38377 91791
1049 91791 116865 21292 -64083 -43345 -3996 -7585 -109687 -93650 -38390 10879 10006 -95701
1037 -95701 -63791 10681 -25106 -32738 2010 76515 -72483 -31451 -106871 -62163 -30188 -15775
1025 -15775 -807 103092 180595 -55147 49318 110261 130536 61579 -66012 -140661 -65137
1014 -65137 36810 -3527 -46016 71500 107157 18481 -93513 -26438 7461 -95350 -145562
1003a45562l2127J12463j8840n9661l341k5641J03040O5100r7061k3564Q8159
992c7035N8603K7036L8393m2745J69010r0066l6683J6773j13225r3966J94388
981I0483l8312j72567P3047K6670R7681j73818J29197l533n084o8633j20523J21844
969d3548j41877J2012P5616j2021p2716K2323o0902n4422J49001J89288K6929
958H9683q4162J5608P3058j64984J51057m4049j70779R0252j05258M4804J04686
947h4k7612j37089p1158K19035J41571N6851j43194N3652O4850j19987O3618Q6914
935A87367p1919O8835J7611j10581J424M0128j56093K2295j58570k0792L9213
924a41082Q8932m4005J0908R9763n9822J6728Q6535j86010l9763J13079N8644
$$ plain form
1003 -145562 -177689 -65226 -84066 -143727 -147068 -172709 -69669 -4569 -101630 -125194 -37035
992 -37035 21568 48604 86997 44252 213262 123196 86513 103286 -9939 -103905 90483
981 90483 52171 -120396 -47349 -20679 77002 -96816 32381 28848 23764 -44869 -165392 -43548
969 -43548 -185425 -173413 -97797 -109818 -182534 -160211 -221113 -275535 -126534 62754 89683
958 89683 5521 21129 94187 -70797 80260 36211 -134568 -44316 -149574 -104770 -84
947 -84 -27696 -164785 -235943 -16908 124663 181514 38320 91972 156822 36835 100453 187367
935 187367 115448 184283 201894 91313 92737 132865 -23228 -933 -159503 -180295 -141082
924 -141082 -52150 -96155 -85247 14516 -45306 -28578 57957 -128053 -167816 -54737 3907
913C907J15433k2911r8510o6147N9665J9746j06001k1792J10436p4748J20638
902C9716P077j5010K1503P2077j34057r665J94286j6799n2057l3037j54439l6857
890a17262k4476L2263L6898k4362R8294J37788q3863R0542o5378q3926j13021
879a16503K1729K1793J21571j4315R9758j83762j26200J29238p168R9351q7823
868d2331K141j5766q7887j27607J6134J88722N2628j40601K7095J97009j062k35079
856a66604J60500r067m0728k7105j1165M0791k8631P0958q7093j8657J1145J18379
844A2723O842j20130j3373J62835J64492M421o1205j69122j80376J53143O1877
833B2127N3375l1958j07403j28533J38842L5146k28239P076Q6147Q8546l6085
$$ plain form
913 3907 119340 96429 -2081 -68228 -8563 11183 -94818 -116610 -6174 -80922 39716
902 39716 46793 31783 53286 125363 -8694 -18359 175927 159128 107071 74034 -80405 -117262
890 -117262 -141738 -109475 -72577 -96939 1355 139143 55280 145822 80444 -3482 -116503
879 -116503 -94774 -72981 48590 34275 134033 -49729 -175929 -46691 -53859 45492 -42331
868 -42331 -40190 -55956 -143843 -271450 -255316 -66594 -13966 -154567 -127472 69537 68475 -166604
856 -166604 -6104 -15171 -55899 -83004 -94169 -53378 -82009 -11051 -98144 -116801 -105656 12723
844 12723 19565 -100565 -113938 48897 213389 217810 156605 -12517 -192893 -39750 22127
833 22127 75502 43544 -63859 -192392 -53550 -18404 -246643 -239567 -153420 -64874 -100959
822a00959o2545L4266N0828J14119j99244q6481J81072n8501k44504M0343L00281
811c1325j09497J88451Q2239K4205q2585j99165J32162j1502m9860k7819j9283
800a03979L9327j03555L1797J95722J52378j67335r7896q2153j5489r5313Q9989
789a56507J08103j0517j3289o4613N2937M8711j3829P614P2240j17889M9373P6344
777C8678j654k4067n8621P2449p6257l9315J17881k3496j24410j9295J04851K02580
765A69324k27181q3498J4564m3729K22369m3628m5117q5394J06141J14390j77779
754g9538n6385J09953O6770j51230n8828N4339q0129N7203L9169l2335O7408K0513
742d3090J46197J20716q8349L7469j60789p7092K50589m5542n7939p8386m4832
$$ plain form
822 -100959 -163504 -129238 -78410 35709 -163535 -250016 -68944 -127445 -371949 -331606 -31325
811 -31325 -140822 47629 129868 154073 71488 -127677 4485 -7017 -56877 -84696 -103979
800 -103979 -64652 -168207 -136410 59312 211690 44355 -53541 -135694 -151183 -246496 -156507
789 -156507 -48404 -58921 -72210 -136823 -83886 -35175 -49004 -41390 30850 -87039 -37666 38678
777 38678 37024 12957 -45664 26785 -49472 -88787 29094 5598 -118812 -138107 -33256 169324
765 169324 -57857 -141355 -126791 -170520 51849 8221 -36896 -122290 -16149 98241 -79538
754 -79538 -135923 -25970 40800 -110430 -169258 -114919 -195048 -137845 -98676 -131011 -63603 -43090
742 -43090 103107 223823 135474 172943 12154 -64938 185651 140109 82170 3784 -41048
731d1048N2375l08Q8059p5389j2157j16940O8217J06873L4218j22368n4552J32323
719E9303j73230L7253K1400J4281K6435J0116P0255j16721P8504n9260o9808l8743
707a40215J79233q7865k1247N1064O8941J1871M3731r7723m2184j6308j02263
696a52965J27527j67905J52665J1552j5842k1628J18257L5861p351j09799P4744
685D5116J1325j07659n6053k3034P0937o4522P9396N0337k0111r533Q9722K2549
673H8470q2255J0601k7341j25606k4649J28590l7454J18049m8667l9482P7573
662C7829p7786J40980j5982o1994O8895Q5381N3801p4260j7494j59437j55381
651a75448N9208j4360J99731K12972k04717j38015m8803n1128L3707O8055p9137
$$ plain form
731 -41048 11327 11019 99078 23689 11532 -105408 -37191 69682 103900 -18468 -73020 59303
719 59303 -113927 -76674 -55274 -40993 -14558 -4442 65813 -50908 27596 -31664 -101472 -140215
707 -140215 39018 -48847 -70094 -19030 49911 61782 105513 7790 -34394 -50702 -152965
696 -152965 -25438 -193343 -40678 -29126 -44968 -66596 51661 87522 80171 -29628 45116
685 45116 56441 -51218 -107271 -130305 -59368 -123890 -44494 5843 -14268 -23801 65921 88470
673 88470 6215 16816 -10525 -136131 -160780 -32190 -69644 48405 -262 -39744 37829
662 37829 -39957 101023 85041 23047 91942 177323 231124 156864 139370 -20067 -175448
651 -175448 -116240 -130600 69131 282103 77386 -60629 -109432 -160560 -126853 -58798 -137935
640a37935M9198j31756K00929L3164r8570J2675r1574O657J08951k5472j05853
629a79586n5815K7856J85340k0978l8242j9878N8650K540O7550l0609M9051j80874
617a34995N4711R8307K1216k6416o451M0251r2507M7427j51471M0571K48805j06241
605C3207j05000j2454j7212n743R8657J63188J6082m1106l7311r6513p9297J46441
593F2939j11491p4843L780J14103K2572l8242N1556j07579l3296Q4332P7010n7683
581f842Q3161q1671M4504q4041J03789j06640l3997J1907J7507j26693L963Q6638
569h8415O8131p1652r9073J21985k7080m414M0941K4572r3439k9115N3482R0588
557a3489j03993q4095J02155P3166p8020K2821K7727M1402K6635J09135P5110
$$ plain form
640 -137935 -88737 -220493 -19564 13600 -84970 -72295 -163869 -157212 -48261 -73733 -179586
629 -179586 -235401 -207545 -22205 -43183 -81425 -101303 -42653 -40113 27437 -3172 45879 -134995
617 -134995 -80284 18023 39239 12823 6372 46623 -45884 1543 -149928 -109357 139448 33207
605 33207 -71793 -84247 -101459 -107202 -8545 154643 170725 129619 92308 -4205 -83502 62939
593 62939 -48552 -123395 -119615 -5512 17060 -21182 30374 -77205 -110501 -26169 50841 -6842
581 -6842 76319 -5352 39152 -44889 58900 -47740 -81737 -69830 -52323 -179016 -175053 -88415
569 -88415 -20284 -91936 -191009 -69024 -96104 -100518 -59577 -35005 -128444 -157559 -104077 -13489
557 -13489 -117482 -201577 -99422 -26256 -104276 -81455 -53728 -12326 14309 123444 198554
546A98554p5861j12940j05037N452O0084J00348j72705o6204K01796Q8725k55622
535a33410p6114M2079L4982J79459r0462j20118J21903J23464M0894q7714L5452
524G0415K7179j73387j07051l8429K2501J88166K805j31468M1078J68074j7880
513E2003n1216K5921q2786N7365n1136K2859l2410L0023l3345q6249Q780l3790
501a73981m6761J08501p6387M2784J05807k1544M7196J1270q7740K4245l9536
490a06146J52699K1666R3124J3059Q111j36778j64523K2994J49310Q2044N8866
479A94426j91338k0114P1770j80452l2193J76507L8629q0766n045M8288J17724
$$ plain form
546 198554 122693 9753 -95284 -89832 -29748 70600 -102105 -168309 33487 122212 -133410
535 -133410 -209524 -167445 -132463 46996 -43466 -163584 -41681 81783 122677 34963 70415
524 70415 97594 -75793 -182844 -221273 -198772 -10606 -7801 -139269 -98191 69883 52003
513 52003 787 26708 -56078 1287 -49849 -26990 -59400 -29377 -62722 -148971 -140191 -173981
501 -173981 -220742 -112241 -188628 -145844 -40037 -61581 -14385 -3115 -90855 -66610 -106146
490 -106146 46553 68219 161343 174402 182513 45735 -118788 -95794 53516 135560 194426
479 194426 3088 -17026 54744 -125708 -157901 18606 57235 -23531 -28576 19712 137436
$$ [...]
##END NTUPLES=NMR SPECTRUM
##END=
