##TITLE=1H_EC-3277xy
 DMSO-d6
 8 sc, 
 20.09.2022
##JCAMPDX= 6.0         $$ Bruker NMR JCAMP-DX V2.0
##DATA TYPE= NMR SPECTRUM
##DATA CLASS= NTUPLES
##ORIGIN= UXNMR, Bruker Analytische Messtechnik GmbH
##OWNER= root
$$ XWIN-NMR		Version 3.5
$$ Tue Sep 20 12:42:09 2022 Russian Standard Time (UT+4h)  she@DPX200
##.OBSERVE FREQUENCY= 200.1313499994
##.OBSERVE NUCLEUS= ^1H
##.ACQUISITION MODE= SIMULTANEOUS
##.ACQUISITION SCHEME= undefined
##.AVERAGES= 8
##.DIGITISER RES= 18
##SPECTROMETER/DATA SYSTEM= spect
##.PULSE SEQUENCE= zg30
##.SOLVENT NAME= DMSO
##.SHIFT REFERENCE= (INTERNAL, DMSO, 0, 15.8119)
##AUDIT TRAIL= $$ (NUMBER, WHEN, WHO, WHERE, WHAT)
$$ ##TITLE= Audit trail, XWIN-NMR		Version 3.5
$$ ##JCAMPDX= 5.01
$$ ##ORIGIN= Bruker BioSpin GmbH
$$ ##OWNER= she
$$ F:/spectra/data/she/nmr/H-F/1/pdata/1/auditp.txt
$$ ##AUDIT TRAIL=  $$ (NUMBER, WHEN, WHO, WHERE, WHAT)
(   1,<2022-09-20 12:40:55.75 +0400>,<she>,<DPX200>,
      <created by zg, POWCHK disabled, PULCHK disabled
       configuration hash MD5:
       00 E9 B6 7A A2 85 ED C7 34 08 36 98 17 FE 4E 26
       data hash MD5: 16K
       26 9C 21 AC 06 F7 CA 3D 04 B2 BA 71 81 82 B8 73>)
(   2,<2022-09-20 12:40:58.17 +0400>,<she>,<DPX200>,
      <Start of raw data processing
       efp BC_mod = 2 LB = 0.24 FT_mod = 6 PKNL = 1 PHC0 = -18042.89 PHC1 = 22.00069 SI = 16K 
       data hash MD5: 16K
       DE 21 E5 9A 3D 58 76 A8 34 9E 1E 6C 94 41 2F B0>)
(   3,<2022-09-20 12:41:23.18 +0400>,<she>,<DPX200>,
      <pk PHC0 = 7.03725 PHC1 = -14 
       data hash MD5: 16K
       D4 36 A7 17 46 AC 83 97 BE 27 68 E5 48 1C 68 7C>)
$$ ##END=
$$ 
$$ hash MD5
$$ 07 3B AD 15 82 BE 5C 10 99 01 B1 CA 9A 63 96 EF
##$RELAX= 
##$RELAX= 
##$RELAX= 
##$RELAX= 
##$RELAX= 
##$RELAX= 
$$ Bruker specific parameters
$$ --------------------------
##$DU= <F:/spectra>
##$EXPNO= 1
##$NAME= <H-F>
##$PROCNO= 1
##$TYPE= <nmr>
##$USER= <she>
##$AMP= (0..31)
100 100 100 100 100 100 100 100 100 100 100 100 100 100 100 100 100 100 
100 100 100 100 100 100 100 100 100 100 100 100 100 100 
##$AQSEQ= 0
##$AQ_mod= 1
##$AUNM= <au_zg>
##$AUTOPOS= <>
##$BF1= 200.13
##$BF2= 200.13
##$BF3= 200.13
##$BF4= 200.13
##$BF5= 200.13
##$BF6= 200.13
##$BF7= 200.13
##$BF8= 200.13
##$BYTORDA= 1
##$CFDGTYP= 0
##$CFRGTYP= 5
##$CHEMSTR= <none>
##$CNST= (0..31)
1 1 145 1 1 1 1 1 1 1 1 1 1 1 1 1 1 1 1 1 1 1 1 1 1 1 1 1 1 1 1 1 
##$CPDPRG= <>
##$CPDPRG1= <>
##$CPDPRG2= <>
##$CPDPRG3= <>
##$CPDPRG4= <mlev>
##$CPDPRG5= <mlev>
##$CPDPRG6= <mlev>
##$CPDPRG7= <mlev>
##$CPDPRG8= <mlev>
##$CPDPRGB= <>
##$CPDPRGT= <>
##$D= (0..31)
0 1.2 0 0 0 0 0 0 0 0.06 0 0.03 0 0 0 0 0.0002 0 0 0 0 0 0 0 0 0 0 0 0 
0 0 0 
##$DATE= 1663663255
##$DBL= (0..7)
120 120 120 120 120 120 120 120 
##$DBP= (0..7)
150 150 150 150 150 150 150 150 
##$DBP07= 0
##$DBPNAM0= <>
##$DBPNAM1= <>
##$DBPNAM2= <>
##$DBPNAM3= <>
##$DBPNAM4= <>
##$DBPNAM5= <>
##$DBPNAM6= <>
##$DBPNAM7= <>
##$DBPOAL= (0..7)
0.5 0.5 0.5 0.5 0.5 0.5 0.5 0.5 
##$DBPOFFS= (0..7)
0 0 0 0 0 0 0 0 
##$DE= 6
##$DECBNUC= <off>
$$ [...]
##$SUBNAM2= <"">
##$SUBNAM3= <"">
##$SUBNAM4= <"">
##$SUBNAM5= <"">
##$SUBNAM6= <"">
##$SUBNAM7= <"">
##$SUBNAM8= <"">
##$SUBNAM9= <"">
##$SW= 18.0517283424941
##$SWIBOX= (0..15)
0 0 2 0 0 0 0 0 0 0 0 0 0 0 0 0 
##$SW_h= 3612.71676300578
##$TD= 16384
##$TD0= 1
##$TE= 0
##$TE2= 300
##$TE3= 300
##$TEG= 300
##$TL= (0..7)
0 120 120 120 120 120 120 120 
##$TP= (0..7)
150 150 150 150 150 150 150 150 
##$TP07= 0
##$TPNAME0= <>
##$TPNAME1= <>
##$TPNAME2= <>
##$TPNAME3= <>
##$TPNAME4= <>
##$TPNAME5= <>
##$TPNAME6= <>
##$TPNAME7= <>
##$TPOAL= (0..7)
0.5 0.5 0.5 0.5 0.5 0.5 0.5 0.5 
##$TPOFFS= (0..7)
0 0 0 0 0 0 0 0 
##$TUNHIN= 0
##$TUNHOUT= 0
##$TUNXOUT= 0
##$USERA1= <user>
##$USERA2= <user>
##$USERA3= <user>
##$USERA4= <user>
##$USERA5= <user>
##$V9= 5
##$VALIST= <valist>
##$VCLIST= <CCCCCCCCCCCCCCC>
##$VD= 0
##$VDLIST= <DDDDDDDDDDDDDDD>
##$VPLIST= <PPPPPPPPPPPPPPP>
##$VTLIST= <TTTTTTTTTTTTTTT>
##$WBST= 1024
##$WBSW= 4
##$XGAIN= (0..3)
0 0 0 0 
##$XL= 0
##$YL= 0
##$YMAX_a= 159122
##$YMIN_a= -258615
##$ZGOPTNS= <>
##$ZL1= 120
##$ZL2= 120
##$ZL3= 120
##$ZL4= 120
##$ABSF1= 0
##$ABSF2= 0
##$ABSG= 0
##$ABSL= 0
##$ALPHA= 0
##$AQORDER= 0
##$ASSFAC= 0
##$ASSFACI= 0
##$ASSFACX= 0
##$ASSWID= 0
##$AUNMP= <proc_1d>
##$AZFE= 0.1
##$AZFW= 0.1
##$BCFW= 0
##$BC_mod= 2
##$BYTORDP= 0
##$COROFFS= 0
##$CY= -3
##$DATMOD= 1
##$DC= 0
##$DFILT= <>
##$DTYPP= 0
##$F1P= 0
##$F2P= 0
##$FCOR= 1
##$FTSIZE= 16384
##$FT_mod= 6
##$GAMMA= 0
##$GB= 0
##$INTBC= 1
##$INTSCL= 3.70164e-10
##$ISEN= 128
##$LB= 0.24
##$LEV0= 0
##$LPBIN= 0
##$MAXI= 10000
##$MC2= 0
##$MEAN= 0
##$ME_mod= 0
##$MI= 1.114404
##$NCOEF= 0
##$NC_proc= -6
##$NLEV= 6
##$NOISF1= 3.799351
##$NOISF2= 2.8
##$NSP= 0
##$NTH_PI= 0
##$NZP= 0
##$OFFSET= 15.8119
##$PC= 1
##$PHC0= -18035.85
##$PHC1= 8.00069
##$PH_mod= 1
##$PKNL= yes
##$PPARMOD= 0
##$PSCAL= 0
##$PSIGN= 0
##$REVERSE= no
##$SF= 200.129991923649
##$SI= 16384
##$SIGF1= 3
##$SIGF2= 2
##$SINO= 5.538805
##$SIOLD= 16384
##$SREGLST= <1H.CDCl3>
##$SSB= 0
##$STSI= 16384
##$STSR= 0
##$SW_p= 3612.71676300578
##$SYMM= 0
##$S_DEV= 0
##$TDeff= 16384
##$TDoff= 0
##$TI= <>
##$TILT= no
##$TM1= 0
##$TM2= 0
##$TOPLEV= 0
##$USERP1= <user>
##$USERP2= <user>
##$USERP3= <user>
##$USERP4= <user>
##$USERP5= <user>
##$WDW= 1
##$XDIM= 16384
##$YMAX_p= 405295387
##$YMIN_p= -398789
$$ End of Bruker specific parameters
$$ ---------------------------------
##NTUPLES= NMR SPECTRUM
##VAR_NAME=  FREQUENCY,     SPECTRUM/REAL,   SPECTRUM/IMAG
##SYMBOL=    X,             R,               I
##VAR_TYPE=  INDEPENDENT,   DEPENDENT,       DEPENDENT
##VAR_FORM=  AFFN,          ASDF,            ASDF
##VAR_DIM=   16384,         16384,           16384
##UNITS=     HZ,            ARBITRARY UNITS, ARBITRARY UNITS
##FACTOR=    0.220516191357247, 1,           1
##FIRST=     3164.43544708659, 0,            0
##LAST=      -448.281315919189, 0,           0
##MIN=       -448.281315919189, -398789,     0
##MAX=       3164.43544708659, 405295387,    0
$$ Real data points
##PAGE= N=1
##DATA TABLE= (X++(R..R)), XYDATA
16383b31369P3881k268P513o5288k8999M9285j4387J5968M6100j3130n1726L8506
$$ -231369 -157488 -159756 -152243 -217531 -246530 -197245 -211632 -195664 -149564 -162694 -214420 -175914
16371a75914J71K0817r723k288J3204m5491J0713K2229N1136l6892R047J7496
$$ -175914 -175743 -154926 -164649 -166937 -153733 -199224 -188511 -166282 -115146 -152038 -142991 -125495
16359a25495K3015p4995N3709K0490K309Q822q346M0668k2688p299k7658r3523
$$ -125495 -102480 -177475 -123766 -103276 -100967 -92145 -100491 -59823 -82511 -89810 -117468 -210991
16347b10991K2630n703m565K7916L5780J3452P388l0430J3691L5127l3494r9769
$$ -210991 -188361 -194064 -198629 -170713 -134933 -121481 -114093 -144523 -130832 -95705 -129199 -228968
16335b28968O6805J07498r5756N161K0027N2261j0632M8154o4810k4933j7159
$$ -228968 -162163 -54665 -150421 -145260 -125233 -72972 -83604 -35450 -100260 -125193 -142352
16324a42352O3961L2156p1021n1596L8092k5402M3256J5626L2514L0300j9492
$$ -142352 -78391 -46235 -117256 -168852 -130760 -156162 -112906 -97280 -64766 -34466 -53958
16313e3958q1374o3815J16020o843j8775K5510L9687N78q0237n244N9921N2153
$$ -53958 -135332 -199147 -83127 -89970 -108745 -83235 -43548 -42970 -123207 -128451 -68530 -16377
16301a6377n0870j4948L2686n3391L3624k3828l792K0822o0811o8711J3410J20395
$$ -16377 -67247 -82195 -49509 -102900 -69276 -93104 -96896 -76074 -136885 -205596 -192186 -71791
16289g1791o0754m055L1002j9712j5742M3818J9680q110L4389M7715k835m2972
$$ -71791 -132545 -136600 -105598 -125310 -141052 -97234 -77554 -85664 -51275 -3560 -6395 -49367
16277d9367j7628J9329M0007p5024k1545P9149L3765q3710m1822M0711j5906j7150
$$ -49367 -66995 -47666 -7659 -82683 -104228 -25079 8686 -75024 -116846 -76135 -92041 -109191
16265a09191k2745K8307J1852P4336l081o1802p4220M5989L8588j0228K5117k9947
$$ -109191 -131936 -103629 -91777 -17441 -20522 -82324 -156544 -110555 -71967 -82195 -57078 -87025
16253h7025Q4994K5728p435q0182K5125o164j7867K2489N011O199P753j33544
$$ -87025 -2031 23697 16262 -63920 -38795 -44959 -62826 -40337 -35326 -29127 -21374 -154918
16241a54918M9062M9269O2060R1576M4j16192q391m5385J10454K9724l3521k3616
$$ -154918 -105856 -56587 5473 97049 97093 -19099 -27490 -72875 37579 67303 33782 10166
16229A0166l3874M2525l0814k13p920r251L8789k151j0545m8265l2532K85J3855
$$ 10166 -23708 18817 -11997 -12210 -20130 -29381 9408 7257 -3288 -51553 -84085 -83800 -69945
16216f9945P359M6551j9796l3596j496M104N6531L1208k506J6744j8779m1242
$$ -69945 -62586 -16035 -35831 -69427 -70923 -66819 -10288 20920 18414 35158 16379 -24863
16204b4863M1862l4146M1871K676k0281o373m710m9426K3133r026P7143n6807
$$ -24863 16999 -17147 24724 27400 7119 746 -3964 -53390 -30257 -39283 37860 -18947
16192a8947J5312N3143k5357Q4686l6416L285p6327r0631k8632P3875J12696o5199
$$ -18947 -3635 49508 24151 108837 72421 75706 -621 -91252 -119884 -46009 66687 1488
16180A488M522L409Q7020j73363P8121J4706o8884R0855j5370q5469Q1013L4915
$$ 1488 6010 9419 96439 -76924 1197 15903 -52981 37874 22504 -62965 18048 52963
16168E2963K492l7119R847m0607J4278N1943M6244M6323q8868r928n7975j44295
$$ 52963 55455 18336 28183 -12424 1854 53797 100041 146364 57496 47568 -10407 -154702
16156a54702J15139J53978K6436L6499p8223o2484r953R3998m5449k8908o8091
$$ -154702 -39563 114415 140851 177350 99127 36643 26690 120688 75239 46331 -21760
16145b1760j00164N3861P1083j1408o0000m1732J02934N6128j02585k019J01580
$$ -21760 -121924 -68063 3020 -8388 -68388 -110120 -7186 48942 -53643 -55662 45918
16134D5918N5755p076j03402k4212O3439K5496j67198N4947O2144M6172m2672
$$ 45918 101673 94597 -8805 -33017 30422 55918 -111280 -56333 5811 51983 9311
16123I311r2437J51690p6457N1057J9130k5317j34590N6257L7478k5810M9165
$$ 9311 -83126 68564 -7893 43164 62294 36977 -97613 -41356 -3878 -29688 19477
16112A9477l5827O6463j23346J966K8258k9022Q5052l3605q66J2372P5118O4800
$$ 19477 -16350 50113 -73233 -71267 -43009 -72031 13021 -20584 -21450 -9078 66040 130840
16100A30840j9314P6953n8943o1662o3150J12576m887p3313K4350J927l3164m3022
$$ 130840 111526 188479 129536 67874 4724 117300 112413 39100 63450 65377 32213 -10809
16088a0809j17395R5229o764q01K5076O4328O6504p8607L0815J967K1690N8462
$$ -10809 -128204 -32975 -39739 -40540 -15464 48864 115368 36761 67576 69543 91233 149695
16076A49695l2174K8987r6471j8672j78669K4624J31208L3576j00593M5329J9115
$$ 149695 117521 146508 50037 31365 -147304 -122680 8528 42104 -58489 -13160 5955
16065E955p9713J08411m097j2004P0085K0422r5642K235r8791m7763J28203N9357
$$ 5955 -73758 34653 30556 18552 88637 109059 13417 15652 -83139 -130902 -2699 56658
16053E6658m3118J26541k0476j7322o9301j4996j5353M3064k3990M4949m3597
$$ 56658 13540 140081 119605 102283 32982 17986 2633 45697 21707 66656 23059
16042B3059k2640Q5328L539P165K2284P9705j34650l838J00532m816q2251r3115
$$ 23059 419 85747 89286 96451 118735 198440 63790 59952 160484 155668 73417 -19698
16030a9698P9490Q9195j04465o3536N7488P0870k3907l7771o7866M3982P49k8031
$$ -19698 59792 148987 44522 -19014 38474 109344 85437 47666 -20200 23782 24531 -3500
16018c500R4768K6061M0037j37262j12730M200L8181M5139m0692m7001m0810P47
$$ -3500 91268 117329 157366 20104 -92626 -88426 -50245 -5106 -45798 -92799 -133609 -132862
16006a32862P6482N3343L9999l2574m0396k371N9129O2456k5642l9255K2699J5882
$$ -132862 -56380 -3037 36962 4388 -36008 -38379 20750 83206 57564 18309 41008 56890
15994E6890J6069q4232l3756r630K2833L6635q1222l8869Q7897Q1285l5739L1857
$$ 56890 72959 -11273 -45029 -54659 -31826 4809 -76413 -115282 -27385 53900 18161 50018
15982E0018J1985n3187O0770J690j5057p1242K4060O8658K9024j1709m1469J5677
$$ 50018 62003 8816 69586 71276 56219 -15023 9037 77695 106719 95010 53541 69218
15970F9218k4117J9372l5485l0010n2888J34220j31856R6031K7862n3928K7622
$$ 69218 45101 64473 28988 -1022 -53910 80310 -51546 44485 72347 18419 46041
15959D6041K5832K9362k7838p4455l5126J21617K0186K0026o5652J799L027N2792
$$ 46041 71873 101235 73397 -1058 -36184 85433 105619 125645 59993 61792 64819 117611
15947A17611l9540m6987q68L1184j18429K8784m5760R7224P800l6271J1259L6929
$$ 117611 78071 31084 30216 61400 -57029 -28245 -74005 23219 31019 -5252 6007 42936
15935D2936j5223j2553n400j3574j22394M8353l5997J9167K9284j5631m1904L5089
$$ 42936 27713 15160 9760 -3814 -126208 -77855 -113852 -94685 -65401 -81032 -122936 -87847
15923h7847J41381J4414P2064l0804k4125J5339j21088l5887L0216o2243J42599
$$ -87847 53534 67948 140012 109208 85083 100422 -20666 -56553 -26337 -88580 54019
15912E4019L2530n4796L2960L6003P4711n0994j42247N9771L8871j8333p5752
$$ 54019 86549 31753 64713 100716 175427 124433 -17814 41957 80828 62495 -13257
15901a3257j8020L506J01135m2625j6761R1199N0900m5027j00050K5191M3729
$$ -13257 -31277 -27771 73364 30739 13978 105177 156077 111050 11000 36191 79920
15890G9920l6657N3105n0992J6236N9647P377l0766o0995j342J356j6033J05589
$$ 79920 43263 96368 45376 61612 121259 128636 97870 36875 35533 36889 20856 126445
15878A26445N002n2467j04440P9727K8395M509n9597K8653K570K8233K9733l9666
$$ 126445 131447 78980 -25460 54267 82662 87171 27574 56227 58797 87030 116763 77097
15866G7097p4480k3485N4991R3424r118m7462k702k0767j8576j02l8549P6652
$$ 77097 2617 -20868 34123 127547 118429 70967 68265 47498 28922 28820 -9729 66923
15854F6923K596j687M9361K1829p2588m5985K8083m1106N3828j24905L670J2992
$$ 66923 69519 67832 117193 139022 66434 20449 48532 7426 61254 -63651 -59981 -46989
15842d6989M2352P3582J1094O0714n1443o6645Q4505K0968l6925R837l3053p0250
$$ -46989 -4637 68945 80039 140753 89310 22665 107170 128138 91213 101050 67997 -2253
15830b253R955n244J59438M8625l2830m5746Q366p4151J656j07729M0284P4439
$$ -2253 7702 2458 161896 210521 177691 131945 140311 66160 67816 -39913 371 74810
15818G4810r0460K4650J0119k1340O9091o2079k6448J40306J6119j93036j24751
$$ 74810 -15650 9000 19119 -2221 66870 4791 -21657 118649 134768 -58268 -183019
15807a83019R7781N1314J31710q1649o4238Q3103J10283j04044j07133P9118m2783
$$ -183019 -85238 -33924 97786 16137 -48101 35002 145285 41241 -65892 13226 -29557
15796b9557L1317Q7413m4939P668P7836n4194j13287J14559K6807q2304K7372
$$ -29557 1760 89173 44234 51902 129738 75544 -37743 76816 103623 21319 48691
15785D8691J1259N1281n3947J8002q7594K111J16512R229q1204o512J5622m6905
$$ 48691 59950 111231 57284 75286 -12308 -10197 106315 115544 34340 27828 43450 -3455
15773c455L6560P2253j4142m0868j09702j0670Q4757Q900M356P4091k5837j24543
$$ -3455 33105 105358 91216 50348 -59354 -70024 14733 23633 27989 102080 76243 -48300
15761d8300J27018J8321J3157J7647M9443n5569M165q1245m3796M2844k0616O1318
$$ -48300 78718 97039 110196 127843 177286 121717 125882 44637 841 43685 23069 84387
15749H4387k1047m3780p9924J14004m5930n7999J8134O8339l0956R727M2240N3490
$$ 84387 63340 19560 -60364 53640 7710 -50289 -32155 36184 5228 14955 57195 110685
15737A10685m2951j8000O2981P023M2212k3623j160j15468r590M4210p9859R8523
$$ 110685 67734 49734 112715 119738 161950 138327 137167 21699 12109 56319 -23540 74983
15725G4983j0572m7712q229k0847k5311K2452M5638L6490M7479J0169k9850j853
$$ 74983 64411 16699 8470 -12377 -37688 -15236 30402 66892 114371 124540 94690 92837
15713I2837N8822q9482p3836k6455L9846j7722J2026l152L7728o1429n7681O372
$$ 92837 151659 62177 -11659 -38114 1732 -15990 -3964 -7116 30612 -30817 -88498 -82126
15701h2126J22172J7872J0450L1609j09878K4271Q3201p201r4151O8821K7500
$$ -82126 40046 57918 68368 99977 -9901 14370 97571 90370 -3781 65040 92540
15690I2540J289l7043p8245j4624j02734N7873L8579J2076J21955l8906l8672
$$ 92540 93829 56786 -21459 -36083 -138817 -80944 -42365 -30289 91666 52760 14088
15679A4088p8901j1648j0969J01102j32912k715M5062L4981P7642K7224p4484
$$ 14088 -64813 -76461 -87430 13672 -119240 -121955 -76893 -41912 35730 62954 -11530
15668a1530k8079K7875P943n707p2033K5258J6353N0935j01432J70134M3411n4944
$$ -11530 -39609 -11734 -3791 -9498 -81531 -56273 -39920 11015 -90417 79717 123128 68184
15656F8184K592j6700R1566J1819r4977k7719K8711N5517m371J7324P1345p7882
$$ 68184 70776 54076 145642 157461 62484 34765 63476 118993 114622 131946 203291 125409
15644A25409j26282N4390R345L9984p2966n2087R545M6800j2139l0879r678J1222
$$ 125409 -873 53517 62862 102846 29880 -22207 -12662 34138 21999 -8880 -18558 -7336
15632g336r5398O9081N2127K6296O5337J8134n8402P0745m9981M60p8715p4723
$$ -7336 -102734 -33653 18474 44770 110107 128241 69839 140584 90603 91063 12348 -62375
15620f2375J08444l2874j7168k5099L0486n5993j9445R9281n6440q108Q0221K5996
$$ -62375 46069 13195 -3973 -29072 1414 -54579 -74024 25257 -31183 -39291 40930 66926
15608F6926J9855N1485j2896r1366J188K4581l7949j7864P6580m1095J5353J35428
$$ 66926 86781 138266 125370 34004 35192 59773 21824 3960 80540 39445 54798 190226
15596A90226L9528r8622K8617n914r548k1376j23260o9908J86582j3229p8805
$$ 190226 229754 131132 159749 153835 144287 122911 -349 -70257 116325 103096 24291
15585B4291j7048k9142N1736J69555j41459p6323j851j8243P9578j8986k0524
$$ 24291 7243 -21899 29837 199392 57933 -18390 -20241 -38484 41094 22108 1584
15574A584O3859R373k5931K3285K2428l6118M1891J6952j02182M5732r2510R9068
$$ 1584 65443 74816 48885 72170 94598 58480 100371 117323 15141 60873 -31637 67431
15562F7431N6896j41678p940M5346j7315J0208O1108P222o3260q7634p117M5928
$$ 67431 124327 -17351 -25291 20055 2740 12948 74056 81278 18018 -69616 -76733 -30805
15550c0805J46846J7209n6930k4258l1336k4377L0076m6916k3844J32813M3119
$$ -30805 116041 133250 76320 52062 20726 -3651 26425 -20491 -44335 88478 131597
15539A31597p6477N8204m9012L5537P7453m4958j0394p394n9617J8230N7552n707
$$ 131597 55120 113324 64312 99849 177302 132344 121950 114556 54939 73169 130721 125014
15527A25014K0854m0587j43963M17P2390M9537o3277r135l1140R6197M390K4491
$$ 125014 145868 105281 -38682 -38265 34125 83662 20385 11250 -19890 76307 80697 105188
15515A05188R3322r0963n1601Q7240o604j46216M5350k0284M0197N2665m8699
$$ 105188 198510 107547 55946 143186 136582 -9634 35716 15432 55629 108294 59595
15504E9595o86m8281p3267N4240m585M0251J06361q8036n441J38818j14413N7326
$$ 59595 58909 10628 -62639 -8399 -12984 27267 133628 45592 40151 178969 64556 121882
15492A21882m918k3141p4025J2927M9177k5585O1914n4798j06885j7044L9806
$$ 121882 116964 93823 19798 32725 81902 56317 118231 63433 -43452 -60496 -20690
15481b0690J00771l0342P546k4143j6563P8519p7609j4930L4130J0300M8041r9248
$$ -20690 80081 49739 57285 33142 16579 95098 17489 2559 36689 46989 95030 -4218
15469d218K9345N9714o76j5581o1870M084k1214J10635j7880j02463p245M7716
$$ -4218 25127 84841 84165 68584 6714 10798 -10416 100219 82339 -20124 -27369 20347
15457B0347k4316P3644J10907j8984j25732j38125J27622K9787j13046O8996J13346
$$ 20347 -3969 69675 180582 161598 35866 -102259 25363 55150 -57896 11100 124446
15446A24446n0701K6005r403k0734J07426o5758k3130P962L0954l57j16569p4132
$$ 124446 73745 99750 90347 69613 177039 111281 88151 96113 127067 126710 10141 -63991
15434f3991J29463P864o1125R811O3028k1082J8767l6837m2465N0545R745o3231
$$ -63991 65472 73336 12211 22022 85050 63968 82735 45898 3433 53978 63723 492
15422D92n7558K1071M4811P7050M5186K0415l0040j19553m2292P7251j3531L3960
$$ 492 -57066 -35995 8816 85866 131052 151467 121427 1874 -40418 36833 23302 57262
15410E7262j0937r0601j9298n556K4975J68793J0309o4785q7882l218K6583L0152
$$ 57262 46325 -44276 -63574 -69130 -44155 124638 134947 70162 -17720 -20938 5645 35797
15398C5797o7170J3721L1737O7744j08247m8232J41538O3882j26864O34J17975
$$ 35797 -31373 -17652 14085 81829 -26418 -74650 66888 130770 3906 4540 122515
15387A22515o589l2724n810m2243O1386n3317p9857J08939k6966o7873M9352Q6443
$$ 122515 115926 83202 77392 35149 96535 43218 -36639 72300 45334 -22539 26813 113256
15375A13256q4984L304j6658n1723L3116J31400J3714o3618l2548n2073j856N8417
$$ 113256 28272 31576 14918 -36805 -3689 127711 141425 77807 45259 -6814 -8670 49747
15363D9747N2595K0191k1408p0771m473k5261m6903O7470Q1576O9094m3639n3551
$$ 49747 102342 122533 101125 30354 25881 620 -46283 21187 102763 171857 128218 74667
15351G4667j04209J8279m7623q850J15493L1281m6301J0502P1878o3853j6423
$$ 74667 -29542 -11263 -58886 -67736 47757 79038 32737 43239 115117 51264 34841
15340C4841R205l1938n2624N3233J21293L0246k4860m7540K1204p5065l0066O4815
$$ 34841 44046 12108 -40516 12717 134010 164256 139396 91856 113060 37995 7929 72744
15328G2744M5807Q986l3812j2097q191J8889K0494r9973K5186O3477J7403m7175
$$ 72744 118551 127537 93725 81628 73437 92326 112820 12847 38033 101510 118913 71738
15316G1738l0847O9006Q040K0407m8238J7466N3688o5817p7769j6924Q866k490
$$ 71738 40891 109897 117937 138344 90106 107572 161260 95443 17674 750 9616 7126
15304G126M1898p97m6880Q593K5016P618J0944O5427k607L1735j12390r197J48013
$$ 7126 49024 48227 1347 9940 34956 42574 53518 118945 116338 148073 35683 26486 174499
15291A74499j3470n9217m4120j20619N9920Q2306q7963P1026K8681L4371j6777
$$ 174499 161029 101812 57692 -62927 -3007 79299 -8664 62362 91043 125414 108637
15280A08637J97n1321L5613m4627m0839K4451J1721k0643K4393K006l4898o964
$$ 108637 108834 57513 93126 48499 7660 32111 43832 23189 47582 49588 14690 7726
15268G726M7107q735o078o5760Q7597P9161K361O6616k4623j10487k1836j6050
$$ 7726 54833 46098 40020 -25740 61857 141018 143379 209995 185372 74885 53049 36999
15256C6999n3338K8471n9435J3083P7483L1611K4498j16060l3079J24120j1409
$$ 36999 -16339 12132 -47303 -34220 43263 74874 99372 -16688 -49767 74353 62944
15245F2944l9890N9206k9765Q087j5442N4859l9997K3789M7933p8471J5529j28070
$$ 62944 23054 82260 52495 60582 45140 99999 60002 83791 131724 53253 68782 -59288
15233e9288O8949K1297o979j4755P2612O0692n9015j6737P4370j27328k2026K570
$$ -59288 9661 30958 23979 9224 81836 142528 83513 66776 141146 13818 -8208 -5638
15221e638O4339J647O4738j9974r2930r0553L1002N3686K6844K9568j01631L6591
$$ -5638 58701 60348 125086 105112 12182 -78371 -47369 6317 33161 62729 -38902 -2311
15209b311L6074j3394L7652P2678m5082j03039Q1147P4401k2443q7686N7048M1491
$$ -2311 33763 20369 58021 130699 85617 -17422 63725 138126 115683 27997 85045 126536
15197A26536o2972J6121j7862m0733M6781P304L4626Q8428j25417j14387J50496
$$ 126536 63564 79685 61823 21090 67871 75175 109801 198229 72812 -41575 108921
15186A08921n4121n4764M641M8799K1839r0970L4932O4934L1975Q5950j51264
$$ 108921 54800 36 4677 53476 75315 -15655 19277 84211 116186 202136 50872
15175E0872l9592J03569M8651j7132Q018n7403K0406L2017j21166N3886p1q1131
$$ 50872 11280 114849 163500 146368 154386 96983 117389 149406 28240 82126 82055 924
15163I24J268Q5616M9738o7684P240M1874r7489M0598J5073O8478m7623J6347
$$ 924 2192 87808 137546 69862 77102 118976 21487 62085 77158 145636 98013 114360
15151A14360j10437J7296R0518O013k3170L7606p699j09746K6752M1097l2719
$$ 114360 3923 21219 111737 117750 94580 132186 124487 14741 41493 82590 49871
15140D9871l5877K3240P667J23633j3746m6612k5751r3982O4831L0645Q576j7803
$$ 49871 13994 37234 44901 168534 154788 108176 82425 -11557 53274 83919 92495 74692
15128G4692J8414k9273p9550J966L3494Q519j2488M4269J3265j55137J07984M9809
$$ 74692 93106 63833 -15717 -13751 19743 28262 15774 60043 73308 -81829 26155 75964
15116G5964l9290N7475L9604r0416n1133P2065k4178K4234J22559j32969l5222
$$ 75964 36674 94149 133753 43337 -7796 64269 40091 64325 186884 53915 18693
15105A8693K5070N8069Q3476n9950j69016L424J00005N1767o9078Q7814l9167
$$ 18693 43763 101832 185308 125358 -43658 -40234 59771 111538 42460 130274 91107
15094I1107j41858m7125P1751L5478P4626K7626l7608p7447o0884P2513k9633
$$ 91107 -50751 -97876 -26125 9353 83979 111605 73997 -3450 -64334 8179 -21454
15083b1454J07089N32O4204o5970K8288m8609O336N1973k5155j9166L7668r6335
$$ -21454 85635 86167 150371 84401 112689 64080 70416 122389 97234 78068 115736 19401
15071A9401N2757N4002M1474j17256o5183K49901J9263j05200n7402N9810n5553
$$ 19401 72158 126160 167634 50378 -14805 235096 254359 149159 91757 151567 96014
15060I6014p9717k1963n4636R0198k0090m6731M5693Q4948K0956L5740m5231q4195
$$ 96014 16297 -5666 -60302 29896 9806 -36925 8768 93716 114672 150412 105181 20986
15048B0986L6385L613K6532n4337P7794k3910m2865N1561L3104M6987m1448j25282
$$ 20986 57371 60984 87516 33179 110973 87063 44198 95759 128863 175850 134402 9120
15036I120n987J48600k5645k4845O3131o4295j1131L7462q499n5491p118L9219
$$ 9120 3133 151733 126088 101243 164374 100079 88948 126410 117911 62420 55302 94521
15024I4521L1571K4404K6687r58j2826l4562k4014J51080k4826j34256O3721K2560
$$ 94521 126092 150496 177183 176225 163399 128837 104823 255903 231077 96821 160542 183102
15012A83102o0768J17706o387o3734r6677L1838M6004m3220o8693j4711N2853
$$ 183102 122334 240040 233653 169919 73242 105080 151084 107864 39171 24460 77313
15001G7313L7119o037N957j8278k1271N5009O5757k4792L16l149q0163K1143m0630
$$ 77313 114432 108395 114352 96074 74803 129812 195569 170777 171093 167944 87781 108924 68294
14988F8294j4470n194j083m5459N0449p3189j02797J39699M4094J4456J5839j9119
$$ 68294 53824 48630 47547 2088 52537 -20652 -123449 16250 60344 74800 90639 71520
14976G1520N7687j25748J00279L6555o3028L1837j10547M0792J22493l9313r9122
$$ 71520 129207 3459 103738 140293 77265 109102 -1445 39347 161840 122527 23405
14965B3405Q530l0969J07486j8165k5641l0599k1592J29048M3100m327l5738J0661
$$ 23405 31935 966 108452 90287 64646 34047 12455 141503 184603 180276 144538 155199
14953A55199l5087O3169J6040q5548o1768N7008L8558p8259P6557l7051L3449
$$ 155199 120112 183281 199321 113773 52005 109013 147571 69312 145869 108818 142267
14942A42267L4964l7211p612k8508k6018R2779Q4277L1144q4717p2494J4784J8672
$$ 142267 177231 140020 132408 103900 77882 170661 254938 286082 201365 128871 143655 162327
14930A62327K4468j2188p1302l6745l6717K8801N2492m0652k0231M6348l4301
$$ 162327 186795 174607 103305 66560 29843 58644 111136 70484 50253 96601 62300
14919F2300N3525P1338l3711n0130m7758L5507l0426P0466J9313l9195l3963O0458
$$ 62300 115825 187163 153452 103322 55564 91071 60645 131111 150424 111229 77266 137724
14907A37724l8931O1441o516o0430k0430J923M6438J07481l737j38929K219o6521
$$ 137724 98793 160234 153718 93288 72858 74781 121219 228700 224963 86034 88253 21732
14895B1732l575M8140J2437J3542R5868n139j2078P5086j16182j1584M1956L8601
$$ 21732 18157 66297 78734 92276 188144 183005 170927 246013 129831 118247 160203 198804
14883A98804m6164k489m6660J546N0551r6994P0675K0777K9013k7998o9640O5287
$$ 198804 152640 150151 103491 105037 155588 58594 129269 150046 179059 151061 81421 146708
14871A46708m5649L7257j4305J1315J5704j128j5034l8800l1613K3805L994q562
$$ 146708 101059 138316 124011 135326 151030 149902 134868 96068 64455 88260 92254 83692
14859H3692Q596l6621O9787m6510L1764J43672j00525q5599j5951R0165n5313
$$ 83692 92288 55667 125454 78944 110708 254380 153855 68256 52305 142470 87157
14848H7157j15O1167p9894j2559J13098n8486n7045Q3572Q4923l38j26862N2804
$$ 87157 87042 148209 68315 55756 168854 110368 53323 136895 221818 221480 94618 147422
14836A47422q3200k7145K3447J9089L5314Q621j08395k2406N1119M822L9644L204
$$ 147422 64222 37077 60524 79613 114927 123548 15153 -7253 43866 48688 88332 91536
14824I1536k1201l0100k870L376K966L5970p6975J5460J04323J10031p2157j12588
$$ 91536 70335 40235 37365 40741 43707 79677 2702 18162 122485 232516 160359 47771
14812D7771k679Q8007K1403o4357l573o0573M5070O4965l919O2092l1527o3700
$$ 47771 45092 133099 154502 90145 86572 25999 71069 136034 132115 194207 162680 98980
14800I8980N812j5765j5381j3384M3814P1103r5276l6051J3125n641R413K907
$$ 98980 104792 89027 73646 60262 104076 175179 79903 43852 56977 51336 60749 63656
14788F3656l499P6730N0507N367j1203L2658l139j41250K7057o6631K6250J9321
$$ 63656 60157 136887 187394 192761 181558 214216 211077 69827 96884 30253 56503 75824
14776G5824J3891N1069q42n7881l5900R2446O0229L0134p6292m3084M5389N1161
$$ 75824 89715 140784 139942 82061 46161 138607 198836 228970 152678 109594 154983 206144
14764B06144J0684o0112n1155R6007J24016j14961j31214J3594L3132j6647m7355
$$ 206144 216828 156716 105561 201568 325584 210623 79409 93003 126135 109488 62133
14753F2133L1M2961J26730n3930j03524N088R1203j7943m0321m2468j9770J42731
$$ 62133 62164 105125 231855 177925 74401 79489 170692 152749 112428 69960 50190 192921
14741A92921l5857j9811j7597J2249J563q2426Q1012J2288p2336j5747j5613k1904
$$ 192921 157064 137253 119656 131905 133468 51042 132054 144342 72006 56259 40646 18742
14729A8742Q4877L6552K6476j3789R7208r354K0714n7166n8736K5532L7986l0346
$$ 18742 103619 140171 166647 152858 250066 240712 261426 204260 145524 171056 209042 178696
14717A78696j9586J2811n573K3180r1499n3600k1119L2139K7578K1514Q8542N2615
$$ 178696 159110 171921 166348 189528 98029 44429 23310 55449 83027 104541 193083 245698
14705B45698o8336p0410m4486J70108J8948l8006j0653n3145L5219K7216l151
$$ 245698 177362 106952 62466 232574 251522 213516 202863 149718 184937 212153 209002
14694B09002L2525q2996p5939l4346j1529N7955N1574n5434L3154N7334l4854
$$ 209002 241527 158531 82592 48246 36717 94672 146246 90812 123966 181300 146446
14683A46446K7212M1508k8290k3740l8346K5330K083j8314n6073J43540J547q4718
$$ 146446 173658 215166 186876 163136 124790 150120 152203 133889 77816 221356 222903 138185
14671A38185R7848k3084p5983M5600R180k7184l6417L9493Q2584n8921o3632j0223
$$ 138185 236033 212949 136966 182566 191746 164562 128145 167638 250222 191301 127669 117446
14659A17446m3543O0054n8412N958R3826L0637J08696j3398r5585O1440M4835
$$ 117446 73903 133957 75545 81503 175329 205966 314662 301264 205679 267119 311954
14648C11954k6504j55731K9806m1184K1928L9064j50404L2887k4344L715K8968
$$ 311954 285450 129719 159525 118341 140269 179333 28929 61816 37472 41187 70155
14637G0155j8592R433O8951J2800m9100j28k167J6776Q4584M0800J2402n9647
$$ 70155 51563 60996 129947 142747 93647 93519 91352 108128 192712 233512 245914 186267
14625A86267N7752r5199l0695L1851k5677O3677J7236j02126M0516M34o1247M6934
$$ 186267 244019 148820 118125 149976 124299 187976 205212 103086 143602 144036 82789 129723
14613A29723M9403j56313p350O9935M803K5758P8137p2779k0637J74403j4297
$$ 129723 179126 22813 15463 85398 90201 115959 194096 121317 100680 275083 260786
14602B60786r9659m0563J3802P0623M6545k2884j25819K8276R9565p9300n1490
$$ 260786 161127 120564 134366 204989 251534 228650 102831 131107 230672 151372 99882
14591I9882n8287p8733J21896o7831O586P7270k6437Q5853L1517r898k7355p5605
$$ 99882 41595 -37138 84758 16927 23513 100783 74346 160199 191716 181818 154463 78858
14579G8858N2101R1185l1174m9083M2716m3724J3614j4542n9254J11311m1233
$$ 78858 130959 222144 190970 141887 184603 140879 154493 139951 80697 192008 150775
14568A50775K8787L2075m9193o4435K5179K8074N7018l7798p2337O4204j4528
$$ 150775 179562 211637 162444 98009 123188 151262 208280 170482 98145 162349 147821
14557A47821J8817j11347J00148P7035k6015M0653P534j5509q7892J0969O3898
$$ 147821 166638 55291 155439 232474 206459 247112 254646 239137 151245 162214 226112
14546B26112p627k5217k7699L8235j2225p0966M4168K3441m8297p2730N7877K6830
$$ 226112 218485 193268 165569 203804 191579 120613 164781 188222 139925 67195 125072 151902
14534A51902N6286m8881M2017k0686M5624N9757N4888j9840m5410o2321p4427
$$ 151902 208188 159307 201324 180638 226262 286019 340907 321067 275657 213336 138909
14523A38909l011K9727n3101k2181N8445N7513L969J326J5825p7362l9394j2043
$$ 138909 135898 165625 112524 90343 148788 206301 210270 211596 227421 150059 110665 98622
14511I8622J2283P0554j580m8890j3295K6540k8473K0194P8595J4859J1857R785
$$ 98622 110905 181459 179879 130989 117694 144234 115761 135955 214550 229409 241266 251051
14499B51051m4413m3427k2737Q9552j30931N0626J46800P4123j05042k4879l1935
$$ 251051 206638 163211 140474 230026 99095 149721 296521 370644 265602 240723 208788
14488B08788J7790K3153j27371j0994n197P8760P8044P5274j20621P210J08824
$$ 208788 226578 249731 122360 111366 106169 184929 262973 338247 217626 224836 333660
14477C33660L2092j20641m9636k0875M2658J8478q511n4569J0361O5569q6699
$$ 333660 365752 245111 195475 174600 217258 235736 227225 172656 183017 248586 161887
14466A61887o0239J27250j06910J23249j10329M2263J2821p989J4018K1034M1432
$$ 161887 101648 228898 121988 245237 134908 177171 189992 182003 196021 217055 258487
14455B58487L0481K8390j2887k1139k9383j21445j7469J78218k5397l4784p5337
$$ 258487 288968 317358 304471 283332 253949 132504 115035 293253 267856 233072 157735
14444A57735N81J22338M9009K0264J4607j25825p3335Q4985O6465q5385Q0966
$$ 157735 158316 280654 329663 349927 364534 238709 165374 250359 316824 231439 312405
14433C12405N0909k8718m4910n1760j26229m5967k1881P056O4984j2563l657R7778
$$ 312405 363314 334596 289686 237926 111697 65730 43849 50905 115889 103326 99669 197447
14421A97447j10231R8799M5685o7907l613J9470O9707m4351P2090q1120n1231
$$ 197447 87216 186015 231700 163793 160180 179650 249357 205006 277096 195976 144745
14410A44745J24444r3778j3531Q8713k2044l1356Q4196q7576o7453M0114M0843
$$ 144745 269189 175411 161880 250593 228549 197193 281389 193813 126360 166474 207317
14399B07317K3901q1248J08910K8841n8603P538N457K8808J5187M247o1480P091
$$ 207317 231218 149970 258880 287721 229118 236656 242113 270921 286108 290355 228875 235966
14387B35966o0341L9651N6472M5797j03746l2472j097j5312O4339o758k3787m3797
$$ 235966 175625 215276 271748 317545 213799 181327 180230 164918 229257 222499 198712 154915
14375A54915J2034P5995M5394n9433l6517J19764l8576O592M4420j47239j7101
$$ 154915 166949 242944 288338 228905 192388 312152 273576 280168 324588 177349 160248
14364A60248K8698M9980l6091Q7993M1433q2664j09253J4796M5979K7499J0371
$$ 160248 188946 238926 202835 290828 332261 249597 140344 155140 201119 228618 238989
14353B38989M1841q6077O383J20130r0948k9454K21N733J046p8352N1814K4724
$$ 238989 280830 194753 201136 321266 230318 200864 201085 206818 207864 129512 181326 206050
14341B06050K174k1778Q8652L9200N9347r0300o8764j0666N1495J20975o3194
$$ 206050 208224 186446 275098 314298 373645 283345 214581 203915 255410 376385 313191
14330C13191Q308q5J544q1091O8635m3976N986j8696k8294J33368j03969n0255
$$ 313191 321499 321414 322958 241867 310502 266526 272512 253816 225522 358890 254921 204666
14318B04666l435J00447M5138p0225m1565N801l0458n089L0644o7295K1537O5053
$$ 204666 201231 301678 346816 276591 235026 240827 210369 205280 235924 168629 190166 255219
14306B55219K0312n1612K0180O9207r2816K4289Q7833p4524N4750k4631M2331
$$ 255219 275531 223919 244099 313306 220490 244779 332612 258088 312838 288207 330538
14295C30538N937K5975K7397p7313p827j2460l7276o079M202K8629J12291l1019
$$ 330538 336475 362450 389847 312534 304707 292247 254971 248892 253094 281723 394014 362995
14283C62995j0553k8450l3032N6427J644r9702K7962Q0490o2492k7396L809P5366
$$ 362995 352442 323992 290960 347387 349031 249329 277291 357781 295289 267893 271702 347068
14271C47068l6850N0437n3743j16375j3036M9421K1431J3837j3685J0175R1136
$$ 347068 310218 360655 306912 190537 177501 226922 248353 262190 248505 258680 349816
14260C49816n2640k2892p9805M1301J25711j0206j34853r4195N1409J43462m0251
$$ 349816 297176 274284 194479 235780 361491 351285 216432 122237 173646 317108 276857
14249B76857o4069J06855J980N1517K1650j10344q618K6516n9636p6142M7307
$$ 276857 212788 319643 321623 373140 394790 284446 275828 302344 242708 166566 213873
14238B13873L0690l707K834J1802O301m8068J8237m9440r0346l966J6512N9615
$$ 213873 244563 240856 243690 255492 261793 213725 231962 182522 92176 88210 104722 164337
14226A64337o7482L6502K6939Q6673K1492o8023k8339j8205N7339l1244m0237
$$ 164337 96855 133357 160296 246969 268461 200438 172099 153894 211233 179989 139752
14215A39752O6298J51232K7j45413J718Q6554N9614l4722k9296n032j2083p3870
$$ 139752 206050 357282 357309 211896 213614 300168 359782 325060 295764 290732 278649 204779
14203B04779K0118Q1929q8809J2681o3606N1111J1759R89p549Q0059o6505j20727
$$ 204779 224897 306826 218017 230698 167092 218203 229962 230951 223402 303461 236956 116229
14191A16229P4659M9426N177J5683k344p3015m2568O7252k6564M6695N0035o3961
$$ 116229 190888 240314 245491 261174 258830 185815 143247 210499 183935 230630 280665 216704
14179B16704P6781k5121q3148J4822R7316r0292N3764L9332K3883Q1600j23503
$$ 216704 293485 268364 185216 200038 297354 207062 260826 300158 324041 405641 282138
14168B82138o3625R687m3079O1479J4575N0833m3985J032J59771Q3863j40572
$$ 282138 218513 228200 185121 246600 261175 312008 268023 269055 428826 512689 372117
14157C72117n6154L1230o1986J0031k6184O2965K0156q1020J4565P122J1274r2871
$$ 372117 315963 347193 285207 295238 269054 332019 352175 271155 285720 292842 304116 211245
14145B11245r9114J23891Q8198l114n4769p933Q507j9744O2003j1725l9634J3828
$$ 211245 112131 236022 324220 321106 266337 258404 266911 247167 309170 297445 257811 271639
14133B71639n2148O6302J23859l7349o3841M3717o9067p0485p131M2262j0214
$$ 271639 219491 285793 409652 372303 308462 352179 283112 212627 205496 247758 237544
14122B37544O2482k8965J0246m8249K8487k4922Q5915Q5086j16812L1770K4853
$$ 237544 300026 271061 281307 233058 261545 236623 322538 407624 290812 322582 347435
14111C47435N9206J2469o2145J5263J3594p4682Q4874j3014N045J611l0240K2127
$$ 347435 406641 419110 356965 372228 385822 311140 396014 383000 388045 389656 359416 381543
14099C81543N3360r2162o6171J40995n6158q5277J51985P2674j1894P2116j07578
$$ 381543 434903 342741 276570 417565 361407 276130 428115 500789 488895 561011 453433
14088D53433n2849L123j10092L2005K5056o637k8732J00234l561o3718M3587Q9387
$$ 453433 400584 403707 293615 325620 350676 344039 315307 415541 411980 348262 391849 481236
14076D81236p5367j1760N2781o8999o3151l8908P2971R776J15004m3057q1528
$$ 481236 405869 394109 446890 377891 314740 275832 348803 358579 473583 430526 348998
14065C48998K9288J3651j4294R6003K4097o9269k3055k9583L4581P7419p1573
$$ 348998 378286 391937 377643 473646 497743 428474 405419 375836 410417 487836 416263
14054D16263k9627p846m5494k800K7379N0254L59K1901J0163n5081m4718P3036
$$ 416263 386636 378790 333296 330496 357875 408129 408488 430389 440552 385471 340753 413789
14042D13789n9109j8854N3367J9953j8637J4157n010j00379L187o1871N8709J17743
$$ 413789 354680 335826 389193 409146 390509 404666 399656 299277 302464 240593 299302 417045
14030D17045N4164j7179o7477L9500o6383j3232J12464N4l6303O1675m8449j6630
$$ 417045 471209 454030 386553 426053 359670 346438 458902 458956 422653 484328 435879 419249
14018D19249m464o4566L8296j22207M3945J01467L9909J2187j6788Q4522l9843
$$ 419249 414785 350219 388515 266308 310253 411720 451629 463816 447028 531550 491707
14007D91707p8136m7212P9868n6853k9154J9133M6117M3993J3898q2844R6648
$$ 491707 413571 366359 446227 389374 360220 379353 425470 469463 483361 400517 497165
13996D97165m4008K1901R829K9409q397j49896Q8554j5864k2717P6067N4465M023
$$ 497165 453157 475058 484887 514296 505899 356003 444557 428693 405976 482043 536508 540531
13984E40531p6178L3918J14448k180p0075J7209k5568N515j7702p5396L3j9408
$$ 540531 464353 498271 612719 610539 540464 557673 532105 537620 519918 444522 444555 425147
13972D25147J12664N0959o5711n2589P3341j2319Q0722N0144j67343j18J0932
$$ 425147 537811 588770 523059 470470 543811 531492 612214 662358 495015 494897 505829
13961E05829o6124J6909J00207N8469J5670p8006p0835J73849M2854k2357p2286
$$ 505829 439705 456614 556821 615290 630960 552954 482119 655968 698822 676465 604179
13950F04179n7680P2211K2524j08430J5462n7356J21292K08872q7535n8543j17266
$$ 604179 546499 618710 641234 532804 548266 490910 612202 821074 733539 674996 557730
13939E57730O5452M0107R56R913l5934j1105n8521M9227m5775p4621p157J16377
$$ 557730 623182 663289 664245 674158 638224 627119 568598 617825 572050 497429 490272 606649
13927F06649J06748p6587J2765L1573p5570M3691N5900k2330j785N9797M1399
$$ 606649 713397 636810 649575 681148 605578 649269 705169 682839 681054 740851 782250
13916G82250q3889j43897L9187P6217n191j34438N0830L4798N865q080R7457k5570
$$ 782250 698361 554464 593651 669868 664677 530239 581069 615867 621732 613652 711109 685539
13904F85539o7325J6030k1133K7813n0065L7446J17219j3616N4654j19418j3993
$$ 685539 618214 634244 613111 640924 590859 628305 745524 731908 786562 667144 653151
13893F53151p7439o573M6946k741K8M7127J75057l4623r9938m1558P1192K1157
$$ 653151 575712 569139 616085 613344 613372 660499 835556 800933 700995 659437 730629 751786
13881G51786N6612l0305K1196P7707J7020r7734K2675p4187L9566J4836l1776
$$ 751786 808398 778093 799289 876996 894016 796282 818957 744770 784336 799172 767396
13870G67396J2637M5256m4262O0384L7938J931P7315j00645j03447Q5946m65j275
$$ 767396 780033 825289 781027 841411 879349 881280 958595 857950 754503 840449 839984 838709
13858H38709l8679N337R4252o6507N7013L6995m7095J7387j20483k0825Q6576
$$ 838709 800030 805367 899619 833112 890125 927120 880025 897412 776929 756104 842680
13847H42680O029N5982O541l0851l8328P4312n2758K54J16497j1826k5373N9426
$$ 842680 848709 904691 911232 880381 842053 916365 863607 863861 980358 968532 943159 1002585
13835A002585J61n5235n7784o5794P7955O3995J47894j29036J2681P6601O4656
$$ 1002585 1002746 947511 889727 823933 901888 965883 1113777 984741 997422 1074023 1138679
13824A138679o6997n9788j8908K6377P0346k4522N1823P5724m7207n4968k9624
$$ 1138679 1071682 1011894 992986 1019363 1089709 1065187 1117010 1192734 1145527 1090559 1060935
13813A060935O1847J7781m1100l636k5893P7211m9338R5610l4486J8832o2993
$$ 1060935 1122782 1140563 1099463 1095827 1069934 1147145 1097807 1193417 1158931 1177763 1114770
13802A114770l3044j4117J07196J3725L162J0526J0529o3968j4374L7608M1878
$$ 1114770 1081726 1067609 1174805 1188530 1191692 1202218 1212747 1148779 1134405 1172013 1213891
13791A213891N7312j28907q043l7456n3601N4177P1323p332R9480R0p1509r0616
$$ 1213891 1271203 1142296 1134253 1096797 1043196 1097373 1168696 1161364 1260844 1260934 1189425 1098809
13779A098809M3629J1739n9512J07564P7644k5083j9103O6606N8332m1504m7973
$$ 1098809 1142438 1154177 1094665 1202229 1279873 1254790 1235687 1302293 1360625 1319121 1271148
13768A271148K7078J1942l0408N5248N457J6695n2682Q4721j3270j1651N7645
$$ 1271148 1298226 1310168 1279760 1335008 1340465 1357160 1304478 1389199 1375929 1364278 1421923
13757A421923k3475K1091K0772o190K2468L3191k9475K5865j2777J52020J3026
$$ 1421923 1398448 1419539 1440311 1434121 1456589 1489780 1460305 1486170 1473393 1625413 1638439
13746A638439J1173j7784P7580l2333N6296J9394j12049r850K0098O6073o866
$$ 1638439 1649612 1631828 1709408 1677075 1733371 1752765 1640716 1630866 1650964 1717037 1710171
13735A710171m3258j9254j22114J08965O5823N3293N9562M051j8630J3792J31939
$$ 1710171 1666913 1647659 1525545 1634510 1700333 1753626 1813188 1817239 1798609 1812401 1944340
13724A944340r1273M3601O0998q4748L5544M4010J9851k0057n0093J22085o6269
$$ 1944340 1853067 1896668 1957666 1872918 1908462 1952472 1972323 1952266 1902173 2024258 1957989
13713A957989J7315l1927O362O5045M4195n8637O4497N4388Q5443j6726J0045
$$ 1957989 1975304 1943377 1949739 2014784 2058979 2000342 2064839 2119227 2204670 2187944 2197989
13702B197989r2148O8841P2464n2420M4586j24514N65O1946J7473j01060L7696
$$ 2197989 2105841 2174682 2247146 2194726 2239312 2114798 2115363 2177309 2194782 2093722 2131418
13691B131418M0558j5055J29184P1788j27523M7337K2213K0013K3268J8676J28179
$$ 2131418 2171976 2156921 2286105 2357893 2230370 2277707 2299920 2319933 2343201 2361877 2490056
13680B490056j7440m4302O7746q826R6988j4869J6825L4799k7900k4727J8871
$$ 2490056 2472616 2428314 2496060 2487234 2584222 2569353 2586178 2620977 2593077 2568350 2587221
13669B587221L7436J997L9557Q5422n6142m1025K3482J69984J5356k7030N2331
$$ 2587221 2624657 2626654 2666211 2751633 2695491 2654466 2677948 2847932 2863288 2836258 2888589
13658B888589N0273N2009R4043l1061j6931J22883L1009j6076M7148N3134j961
$$ 2888589 2938862 2990871 3084914 3053853 3036922 3159805 3190814 3174738 3221886 3275020 3273059
13647C273059L3723N9978J10182m8496O8641n6138M4309p883N0379L4494M2759
$$ 3273059 3306782 3366760 3476942 3428446 3497087 3440949 3485258 3477375 3527754 3562248 3605007
13636C605007L0593J7901J210N5221K3611m4671j446n4668J24489J04464L5027
$$ 3605007 3635600 3653501 3654711 3709932 3733543 3688872 3687426 3632758 3757247 3861711 3896738
13625C896738m0696O3324J2443M1535J4181J373J37892M0902o20K8422R7445K1142
$$ 3896738 3856042 3919366 3931809 3973344 3987525 3988898 4126790 4167692 4167072 4195494 4292939 4314081
13613D314081r652M2515j3565Q0923J00395O4530P9738J11509M5707K9636N9833
$$ 4314081 4304429 4346944 4333379 4414302 4514697 4579227 4658965 4770474 4816181 4845817 4905650
13602D905650R0523m871J34606J31386P7284O6180Q9547J06434P5998J63309N3100
$$ 4905650 4996173 4991302 5125908 5257294 5334578 5400758 5490305 5596739 5672737 5836046 5889146
13591E889146J59353P4072J73157K05212N0785J05577J66480J20874J55591L4211
$$ 5889146 6048499 6122571 6295728 6500940 6551725 6657302 6823782 6944656 7100247 7134458
13581G134458K26186O3148J95173R4909k7924K80521J56505N2171Q9539J67615
$$ 7134458 7360644 7423792 7618965 7713874 7685950 7966471 8122976 8175147 8264686 8432301
13571H432301J35821O8489J00794J31324J15537J14020J10510J94823J12979J36793
$$ 8432301 8568122 8636611 8737405 8868729 8984266 9098286 9208796 9403619 9516598 9653391
13561I653391P6087J93222J75210K47503J69470J20398J17264J18802K42339R1950
$$ 9653391 9729478 9922700 10097910 10345413 10514883 10635281 10752545 10871347 11113686 11205636
13551A1205636J93813J35534O6369L24254R9644K02660M36640J74716J29009J34627
$$ 11205636 11399449 11534983 11601352 11925606 12025250 12227910 12664550 12839266 12968275 13102902
13541A3102902K31168J99887J61806L07151J95730J03413L10767J65186K59608
$$ 13102902 13334070 13533957 13695763 14002914 14198644 14302057 14612824 14778010 15037618
13532A5037618K19050K64256K99040L42142L71265L75153M01984L58504K62086
$$ 15037618 15256668 15520924 15819964 16162106 16533371 16908524 17310508 17669012 17931098
13523A7931098K92841M06155M25836K78800L24316N27399M53850M87872M08079
$$ 17931098 18223939 18630094 19055930 19334730 19659046 20186445 20640295 21128167 21536246
13514B1536246N02981M47782N69793M08430N04657N84139O18484N57258N48979
$$ 21536246 22039227 22487009 23056802 23465232 23969889 24554028 25172512 25729770 26278749
13505B6278749N53873O65445O44835O02013O29468O67377P10204P51458Q91702
$$ 26278749 26832622 27498067 28142902 28744915 29374383 30041760 30751964 31503422 32395124
13496C2395124P88773Q09452Q43964P54762Q05002R37021Q91365Q87891J009761
$$ 32395124 33183897 33993349 34837313 35592075 36397077 37334098 38225463 39113354 40123115
13487D0123115R93162J060266J116615J104970J160683J286685J306369J398418
$$ 40123115 41116277 42176543 43293158 44398128 45558811 46845496 48151865 49550283
13479D9550283J417489J333649J562976J681982J582337J751838J847491J858647
$$ 49550283 50967772 52301421 53864397 55546379 57128716 58880554 60728045 62586692
13471F2586692K001677K101428K214002K355001K431980K417021K585042K698599
$$ 62586692 64588369 66689797 68903799 71258800 73690780 76107801 78692843 81391442
13463H1391442L017838L212942L271095L280212L542154L748314L833145M156729
$$ 81391442 84409280 87622222 90893317 94173529 97715683 101463997 105297142 109453871
13455A09453871M313453M685300M823599N013423N415365N671198O137916O575022
$$ 109453871 113767324 118452624 123276223 128289646 133705011 139376209 145514125 152089147
13447A52089147O817103P078100P605216Q143216Q753320R298217R700909J0353501
$$ 152089147 158906250 165984350 173589566 181732782 190486102 199784319 209485228 219838729
13439B19838729J1056039J1744418J2200575J2753485J3275543J3594362J3856858
$$ 219838729 230894768 242639186 254839761 267593246 280868789 294463151 308320009
13432C08320009J3747073J3739539J3436464J2637738J1567500J0460294Q693376
$$ 308320009 322067082 335806621 349243085 361880823 373448323 383908617 392601993
13425C92601993O581678M338977J772739j137891l898872o574360r212323j1499393
$$ 392601993 399183671 403522648 405295387 404157496 400258624 393684264 384471941 372972548
13417C72972548j3169659j4597398j5647414j6137099j6223121j6057133j5807563
$$ 372972548 359802889 345205491 329558077 313420978 297197857 281140724 265333161
13410B65333161j5051782j4409253j3631139j2801118j2040996j1368943j0496822
$$ 265333161 250281379 235872126 222240987 209439869 197398873 186029930 175533108
13403A75533108r836746r228884q465075p925252p249011o827203o362123o001507
$$ 175533108 165696362 156467478 148002403 140077151 132828140 126000937 119638814 113637307
13395A13637307n486769m986049m836737m497440m145755l954384l579627l271780
$$ 113637307 108150538 103164489 98327752 93830312 89684557 85730173 82150546 78878766
13387G8878766l234773l107379k721739k664285k488946k292334k219528k053512
$$ 78878766 75643993 72536614 69814875 67150590 64661644 62369310 60149782 58096270
13379E8096270k003257j876716j764144j668417j534136j499160j590395j440020
$$ 58096270 56093013 54216297 52452153 50783736 49249600 47750440 46160045 44720025
13371D4720025j441097j214746j228110j252118j068030r73505j049223j058804
$$ 44720025 43278928 42064182 40836072 39583954 38515924 37542419 36493196 35434392
13363C5434392j014277j050273r36571q62000q27652q98607q59299o91082o05518
$$ 35434392 34420115 33369842 32433271 31571271 30743619 29845012 28985713 28294631 27689113
13354B7689113q30928p69796o19746p58384o54038o01668o04143n91028o14935
$$ 27689113 26858185 26088389 25468643 24710259 24056221 23454553 22850410 22259382 21644447
13345B1644447o23345m32853m58521l66324m63970m70323n03759m42003l95931
$$ 21644447 21021102 20588249 20129728 19763404 19299434 18829111 18325352 17883349 17487418
13336A7487418m03687l50961l94548l73030m09580k21159k65479l04177k44263
$$ 17487418 17083731 16732770 16338222 15965192 15555612 15334453 15068974 14764797 14520534
13327A4520534l73456l55086l19811k49595k24372l23065k48497k56059k54430
$$ 14520534 14147078 13791992 13472181 13222586 12998214 12675149 12426652 12170593 11916163
13318A1916163j49636r4668k73672l51468j85003k30293k21383j68639k58589
$$ 11916163 11766527 11671859 11398187 11046719 10861716 10631423 10410040 10241401 9982812
13309I982812j87001j90274j61708k38469k50804q4171p3253j68700n4755k07802
$$ 9982812 9795811 9605537 9443829 9205360 8954556 8870385 8797132 8628432 8573677 8365875
13299H365875j32220j82604k10276j73096r5350j69502o3911l1769m6976j73531
$$ 8365875 8233655 8051051 7840775 7667679 7572329 7402827 7338916 7307147 7260171 7086640
13289G086640j20497r1081O992j90015k02710n6886j30304q0613k8623j61360
$$ 7086640 6966143 6875062 6882054 6692039 6489329 6432443 6302139 6221526 6192903 6031543
13279F031543j20833j24593m747k725j26466k1520m3021o6030q7690n0153q8160
$$ 6031543 5910710 5786117 5781370 5778645 5652179 5630659 5587638 5521608 5433918 5383765 5295605
13268E295605r6836p7966q723j29857n176q7830P865m8786k6209j04838k7991
$$ 5295605 5198769 5120803 5112080 4982223 4977047 4889217 4897082 4848296 4822087 4717249 4689258
13257D689258J8656l916o2705J1064j49233L2465L5050O541r5348j00178q055
$$ 4689258 4707914 4703998 4641293 4652357 4503124 4535589 4570639 4577180 4481832 4381654 4373599
13246D373599L6424n5612J2361N168o034p2591j66572r7106O0630j521j6155p8902
$$ 4373599 4410023 4354411 4366772 4371940 4365906 4293315 4126743 4029637 4090267 4088746 4072591 3993689
13234C993689k0308r3597J2777j43278p4176k3397q0541j11396o2443O918j21599
$$ 3993689 3973381 3879784 3892561 3749283 3675107 3651710 3571169 3459773 3397330 3404248 3282649
13223C282649O1155k0286o4917j05858o0903m4202n6047j3463R300j19150l4421
$$ 3282649 3343804 3323518 3258601 3152743 3091840 3047638 2991591 2978128 2987428 2868278 2833857
13212B833857j07810p8516q2573J04844n2142j30319j49801M50P7427j26459l9527
$$ 2833857 2726047 2647531 2564958 2669802 2617660 2487341 2337540 2337990 2415417 2288958 2249431
13201B249431J0214j8m5584k9034Q7516j39025K7040q7506K1637o4821l7958J6638
$$ 2249431 2259645 2259627 2214043 2185009 2272525 2133500 2160540 2073034 2094671 2029850 1991892 2008530
13189B008530m9883N6563j5724J0394N0323q541j3063r7782L8775j01607j12199
$$ 2008530 1958647 2015210 1999486 2009880 2060203 2051662 2038599 1940817 1979592 1877985 1765786
13178A765786P698Q5420q1126r8221N7488L4151n1365L5827j7461J7701j16404
$$ 1765786 1773484 1858904 1777778 1679557 1737045 1771196 1719831 1755658 1738197 1755898 1639494
13167A639494K672l50r5312Q663N3034o5472J317N8637o8650K0308q5828j5292
$$ 1639494 1642166 1641816 1546504 1555167 1608201 1542729 1544046 1602683 1534033 1554341 1468513 1453221
13155A453221J6396K061j05823j3012r3433J0557J2315L4625J9659p3715n198
$$ 1453221 1469617 1471678 1365855 1352843 1259410 1269967 1282282 1316907 1336566 1262851 1257653
13144A257653P9400p4577l658M019l4664j506o6449l5027q0170m3429O7547l0686
$$ 1257653 1337053 1262476 1258818 1262837 1228173 1226667 1160218 1125191 1045021 1001592 1069139 1038453
13132A038453n2130m361l9168m9291n3191j045J29799K3474L139j48543Q9059
$$ 1038453 986323 981962 942794 893503 840312 839267 969066 992540 995679 847136 936195
13121I36195n9649m615K3669N5696J2013p5918p0442J28282L3560j46267k1796
$$ 936195 876546 871931 895600 951296 963309 887391 816949 945231 978791 832524 810728
13110H10728p7306N0863m3554j12927Q1728N798j1713R9528J19884j17053j3678
$$ 810728 733422 784285 740731 627804 709532 715330 703617 803145 923029 805976 792298
13099G92298J3686L5042K4488L3641J26071j26681L6853r6047p3825m8543r5682
$$ 792298 805984 841026 865514 899155 1025226 898545 935398 839351 765526 716983 621301
13088F21301Q0130p2274J5681Q4592J9K2370l9208k3763m7068J22561k231L7825
$$ 621301 701431 629157 644838 729430 729449 751819 712611 688848 641780 764341 762110 799935
13076G99935J8770p3379k8208N479o0931j8578Q718n5475N7268J637p7380j7595
$$ 799935 818705 745326 717118 722597 661666 643088 651806 596331 653599 655236 577856 560261
13064E60261O3508M2418o3458L1946R4898l4286j5657O0126j02238j1466q3241
$$ 560261 623769 666187 602729 634675 729573 695287 679630 739756 637518 626052 542811
13053E42811J0544P5506L371j01333J7524r914O3646M7640p2086n5995p51R518
$$ 542811 553355 628861 632232 530899 548423 538509 602155 649795 577709 521714 520963 530481
13041E30481m0986Q485n2589k145o5436K7598K7939M8163q9188K0136Q2406l907
$$ 530481 489495 497980 445391 443246 377810 405408 433347 481510 392322 412458 494864 490957
13029D90957N3407n1424q4612l3723J8488m283n0573O6011L9178j08008J5346
$$ 490957 544364 492940 408328 374605 393093 388810 338237 404248 443426 335418 350764
13018C50764J4437K3285N82J0345K0482j22498l6302Q7135j7771p328P1001j0932
$$ 350764 365201 388486 389068 399413 419895 297397 261095 348230 330459 323131 394132 383200
13006C83200J551R476p7552M3372K1444J03421J1418m9592M9368q3549q163j47362
$$ 383200 384751 394227 316675 360047 381491 484912 496330 446738 496106 412557 404394 257032
12994B57032p549J27233J82K9459K6870J7338Q6426j06463j80401p2196L2115
$$ 257032 249483 376716 376898 406357 433227 450565 536991 430528 250127 177931 210046
12983B10046O1107K1984Q264J9801J47148j04480n1289J08808j7044m4110l9656
$$ 210046 271153 293137 301401 321202 468350 363870 312581 421389 404345 360235 320579
12972C20579J4395j8024j71K8235K6886k5760j12192K2163J06206j4927k5012
$$ 320579 334974 316950 316779 345014 371900 346140 233948 256111 362317 347390 322378
12961C22378m9769k60o4920R626J33221o4367m9718q746o652P8697K6815M273
$$ 322378 272609 272349 207429 217055 350276 285909 236191 227445 220793 299490 326305 330578
12949C30578p6117j09753M6872J03545j8985j17308j778M7115J06866J8120o7101
$$ 330578 254461 144708 191580 295125 276140 158832 157054 204169 311035 329155 262054
12938B62054R9446j05227r4903N7970L6147L7816J7883j15375Q9987m7124r462
$$ 262054 361500 256273 161370 219340 255487 293303 311186 195811 285798 238674 229212
12927B29212K0497q544J03205o2097O5346n8103o3463J3045P749j05658J1541
$$ 229212 249709 241165 344370 282273 347619 289516 226053 239098 246847 141189 152730
12916A52730o214Q0478O6766j15900l3295k5791J81024P6537n4055O5287o0511
$$ 152730 146516 226994 293760 177860 144565 118774 299798 376335 322280 387567 327056
12905C27056j28479L1447n6404R9860M5052m1535l5094P679n9731L8191Q0841
$$ 327056 198577 230024 173620 273480 318532 276997 241903 249582 189851 228042 308883
12894C08883j21913k1565K2734l8029P1231K1376m7971n5929p4535J35808q3707
$$ 308883 186970 165405 188139 150110 221341 242717 194746 138817 64282 200090 116383
12883A16383P0988L1742o2471l0566O9693M756o3758O840J7380M2639j13219j09242
$$ 116383 187371 219113 156642 126076 195769 200525 136767 143607 160987 203626 90407 -18835
12871a8835J19583J3572J41486M1937n2573m0660o6424l5492N2629k3942o7662
$$ -18835 100748 114320 255806 297743 245170 204510 138086 102594 155223 131281 63619
12860F3619J56768M4558n4954q7957J09521J6101p4574n429o3864M605J28926
$$ 63619 220387 264945 209991 122034 231555 247656 173082 167653 103789 108394 237320
12849B37320K5332L4246n384M3262n6082p9594M8286o6776j23837N9050K746M0177
$$ 237320 262652 296898 291514 334776 278694 199100 247386 180610 56773 115823 118569 158746
12837A58746P8744l9149n0623O8717n3174p1114J7395N886K421l461J4845m9770
$$ 158746 237490 198341 147718 216435 163261 92147 109542 115428 117849 114388 129233 79463
12825G9463J2548l1298L9066N7918j06381j02550R5977k852N1793O950L7646m1765
$$ 79463 92011 60713 99779 157697 51316 -51234 44743 41891 93684 100634 138280 96515
12813I6515q449J25204p7513J527j82j6718R773M5199K7372p7128M07M1806j02265
$$ 96515 88066 213270 135757 137284 137102 120384 130157 175356 202728 125600 126007 167813 65548
12800F5548N8737P31R479K910k5289j074j6350R0525j09866j4258O594K7257m0953
$$ 65548 124285 125016 134495 137405 112116 111042 94692 185217 75351 61093 67687 94944 53991
12787E3991p842r156O9368J44888M8472o6480q1035M3690M336j0667k068q3459
$$ 53991 46149 36993 106361 251249 299721 233241 152206 195896 200232 189565 187497 104038
12775A04038l8679p6325Q7409J9197L4945p6435l0534J17950m4228K9217m7733
$$ 104038 65359 -10966 76443 95640 130585 54150 23616 141566 97338 126555 78822
12764G8822L9854q5837P146R7269J7217k3759j5048k2569n7753M7366R568r8986
$$ 78822 118676 32839 39985 137254 154471 130712 115664 93095 35342 82708 92276 -6710
12752f710J01526L6132M4496k9712m061N2733n7506J8217o6844M644M7864j5598
$$ -6710 94816 130948 175444 145732 141671 194404 136898 155115 88271 92915 140779 125181
12740A25181O527N2865L5942n0987m7149k68R1739q940l4762p8001P4464J9286
$$ 125181 131708 184573 220515 169528 122379 122111 213850 204910 170148 92147 166611 185897
12728A85897l9889K527o4730L3745q8785L1742P0123Q189L3002P6277k3122l0940
$$ 185897 146008 148535 83805 117550 28765 60507 130630 138819 171821 248098 224976 194036
12716A94036k6020o6043J011N1110N4877M3218j9595k0253l5387l500O4995k0342
$$ 194036 168016 101973 102984 154094 208971 252189 232594 212341 176954 173454 238449 218107
12704B18107j5380l6662J15080n216o4517m4300q216o172j5651J168J3522j3889
$$ 218107 202727 166065 281145 275929 211412 167112 158896 152724 137073 138241 151763 137874
12692A37874L830Q9917L7605q1066j66774N7610K2452R3924O5288j74973m8481
$$ 137874 141704 231621 269226 188160 21386 78996 101448 195372 260660 85687 37206
12681C7206O0914N6100p6160m594O5110q14o3846N8171k1567k9817J09396O331
$$ 37206 98120 154220 78060 73466 138576 137762 73916 132087 110520 80703 190099 196430
12669A96430j39087N2167Q911m0729R4356l9903r1915P6018J23603p4463n5996
$$ 196430 57343 109510 118421 77692 172048 132145 40230 116248 239851 165388 109392
12658A09392J9643K8631P4977J5274m9771Q0341n0830q502k477j216r8155R0266
$$ 109392 129035 157666 232643 247917 198146 278487 227657 219155 216678 215462 117307 207573
12646B07573J75357p4571j13935k5261J09001p6473m4598j9236M4375O6067q5944
$$ 207573 382930 308359 194424 169163 278164 201691 157093 137857 182232 248299 162355
12635A62355j4287K4352q3868o8593N0044m4836J17877O3195L211M6931L1616
$$ 162355 148068 172420 88552 19959 70003 25167 143044 206239 209450 256381 287997
12624B87997r4391j17898k7956Q5404j2330j07895J12470O2543Q7304o2147m3305
$$ 287997 193606 75708 47752 133156 120826 12931 125401 187944 275248 213101 169796
12613A69796n9460K35K1578j18487K5184P2284R7028L2521j53674j976l0165k8260
$$ 169796 110336 110571 132149 13662 38846 111130 208158 240679 87005 85029 54864 26604
12601B6604N1605j1494n5952J8646J27950k8364K3865j6641K4759M441j47642
$$ 26604 78209 66715 10763 29409 157359 128995 152860 136219 160978 165419 17777
12590A7777K1759R2476j03448M4504n365P1281P2571q6959p4584J63891L4396
$$ 17777 39536 132012 28564 73068 67703 138984 211555 124596 50012 213903 248299
12579B48299o4828Q091q3299L4493m4824l7468Q7847J2238J2986J8864N6264j17449
$$ 248299 183471 191562 108263 142756 97932 60464 148311 160549 173535 192399 248663 131214
12567A31214O0400j1815m6887J6443J40833j51149Q6527Q7903j81513K9192n354
$$ 131214 191614 179799 132912 149355 290188 139039 225566 313469 131956 161148 155794
12556A55794J3346P3267M0075j53709l7113O4089j0011p0195O5404L2241N0945
$$ 155794 169140 242407 282482 128773 91660 155749 145738 75543 140947 173188 224133
12545B24133j2160N4393o5611O9535O8367l042r3333l4297N1829L8555l6029q857
$$ 224133 211973 266366 200755 270290 338657 335615 242282 207985 259814 298369 262340 253483
12533B53483O2903p301p3909R9643Q015M467k6328p3418J7444P7109o9423J06
$$ 253483 316386 309085 235176 334819 342834 347301 320973 247555 264999 342108 272685 272791
12521B72791N7789J6358K6358q0586n7758M9662J3674Q3010J1465l9874l8665
$$ 272791 330580 346938 373296 292710 234952 284614 298288 381298 392763 352889 314224
12510C14224j9713M6964j8442q0241M8060N8566n0510L933P5047O8039j6718M3453
$$ 314224 294511 341475 323033 242792 290852 349418 298908 302841 377888 445927 429209 472662
12498D72662K34n9719L5131k3275K9650N7551J02881q0904k9414J22386n2699
$$ 472662 472896 413177 448308 425033 454683 512234 615115 534211 504797 627183 574484
12487E74484q3190N0320J72009n818o40l6726l0168K9659j9877o0612n5578M8780
$$ 574484 491294 541614 713623 707805 707165 670439 640271 669930 650053 589441 533863 582643
12475E82643Q5281M4461k2791L506N9555L7806J11685K1317j11645J03892q9288
$$ 582643 667924 712385 689594 693100 752655 790461 902146 923463 811818 915710 826422
12464H26422l8171L2157j17116J1131P2388M210J53015m3739J1133j9937K0823
$$ 826422 788251 820408 703292 714423 786811 791021 944036 900297 911430 891493 912316
12453I12316R9164j19282Q7001o9746L8613j2808O4392J42043r4064j6084O5582
$$ 912316 1011480 892198 979199 909453 948066 935258 999650 1141693 1047629 1031545 1097127
12442A097127j1163K057q2437J7089P6028L5562k4644j932O1899N5408M765m8832
$$ 1097127 1085964 1088021 1005584 1022673 1098701 1134263 1109619 1107687 1169586 1224994 1229759 1180927
12430A180927P7531J0954o5613j3520N0395l878J575J2408M5764J3193j25992
$$ 1180927 1258458 1269412 1203799 1190279 1240674 1236796 1238371 1250779 1296543 1309736 1183744
12419A183744K7420P8339l2265o7852j9854q529Q5002m8896L0553n7960J14646
$$ 1183744 1211164 1289503 1257238 1189386 1169532 1161003 1246005 1197109 1227662 1169702 1284348
12408A284348m2950R1084o4802o9705o1546j5610L9503o2398N9539O4073j17663
$$ 1284348 1241398 1332482 1267680 1197975 1136429 1120819 1160322 1097924 1157463 1221536 1103873
12397A103873k4217K5572o999n7952R508P8523l238o7207n2159R400Q8282l3406
$$ 1103873 1079656 1105228 1098229 1040277 1049785 1128308 1125070 1057863 1005704 1015104 1103386 1069980
12385A069980r9440j2124j28143r1227O7363M2238m8730l0172l6504J04372m3279
$$ 1069980 970540 958416 830273 739046 806409 848647 799917 769745 733241 837613 794334
12374G94334r0730R331j6797j3081j6272l8151Q5400K8599q2342n1789M088K9104
$$ 794334 703604 712935 696138 683057 666785 628634 714034 742633 660291 608502 612590 641694
12362F41694l4574o7722k0105j1824K1678k2373l4531o048M6562l046l3478o6567
$$ 641694 607120 539398 519293 507469 529147 506774 472243 466195 512757 509711 476233 409666
12350D09666l2862o679J02582n0970J1428J0975P193k8866r5312n3979k6727O5390
$$ 409666 376804 370125 472707 421737 433165 444140 451333 422467 327155 273176 246449 311839
12338C11839M6016R019r6986n9901m1478O9412k7483j93243J43951J15581j2446
$$ 311839 357855 366874 269888 209987 168509 237921 210438 17195 161146 276727 264281
12327B64281K6999k1574l738K1910j93886K2407R3752J32372l4427j22221j4256
$$ 264281 291280 269706 265968 287878 93992 116399 210151 342523 308096 185875 171619
12316A71619K513K3440N3161n7337K5876M2425p8551j35797Q0779M7828R9804
$$ 171619 174132 197572 250733 193396 219272 261697 183146 47349 128128 175956 275760
12305B75760j197r9591k165J745J0650m811l9567Q8167n1874j8068L4897r7381
$$ 275760 274563 174972 172807 174552 185202 180391 140824 228991 177117 159049 193946 96565
12293I6565J12270P2136j76000K5247q0064O172M0951j3637J6614M4827l02m8705
$$ 96565 208835 280971 104971 130218 50154 56326 97277 83640 100254 145081 144779 96074
12281I6074N0249k8612j8862j33578J40924K1210o8805L1614L051K0782R494p8943
$$ 96074 146323 117711 98849 -34729 106195 127405 58600 90214 93265 114047 123541 44598
12269D4598J64O6925j1804q612m2980j2966Q5586k9049M067o2778M3106M2611
$$ 44598 44762 111687 99883 91271 48291 35325 120911 91862 95929 33151 76257 118868
12257A18868r8259R8483N9422j2537k6194l8404O1383j26050J4641j459P1923
$$ 118868 20609 119092 178514 165977 139783 101379 162762 36712 51353 49894 121817
12246A21817J1638O46o914p7234L4298K272n7647P2154m7532p2818j1202N1337
$$ 121817 133455 134101 127187 49953 84251 86523 28876 101030 53498 -19320 -30522 20815
12234B0815J1285k0690j02378O0861J29999N5229J1343l7060j35002J2721O2504
$$ 20815 32100 11410 -90968 -30107 99892 155121 166464 129404 -5598 7123 69627
12223F9627o7005L6314p4105O3180L6354J9541j7324j48339R8564K6095N493r0073
$$ 69627 2622 38936 -35169 28011 64365 83906 66582 -81757 16807 42902 48395 -41678
12211d1678N3382J23584m3631n7751m1014L7586J2453O5803K8011n3177k9158
$$ -41678 11704 135288 91657 33906 -7108 30478 42931 108734 136745 83568 54410
12200E4410L2122m0552M5733P4375r4155j3086j775K69j00887Q9278j5769J18265
$$ 54410 86532 45980 91713 166088 71933 58847 57072 57341 -43546 45732 29963 148228
12188A48228K9755l4042j7544j33337N9856J4715K1243l6704l9940K5283k2183
$$ 148228 177983 143941 126397 -6940 52916 67631 88874 52170 12230 37513 15330
12177A5330M4005P9144m9073k0375m7416n8205k4088R5813k4236o6603K521J08537
$$ 15330 59335 138479 89406 69031 21615 -36590 -60678 35135 10899 -55704 -53183 55354
12165E5354q462J1293n10Q6982J7151o4906j011J2840k873l0528k5884j2035K8769
$$ 55354 46892 58185 57675 144657 161808 96902 95891 108731 105858 75330 49446 37411 66180
12152F6180l0025j0096r883L8739l7300j6136M5538l8591P4986l8964m7262Q242
$$ 66180 36155 26059 16176 54915 17615 1479 47017 8426 83412 44448 -2814 5428
12140E428J07436N38p2930R7893p3339P778o3486m302O6413J11484L7805n0044
$$ 5428 112864 113402 40472 138365 65026 72804 9318 5016 71429 182913 220718 170674
12128A70674q5329n3923Q3810L3554j9255J4824m319j57223J08132L3952M1601
$$ 170674 85345 31422 115232 148786 129531 144355 140036 -17187 90945 124897 166498
12117A66498m8490m1310K4153K8912P249p0349j673J35524j51542J11394j4254
$$ 166498 118008 76698 100851 129763 137012 66663 64990 200514 48972 160366 146112
12106A46112L2271J5883M9133n0448j03353P0787L7353j2671l765J28400k0587
$$ 146112 178383 194266 243399 192951 89598 160385 197738 185067 181302 309702 289115
12095B89115J0424n0261n7755J05843l1547M6314n7335l2071K4876o1802l9991
$$ 289115 299539 249278 191523 297366 265819 312133 254798 222727 247603 185801 145810
12084A45810m0377K7022N708Q5557m4964Q4942K5485k9408m7679l8558R6461K4029
$$ 145810 105433 132455 138163 223720 178756 263698 289183 259775 212096 173538 269999 294028
12072B94028j6706K3538j9313o9470O911P5047N969j13704l1338M8808R8769Q2531
$$ 294028 277322 300860 281547 212077 218988 294035 300004 186300 154962 203770 302539 385070
12060C85070q5687J05226j2831j94078J9487O7114r665Q7800o2679l6173l4924
$$ 385070 299383 404609 391778 197700 217187 284301 274636 362436 299757 263584 228660
12049B28660l0383r8343N3146N7679J13625l0363o4423K8630N3821k08306l4529
$$ 228660 198277 99934 153080 210759 324384 294021 229598 258228 312049 103743 69214
12038F9214K5336o4545P7294N946R3125q398q7689J63654K8142l4628P5185o7947
$$ 69214 94550 30005 107299 113245 206370 197972 110283 273937 302079 267451 342636 274689
12026B74689k7265n490L7800K2361K1010q8695j4609N7112k2255m5344n8380o6423
$$ 274689 247424 241934 279734 302095 323105 234410 219801 276913 254658 209314 150934 84511
12014H4511j9083J37769l9745l639o375m2582Q104L490o9435l355L6961L4539
$$ 84511 65428 203197 163452 159813 153438 110856 118960 122450 53015 49660 86621 121160
12002A21160L3616L5322L8216K3122m2529K7827R3364j22044r9650p7525Q2509
$$ 121160 154776 190098 228314 251436 208907 236734 330098 208054 108404 30879 113388
11991A13388M6442N5492j7118P817K7863m9827n4081k274q0548J5473L4723q9268
$$ 113388 159830 215322 198204 206021 233884 184057 129976 127702 47154 62627 97350 8082
11979H082J0495M054O5739L8305K3605l2746n917J2556k7765J17126J1605N5164
$$ 8082 18577 22631 88370 126675 150280 117534 111617 124173 96408 213534 225139 280303
11967B80303K6251l4781j5056p1624L6934j0434j52627M114O3853k2473j8878
$$ 280303 306554 271773 256717 185093 222027 211593 58966 63080 126933 104460 85582
11956H5582M3154O7388P3531p0701m2592k5407K3508J6516o3147m173K0371L3861
$$ 85582 128736 196124 269655 198954 156362 130955 154463 170979 107832 103659 124030 157891
11944A57891j1683k4442N419N3302r2557M6251N0066m5272p7341N554O2301O5172
$$ 157891 146208 121766 127185 180487 87930 134181 184247 138975 61634 67188 129489 194661
11932A94661q535n3238J3318L121k4540r1735J06185L3761M9615Q1090n0325o1962
$$ 194661 186126 132888 146206 149327 124787 33052 139237 172998 222613 303703 253378 191416
11920A91416m5937J23026mn0990J2368O8652R8590m300r4970M881L0461P2928
$$ 191416 145479 268505 268501 217511 229879 298531 397121 392821 297851 302732 333193 406121
11908D06121n9473M3827K7739K2439L2196m4629k8020m2346j9880j9681J0910
$$ 406121 346648 390475 418214 440653 472849 428220 400200 357854 337974 318293 329203
11897C29203J9906J08246K5904k2538j03611r9749j3131J15633M7769j7478k5136
$$ 329203 349109 457355 483259 460721 357110 257361 244230 359863 407632 390154 365018
11886C65018R3665j3430l7586M0955O7008K2272r389n6057j64n044R6329L9609
$$ 365018 458683 445253 407667 448622 515630 537902 528513 472456 472292 467248 563577 603186
11874F03186L4031L9040l3518j08573m07J5670J0827n716p4306q6116K9806L7644
$$ 603186 637217 676257 642739 534166 533759 549429 560256 554540 480234 394118 423924 461568
11862D61568J04875m4205n465J03786k7579O9815n7367m1217J69119q763m8337
$$ 461568 566443 522238 516773 620559 592980 662795 605428 564211 733330 724567 676230
11851F76230J3155Q0684q4886N0045P447j14744N7613j20236R1523Q8953j0929
$$ 676230 689385 770069 685183 735228 742675 627931 685544 565308 656831 745784 734855
11840G34855J36880O0942r3284r221o0507P7553O4984L3587K3959l9710n1518
$$ 734855 871735 932677 839393 830172 769665 847218 912202 945789 969748 930038 878520
11829H78520M6030j3014J42727o8948n233m5517N6187j27l423Q1975m0733n757
$$ 878520 924550 911536 1054263 985315 980082 934565 990752 990625 987202 1069177 1028444 1022687
11817A022687M441P1809l8589P1186M5619o6662m8170O1199M1732O0070l7983
$$ 1022687 1027128 1098937 1060348 1131534 1177153 1110491 1062321 1123520 1165252 1225322 1187339
11806A187339j9375L8259r368P262O6576m6568j05070j9543J54381J3034R2652
$$ 1187339 1167964 1206223 1196855 1204117 1270693 1224125 1119055 1099512 1253893 1266927 1359579
11795A359579r512l3885N8975p0195j272Q983M6353J2181J7472p0578Q5383K7707
$$ 1359579 1350067 1316182 1375157 1304962 1303690 1312673 1359026 1371207 1388679 1318101 1403484 1431191
11783A431191K6626j4639J03444j5617M335P8767O9442m5055k71877K6821J38526
$$ 1431191 1457817 1443178 1546622 1531005 1535340 1614107 1683549 1638494 1366617 1393438 1531964
11772A531964j3770J03044L1943j36322L6100R4107m2467M0614K3118p6317n11
$$ 1531964 1518194 1621238 1653181 1516859 1552959 1647066 1604599 1645213 1668331 1592014 1591503
11761A591503n7940l7837M7055M090n5936J2241j0671K4734m1757N8638O7813
$$ 1591503 1533563 1495726 1542781 1546871 1490935 1503176 1492505 1517239 1475482 1534120 1601933
11750A601933k7597N3313j6615j26977q6344N2550L7033M0243o2661J3695L4025
$$ 1601933 1574336 1627649 1611034 1484057 1397713 1450263 1487296 1527539 1464878 1478573 1512598
11739A512598J2733r2591L6474N7429Q4848J5056q1784P857j33598o1250N3883
$$ 1512598 1525331 1432740 1469214 1526643 1611491 1626547 1544763 1552620 1419022 1357772 1411655
11728A411655L7400l0737j3801j0881o1146L1503l1820p8156k9810J7663K7115
$$ 1411655 1449055 1418318 1404517 1393636 1332490 1363993 1332173 1254017 1224207 1241870 1268985
11717A268985p5801O7284O1829m1584l2026j14817P368O5590q372O181o202k1226
$$ 1268985 1193184 1260468 1322297 1280713 1248687 1133870 1141238 1206828 1198456 1204637 1198435 1177209
11705A177209k1821l3153K0485o7963n4029M3184m8593J725j24314K7121L4268
$$ 1177209 1155388 1122235 1142720 1074757 1020728 1063912 1015319 1017044 892730 919851 954119
11694I54119p1112N9147L5156k811K4976r8146K4460j7617q658P999j05433n3014
$$ 954119 883007 942154 977310 974499 999475 901329 925789 908172 899514 907513 802080 749066
11682G49066N2941q779J7905k5693O2535l8646j01304n8579q6155N7748J95936
$$ 749066 802007 793228 811133 785440 847975 809329 708025 649446 563291 621039 816975
11671H16975j81340P9315R265O319j10071J4287n378j2011O1355J89P811q0834
$$ 816975 635635 714950 724215 730534 620463 634750 629372 617361 678716 678905 686716 605882
11659F05882k0495j02619Q1154m7635M5968M9337j09185r6330R5141n3377l6866
$$ 605882 585387 482768 563922 516287 562255 611592 502407 406077 501218 447841 410975
11648D10975M7233J13898r968q321q7854L9817O9900o8974j51621N557K7677l0187
$$ 410975 458208 572106 562138 553817 465963 505780 575680 506706 355085 360642 388319 358132
11636C58132M7040q7643n6652J30933j7825M4317K8846p3567l3681K8024J7228
$$ 358132 405172 317529 260877 391810 373985 418302 447148 373581 339900 367924 385152
11625C85152L2015q716l7591j54O8002o0137k3481n8000J5486J02308l9084K4281
$$ 385152 417167 408451 370860 370706 438708 378571 355090 297090 312576 414884 375800 400081
11613D00081j00264K6263R1636k5305N0093m4645k1576M5742j1109l2490q2577
$$ 400081 299817 326080 417716 392411 442504 397859 376283 422025 410916 378426 295849
11602B95849P7772K6318r082j10540O3946K8188L2694l4507l2878m4491l9639
$$ 295849 373621 399939 390857 280317 344263 372451 405145 370638 337760 293269 253630
11591B53630J03020m6046l7732Q5949J9467k9912R516L8960p0104j11838N9122
$$ 253630 356650 310604 272872 358821 378288 348376 357892 396852 326748 214910 274032
11580B74032J95205J00334q4378j9856Q8545Q770j3089j8785o6789m0031K0960
$$ 274032 469237 569571 485193 465337 553882 562652 549563 530778 463989 423958 444918
11569D44918R601O2068l5190J441J3572j105J338n9448J25084K1684K3546l3884
$$ 444918 454519 516587 481397 482838 496410 495305 496643 437195 562279 583963 607509 573625
11557E73625K6588J3424R8649p7580R82p934o5520K4393M9746K0586K0312n1167
$$ 573625 600213 613637 712286 634706 635688 627754 562234 586627 636373 656959 677271 626104
11545F26104J0602k1969L1944J13533N1311q5456o7059M2096J076L225Q3190O747
$$ 626104 636706 614737 646681 760214 811525 726069 659010 701106 702182 705407 788597 795344
11533G95344l9212M5795j2044k70r2822m2627M8566L8973L290j0442J902K970
$$ 795344 756132 801927 789883 789613 696791 654164 702730 741703 744993 734551 736453 739423
11521G39423P5018l6954k3641K0483m4194M6512J10549j14004k7381K2656m6727
$$ 739423 814441 777487 753846 774329 730135 776647 887196 773192 745811 768467 721740
11510G21740L9338o6351J72684p3352j2377P251m7425q5566K2101L4682Q1671
$$ 721740 761078 694727 867411 794059 781682 788933 741508 655942 678043 712725 794396
11499G94396m3071n60P3072m1583m6497j47842p146J08913L8409l7053j01511
$$ 794396 751325 750765 823837 782254 735757 587915 580769 689682 728091 691038 589527
11488E89527K2353O8758q1663O3151m6698K6235n0223q3911q1710K9763K6869
$$ 589527 611880 680638 598975 662126 615428 641663 591440 507529 425819 455582 482451
11477D82451J8869J487M483M3961K0378M9634r4078j8357K0738m7210K9261j03053
$$ 482451 501320 502807 507290 551251 571629 621263 527185 508828 529566 482356 511617 408564
11465D08564n934n3429k8865O0508j22355J21444K6592k3209k5401k4120l9311
$$ 408564 402630 349201 320336 380844 258489 379933 406525 383316 357915 333795 294484
11454B94484J57772L051j13860J2352Q0567o1108r6854k9217j4767L4466O1053
$$ 294484 452256 455307 341447 353799 434366 373258 276404 247187 232420 266886 327939
11443C27939p4752q8985J17239J2297j58386P7611P4010L2935n7945N2485l4958
$$ 327939 253187 164202 281441 293738 135352 212963 286973 319908 261963 314448 279490
11432B79490m5650O6465o3041l6092L3215m1496q216J14982n4226M8072j79612
$$ 279490 233840 300305 237264 201172 234387 192891 184675 299657 245431 293503 113891
11421A13891j05927L2222L6194j6257J19495R1994r0510p5538m38j477Q1941Q0896
$$ 113891 7964 40186 76380 60123 179618 271612 181102 105564 105126 103649 185590 266486
11409B66486r1813n7738R4804m9192j04924k3687L3032O523k2746O6844K2277
$$ 266486 174673 116935 211739 162547 57623 33936 66968 73491 50745 117589 139866
11398A39866j01218N0863P527p4586N6954o5000j4868Q8674M7673k4161N4864
$$ 139866 38648 89511 97038 22452 79406 14406 -462 88212 135885 111724 166588
11387A66588O0429K548j06106j2271n5638j15687K2134M1880M9052M7502j07282
$$ 166588 227017 229565 123459 111188 55550 -60137 -38003 3877 52929 100431 -6851
11376f851k7411Q6913r7245M707J45897K1816j2061K6745K7296k1161r155n5097
$$ -6851 -34262 52651 -44594 -39887 106010 127826 115765 142510 169806 148645 139490 84393
11364H4393M7278N1816l9120j92R375q5189n0038P5553k2207Q020k0323Q586J14211
$$ 84393 131671 183487 144367 144175 153550 68361 18323 93876 71669 79689 59366 67952 182163
11351A82163o5599j29100p530J3232N8874k1941N2671m6657n500M9385j24429
$$ 182163 116564 -12536 -20066 -6834 52040 30099 82770 36113 30613 79998 -44431
11340d4431j3184J75712Q8338k12324p2168M7513J41631O3553j27964n2391l4658
$$ -44431 -57615 118097 206435 -5889 -78057 -30544 111087 174640 46676 -5715 -40373
11329d0373J17716m0363o6675N3019J4344j0645J09282j9951m5285o1909k0645
$$ -40373 77343 36980 -29695 23324 37668 27023 136305 116354 71069 9160 -11485
11318a1485j493L4030k214J733K3060l6099O039J2122L7570M8575k3996j37019
$$ -11485 -12978 21052 18838 20571 43631 7532 13571 25693 63263 111838 87842 -49177
11306d9177r2980r689j2365R1065r898N8493J23429j9225K141l6019p0237l2896
$$ -49177 -142157 -151846 -164211 -73146 -83044 -24551 98878 79653 81794 45775 -24462 -57358
11294e7358K2659N1430N5575j7986K8261J7752p2467k4879M928m7690J4296L7955
$$ -57358 -34699 16731 72306 54320 82581 100333 27866 2987 7915 -39775 -25479 12476
11282A2476J4655L1971Q7700m3805m8971M0047N1783n96k8691j1800J690O0825
$$ 12476 27131 59102 146802 102997 54026 94073 145856 145260 116569 104769 106459 167284
11270A67284J5292p6105J0688m9988n4874N5731M2972p2985l6235l7133n3673
$$ 167284 182576 106471 117159 67171 12297 68028 111000 38015 1780 -35353 -89026
11259h9026Q0496n1953N5139M3776M4499M7908q2748j3928J0860o565J2094q0113
$$ -89026 -8530 -60483 -5344 38432 82931 130839 48091 34163 45023 38458 50552 -29561
11247b9561j7617L274q1308j1069O6402M8623r862K0544M9531N5608J4187j4115
$$ -29561 -47178 -43904 -125212 -136281 -69879 -21256 -31118 -10574 38957 94565 108752 94637
11235I4637j5777J5467L802O6570l1579r703q7916R035n8103J25326N2921N9923
$$ 94637 78860 94327 98129 164699 133120 123417 35501 44536 -13567 111759 164680 224603
11223B24603p1948j06953K8332L9925r5192L2827L5319n9809M3653M0364J01544
$$ 224603 152655 45702 74034 113959 18767 51594 86913 27104 70757 111121 212665
11212B12665p4851l1501k3811l0821j39241l6433L6706K8516P2822N4918p9889
$$ 212665 137814 106313 82502 51681 -87560 -123993 -87287 -58771 14051 68969 -10920
11201a0920r0691K4651k4929J19772J15312L452j02149J9451p366K1038j6005
$$ -10920 -101611 -76960 -101889 17883 133195 136647 34498 53949 46583 67621 51616
11190E1616o6102J84138M6666o7927K0693n6454l0591L0106J3470M7030p5508
$$ 51616 -14486 169652 216318 148391 169084 112630 82039 112145 125615 172645 97137
11179I7137j50464o8596Q8203L8877P1365r567n9396L6283N0247m2920Q1265L7440
$$ 97137 -53327 -121923 -33720 5157 76522 66955 7559 43842 94089 51169 132434 169874
11167A69874q5948k9425q1533M4445J13991l4838N6919j3967p6253J523l6743
$$ 169874 83926 54501 -27032 17413 131404 96566 153485 139518 63265 64788 28045
11156B8045P70J11851j41417j03928J10142N3628j10475o8017O2997O3423L803
$$ 28045 28815 140666 -751 -104679 5463 59091 -51384 -119401 -56404 7019 10822
11145A0822j8344O5257M3719o2860p5282l9392P3764K6885k9546j3478J0264l6519
$$ 10822 -7522 57735 101454 38594 -36688 -76080 -2316 24569 -4977 -18455 -8191 -44710
11133d4710M2029J16669m804J7085j32888n2000O1703j21210O6500M1089K32J18998
$$ -44710 -2681 113988 109184 126269 -6619 -58619 3084 -118126 -51626 -10537 -10305 108693
11121A08693l021r0413L2744k6743Q353K4944R0888j6516O514m5924J947R2692
$$ 108693 105672 15259 48003 21260 29613 54557 145445 128929 135443 89519 91466 184158
11109A84158l1714n3188N77j1985o0680l344J4827J78426j2338j68633n2844J12664
$$ 184158 152444 99256 99833 87848 27168 23824 38651 217077 204739 36106 -16738 95926
11097I5926k698m0927P9033K979l9046O0647m7667j5814L4060n7904p4870L0859
$$ 95926 93228 52301 131334 134313 95267 155914 108247 92433 126493 68589 -6281 24578
11085B4578P3607k0302n6662K431O5554K2316N2352k5886q1128m3771K1329P7641
$$ 24578 98185 77883 21221 23652 89206 111522 163874 137988 56860 13089 34418 112059
11073A12059K3058L537j0998R102O0617j9174j55167J5042Q1292n009L3709k7106
$$ 112059 135117 138654 127656 136758 197375 178201 23034 38076 119368 114359 148068 120962
11061A20962J9248r503l0834J5199q559j92k1113l6709l3671O6208o6282q3545
$$ 120962 140210 130707 99873 115072 106513 106321 85208 48499 14828 81036 14754 -68791
11049f8791L0633J07591M7734r067L5066l9172j12072M7455O7574K6486p9797
$$ -68791 -38158 69433 117167 108100 143166 103994 -8078 39377 106951 133437 53640
11038E3640n1599j3878O0262N7296J2100p3329k2226m1299N0161J06599J8695
$$ 53640 2041 -11837 48425 105721 117821 44492 22266 -19033 31128 137727 156422
11027A56422n493n4922r0849M8935r942q8133L5186Q4416k91j07306J01454l1722
$$ 156422 150929 96007 5158 54093 44151 -43982 -8796 75620 75329 -31977 69477 37755
11015C7755N9341r739o7519k2600q2484K3963M7839k0832l341P6824P459K1897
$$ 37755 97096 87357 19838 -2762 -85246 -61283 -13444 -34276 -37617 39207 46666 68563
11003F8563j11153O2820p2738K0171N7450l3956P8045o411M5716j5j02443R7172
$$ 68563 -42590 20230 -52508 -32337 25113 -8843 69202 62791 108507 108492 6049 103221
10991A03221Q3961l4452J8739j5600K4949j0757n9704q9927R4594L07k8183p1757
$$ 103221 187182 152730 171469 155869 180818 170061 110357 20430 115024 115331 87148 15391
10979A5391l1322o6035K5751k4978Q1624J1711m1063J30969k5178M6923r9336
$$ 15391 -15931 -81966 -56215 -81193 431 12142 -28921 102048 76870 123793 24457
10968B4457n0873R592L7180O6002l1256o4768J6086N1651o000k8219n3314O8159
$$ 24457 -26416 -16824 20356 86358 55102 -9666 6420 58071 52071 23852 -29462 38697
10956C8697l4332M6692k6350q6584P8328N703K378M6064j33738K402L8764J04058
$$ 38697 4365 51057 24707 -61877 16451 22154 24532 70596 -63142 -60740 -21976 82082
10944H2082m547p852J9239k7575O4857p3965L1376J4484l2251L4823P902m7081
$$ 82082 77535 69683 88922 61347 126204 52239 83615 98099 65848 100671 108573 61492
10932F1492J48631l3598l8495N0125j5601l7988n7182p661N6069n5185P7842K0793
$$ 61492 210123 176525 138030 188155 172554 134566 77384 69723 125792 70607 148449 169242
10920A69242j08835O0301K5494l303j14051j1811R3620j705J6322J92j06442J7111
$$ 169242 60407 120708 146202 142899 28848 17037 110657 108952 125274 125466 19024 36135
10908C6135Q5844J3488N0151n8016q6209R7270K715l1063k4577l9760R1694j4407
$$ 36135 121979 135467 185618 127602 41393 138663 141378 110315 85738 45978 137672 123265
10896A23265j5640k6512j04079K9005O4159l1835j36573l762M4152J58150n3928
$$ 123265 107625 81113 -22966 6039 70198 38363 -98210 -101972 -57820 100330 46402
10885D6402m2673J5599K2879q3638Q1986L861o2226J42013o371O3520j2867k7486
$$ 46402 3729 19328 42207 -41431 40555 44416 -17810 124203 117832 181352 168485 140999
10873A40999o5120M7893J3038L534L9134k124p7536k6989M3437p2769K7356m1002
$$ 140999 75879 123772 136810 140344 179478 177354 99818 72829 116266 43497 70853 29851
10861B9851L1855N3755j142l8940J14401L9475q5408j038p3219O0200k1037j14476
$$ 29851 61706 115461 114319 75379 189780 229255 143847 142809 69590 129790 108753 -5723
10849e723j8620q5146R1148L2763O1062j9804J1356n6582P3014L1032j38981P2322
$$ -5723 -24343 -109489 -18341 14422 75484 55680 67036 10454 83468 114500 -24481 47841
10837D7841O4498J01321j20282J2052O0710M6628q0017m464k7028k597m4365L7538
$$ 47841 112339 213660 93378 105430 166140 212768 132751 128287 101259 98662 54297 91835
10825I1835k0434P0036L9849n8763K0908J7625o9124J2563R910L6982j4816o7852
$$ 91835 71401 141437 181286 122523 143431 161056 91932 104495 114405 151387 136571 68719
10813F8719J3654K1802m1961j141L5088j5755l4695l9571P3768M5842R916O6717
$$ 68719 82373 104175 62214 61073 96161 80406 45711 6140 79908 125750 135666 202383
10801B02383m0703O0655n9979m2632l7064o9850L8444O4836q4876j4243k881L1064
$$ 202383 161680 222335 162356 119724 82660 12810 51254 116090 31214 16971 14090 45154
10789D5154J27925K9906k5141o3999q5124L3440N2228M3802N904p4196R1998L2143
$$ 45154 173079 202985 177844 113845 28721 62161 114389 158191 164095 89899 181897 214040
10777B14040n4868l7521R5683o7754q8957j5336L0081q3974J3642O0908k0832
$$ 214040 159172 121651 217334 149580 60623 45287 75368 -8606 5036 65944 45112
10766D5112J3499M8240j1267j35919l7989Q9233J05682J05306J2051Q93o2462
$$ 45112 58611 106851 95584 -40335 -78324 10909 116591 221897 233948 234841 172379
10755A72379k4229J1563o6280j5110J55471o1911N5632n4658J0161R8781K8797
$$ 172379 148150 159713 93433 78323 233794 171883 227515 172857 183018 281799 310596
10744C10596j14297m2104J4402o2012L2678R7195p662k7022k4963L7356O1540
$$ 310596 196299 154195 168597 106585 139263 236458 228796 201774 176811 214167 275707
10733B75707l6264q4408m298n978K8230Q4919q5058l6282p294Q9511p786L9109
$$ 275707 239443 155035 150737 144759 172989 257908 172850 136568 129274 218785 210999 250108
10721B50108l2656M9954R557q270k2818J91n7153K9417L9258M4158Q1873J0830
$$ 250108 217452 267406 276963 268693 245875 246066 188913 218330 257588 301746 383619 394449
10709C94449j04678q9155J08526o647o2152o3431Q5071j0408l562J2202M5781
$$ 394449 289771 200616 309142 302495 240343 176912 261983 251575 248013 260215 305996
10698C05996l0843P6664J0320j9470m7576q1652J05962Q1498k3642M1379N7660
$$ 305996 275153 351817 362137 342667 295091 213439 319401 400899 377257 418636 476296
10687D76296n8005m5309n7359p1R3063J7367k8977n859K554O9944N1072j7114
$$ 476296 418291 372982 315623 315552 408615 425982 397005 391146 393700 463644 514716 497602
10675D97602J40701M646n4197J08345q7788N8603M3023j4783o2135m8079M6316
$$ 497602 638303 642949 588752 697097 609309 667912 710935 696152 634017 585938 632254
10664F32254r778j320K6119L7106O8413L6733l1356m4110K753L3723j2502m6453
$$ 632254 622476 621156 647275 684381 752794 789527 758171 714061 716814 750537 738035 691582
10652F91582J4797o7846k4805J10394Q2928M6799j7471j08655R3359k629O9695
$$ 691582 706379 638533 613728 724122 807050 853849 836378 727723 821082 818453 888148
10641H88148O9734N8561p6526o4506K5471p3088Q1220J30471J33968n8070q6927
$$ 888148 957882 1016443 939917 875411 900882 827794 909014 1039485 1173453 1115383 1028456
10630A028456Q5040m2092K9028N926m3864K6492R8116J12691o0752n2119n59J04952
$$ 1028456 1113496 1071404 1100432 1106358 1062494 1088986 1187102 1299793 1239041 1186922 1186363 1291315
10618A291315L2105J7613m2922o8779L1566j4736j07373l08K6434l1255R4101
$$ 1291315 1323420 1341033 1298111 1229332 1260898 1246162 1138789 1138481 1164915 1133660 1227761
10607A227761o3496k9828O1361M8029k5529o4689K0795J0311M6224j39202K0477
$$ 1227761 1164265 1134437 1195798 1243827 1218298 1153609 1174404 1184715 1230939 1091737 1112214
10596A112214Q9499J4353j7363N7811p6869p8753J08340j16485p258R4600M1367
$$ 1112214 1201713 1216066 1198703 1256514 1179645 1100892 1209232 1092747 1085489 1180089 1221456
10585A221456m5293j10050k3300L4549k2852N9791j1775K9960O1009j45366n9210
$$ 1221456 1176163 1066113 1042813 1077362 1054510 1114301 1102526 1132486 1193495 1048129 988919
10574I88919N2882P7034P5845L2863j8752J927K680J4786o8730K662m0233q5909
$$ 988919 1041801 1118835 1194680 1227543 1208791 1210718 1213398 1228184 1159454 1162116 1121883 1035974
10562A035974N8262J77448j6689j02919M0981l8557j40010K886L8045L4974j41913
$$ 1035974 1094236 1271684 1254995 1152076 1193057 1154500 1014490 1017376 1055421 1090395 948482
10551I48482k8032J94680O770m569j13221m2760k6951J1845J49978q2099p6572
$$ 948482 920450 1115130 1121900 1117331 1004110 961350 934399 946244 1096222 1014123 937551
10540I37551K757q0802j9173L1754o2597O1191k2981j26370K1011M5436L4174
$$ 937551 940308 859506 840333 872087 809490 870681 847700 721330 742341 787777 821951
10529H21951k7151k7271p1742J0726m7280J74451r40M562M8503j13429k599k2061
$$ 821951 794800 767529 695787 706513 659233 833684 832744 837306 885809 772380 769781 747720
10517G47720l2259p2684N8139L0158N237o6586j6459J5477j3171M11O0269m8882
$$ 747720 715461 642777 700916 731074 736311 669725 653266 668743 655572 655983 716252 667370
10505F67370n1356o3747o2587J41767N7713m2045j11676k6586j4687l0466j0257
$$ 667370 616014 552267 489680 631447 689160 647115 535439 508853 494166 463700 453443
10494D53443K1425J25573p0562q2829p3723L3228L8728k8751n8205o2491R3934
$$ 453443 474868 600441 529879 447050 373327 406555 445283 416532 358327 295836 389770
10483C89770J15762j18438m0024L0570n4757m4538n8020J03028n20m9244L6315
$$ 389770 505532 387094 347070 377640 322883 278345 220325 323353 322833 273589 309904
10472C09904l4991J4026L3788n7233K9383N6903p4610m2448N4420o4387j6016
$$ 309904 274913 288939 322727 265494 294877 351780 277170 234722 289142 224755 208739
10461B08739O5698o1568j8332M0371N6864N3283j03425l5490m5488J7569Q8460
$$ 208739 274437 212869 194537 234908 291772 345055 241630 206140 160652 178221 266681
10450B66681q796R1961r7845r8756O9484k8212O4303R0981j36891l2943L9235
$$ 266681 257885 349846 252001 153245 222729 194517 258820 349801 212910 179967 219202
10439B19202p4052J28729L6585o1493O4254q298p9411L3367L3283j18779J182
$$ 219202 145150 273879 310464 248971 313225 304927 225516 258883 292166 173387 174569
10428A74569P9106m0388J00508k9715q1278K5172M7737J46L7723r1176J2404J884
$$ 174569 253675 213287 313795 284080 202802 227974 275711 275857 313580 222404 234808 236692
10416B36692L7614k5383o1839J21342l4883m8150k904N4972m4865N8097q5786
$$ 236692 274306 248923 187084 308426 273543 225393 222489 277461 232596 290693 204907
10405B04907r2793R0942k5195J4485k90j2728Q485N9177J17882o9640k526l0169
$$ 204907 112114 203056 177861 192346 192056 179328 187813 246990 364872 295232 292706 262537
10393B62537l959M0718M0897q4351j3767O2720j65787n857m0708j3044K094J85187
$$ 262537 258578 299296 340193 255842 242075 304795 139008 133151 92443 79399 81493 266680
10381B66680P6487n1154o6606K418J27712q6810j1900J02297L561r7542K1552
$$ 266680 343167 292013 225407 227825 355537 268727 256827 359124 362685 265143 286695
10370B86695Q2389O7128q0515k8710n585K3846N4826P603J4862M6947l7353j27760
$$ 286695 369084 436212 355697 326987 321402 345248 400074 407677 422539 469486 432133 304373
10358C04373J12916J7981k7239n5011K0508J06978p788P6763q3n2212j3462R0526
$$ 304373 417289 435270 408031 353020 373528 480506 472718 549481 549398 497186 483724 574250
10346E74250l1617k7204j3824j7461P6530j0897m0917k5112J9288R932R9791q7741
$$ 574250 542633 515429 501605 484144 560674 549777 508860 483748 503036 512968 612759 525018
10334E25018j8151M2029M4303N2459p0588J1344p1926J5122P30P69K7033P2572
$$ 525018 506867 548896 593199 645658 575070 586414 514488 529610 530340 531109 558142 630714
10322F30714o6694J33586K319L4278o1617p7113M0501k2272p1528J277O2963M2386
$$ 630714 564020 697606 699925 734203 672586 595473 635974 613702 542174 543451 606414 648800
10310F48800J40256o7267k4299M7315q5093L2893J1753R1249M7666j09174o2874
$$ 648800 789056 721789 697490 744805 659712 692605 704358 795607 843273 734099 671225
10299F71225n0937J09473L7526N4271j1468j5267j37494M8179J35805j0343n9922
$$ 671225 620288 729761 767287 821558 810090 794823 657329 705508 841313 830970 771048
10288G71048P1069M210K2355j4078P2581j5771o0946p8178L1278J8319l6640j9272
$$ 771048 842117 846327 868682 854604 927185 911414 850468 772290 803568 821887 785247 765975
10276G65975l3516k8759J5766L2665N9398K1131n8632K0936l2698J00842M3239
$$ 765975 732459 703700 719466 752131 811529 832660 774028 794964 762266 863108 906347
10265I06347j8915k8056q7731j235J05215j9259k8156k6347j7326J6138N4269
$$ 906347 887432 859376 771645 770410 875625 856366 828210 801863 784537 800675 854944
10254H54944n2599k4641M9772J14901l3089o8204P146J03203R0924j1413l529
$$ 854944 802345 777704 827476 942377 909288 841084 848230 951433 1042357 1030944 1027415
10243A027415J2525n2172j22553J37158K5517k123K8459q159o8230j33014L5994
$$ 1027415 1039940 987768 865215 1002373 1027890 1025767 1054226 1046067 977837 844823 880817
10232H80817N1760k7139M3038M0856K5557q7008M3917m7925o5520M5392o0023
$$ 880817 932577 905438 948476 989332 1014889 927881 971798 923873 858353 903745 843722
10221H43722J34566j6013m3304O0246N6823k1886j2109j54766O32N3884L5169
$$ 843722 978288 962275 918971 979217 1036040 1014154 1002045 847279 847911 901795 936964
10210I36964k3448j5094m2543k536P4720J0534n9411K605K3056q0175J35079K4221
$$ 936964 913516 898422 855879 853343 928063 938597 879186 881791 904847 824672 959751 983972
10198I83972m7374K2339O1919r091n7070M1778m6981p1775j4426q973n739R8080
$$ 983972 936598 958937 1020856 1011765 954695 996473 949492 877717 863291 854318 848579 946659
10186I46659M3141P809j19040M0508J73115k5284n6628p3143j2455o9232L363
$$ 946659 989800 997609 878569 919077 1092192 1066908 1010280 937137 924682 855450 858813
10175H58813j5397r100J6321p7752J7810L2787n9367m8106n0537l9584O0333R299
$$ 858813 843416 834316 850637 772885 790695 823482 764115 716009 665472 625888 686221 695520
10163F95520j9104K5501N6159l5132j7239P0166k8442j0140l6010j8490o8053
$$ 695520 676416 701917 758076 722944 705705 775871 747429 737289 701279 682789 614736
10152F14736K4059N7160j9615j8702L7559n9067J3087k8539q2314N5675N6422
$$ 614736 638795 695955 676340 657638 695197 636130 649217 620678 538364 594039 650461
10141F50461K5566p442j32980N0057M6121P867J7058m2093j02557k178j5074k3567
$$ 650461 676027 668585 535605 585662 631783 639650 656708 614615 512058 509880 494806 471239
10129D71239l1838M6397L2901j605M1245j7583k1370K824Q16L6292p8208l5737
$$ 471239 439401 485798 518699 517094 558339 540756 519386 522210 523026 559318 481110 445373
10117D45373J6481m7539j623n2581j8470P4806Q8802j9467o1811j7632k1277m8235
$$ 445373 461854 414315 412692 360111 341641 416447 505249 485782 423971 406339 385062 336827
10105C36827m1125n9950R4807M1289L6393j41386P0497m5305L1963Q6678j5149
$$ 336827 295702 235752 330559 371848 408241 266855 337352 292047 324010 410688 395539
10094C95539o8253J6720K6961n88Q7958j28919k8686l459m2919r801n8900k3319
$$ 395539 327286 344006 370967 370379 458337 329418 300732 297273 254354 244553 185653 162334
10082A62334M9419R376j9668j93Q043J63441L80l2246j5026r9851m7602r1550
$$ 162334 211753 221129 201461 201268 209311 372752 373132 340886 325860 226009 178407 86857
10070H6857P6215K3572J11432r554j01639m4621J0366J77517r44L9299j09754
$$ 86857 163072 186644 298076 288522 186883 142262 152628 330145 329201 368500 258746
10059B58746p601M1274j45711M9151P6894N3361j32089n867k4153M941p0249l4650
$$ 258746 251145 292419 146708 195859 272753 326114 194025 188158 164005 168946 98697 64047
10047F4047j3884J15480j5199o416J28168M1681q7120j21310O9206m937J11945
$$ 64047 50163 165643 150444 144028 272196 313877 226757 105447 174653 169716 281661
10036B81661o8156q039m8666l5464o1629N7924j4141j7433L130P7148J31401p0483
$$ 281661 213505 205466 156800 121336 59707 117631 103490 86057 89187 166335 297736 227253
10024B27253p7165K6119N1866M8856k5598K6128q9401r8817k0680O9200N8902
$$ 227253 150088 176207 228073 276929 251331 277459 188058 89241 68561 137761 196663
10013A96663k3031o277n3285r943J17526q2476J088M6048l966j984O074L2762
$$ 196663 173632 167355 114070 104127 221653 139177 140265 186313 182347 180363 186437 219199
10001B19199p7977K2389m7016M2211n0387K6015J8068l3422o3036j446O1993R2568
$$ 219199 141222 163611 116595 158806 108419 134434 152502 119080 56044 54598 116591 209159
9989B09159O206L180n1980q2655o2409O5056Q7384l0600P4567n8554m4806M9392
$$ 209159 215365 218545 166565 83910 21501 86557 173941 143341 217908 159354 114548 163940
9977A63940j05661K9411r356o8724O8377Q913L7092N2984j07204L0134J06691
$$ 163940 58279 87690 78334 9610 77987 86900 123992 176976 69772 99906 206597
9966B06597m7426j35921P2899j037K9110O0024Q6606j70745l1747L6363j25104
$$ 206597 159171 23250 96149 95112 124222 184246 270852 100107 68360 104723 -20381
9955b0381O8696M5543P2069j49617P9983Q1702k7689K5715r058m0100j4316O6398
$$ -20381 48315 93858 165927 16310 96293 177995 150306 176021 166963 126863 112547 178945
9943A78945o3349N2109K4318j26630r6033R8428L7654r2740j6538l9340K1849
$$ 178945 115596 167705 192023 65393 -30640 67788 105442 12702 -3836 -43176 -21327
9932b1327Q148j3209J3292R3428R4894j396o9560j29749J07493o1234j6934P2641
$$ -21327 -13179 -26388 -13096 80332 175226 173830 104270 -25479 82014 20780 3846 76487
9920G6487j8378M606N2187N4555r295O9627o2422o210K9140L6225K5923K9706
$$ 76487 58109 62715 114902 169457 160162 229789 167367 161157 190297 226522 252445 282151
9908B82151j4718j44295Q2443J586j8033K9901p2172l7397l4275k7033n7369J1962
$$ 282151 267433 123138 205581 207167 189134 219035 146863 109466 75191 48158 -9211 2751
9896B751J3112J7802K4713p464k0982J15994o6139r4080O2335j9188L2177J33890
$$ 2751 15863 33665 58378 50914 29932 145926 79787 -14293 48042 28854 61031 194921
9884A94921J6512o7610k071l7882l7302J44268q4137o882N0149J231L9365q481
$$ 194921 211433 143823 141752 103870 66568 210836 126699 119817 169966 171197 210562 202081
9872B02081m0050l7362j2246N775j10750P0410J2666j08184J30849J5582o0472
$$ 202081 162031 124669 112423 118198 7448 77858 90524 -17660 113189 128771 68299
9861F8299l0371j09808P0477N9958P6079J4898o5970M842m6489k3051P3465K9289
$$ 68299 37928 -71880 -1403 58555 134634 149532 83562 88404 41915 18864 92329 121618
9849A21618L8913j9807M0359k0382l9489k0330p0699L9100o2190N6109l1337K5228
$$ 121618 160531 140724 181083 160701 121212 100882 30183 69283 7093 63202 31865 57093
9837E7093N2039K9703l0819k8810M1848o5387O6901K8238R038M3671q8513n0846
$$ 57093 109132 138835 108016 79206 121054 55667 122568 150806 159844 203515 115002 64156
9825F4156P3281j8802n8740J4836o9622O335J20023O1040p8554o6536P1529k7110
$$ 64156 137437 118635 59895 74731 5109 11444 131467 192507 113953 47417 118946 91836
9813I1836L937o5432r1448J14694M8142r4315Q8901k3423m2419J441M0668n1265
$$ 91836 95773 30341 -61107 53587 101729 7414 96315 72892 30473 31914 72582 21317
9801B1317P5082o1901j10077P2575k6972M8469m9346j836J29366L8946r2673J364
$$ 21317 96399 34498 -75579 -3004 -29976 18493 -30853 -32689 96677 135623 42950 44314
9789D4314j2113K2979l1746P1058l5539j16542K2186J23959j7461K0158q440J436
$$ 44314 32201 55180 23434 94492 58953 -57589 -35403 88556 71095 91253 82813 84249
9777H4249L1628R8634n6277n7041k1241o8921J26906M9980j17532k4908L0252
$$ 84249 115877 214511 158234 101193 79952 11031 137937 187917 70385 45477 75729
9766G5729J18657m6094J472j2018l2738O8995K6491j6690J2255k534O8r3817m8471
$$ 75729 194386 148292 149764 137746 105008 174003 200494 183804 196059 193525 193593 99776 51305
9753E1305k141K5138J03523J36952r0361j0949L9605o760n9972q2546L9706J5163
$$ 51305 49164 74302 177825 314777 224416 213467 253072 246312 186340 103794 143500 158663
$$ [...]
##END NTUPLES=NMR SPECTRUM
##END=
