##TITLE=1H_EC-3277x3Hy
 D2O
 8 sc, 
 30.09.2022
##JCAMPDX= 6.0         $$ Bruker NMR JCAMP-DX V2.0
##DATA TYPE= NMR SPECTRUM
##DATA CLASS= NTUPLES
##ORIGIN= UXNMR, Bruker Analytische Messtechnik GmbH
##OWNER= root
$$ XWIN-NMR		Version 3.5
$$ Fri Sep 30 13:45:24 2022 Russian Standard Time (UT+4h)  she@DPX200
##.OBSERVE FREQUENCY= 200.1313499994
##.OBSERVE NUCLEUS= ^1H
##.ACQUISITION MODE= SIMULTANEOUS
##.ACQUISITION SCHEME= undefined
##.AVERAGES= 8
##.DIGITISER RES= 18
##SPECTROMETER/DATA SYSTEM= spect
##.PULSE SEQUENCE= zg30
##.SOLVENT NAME= D2O
##.SHIFT REFERENCE= (INTERNAL, D2O, 0, 15.7645)
##AUDIT TRAIL= $$ (NUMBER, WHEN, WHO, WHERE, WHAT)
$$ ##TITLE= Audit trail, XWIN-NMR		Version 3.5
$$ ##JCAMPDX= 5.01
$$ ##ORIGIN= Bruker BioSpin GmbH
$$ ##OWNER= she
$$ F:/spectra/data/she/nmr/H-F/1/pdata/1/auditp.txt
$$ ##AUDIT TRAIL=  $$ (NUMBER, WHEN, WHO, WHERE, WHAT)
(   1,<2022-09-30 13:44:01.60 +0400>,<she>,<DPX200>,
      <created by zg, POWCHK disabled, PULCHK disabled
       configuration hash MD5:
       00 E9 B6 7A A2 85 ED C7 34 08 36 98 17 FE 4E 26
       data hash MD5: 16K
       2B 14 6C 68 21 B1 1E 9F 09 C2 E9 6F 70 DF 0E 1D>)
(   2,<2022-09-30 13:44:05.31 +0400>,<she>,<DPX200>,
      <Start of raw data processing
       efp BC_mod = 2 LB = 0.24 FT_mod = 6 PKNL = 1 PHC0 = -18040.58 PHC1 = 16.60069 SI = 16K 
       data hash MD5: 16K
       9C 08 79 BD 2E 3F 3E 15 84 53 9F 5F C5 49 05 7A>)
(   3,<2022-09-30 13:44:28.10 +0400>,<she>,<DPX200>,
      <pk PHC0 = -157.8198 PHC1 = -4 
       data hash MD5: 16K
       B6 17 17 90 FC C8 63 8A 04 02 21 21 C2 1A 96 BE>)
(   4,<2022-09-30 13:44:31.68 +0400>,<she>,<DPX200>,
      <abs ABSG = 5 
       data hash MD5: 16K
       84 C4 45 18 9F E6 0A FF AA CC 23 EA 11 EB C2 2A>)
$$ ##END=
$$ 
$$ hash MD5
$$ 95 14 60 CC 61 AA 60 4D 09 93 0B AD B8 B6 30 B7
##$RELAX= 
##$RELAX= 
##$RELAX= 
##$RELAX= 
##$RELAX= 
##$RELAX= 
$$ Bruker specific parameters
$$ --------------------------
##$DU= <F:/spectra>
##$EXPNO= 1
##$NAME= <H-F>
##$PROCNO= 1
##$TYPE= <nmr>
##$USER= <she>
##$AMP= (0..31)
100 100 100 100 100 100 100 100 100 100 100 100 100 100 100 100 100 100 
100 100 100 100 100 100 100 100 100 100 100 100 100 100 
##$AQSEQ= 0
##$AQ_mod= 1
##$AUNM= <au_zg>
##$AUTOPOS= <>
##$BF1= 200.13
##$BF2= 200.13
##$BF3= 200.13
##$BF4= 200.13
##$BF5= 200.13
##$BF6= 200.13
##$BF7= 200.13
##$BF8= 200.13
##$BYTORDA= 1
##$CFDGTYP= 0
##$CFRGTYP= 5
##$CHEMSTR= <none>
##$CNST= (0..31)
1 1 145 1 1 1 1 1 1 1 1 1 1 1 1 1 1 1 1 1 1 1 1 1 1 1 1 1 1 1 1 1 
##$CPDPRG= <>
##$CPDPRG1= <>
##$CPDPRG2= <>
##$CPDPRG3= <>
##$CPDPRG4= <mlev>
##$CPDPRG5= <mlev>
##$CPDPRG6= <mlev>
##$CPDPRG7= <mlev>
##$CPDPRG8= <mlev>
##$CPDPRGB= <>
##$CPDPRGT= <>
##$D= (0..31)
0 1.2 0 0 0 0 0 0 0 0.06 0 0.03 0 0 0 0 0.0002 0 0 0 0 0 0 0 0 0 0 0 0 
0 0 0 
##$DATE= 1664531041
##$DBL= (0..7)
120 120 120 120 120 120 120 120 
##$DBP= (0..7)
150 150 150 150 150 150 150 150 
##$DBP07= 0
##$DBPNAM0= <>
##$DBPNAM1= <>
##$DBPNAM2= <>
##$DBPNAM3= <>
##$DBPNAM4= <>
$$ [...]
##$SUBNAM3= <"">
##$SUBNAM4= <"">
##$SUBNAM5= <"">
##$SUBNAM6= <"">
##$SUBNAM7= <"">
##$SUBNAM8= <"">
##$SUBNAM9= <"">
##$SW= 18.0517283424941
##$SWIBOX= (0..15)
0 0 2 0 0 0 0 0 0 0 0 0 0 0 0 0 
##$SW_h= 3612.71676300578
##$TD= 16384
##$TD0= 1
##$TE= 0
##$TE2= 300
##$TE3= 300
##$TEG= 300
##$TL= (0..7)
0 120 120 120 120 120 120 120 
##$TP= (0..7)
150 150 150 150 150 150 150 150 
##$TP07= 0
##$TPNAME0= <>
##$TPNAME1= <>
##$TPNAME2= <>
##$TPNAME3= <>
##$TPNAME4= <>
##$TPNAME5= <>
##$TPNAME6= <>
##$TPNAME7= <>
##$TPOAL= (0..7)
0.5 0.5 0.5 0.5 0.5 0.5 0.5 0.5 
##$TPOFFS= (0..7)
0 0 0 0 0 0 0 0 
##$TUNHIN= 0
##$TUNHOUT= 0
##$TUNXOUT= 0
##$USERA1= <user>
##$USERA2= <user>
##$USERA3= <user>
##$USERA4= <user>
##$USERA5= <user>
##$V9= 5
##$VALIST= <valist>
##$VCLIST= <CCCCCCCCCCCCCCC>
##$VD= 0
##$VDLIST= <DDDDDDDDDDDDDDD>
##$VPLIST= <PPPPPPPPPPPPPPP>
##$VTLIST= <TTTTTTTTTTTTTTT>
##$WBST= 1024
##$WBSW= 4
##$XGAIN= (0..3)
0 0 0 0 
##$XL= 0
##$YL= 0
##$YMAX_a= 298930
##$YMIN_a= -288149
##$ZGOPTNS= <>
##$ZL1= 120
##$ZL2= 120
##$ZL3= 120
##$ZL4= 120
##$ABSF1= 15.76452
##$ABSF2= -2.28733
##$ABSG= 5
##$ABSL= 3
##$ALPHA= 0
##$AQORDER= 0
##$ASSFAC= 0
##$ASSFACI= 0
##$ASSFACX= 0
##$ASSWID= 0
##$AUNMP= <proc_1d>
##$AZFE= 0.1
##$AZFW= 0.1
##$BCFW= 0
##$BC_mod= 2
##$BYTORDP= 0
##$COROFFS= 0
##$CY= -3
##$DATMOD= 1
##$DC= 0
##$DFILT= <>
##$DTYPP= 0
##$F1P= 0
##$F2P= 0
##$FCOR= 1
##$FTSIZE= 16384
##$FT_mod= 6
##$GAMMA= 0
##$GB= 0
##$INTBC= 1
##$INTSCL= 3.70164e-10
##$ISEN= 128
##$LB= 0.24
##$LEV0= 0
##$LPBIN= 0
##$MAXI= 10000
##$MC2= 0
##$MEAN= 0
##$ME_mod= 0
##$MI= 1.114404
##$NCOEF= 0
##$NC_proc= -4
##$NLEV= 6
##$NOISF1= 3.799351
##$NOISF2= 2.8
##$NSP= 0
##$NTH_PI= 0
##$NZP= 0
##$OFFSET= 15.76452
##$PC= 1
##$PHC0= -18198.4
##$PHC1= 12.60069
##$PH_mod= 1
##$PKNL= yes
##$PPARMOD= 0
##$PSCAL= 0
##$PSIGN= 0
##$REVERSE= no
##$SF= 200.130001404204
##$SI= 16384
##$SIGF1= 3
##$SIGF2= 2
##$SINO= 5.538805
##$SIOLD= 16384
##$SREGLST= <1H.CDCl3>
##$SSB= 0
##$STSI= 16384
##$STSR= 0
##$SW_p= 3612.71676300578
##$SYMM= 0
##$S_DEV= 0
##$TDeff= 16384
##$TDoff= 0
##$TI= <>
##$TILT= no
##$TM1= 0
##$TM2= 0
##$TOPLEV= 0
##$USERP1= <user>
##$USERP2= <user>
##$USERP3= <user>
##$USERP4= <user>
##$USERP5= <user>
##$WDW= 1
##$XDIM= 16384
##$YMAX_p= 459144338
##$YMIN_p= -48754
$$ End of Bruker specific parameters
$$ ---------------------------------
##NTUPLES= NMR SPECTRUM
##VAR_NAME=  FREQUENCY,     SPECTRUM/REAL,   SPECTRUM/IMAG
##SYMBOL=    X,             R,               I
##VAR_TYPE=  INDEPENDENT,   DEPENDENT,       DEPENDENT
##VAR_FORM=  AFFN,          ASDF,            ASDF
##VAR_DIM=   16384,         16384,           16384
##UNITS=     HZ,            ARBITRARY UNITS, ARBITRARY UNITS
##FACTOR=    0.220516191357247, 1,           1
##FIRST=     3154.95334798995, 0,            0
##LAST=      -457.763415015831, 0,           0
##MIN=       -457.763415015831, -48754,      0
##MAX=       3154.95334798995, 459144338,    0
$$ Real data points
##PAGE= N=1
##DATA TABLE= (X++(R..R)), XYDATA
$$ [...]
10365D41J00n265j374N399K269m965m442N506j3136K436R967J717Q00N922n051
10350C24K112K359J11k138j387J164l969Q981p347J522K135j1971J384N103L480
10335A863j751k707L932J860m156q235j216J825P663J18r949j941p0J499L094
10320h171O61J143q291m63J3189M101k473K461j1303l236J520k348K661J058K289
10305g202K56L486M86J180j3687P819J848O393l179K949Q82q888M631K783K898
10290B655o792k648k597M377K223k32j707m397k648K402L562M104n937K438O32
10275d565J956r939L311Q634o507O90K742j804R16K305J894l435N34L012P95Q55
10259A394m384k899K48q056L602L386r53n05J923K86j932k260J0623k500l409
$$ y = [441, 541, -4724, -6098, -699, 1570, -3395, -7837, -2331, -15467, -13031, -3064, -1347, -547, 5375, 324, 2436, 4795, 4906, 2768, 1381, 2545, -1424, 7557, 210, 1732, 3867, -8104, -6720, -1617, 1863, 112, -2595, 1337, 3197, -959, -9194, -10410, -8585, -922, -804, -10753, -12694, -12764, -11265, -8171, -7510, -6367, -14658, -15121, -1932, 2169, -304, 2157, -9146, -12382, -10862, -13210, -10549, -9491, -7202, -6946, -3460, -2974, -1794, -15481, -7662, -5814, 579, -2600, 349, 1231, -7657, -3026, -243, 2655, -4137, -6785, -9382, -5005, -2782, -3014, -4721, -9118, -11766, -9364, -5802, -1698, -7635, -5197, -4565, -2609, -12548, -9237, -603, -7110, -6420, -3678, -5482, -4566, -2261, -367, -3802, -3268, -256, 539, 1394, -2990, -5889, -5641, -13697, -10095, -6709, -7662, -8167, -6244, -5958, -7890, -10150, 473, -2027, -5436]
10244e436k346k074Q435K983J673j3077o481P695P395L838n474n563l17L202M287
10229a260k044q112O782K772L999q04k763L18L190m903M550Q51m646j303l364
10214f737M049l365n805O504Q642p192m09J481m059p012P683m565p654O231Q56
10199a1352j58M164k122P079K566j0237K525M710n588k371R542N226r324L110
10185b230J355m15j90l550j940l581j833R132n244k016K674J1921j517j2010O156
10170c288n263M994L562n019N982j929n180r91M25j879j906M983k693O715J152
10155c35j553m143m246L626k791l593N751M417M437j991M639k099r091K309Q053
10140C390l255l481O793L52k435l420N007K69k368L57o237m763j310L080L275
$$ y = [-5436, -7782, -9856, -1421, 1562, 3235, -9842, -16323, -8628, -1233, 2605, -2869, -8432, -8749, -5547, -1260, -3304, -11416, -4634, -1862, 2137, 1333, -1430, -1112, 2078, -2825, 1725, 2576, -2070, -3373, -6737, -2688, -6053, -11858, -5354, 3288, -3904, -4313, -2832, -6891, -13903, -6220, -10785, -18439, -12208, -11352, -11510, -7346, -9468, -2389, 177, -10060, -7535, -2825, -8413, -10784, -1242, 3984, -5340, -2230, -875, -1290, -1480, -5030, -6970, -10551, -12384, -3252, -8496, -10512, -7838, 4083, 2566, -9444, -3288, -8551, -3557, 5, -5014, 968, -961, -6141, -7132, -6707, -8586, -10492, -5509, -8202, -1487, -335, -1888, -6031, -10277, -6651, -9442, -13035, -7284, -2867, 1570, -421, 4218, 2119, -6972, -4663, 3390, 135, -3346, 3447, 3799, 1364, -2056, 2951, 3220, 852, 1209, -5028, -9791, -11101, -8021, -4746]
10125d746l523j242N290R790j4289K441N310j182L116L376n714j761P309n045
10111h70r516k737j765L986j299M723l62r76k15l775o562Q886J602N397j282j1585
10095a6350L972L962J624P550n652j401J907L517j486l265l21m435m843j677Q519
10080h379j416k327K782M643J908K927M38P884m975k12j775j2298N6K373n255
10065a3626J246O247J285L329l42j2474q84N645L779J099l778M329N004q975N442
10050b674m154k52M507n816N007N62j1127J469l62j831M855O938J09M959p309
10035e119n487l5k065J1848M654p164O55o308K883m431q71M252N854l805k858
10020g997K833k07p158P624J942P8p039j515J065j783L421M516M659m722L68J653
$$ y = [-4746, -8269, -9511, -4221, 5569, -8720, -6279, -969, -2151, 965, 4341, -1373, -3134, 4175, -870, -10386, -13123, -14888, -10902, -12201, -7478, -7840, -8816, -9031, -12806, -19368, -10482, -8880, -3483, -4765, -16350, -12378, -8416, -6792, 758, -4894, -6295, -4388, -871, -2357, -5622, -5943, -10378, -15221, -16898, -8379, -9795, -12122, -9340, -4697, -2789, 138, 576, 8460, 3485, 3273, 1498, -10800, -10744, -8371, -13626, -12380, -6133, -4848, -1519, -1861, -14335, -15219, -9574, -5795, -4696, -8474, -4145, 859, -8116, -2674, -6828, -7080, -2573, -8389, -3382, -2820, -13947, -12478, -12840, -14671, -9816, -2878, -2769, 2190, -5119, -10606, -10641, -12706, -858, 3796, -3368, -2713, -9021, -6138, -10569, -11440, -7188, -1334, -5139, -7997, -5164, -5371, -12529, -4905, -2963, -2885, -9924, -11439, -10374, -12157, -8736, -4220, 439, -4283, -3915, -2262]
10004b262M661p830n937O228M931M259K985l066J146j476K277n453m287J380J723
9989g21k398K400n08K056J782m350K768o237k136P736l745L539J059j886m092
9974d733k617m15J0097L966J981m061o462L346K989L731m259j030K669l919n715
9959d432q08K948M289N822k549K09r329n331L197L171m217M511l9j1922R341L517
9943a622L40j3l715K607n066p5Q328m906J00L335q127M502p633N780J518k942
9927g589p80P944j365m141J711L154J0323l237j0069J782M108j0482l030K79j294
9912a2686k51N614N213j95j039J380j246p875o18J535m0N244j511K74L895L458
9896A152p156P808O144l882j0379J675J163l585L622J125o931k351L967L915O668
$$ y = [-2262, 2399, -5431, -11368, -5140, -209, 4050, 7035, 3969, 5115, 3639, 5916, 463, -3824, -2444, -721, -3119, -719, -1227, 829, 2611, -1739, 1029, -5208, -7344, 392, -3353, 186, 1245, -641, -4733, -7350, -7765, 2332, 6298, 8279, 4218, -2244, 1102, 4091, 7822, 3563, 2533, 5202, 1283, -4432, -5240, -2292, 1997, 7819, 5270, 5479, -3850, -9181, -5984, -2813, -7030, -2519, -2558, -14480, -5139, -1622, -1282, -1295, -5010, -2403, -7469, -7544, 784, -4122, -4022, -687, -8814, -4312, -11945, -6165, -4647, -7589, -8369, -425, -1790, -5931, -4220, -1066, 9257, 6020, -4049, -2267, 1841, -8641, -11671, -11392, -12686, -12937, -7323, -2110, -2305, -3344, -1964, -3210, -11085, -11703, -10168, -10208, -4964, -6475, -6201, -2306, 1152, -6004, 1804, 7948, 4066, -6313, -4638, -3475, -7060, -3438, -2313, -9244, -11595, -7628, -3713, 2955]
9881B955k129o013o318N048J910k454L300j087m509N683k363K913o905k763M943
9866g789l326J091k125L798K174K159j176l412P13J182L53Q857K32k622N96j412
9850g07l021k42j588l102L984O238j701j391j281M80n102J107J0847J0133j2261
9835B393l163m446j882N584m588m394p22R07L026m7l042l03M289L895m891j057
9819h441J435N385m589K54R237N87m568J835q248k015P796J197o144N273Q091
9804G085j0599l460Q77l233J0562N505j711j0645q959K373J7996l414o739J109
9790c253O634k286j927K428p418L534l050l07O988l292n393P53P028q02m741K031
9774c073k413K498j227p606N1K280k090o61J1217M322q208j168l334J30L351P380
$$ y = [2955, 826, -5187, -11505, -6457, -4547, -7001, -3701, -4788, -9297, -3614, -5977, -3064, -9969, -12732, -7789, -11115, -10024, -12149, -8351, -6177, -4018, -5194, -8606, -7893, -6711, -6358, 2499, 2731, 109, 705, -707, -3728, -3970, -5558, -8660, -4676, 1562, -139, -1530, -2811, -2331, -7433, -6326, 4521, 14654, 2393, -770, -5216, -7098, -1514, -6102, -10496, -11218, -10311, -7285, -7332, -10374, -10677, -6388, -2493, -7384, -8441, -7006, -1621, -6210, -5956, 3281, 3868, -700, 1135, -7113, -9128, -1332, -135, -6279, -1006, 7085, -3514, -6974, -6097, -9330, 1232, 6737, 5026, -5619, -14578, -12205, 5791, 2377, -4362, -3253, 3381, 1095, -832, 1596, -5822, -2288, -5338, -5645, 1343, -1949, -7342, -6589, 439, -363, -5104, -3073, -5486, -2988, -4215, -11821, -11770, -9490, -11580, -12241, -1024, 3298, -4910, -6078, -9412, -9282, -5931, 1449]
9758A449q513M98J706M422P789L833j330p575o878J428L282j25m185L013l26j31
9742a643m077K533K866r354Q15M462N586L081k374l3p99p323j1633J2792Q252
9727C151j0909R18l924M389j351n15J623j285O181Q188M96p124j97Q201q797p635
9711h590p4J826M513j018n275J862M187m577J160J486N33k589J430M403j0725
9696a1448J2061P096j5345K776N074L231K563l833M354l00k284j0754j0578R170
9682h217O043J621J189O50l66L787Mp686j59l078k37Q956k221K248l873j090N375
9665B946O865n816K218r304J156O89m844O721k807m252L99R99J699J292J687O987
9649F635q991m510k782Q369l771N270j009K278M107K156r12l612n716n936l171
$$ y = [1449, -7064, -6566, -4860, -438, 7351, 11184, 9854, 2279, -4599, -3171, 111, -14, -4199, -1186, -1512, -1643, -5720, -3187, -321, -9675, -8860, -4398, 1188, 4269, 1895, 1862, 1063, -6260, -17893, -5101, 3151, -7758, -6840, -10764, -6375, -7726, -8241, -6618, -7903, -1722, 6466, 6962, -162, -359, 7842, -955, -8590, -8664, -6838, -2325, -3343, -8618, -6756, -2569, -7146, -5986, -4500, -3967, -6556, -5126, -723, -11448, 613, 7709, -7636, -4860, 214, 3445, 6008, 2175, 6529, 6229, 3945, -6809, -17387, -8217, -2174, -553, 636, 1286, 920, 4707, 4711, -2975, -3134, -6212, -6449, 2507, 286, 2534, -1339, -2429, 2946, 9811, 3995, 6213, -3091, -1935, -1246, -6090, 631, -2176, -6428, -6029, -5030, -3331, -2039, -352, 6635, -2356, -6866, -9648, -1279, -5050, 220, -789, 1489, 5596, 7752, 6840, 3228, -2488, -8424, -11595]
9634a1595R917o96M754k426K207n643M446N102q097k676l544K864J036n24K248
9619b627m260L127R380k696q094P908J149m467N874p273k67j691M500K0m72M328
9603D439m446l95N903j1649J662l94o05K694R327m994o572m977n264L516O042
9588e713L28J122J700M650k433l002L961n003l429L146m467M85Q639N33j008K411
9572A920j1671l928P474L314M090k735j480o68l996k012Q329K357k999K485k770
9557b290l191k149J1375O626n464N74n598O244K992q547k675n437K401L109J098
9542i32o132L595m711K522k21M761k786M27q19l35Q981l954K778O505l660p969
9526a950M489K391q474L919k883M087k7m350K503o374M684l257j69M894L50M223
$$ y = [-11595, -1678, -2374, 2380, -46, 2161, -3482, 964, 6066, -2031, -4707, -8251, -5387, -4351, -4875, -2627, -6887, -3760, 5620, 2924, -5170, 2738, 3887, -580, 5294, -1979, -2246, -3937, 563, 583, 111, 4439, -7, -402, 5501, -6148, -4486, -4880, -5485, -2791, 6536, 1542, -5030, -10007, -15271, -11755, -5713, -5385, -4263, -2563, 2087, -346, -3348, 613, -4390, -7819, -4673, -9140, -8655, -16, 517, -491, 1920, -9751, -13679, -6205, -2891, 1199, -1536, -3016, -3684, -7680, -9692, -1363, 994, -2005, 480, -2290, -5481, -7630, 3745, 10371, 4907, 5481, -117, 6127, 9119, 572, -2103, -7540, -5139, -2030, -932, -7064, -3469, -8180, -5658, -5879, -1118, -3904, -3477, -4296, -4631, 4350, 396, 3174, 9679, 6019, -1950, 2539, 4930, -3544, 375, -2508, 1579, 1552, -2798, -295, -6669, -1985, -5242, -5411, -517, -167, 4056]
9510D056N362r230p432J805K760p372J969k248M804J006k674J632l648k609N768
9495f051n708P485n359R46M221L292J995k102j940Q27L899K78l265j085J067J0051
9479H551n856j895N215n61k319r100M933K501J096q809m229N096P975K374l166
9464A806R55R25o292M636m916K755Q9l224K987J588j682m60j526k486K674k282
9448d453Q34O933j559J727J047p32J648j008o236o788J1167L106r681J213R69
9433a813l749M026P41J059q28K478j077L887Q394j063M384r301n757K597O511
9418A0489j1100p852R791K520J785L25j973r924k142Q85N207O509o817r297K22
9403a1372O747k616lM22j128L728K947P1J281M104m747p236O854P693q152j6072
$$ y = [4056, 9418, 188, -7244, -5439, -2679, -10051, -8082, -10330, -5526, -4520, -7194, -5562, -9210, -11819, -6051, -11759, -4274, -9633, -8687, -4466, -1174, 821, -1281, -3221, -2394, 1505, 1783, -1482, -2567, -1500, 8551, 2695, 800, 6015, 5454, 3135, -5965, -1032, 1469, 2565, -6244, -10473, -5377, 2598, 4972, 1806, 2761, 3686, -2606, 2030, -2886, -131, -42, -3266, -279, 1309, -373, -833, -2359, -4845, -2171, -4453, -3619, 3314, 1755, 3482, 4529, 3797, 5445, 4437, -1799, -8587, 2580, 5686, -3995, -2782, -1813, -5562, -1536, -795, 264, -564, 1914, 837, 4724, 13118, 12055, 16439, 7138, 1381, 3978, 10489, -611, -8463, 1328, 3848, 5633, 5958, 3985, -5939, -8081, -7196, -1989, 4520, -2297, -11594, -11372, -4625, -7241, -7244, -6822, -7950, -4222, -1275, -1204, 77, 4181, -566, -7802, -948, 6745, -1407, -17479]
9387a7479M201M381Q49M513j313j717O769k222K32l883R24O495n034J176l392
9372e500p35k529K673P465K728q739q3p08m112j079M296r083N645O657L800p157
9356f461M671L038o494J909K9m591J224R626k846l754M524O686k700j0485J645
9341c979n522L628J1912n073n34n802K502l207p313m958N89J3202M531l396O278
9326B858n71M58j25Q237p960n412N214N664K597j7062j0607M441Q104K73j869
9311e760k190R134N236q766p954Q391n263Q414M632r364K718j087L635j5165k532
9296a5921J611M256M651k632k493M415L594k609j171K902p164L727M531R484n045
9281B136n208L164o602m767L182M143m323R12J829J092J126l607q24j922J592
$$ y = [-17479, -13278, -8897, -8048, -3535, -4848, -6565, 204, -2018, -1786, -5669, -4745, 1750, -3284, -2108, -5500, -6235, -8764, -6091, 1374, 4102, -4637, -4720, -5428, -9540, -10619, -6323, -15406, -9761, -3104, 696, -6461, -1790, 1248, -5246, -3337, -3308, -7899, -6675, 2951, 105, -3649, 875, 7561, 4861, -5624, -3979, -9501, -5873, 6039, 966, 432, -5370, -2868, -6075, -13388, -18346, -17757, -4555, -24, -3420, 2858, 2287, 2745, 2620, 10857, 2897, -2515, 2699, 8363, 10960, -6102, -16709, -12268, -4164, -3891, -5760, -7950, 1184, 6420, -2346, -10300, -1909, -7172, 1242, 5874, -3490, -772, -1859, 1776, -13389, -15921, -14310, -10054, -5403, -8035, -10528, -6113, -2519, -5128, -6299, -3397, -10561, -6834, -2303, 7181, 2136, -3072, 92, -6510, -11277, -8095, -3952, -8275, -7363, -5534, -4442, -3316, -6923, -7747, -9669, -8077]
9266h077Q138K615q517m785O544J025O139j346M374j136K846r727n70O717p423
9251c183m31L046K850O39K98q149R076j140n935N136K062k717J344J603k910m178
9235b589P254K281J570oO33J210l453j913j623J568K006K528n297r884j023q68
9219g606L801j180m495K759M109O75j909R779p834p090J687M009N608R05l940
9204g22q85K724L332o65l300K617p840R61L553L591k644k84P951j209j400o015
9188b35L377j12P201m859o400j068K445L009J954n446q210j981j535N587J1568
9173E295N553l658q10K487r386K505L773q264m65m27m926Q467N036j902J226O369
9157A0873n999j649n096J379N882L024l609k082M689l155k841J426K977j131n152
$$ y = [-8077, 61, 2676, -5841, -10626, -4082, -3057, 3082, 1736, 6110, 4974, 7820, -1907, -2477, 4240, -3183, -3614, -568, 2282, 2921, 3219, -4930, 4146, 3006, -2929, 2207, 4269, 1552, 2896, 4499, 1589, -2589, 4665, 6946, 8516, 8510, 9143, 10353, 6900, 4987, 3364, 4932, 6938, 9466, 4169, -5715, -6738, -7606, -3805, -4985, -9480, -6721, -2612, -1937, -3846, 5933, -1901, -8991, -7304, -3295, 2313, 3218, -722, -1607, 1117, 4449, 3784, 484, 3101, -4739, -3778, -225, 3366, 722, 438, 8389, 7180, 5780, -235, 3142, 3030, 10231, 5372, -1028, -2096, 349, 3358, 5312, -134, -8344, -10325, -11860, -6273, 5295, 10848, 7190, 6380, 8867, -519, 1986, 5759, -2505, -2970, -3397, -8323, 144, 5180, 3278, 4504, 10873, 4874, 3225, -1871, -492, 5390, 8414, 4805, 2723, 7412, 4257, 1416, 2842, 5819, 4688, -464]
9142d64q779K677N071j905Q003M089j391j2024n73K074j766J088R491k458k671
9127D62J32j108K175m03K017j681J250o66M696k355J683P16j950J142M036l564
9111F582p898R20K513k896N045m08L667o05j049m290n93l201O539j96K107J464
9095G701j777n977k695k585k067J658n77L512j950K172N136o444j773M857K864
9080B055N083l529j302K929K783M102n163k910J2152l297k061l561k038j302k791
9065A150M348k139J880l345n318m189R164k395N815n513K513Qj398J940J67j225
9049A463N945j123K64j401O679k926m283n266J90k324L47o30J458k881l092N634
9033a946j63M67m781M793j0470k354R419J1536p11j460p916O050L466k56k727
$$ y = [-464, -9243, -6566, -1495, -3400, 4603, 8692, 7301, -4723, -5296, -3222, -4988, -3900, 5591, 3133, 462, 594, -514, 1661, 1258, 3275, 1594, 2844, 2178, 6874, 4519, 6202, 6918, 4968, 6110, 10146, 6582, -1316, -396, 2117, -779, 4266, 3858, 7525, 6920, 5871, 1581, 988, -2213, 4326, 4130, 6237, 7701, 5924, -53, -2748, -5333, -7400, -5742, -6319, -2807, -4757, -2585, 2551, -3893, -5666, -809, 2055, 7138, 3609, 2307, 5236, 8019, 12121, 6958, 4048, 16200, 12903, 10842, 7281, 5243, 3941, 1150, 5498, 3359, 5239, 1894, -3424, -7613, 1551, -844, 4971, -542, 1971, 1979, 581, 2521, 2688, 1463, 7408, 6285, 6549, 5148, 11827, 8901, 4618, -648, -458, -2782, -2435, -3065, -1607, -4488, -7580, -1946, -2109, -1642, -6423, -1630, -12100, -14454, -5035, 6501, 5790, 4330, -3586, 2464, 5930, 5674, 2947]
9018B947O36j2843k001K257J0687n141J831P729m030O418l191M025m544k538J04
9003B346R5M34K676K620M58O554p483k096M66J557M152p10O050j368r374n156
8987A221K329J0077l017N598j3833n350J2678K544o62k762r73M668n485K733k443
8972G323k577P708k579k318N798n48n892Q892M038j1839K139K995J570K321K311
8957A9342J4p926K528L536k619l334J0632O978j3987j146K384N862j254K277L418
8942B6705M453K056j774r282N393q87n717O677m368J469M085o74L131O750j621
8927C6396j039k689O922j257r2P36M134N975k579P658L454L36l900n673P124P877
8911F3383M501N576L398j135J1551L395J1674J2839P499O074J7792J4513J9739
$$ y = [2947, 3583, -9260, -11261, -9004, 1683, -3458, -1627, 6102, 2072, 8490, 5299, 9324, 4780, 2242, 2346, 2441, 2875, 5551, 8171, 8629, 15183, 7700, 5604, 6070, 7627, 11779, 11069, 17119, 15751, 6377, 1221, 3550, 13627, 10610, 16208, 2375, -2975, 9703, 12247, 11585, 8823, 7850, 12518, 7033, 9766, 7323, 4746, 12454, 9875, 7557, 13355, 12807, 6915, 15807, 19845, 8006, 10145, 13140, 14710, 17031, 19342, 19356, 11430, 13958, 17494, 14875, 11541, 22173, 29151, 15164, 14018, 16402, 22264, 21010, 23287, 26705, 31158, 33214, 31440, 22158, 27551, 26664, 20947, 27624, 23256, 24725, 28810, 28136, 31267, 38017, 36396, 35357, 32668, 39590, 38333, 38241, 38977, 43111, 49086, 46507, 54165, 57619, 57955, 54055, 48382, 55506, 63383, 67884, 73460, 76858, 75723, 87274, 90669, 102343, 115182, 122681, 128755, 146547, 161060, 180799]
8898A80799J2337J1319J920o000j9688m603l189j1177n916q00l870J769O320J362
8884A60583N500L155M934K0952J9216J0729P404p078j0167j5129j1411j8759j3128
8871A56801j0445n034p764L404J923j052r022R753J1938P817J0094J1777K5789
8858B05979J2065J3915J0143M271n176q416j3469k0118j8018q515L222p658j3148
8845A55077J810N903m290J3111J7500P985R344J2496J0974q554l568j0591k4634
8832A82563k6359j7395j5166j2816j0057p054k654l713j1352j161j1722j532k027
8819E9555k097J521p827P60l909O228R23n535O616p289J984m433k700q918J717
8804C6596J1512k148o266n966K837J225O489n857J555n149m125k485K958j285
$$ y = [180799, 193136, 204455, 206375, 200375, 180687, 176084, 172895, 161718, 155802, 155002, 151132, 152901, 159221, 160583, 166083, 169238, 174172, 195124, 214340, 225069, 232473, 225395, 215228, 200099, 188688, 169929, 156801, 146356, 141322, 133558, 136962, 138885, 137833, 128811, 138564, 150502, 158319, 168413, 180190, 205979, 218044, 231959, 242102, 246373, 241197, 232781, 219312, 199194, 181176, 172661, 175883, 168225, 155077, 156887, 162790, 158500, 171611, 189111, 197096, 206440, 218936, 229910, 221356, 217788, 207197, 182563, 156204, 138809, 123643, 110827, 100770, 93716, 91062, 87349, 75997, 74836, 63114, 61582, 59555, 57458, 58979, 51152, 51912, 48003, 54231, 55154, 49619, 56235, 48946, 50930, 46497, 43797, 34879, 36596, 48108, 45960, 39694, 33728, 36565, 37790, 44279, 38422, 39977, 34828, 30703, 28218, 31176, 29891]
8790B9891o51N135j91m714J377J062M290J155j2520k721K740N548M496k169J046
8775C3774k447k06o11P318j560p817L737N390J036k684m828J427m776l725J065
8760B5093k317J1211J871n21j0860k245J3397p672K788J1126k726r044L947L4
8746C4082r341L546M616K783M317J367j5334q66Q510l2q17N626N65n902R02m166
8730B9856j552j193Q604L848N7m715K831q081O755K263L04P981p10j2873L813
8715C7188L289m610j365J262l935K584j567N755L730M466m164k7P815l214j452
8700D5755K186l874p038R486L549m964J949L122o470j977m122Q555j380j845n369
8685C7563N652m207M940K833L630l062Q122P631K801q786k88N064k02R028l170
$$ y = [29891, 29240, 34375, 34184, 29470, 30847, 31909, 36199, 37354, 24834, 22113, 24853, 30401, 34897, 32728, 33774, 31327, 31121, 30510, 37828, 36268, 28451, 32188, 37578, 38614, 35930, 31102, 32529, 27753, 24028, 25093, 22776, 33987, 35858, 35337, 24477, 22232, 35629, 27957, 30745, 41871, 39145, 30101, 34048, 34082, 24741, 28287, 32903, 35686, 40003, 41370, 26036, 25170, 33680, 33648, 32831, 38457, 39022, 33120, 34022, 29856, 28304, 27111, 35715, 39563, 39620, 34905, 37736, 29655, 36410, 38673, 38977, 46958, 46248, 33375, 37188, 40477, 35867, 34502, 35764, 31829, 34413, 32846, 38601, 42331, 46797, 42633, 42606, 50421, 47207, 45755, 47941, 44067, 37029, 46515, 50064, 45100, 47049, 50171, 43701, 41724, 37602, 46157, 44777, 42932, 37563, 43215, 39008, 43948, 46781, 50411, 47349, 55471, 63102, 65903, 57117, 56829, 61893, 61691, 70719, 67549]
8670F7549J737m345Q229J0239l645m310j770O51K300N468N604J620K488O611R656
8655A08082N094J71J752R902q00J3298J4621Q455J7371J9148K4470K1467K7099
8642B70130K4059J4109J1701j760n178r194k5128j6065j7696J374L636q447n939
8629B35602O163M601J5293N416J7559K2709L0843K0884m435j255m070j4550j9387
8616C15373j6829k1481j5304p302q290q18P358m00J6357J5357R890J2899K5321
8603C32131K1249K0540K2014K8588J4272N100o268l4561l1371k0397j5060j5422
8591C20815j6597j3358k629P090O090J1477J7808J6752K6661K1133L776k363p376
8578C89279j5454l2037l4993l2533j8381l538k3459k2115j6267j1016m441q650
$$ y = [67549, 69286, 64941, 73170, 83409, 79764, 75454, 73684, 74335, 76635, 82103, 87707, 89327, 91815, 98426, 108082, 113176, 113347, 115099, 125001, 124201, 137499, 152120, 160575, 177946, 197094, 221564, 243031, 270130, 294189, 308298, 319999, 318239, 313061, 303867, 278739, 262674, 244978, 246352, 249988, 241541, 235602, 241765, 246366, 261659, 267075, 284634, 307343, 338186, 359070, 354635, 353380, 349310, 334760, 315373, 298544, 277063, 261759, 254457, 246167, 245349, 252707, 252307, 268664, 284021, 293911, 306810, 332131, 353380, 373920, 395934, 424522, 438794, 443894, 437626, 403065, 371694, 351297, 336237, 320815, 304218, 290860, 288231, 295321, 301411, 312888, 330696, 347448, 374109, 395242, 399018, 396655, 389279, 373825, 341788, 306795, 274262, 255881, 252343, 228884, 206769, 190502, 179486, 175045, 166395]
8566A66395n532m271q632m643J191r737j4884K474q463j685N0l197r972j080O176
8551A04190j9Q719m333o088J412N565L777L756n143o363N005m60j1893j323j6380
8536H0422K523m6J266P999j1158M773m273m262L76n463L704P358k460n871M06
8521G5294K20J899n511q777J54O038l989k643l556J356K793K49n626K960Q792
8506F9653o140M383K916O429K693q626J620R558R981m515L412M852L314P555n220
8491A01865m950Q299n171l851Q129P662K691j233N064j371J039k050O205l165
8477A19163n646J839m308m70m536Q291k243R716R084J8j550Q226j660J1481O833
8462A54238P895R052O846J1515P902l235Q772K1734P719K2368K0807K3572K0191
$$ y = [166395, 160863, 156592, 147960, 143317, 144508, 134771, 119887, 122361, 113898, 112213, 112263, 109066, 99094, 98014, 104190, 104171, 112890, 108557, 102469, 103881, 109446, 113223, 116979, 111836, 105473, 110478, 110018, 98125, 96802, 80422, 82945, 82899, 84165, 92164, 81006, 85779, 81506, 77244, 77620, 72157, 75861, 83219, 80759, 74888, 75294, 75514, 77413, 71902, 63125, 63279, 69317, 65328, 62685, 59129, 60485, 63278, 63527, 57901, 60861, 69653, 63513, 67896, 70812, 77241, 79934, 71308, 72928, 82486, 92467, 87952, 91364, 96216, 99530, 107085, 101865, 96915, 105214, 100043, 96192, 104321, 111983, 114674, 113441, 118505, 117134, 118173, 116123, 122328, 119163, 113517, 115356, 111048, 110578, 106042, 114333, 112090, 121806, 130890, 130908, 129358, 137584, 135924, 147405, 154238, 162133, 171185, 178031, 189546, 197448, 194213, 202985, 224719, 232438, 254806, 275613, 299185, 319376]
8449C19376L6141K3499L1563R902l289P217l325J331K1839K6895L2607M1997N0849
8436E96602M1785L5291N828j8761l2192m6997l0796k5236j7282J175J7709K3024
8424E50150K2168J1847p216l2055l0850l1597m3542l4888j4745j3654q145q038
8412C59435o916O523J1680Q800J4216K6037K0237K2476J3768j4211O922k657m102
8399D62208J0256J6429L4266L5526M6721M1381L6592J7326l168k9592n1577m9329
8387E67039l2009j6513q696J572J9828J0604J1604n615j0340l1360m3228l2525
8375D30361l5034l8962j8715l461p108j0590M484n231N539P136N19j269l735j1236
8361C12698j834r283j2655q838J270Q447J77J370R596P762n643m325N91k553p375
$$ y = [319376, 355517, 379016, 410579, 420481, 417192, 424409, 421084, 422415, 444254, 471149, 503756, 545753, 596602, 638387, 673678, 679506, 660745, 628553, 581556, 550760, 525524, 508242, 509417, 527126, 550150, 572318, 584165, 576949, 544894, 514044, 482447, 438905, 404017, 389272, 375618, 367473, 359435, 352519, 359042, 370722, 379522, 393738, 419775, 440012, 462488, 476256, 462045, 468967, 466310, 462208, 472464, 488893, 523159, 558685, 605406, 646787, 683379, 700705, 697537, 667945, 616368, 567039, 535030, 518517, 509821, 511393, 531221, 541825, 553429, 547814, 537474, 506114, 462886, 430361, 395327, 356365, 337650, 334189, 327081, 316491, 320975, 315744, 321283, 328419, 328938, 327669, 323934, 312698, 310864, 301581, 288926, 280088, 281358, 289805, 289982, 291352, 300948, 308710, 303067, 298742, 299333, 296780, 289405]
8346B89405P877J0349J4278P547J7727J1675J9467K0105Q698p703j0208p838n396
8333C75983j4496Q878J2571J7116J8845J3536J7750J5241P293P891L563k132k085
8320D79954j3528j9129k8748j5841j771l630M347P807R911N119j962j557k705
8307D18267o879o725j1257R915l626J5070K4959J8389K8933J7964Q726J1217n387
8294E19566j2707k2315k5329m850j0374J018K657J1309J7275J0830m926j6404
8282D65750k0584j7412k1447k0641k4915k0869k3245j6746j2225j1438o133k780
8270B67315P338l141k715q881j2690K455n394p314p45P718p13M674J724J5078
8256B64709J4543Q277m791k1407p642j2346l475j0535p800J95R538K744L4k534
$$ y = [289405, 297282, 307631, 321909, 329456, 347183, 358858, 378325, 398430, 407128, 399425, 389217, 381379, 375983, 361487, 370365, 382936, 400052, 418897, 432433, 450183, 465424, 472717, 480608, 484171, 482039, 479954, 466426, 447297, 418549, 402708, 400937, 397307, 401654, 409461, 419372, 424491, 422529, 420972, 418267, 411388, 404663, 393406, 403321, 399695, 414765, 439724, 458113, 487046, 505010, 513736, 524953, 519566, 506859, 484544, 459215, 454365, 443991, 445009, 447666, 458975, 476250, 487080, 482154, 465750, 445166, 427754, 406307, 385666, 360751, 339882, 316637, 299891, 287666, 276228, 270095, 267315, 274653, 271512, 268797, 259916, 247226, 249681, 244287, 236973, 236228, 243946, 243233, 247907, 249631, 264709, 279252, 287529, 282738, 261331, 253689, 241343, 237868, 227333, 219533, 219728, 229266, 232010, 232044, 229510]
8242B29510q670j2211j5105j4998j4987j8222j963j0629j9838m164j193q541k752
8229I6237k593p476p205n376L461m659r019N096M923p503q004m609J0459K487
8215F6219j3103O912J129l283L295r320J68R576L72o708J1794j1927m398l081
8201D7645o794J2600O761j1123l012j1948n209J1069J732J02396J1442o2201j5828
8188G7530p087l199j6791j3707j753L324n410J542L315m991J813l317j50L145
8174C4264j694N199j0193K923R843n56j2509P300P446L27k96K015r101p201N4
8159B7821p80R15q43o11K408k143k274N833q713j004Q136n802J292K990N816m295
8143B8746L199n756k951K923J47o639k740K183M367n615P874m556j0983Q009R804
$$ y = [229510, 220840, 208629, 193524, 178526, 163539, 145317, 143354, 132725, 112887, 108723, 107530, 98989, 96237, 93644, 86168, 78963, 73587, 77048, 72389, 63370, 68466, 73389, 65886, 57882, 53273, 63732, 66219, 53116, 60028, 61157, 57874, 61169, 51849, 52017, 61593, 61965, 55257, 67051, 55124, 50726, 47645, 40851, 53451, 60212, 49089, 46077, 34129, 28920, 39989, 41721, 144117, 155559, 93358, 77530, 70443, 67244, 50453, 36746, 34993, 38317, 32907, 34449, 37764, 32773, 34586, 31269, 31119, 34264, 32570, 37769, 27576, 30499, 40342, 39786, 27277, 34577, 42023, 42350, 42054, 44069, 34968, 27767, 27821, 27041, 27956, 27113, 26502, 28910, 26767, 24493, 30326, 21613, 20609, 28745, 22943, 24235, 27225, 33041, 28746, 31945, 26189, 23238, 26161, 26308, 19669, 16929, 19112, 23479, 17864, 25738, 21182, 10199, 18208, 28012]
8128B8012N55n182l002J603n501k754L6J857J812m319K382Q791J045j1765j000
8113A2570j483l936P371j027l223N530k897J042j243j262K499k73n872j472k514
8098C810L970k13k0J725k852J291K066L590N326k641q50O182N135l565j100p252
8082A4602k200J272L96j572n908M442L044l426N396j5604L946L174J680M748p230
8067F760L843r228K848N282j115K872M368Jq83J48l569l455j738J0861j187l646
8051A2162K45m909q394N700P141J728M156R59n557r380N31J4985n747k001M21
8036A2040L78m155j417J562k443P51J839P87M4M034J248k838M700n641L340J742
8020A5971k574M179l93n007K295M38L090K811l851p92m390N170j0984q98P738
$$ y = [28012, 28567, 23385, 20383, 21986, 16485, 13731, 13767, 15624, 17436, 13117, 15499, 24290, 25335, 13570, 12570, 11087, 7151, 14522, 13495, 10272, 15802, 12905, 13947, 12704, 11442, 13941, 13668, 7796, 6324, 3810, 7780, 7567, 7547, 9272, 6420, 7711, 9777, 13367, 18693, 16052, 15202, 21384, 26519, 22954, 21854, 14602, 12402, 13674, 14070, 12498, 6590, 11032, 14076, 10650, 16046, 442, 4388, 7562, 9242, 13990, 6760, 10603, 1375, 4223, 9505, 8390, 11262, 15630, 15631, 14748, 14896, 11327, 7872, 6134, 16995, 15808, 12162, 12407, 7498, -896, 4804, 11945, 13673, 17829, 18788, 13231, 3851, 4382, 19367, 13620, 11619, 12040, 12418, 8263, 6846, 8408, 5965, 6716, 8555, 9342, 9386, 13420, 14668, 11830, 16530, 10889, 14229, 15971, 13397, 17576, 17183, 12176, 14471, 14909, 17999, 20810, 16959, 16167, 11777, 16947, 5963, 5065, 12803]
8005A2803M757J021p626k563N059O35n81j346O450j42p26J431m582o191j2441
7990d042K931O371n626J061Q370r75n3O410p010Q590N492m704p547j927J1157
7975A8498k916O603l636q377P0j653O892r83O769m608K293m79M534j273k534m984
7959A4216m820L08J476J447N403j281l085n251p236N026L664Q123j780m556j454
7944A0200l809J625l08o065k507K585R497L911j0032J90j370O050l060N807n84
7929A2130n434O340J607q454J536R414q952k435L999M188L14j213J505n940o79
7914G926j314m344L827O183J0733j2052j1564O116N816k134K647l200K683l23
7900A1000l653N944m210L855M479j3284K128N616Q991r216j355N086o68P09l941
$$ y = [12803, 17560, 18581, 10955, 8392, 13451, 14086, 13505, 12159, 18609, 18467, 17741, 19172, 14590, 8399, -4042, -1111, 5260, -366, 695, 9065, 8090, 8037, 14447, 7437, 16027, 21519, 16815, 9268, 7341, 18498, 15582, 22185, 18549, 10172, 10242, 8589, 15481, 14498, 21267, 16659, 18952, 18473, 23007, 21734, 19200, 14216, 9396, 9704, 11180, 12627, 18030, 16749, 13664, 8413, 1177, 6203, 9867, 17990, 16210, 11654, 10200, 6391, 8016, 7708, 1643, -864, 1721, 11218, 15129, 5097, 5287, 3917, 9967, 6907, 12714, 12130, 6696, 13036, 14643, 6189, 7725, 17139, 8187, 5752, 9751, 13939, 14253, 13040, 14545, 8605, 7926, 6612, 2268, 6095, 12278, 23011, 10959, -605, 5511, 11327, 9193, 11840, 8640, 11323, 11000, 7347, 13291, 9081, 12936, 17415, 4131, 6259, 11875, 20866, 11650, 10295, 15381, 14713, 15422, 11481]
7885A1481j993N054J857o44K66q330r58M822o612K474R361L014m304j385l427
7870A0676p526P603r69M798p89R54P463p65k365r225k657l612J0051j502R92K529
7854A5656Q998j786m548P00j0700Q29m813m042P113L722R634n071p241q47P730
7839A5334L651l120q955k387l96k34J4856J574m415L118P213L477m814q507J977
7824A8372L382M230n32j3153o151L956J341k164K105J5419n3J5077Q085K8147
7810G8061j13148j3667L7068j683J4027j4648P464j749K508M002J0633Q89N498
7797A5255m155J276p408O402l057j228M39L189n241J469J1870r172j1376Q653
7783F916P008o357J273Q631O55k473J836o04j0431N428R74J086o437j82j114l849
$$ y = [11481, 9488, 14542, 16399, 15755, 16021, 7691, 6733, 11555, 4943, 7417, 16778, 19792, 15488, 14103, 10676, 3150, 10753, 9784, 14582, 13793, 14747, 22210, 21445, 19080, 9855, 7198, 3586, 13637, 12135, 13127, 15656, 24654, 22868, 18320, 19020, 8320, 9149, 4336, 294, 7407, 11129, 20763, 15692, 8451, 7604, 15334, 18985, 15865, 6910, 4523, 4127, 3893, 18749, 20323, 15908, 19026, 26239, 29716, 24902, 16395, 18372, 21754, 25984, 25452, 12299, 6148, 10104, 11445, 9281, 11386, 26805, 26752, 41829, 49914, 78061, -35087, -48754, -11686, -13369, 658, -13990, -6526, -8275, -5767, -1765, 8868, 9757, 15255, 11100, 12376, 4968, 11370, 8313, 7085, 7524, 10713, 5472, 6941, 18811, 9639, -1737, 6916, 13924, 7567, 8840, 17471, 18126, 15653, 17489, 16885, 6454, 11882, 12856, 13942, 7505, 7323, 6209, 2360]
7767B360M455P961l404m04k323K063M73k119j175J0232m703n220L541n934j421
7752D382o45L177j2114J868J3063n433J1634O023j4005O85K447l867L206q28n102
7737D491L608J110q063K832P952L303p129K656j222Q632o699K654O440q220l221
7722I124n068j112j214N200J947k913o20J674N777j0037J310m64O843J256l281
7707H422J209J397K579j407L639l071P19j256m554p085L908J205J78M908P558
7692A8349j111l358m683n867N640P946l059M042K44l342n20L436j604J519r67
7677A6665J784j899j446K278Q846p283j881M568J703J158l418m922m300l162L847
7662A2538r985O341J272j29p42N759P100r404l545P471o877n93P58R389M818k816
$$ y = [2360, 6815, 14776, 11372, 10968, 8645, 10708, 11181, 9062, 7887, 18119, 13416, 8196, 11737, 5803, 4382, 3737, 6914, -5200, -3332, 9731, 4298, 15932, 21955, 7950, 8635, 11082, 7215, 10421, 9593, 4491, 8099, 9209, 1146, 3978, 11930, 15233, 8104, 10760, 9538, 18170, 11471, 14125, 20565, 12345, 9124, 4056, 2944, 1730, 6930, 8877, 5964, 5344, 7018, 12795, 2758, 4068, 3604, 10447, 11703, 8422, 9631, 11028, 13607, 12200, 15839, 12768, 13487, 12231, 7677, 592, 4500, 5705, 5883, 10791, 18349, 17238, 13880, 9197, 3330, 8970, 16916, 13857, 17899, 18143, 14801, 14281, 17717, 16113, 17632, 16665, 18449, 16550, 15104, 17382, 26228, 18945, 17064, 21632, 23335, 24493, 21075, 16153, 11853, 8691, 12538, 2553, 8894, 10166, 10037, 9295, 15054, 22154, 12750, 9205, 16676, 9799, 9206, 9964, 19353, 24171, 21355]
7646B1355j261q121k50o94R71m42J816n44j322q31L793J059l031j961k597J808
7630I748q042P165K529L42N418l655L005J892r95M266n590k522k735N431J139
7615A7396M619l932m653K431L391J021o45k475l680K716k543q616P687M878r411
7600H184M346K687M138K789o427j447O713n477J824n895p702Q179l250o315L014
7585E361L88O828o50J3821j0748r031m022K849O801Q585l947q281N430J214m794
7570I804M922m772N65j1169J0201J4277l839o242O869Q830l873P9K354r340J529
7555B0195o83m780N158N186n392n005l589l29l551O600j524p86M666l28J101M381
7539B1320J366j684K380m582J5P96q312Q24J195L029o075P552R741l550j931j0086
$$ y = [21355, 20094, 11973, 11723, 11029, 12000, 11558, 13374, 12830, 11508, 10677, 14470, 15529, 12498, 10537, 7940, 9748, 1706, 8871, 11400, 11742, 17160, 13505, 16510, 18402, 17407, 21673, 16083, 13561, 10826, 16257, 17396, 22015, 18083, 13430, 15861, 19252, 20273, 19628, 17153, 13473, 16189, 13646, 5030, 12717, 17595, 8184, 12530, 15217, 19355, 22144, 15717, 14270, 20983, 15506, 17330, 11435, 3733, 11912, 8662, 2347, 5361, 5749, 12577, 11927, 25748, 15000, 5969, 1947, 4796, 11597, 20182, 16235, 7954, 13384, 14598, 9804, 14726, 9954, 10519, -650, 9551, 23828, 19989, 13747, 20616, 29446, 25573, 25652, 28006, 18666, 20195, 19512, 14732, 19890, 25076, 19684, 14679, 11090, 10761, 7210, 13810, 12286, 11500, 16166, 15838, 16939, 21320, 22686, 21002, 23382, 18800, 18815, 19611, 11299, 12123, 13318, 16347, 10272, 17824, 27565, 24015, 22084, 11998]
7523A1998L070N962J353p237l977L111K367n306j344K499L311l927J3299J0455
7509C5634n364k831n206k969K632p505K200m25l771M998k403K190K373L309O736
7494B9598k962r641N04O791m457K086j060m114p42L500l166n065Q880L229N03
7479B3884J31p439N442Q644L355l779n465J747o475j850j477K838J056l185j010
7464A6417L405K322M649n288j813L199J9Q3j106L837n804j605k222N797M888j498
7448B5280p799k723K77J0247j226K255m758n516j834K338L561O743l884j420n967
7433A5574O40n7L430J1254K9j4684k883J961M252P27K642k07N371K183J216j0263
7417B1185K773r65O811O277M272o161m891J01J004K291m951l155N794o401n787
$$ y = [11998, 15068, 21030, 22383, 15146, 11169, 14280, 16647, 11341, 9997, 12496, 15807, 11880, 25179, 35634, 30270, 27439, 22233, 19264, 21896, 14391, 16591, 16166, 12395, 17393, 14990, 17180, 19553, 22862, 29598, 26636, 16995, 17499, 24290, 19833, 21919, 20859, 16745, 16003, 19503, 16337, 11272, 20152, 23381, 23884, 24015, 16576, 22018, 30662, 34017, 30238, 24773, 26520, 20045, 18195, 16718, 19556, 20612, 17427, 16417, 19822, 22144, 26793, 21505, 19692, 22891, 22910, 22993, 21887, 25724, 19920, 18315, 16093, 21890, 26778, 25280, 17481, 14758, 15035, 25282, 24056, 26311, 21553, 16037, 14203, 16541, 20102, 26845, 22961, 21541, 15574, 16214, 16157, 19587, 30841, 30870, 16186, 13303, 15264, 19516, 20243, 22885, 22678, 28049, 30232, 31448, 21185, 23958, 22993, 29804, 36081, 40353, 34192, 29301, 29402, 30406, 32697, 27746, 24591, 30385, 23984, 18197]
7402A8197J289K775M994J483J85r343K578J682K891N090o70p627k09L797J681
7387B8793n502k529j1807P062Q818o500M825R070o883k941J75L416p566m96N113
7372B3048Q965j779P172L654j347r908O70k375l307k582M448J95K126q5J302L586
7356C3783K880P30j770O614m383n077M483J66j289p728p89N803M403N60q202j568
7340B8616j308k14n28J829Q692L427J50o085k959K990P413p371k239n569j03M795
7324C1536R766k958k708J433O823L112l453p751J0415J866k728L020o335n16L693
7309D5215K590p30j594n398j883P49J784M6m094P540P08q772M676J86o904J577
7293C5696M76K82O263L324r132n24P735L127k914o549K235o775J471O918O052
$$ y = [18197, 19486, 22261, 27255, 28738, 28923, 19580, 22158, 23840, 26731, 31821, 31151, 23524, 23315, 27112, 28793, 23291, 20762, 8955, 16017, 24835, 18335, 23160, 32230, 25347, 22406, 22581, 25997, 18431, 17935, 23048, 32013, 30234, 37406, 41060, 39713, 29805, 30475, 28100, 24793, 22211, 26659, 26854, 28980, 28895, 30197, 33783, 36663, 37393, 35623, 42237, 37854, 32777, 37260, 37426, 36137, 28409, 27620, 33423, 37826, 38386, 30184, 28616, 27308, 27094, 26566, 28395, 37087, 40514, 40664, 34579, 31620, 34610, 42023, 34652, 32413, 26844, 26741, 31536, 41302, 38344, 35636, 37069, 43892, 47004, 43551, 35800, 46215, 48081, 45353, 48373, 42038, 41522, 45215, 47805, 47075, 45481, 40083, 38200, 38949, 40733, 40779, 36685, 44225, 44933, 36161, 40837, 41023, 34119, 35696, 36172, 36454, 42717, 46041, 36909, 36385, 44120, 47247, 44333, 37784, 40019, 33244, 34715, 41633, 47685]
7278D7685k692n100n969n920L946L948N427l944M866K124k138l549L300K884k499
7263D2369P286Q699o599j6368M957P707P017j0309l673n46k741L908p470n00J0761
7248D4498l423N490p1Q669k732n895m075N22L056M5n971Q603k167m984N238l35
7232D6468J54j804K009j73K149J294l353L439j1774j780j361J192N469Q36m392
7217C8373M540j34Q67l392p96k107J550P456k133n364J918l638L950N470L277
7202D9837j0465j728k009J968K055r62p58n022o378O964N902K274n84M590J027
7187D6711r75n766J555Q302O074N903o836k724J058R836l69J236p535l619N949
7172E8800m399L5k498n217R177o534k28J898Q040L206J845j1374P11M260L351
$$ y = [47685, 44993, 39893, 33924, 28004, 31950, 35898, 41325, 37381, 42247, 44371, 42233, 38684, 41984, 44868, 42369, 49655, 58354, 51755, 35387, 40344, 48051, 55068, 44759, 41086, 40540, 37799, 41707, 34237, 33737, 44498, 41075, 46565, 46494, 55163, 52431, 46536, 42461, 42983, 46039, 46084, 40113, 48716, 46549, 41565, 46803, 46468, 46622, 44818, 46827, 46654, 48803, 50097, 46744, 50183, 38409, 36629, 35268, 36460, 41929, 42765, 38373, 42913, 42779, 43646, 40254, 39458, 37351, 38901, 46357, 44224, 38860, 40778, 37140, 41090, 46560, 49837, 39372, 37644, 35635, 37603, 39658, 38696, 37938, 32916, 26538, 33502, 39404, 41678, 41094, 45684, 46711, 45736, 39970, 41525, 49827, 55901, 61804, 54968, 52244, 53302, 63138, 62769, 64005, 56470, 52851, 58800, 54401, 54436, 51938, 46721, 55898, 49364, 49136, 51034, 59074, 62280, 64125, 52751, 53462, 57722, 61073]
7157F1073k681o819J1014K414p854k185J824J7439J0902m665j1268k656P635j3126
7143F1047j778Q570L267k108j140q448J406O081m434P67j0570P636M35j276K995
7128F2450n083k960J346m397M275m66N737l206j942J156K702M949j452p16j122
7113F1271J455Q532r212j657K787O551Q11rL585r58J0010K775K691p984m858O546
7097H2336k722k928O62J1519j151m985J361l370K683N696l919j444J438j322n893
7082G7961j692k179Q52n43K278n024K192M393K988m05l787j25k342n92j84J1827
7066H5618l458p964P771j46N022k28k872k737p103o784N436R33l8k477J57p08
7050G0422N699l415R064M140l973M863k108K827M558r287p449L646O253o174J96
$$ y = [61073, 58392, 51573, 62587, 65001, 57147, 54962, 56786, 74225, 85127, 80462, 69194, 66538, 74173, 61047, 59269, 67839, 71106, 68998, 67858, 59410, 60816, 66897, 62463, 63230, 52660, 60296, 60731, 59455, 62450, 57367, 54407, 55753, 51356, 55631, 55165, 60902, 57696, 55754, 56910, 59612, 64561, 63109, 62393, 61271, 62726, 71258, 62046, 60389, 63176, 69727, 70538, 70529, 74114, 73156, 83166, 85941, 88632, 80648, 75790, 82336, 79614, 76686, 77348, 88867, 87716, 82731, 84092, 80722, 83405, 89101, 85182, 83738, 85176, 83854, 77961, 76269, 74090, 74942, 74399, 76677, 71653, 73845, 78238, 81226, 80821, 77034, 76909, 74567, 73975, 73791, 85618, 82160, 74196, 81967, 81821, 86843, 86615, 83743, 81006, 73903, 67119, 72555, 73488, 73450, 70973, 71130, 70422, 76121, 72706, 81770, 85910, 81937, 86800, 84692, 87519, 92077, 82790, 75341, 78987, 85240, 79066, 79262]
7035G9262P125P189j868r184M296M710L640l081L444o294k410L479M110j1498
7021H2920o77l57M818p30P504N950Q717r071j858J980n67l762L258l937l059K231
7005I3360O82M207l613N250K290j487N857j005J16j235L083r670J867M776R392
6990A13870j056j8j391Q63M289M432k047j1416k227J178l806m048M4k006k538
6975I4123L745R66N198L579O36K296m526r778O60R98p670L727P777o060N836N297
6959A06804K719K158l793o528N931k630P177m259j9n524K80O458O840N802O1l032
6943A18445N104j0432j122L439P991O349l20L439k443K683K610L739M734r30j0932
6928A32354o183P16k411r816P110O168M220m332k381L14Q829r637L558m10p095
$$ y = [79262, 86387, 93576, 91708, 82524, 86820, 91530, 95170, 92089, 95533, 89239, 86829, 90308, 94418, 82920, 82243, 81886, 86704, 85974, 93478, 99428, 108145, 99074, 97216, 99196, 98629, 94867, 98125, 94188, 91129, 93360, 94042, 98249, 94636, 99886, 102176, 100689, 106546, 105541, 105657, 104422, 107505, 97835, 99702, 104478, 113870, 112814, 112796, 111405, 112268, 116557, 120989, 118942, 107526, 105299, 106477, 102671, 98623, 98667, 96661, 94123, 97868, 98834, 104032, 107611, 108247, 110543, 106017, 96239, 96899, 97897, 90227, 93954, 101731, 95671, 101507, 106804, 109523, 111681, 107888, 101360, 107291, 104661, 111838, 107579, 107560, 102036, 102316, 108774, 115614, 121416, 121477, 118445, 123549, 113117, 111995, 115434, 123425, 129774, 129454, 132893, 130450, 133133, 135743, 139482, 144216, 143286, 132354, 126171, 126887, 124476, 114660, 121770, 127938, 132158, 127826, 125445, 125759, 134588, 124951, 128509, 128099, 121004]
6913A21004J490L89K119n11p57K407j163P459K964K064R510q75o475J935M06O038
6897A48004L508O013k964N549l854j139J945j092l789O566l115N278K322J6242
6883A79474J1970O150M246P420N828N546M592K46l952L596n194j811n506O967
6869B19572p190k363L00L035Q989n25j1260L458k232l230J228N912P604n852M633
6854B22079N370Q077J1522P94J0186l088P153O064O416M883J8681O531n15l909
6840C00244J2664P695p049j448M055j176l159K090n446J777J02j631j1978m033
6826B92707p99R439k652K198N359M396P470P711J270P562Q828M583N547N482N118
6811C64219K894P769J3604J3761J1422L433P842R854Q942P616J5547J0200N577
$$ y = [121004, 122494, 122883, 125002, 124491, 123734, 126141, 124978, 132437, 135401, 137465, 146975, 146100, 139625, 141560, 141966, 148004, 151512, 157525, 154561, 160110, 156256, 155117, 157062, 155970, 152181, 158747, 155632, 160910, 163232, 179474, 191444, 197594, 201840, 209260, 215088, 220634, 225226, 225472, 221520, 225116, 219922, 218111, 212605, 219572, 212382, 210019, 210319, 213354, 222343, 221818, 210558, 214016, 211784, 208554, 209782, 215694, 223298, 217446, 222079, 227449, 235526, 247048, 247842, 258028, 254940, 262093, 268157, 274573, 279456, 298137, 304668, 304153, 300244, 312908, 320603, 313554, 312106, 316161, 314985, 311826, 313916, 308470, 310247, 310349, 308718, 296740, 292707, 291908, 301347, 298695, 300893, 306252, 310648, 318118, 325829, 327099, 334661, 343489, 348072, 353619, 359101, 364219, 367113, 374882, 388486, 402247, 413669, 417102, 424944, 434798, 443740, 451356, 466903, 477103, 482680]
6798D82680J012m203p854r240r821r254j1582o218j3055K907j8212j1499p418
6785C78243p445j1229j3692J059J5073L502O389n165L861M983K669k148L727R987
6771C89814K3320P594R898J3505J4769R516O037J1579J2220m948J0133N792M13
6758E09642j1565n845o205K71j179j3997q965j0122j8138j1037j4663k159l212
6745D02826o745p460l014l859O657J0235k458N693J2558L828J0304P403M125j249
6731D38844N488l131k38N377m281j721N489K950J517M417N005M772P552J0703
6717D82743L022n447j0976J800l769r996j2165j0562j030m737q285K956J805o667
6703D18692j208j730m83L311l049k976O67L995o554N505J0232o658J1401J1185
$$ y = [482680, 483692, 479489, 471635, 462395, 452574, 443320, 431738, 425520, 412465, 415372, 397160, 385661, 378243, 370798, 359569, 345877, 346936, 362009, 365511, 371900, 366735, 370596, 375579, 378248, 376100, 379827, 389814, 413134, 420728, 430626, 444131, 458900, 468416, 474453, 486032, 498252, 493304, 503437, 509229, 509642, 498077, 492232, 486027, 486298, 485119, 471122, 462157, 452035, 433897, 422860, 408197, 406038, 402826, 396081, 388621, 385607, 381748, 388405, 398640, 396182, 401875, 414433, 418261, 428565, 435968, 440093, 438844, 444332, 441201, 440963, 446340, 442059, 440338, 445827, 448777, 450294, 454711, 459716, 464488, 472040, 482743, 485765, 480318, 469342, 471142, 467373, 457377, 445212, 434650, 433620, 428883, 420598, 423554, 425359, 418692, 417484, 415754, 415271, 418582, 415533, 412557, 413224, 417219, 410665, 416170, 426402, 419744, 431145, 442330]
6689D42330m22R451Q583R027J0955J1621J2816Q599O484J1314Q651N943N255Q189
6675E58796N884K675j991K581n259l316q963K1l236l156j4505k558p296m863n027
6660E09787r819j0514N441m187J0647K040J2945O522O357m200Q511R874J4879
6647E58283J366Q494k981K513O048Q456q627m282M615R796m046k952m143j669
6633E70871O717J8628R384O049Q870J6294Q158O887R036J6798J6430M210J390
6620F99722K46j968L322n87q647j1584r093K620J6447L090J1075J2773J6849M493
6606G38758L549k206k100o668J0626L5282N8713N4486M0943K8790K6198J9230
6594A005601K0242J1299O050J2987Q346J2270J9617K4189J5902J5420J675r685
$$ y = [442330, 441908, 451359, 459942, 468969, 479924, 491545, 504361, 512960, 519444, 530758, 539409, 545352, 550607, 558796, 564680, 567355, 565364, 567945, 562686, 559370, 550407, 550428, 547192, 544036, 529531, 526973, 519677, 514814, 509787, 499968, 489454, 494895, 490708, 501355, 503395, 516340, 522862, 529219, 525019, 533530, 543404, 558283, 559649, 568143, 565162, 567675, 573723, 582179, 573552, 569270, 573885, 583681, 579635, 576683, 572540, 570871, 577588, 596216, 605600, 611649, 620519, 636813, 644971, 651858, 660894, 677692, 694122, 698332, 699722, 699968, 698000, 701322, 700735, 692088, 680504, 671411, 674031, 690478, 693568, 704643, 717416, 734265, 738758, 742307, 740101, 738001, 731333, 741959, 777241, 835954, 890440, 931383, 960173, 986371, 1005601, 1025843, 1037142, 1043192, 1056179, 1064525, 1076795, 1096412, 1120601, 1136503, 1151923, 1153598, 1143913]
6582A143913j84O517J8400J6299J1755J8003J5690J0546J0535J1961j4079n969
6570A243387j4768j0648k8257l5220m9298n3427l7458l332J4331N7527O8072O5490
6558A216399P2357R0133J08193J32553J04132O0305K391l4310l3329l392K1010
6547A736442M4269N6007M8668K1790J3176J0075K1565J3803L0484K1042K7905
6536B045226O903J1629k071K5671O481J30o155J2218J9403K9431J6523M3359K6354
6523B235102L1281L0191M2277L1761M0295L4055M3655M2868M0465M5784N5674
6512B673408M6877N7959M2621M7499K9964L6492J3664K3110K3251L8917K4223
6501C057985L2244L5783M5112M6953O9185N5739Q4415J02898J22419J35669J22126
$$ y = [1143913, 1143729, 1150246, 1168646, 1184945, 1196700, 1214703, 1230393, 1240939, 1251474, 1263435, 1249356, 1243387, 1228619, 1217971, 1189714, 1154494, 1105196, 1051769, 1014311, 1010979, 1025310, 1082837, 1150909, 1216399, 1288756, 1378889, 1487082, 1619635, 1723767, 1784072, 1786463, 1752153, 1718824, 1715432, 1736442, 1780711, 1836718, 1885386, 1907176, 1920352, 1930427, 1951992, 1965795, 1996279, 2017321, 2045226, 2052129, 2063758, 2061687, 2087358, 2093839, 2093969, 2087814, 2100032, 2119435, 2148866, 2165389, 2208748, 2235102, 2266383, 2296574, 2338851, 2370612, 2410907, 2444962, 2488617, 2531485, 2571950, 2617734, 2673408, 2720285, 2778244, 2820865, 2868364, 2898328, 2934820, 2948484, 2971594, 2994845, 3033762, 3057985, 3090229, 3126012, 3171124, 3218077, 3287262, 3343001, 3427416, 3530314, 3652733, 3788402, 3910528]
6490C910528J12151J02292Q9000P4523O7526Q1028P3843P4973O1386P1041Q6369
6479D804660R7513R6529J03017J34412J51086J69364J81686J83979J90996J83998
6469F297240J80035J78351J78166J84290K04224J98181J76892J91500J96201K24525
6459H209605K20934K14688K15665K33628K31398K38713K35054K56485K64126K74465
6449A0594761K96761L35515L56938M01542L93559M14212M08899M53762M78633
6440A4134582M99353N17754N45005M84929M52011L92381L77855L13688L62003
6431A8079561L91781M77128M75879N46033N70029O81854P13052P47106P15439
6422B3397862P63258P64110Q27867Q32273Q96230R30821J025824J076382J207136
$$ y = [3910528, 4022679, 4124971, 4213971, 4288494, 4356020, 4437048, 4510891, 4585864, 4647250, 4718291, 4804660, 4902173, 4998702, 5101719, 5236131, 5387217, 5556581, 5738267, 5922246, 6113242, 6297240, 6477275, 6655626, 6833792, 7018082, 7222306, 7420487, 7597379, 7788879, 7985080, 8209605, 8430539, 8645227, 8860892, 9094520, 9325918, 9564631, 9799685, 10056170, 10320296, 10594761, 10891522, 11227037, 11583975, 11985517, 12379076, 12793288, 13202187, 13655949, 14134582, 14633935, 15151689, 15696694, 16181623, 16633634, 17026015, 17403870, 17717558, 18079561, 18471342, 18948470, 19424349, 19970382, 20540411, 21222265, 21935317, 22682423, 23397862, 24161120, 24925230, 25753097, 26585370, 27481600, 28412421, 29438245, 30514627, 31721763]
6413C1721763J259118J379846J433808J619813J771990J997182K125537K296652
6405D5605709K361329K606150K756925L065604L266116L636556L865200M194005
6397G1357594M523242N121160N768749O938423Q247221J0107744J2347262J5234594
6389A39645989J8697173K3617729L0191630L8382868M8912960N7748181N4802323
6382D11998853M5996459J149026n8528840p0989222o1724996m8431608l6979660
6375A82490012k7663548k0695122j5905109j2742561j0327920q607830p339961
6368G9207961o315384n486171m848884m233074l625290l162562k847274k562310
6360D6127012k313832k115762j934985j826751j728432j746444j639229j518787
$$ y = [31721763, 32980881, 34360727, 35794535, 37414348, 39186338, 41183520, 43309057, 45605709, 47967038, 50573188, 53330113, 56395717, 59661833, 63298389, 67163589, 71357594, 75880836, 81001996, 86770745, 93709168, 101956389, 112064133, 124411395, 139645989, 158343162, 181960891, 212152521, 250535389, 299448349, 357196530, 411998853, 457995312, 459144338, 400615498, 329626276, 267901280, 219469672, 182490012, 154826464, 134131342, 118226233, 105483672, 95155752, 86547922, 79207961, 72892577, 67406406, 62557522, 58324448, 54699158, 51536596, 48689322, 46127012, 43813180, 41697418, 39762433, 37935682, 36207250, 34460806, 32821577, 31302790]
6352C1302790j440055j376410j188907j066060r78738r48340q90060q49996p54945
6343B1809279p13587o29608o03033n60644n70352n32462n49781n19240n18620
6334A6611952m82105m84834m30882m24852l72377l72565l17545l07117k79524
6325A3140151l02858k82009l08604k89590k98314k73809k87101k72514k69934
6316A0555418k52759k67044k23606k18524k58704l67381l31716l25544k77492
6307H032648k80669k40592k43611k04335j88200j40785j49283j23397j45236j25065
6297F191475j35515j21479j36269j22267j21683q3778j05097p2878p9795o9342
6287E143372r3912q8586j15620j06872j15761j07016j23717j08015j19071q1237
$$ y = [31302790, 29862735, 28486325, 27297418, 26231358, 25252620, 24304280, 23414220, 22564224, 21809279, 21095692, 20466084, 19863051, 19302407, 18732055, 18199593, 17649812, 17130572, 16611952, 16129847, 15645013, 15214131, 14789279, 14416902, 14044337, 13726792, 13419675, 13140151, 12837293, 12555284, 12246680, 11957090, 11658776, 11384967, 11097866, 10825352, 10555418, 10302659, 10035615, 9812009, 9593485, 9334781, 8967400, 8635684, 8310140, 8032648, 7751979, 7511387, 7267776, 7063441, 6875241, 6734456, 6585173, 6461776, 6316540, 6191475, 6055960, 5934481, 5798212, 5675945, 5554262, 5470484, 5365387, 5292509, 5212714, 5143372, 5049460, 4960874, 4845254, 4738382, 4622621, 4515605, 4391888, 4283873, 4164802, 4083565]
6277D083565r6786p8310q2716n8057o6871l5704k3406j1871j6981k6141m4788
6266C541934m8007o6745o3712p2670o4602p0800n4453n6507m2005m1645p2169
6255B888619r0500q3203o4761m0570m1652l1824l9337l7162k4883l7465l1219
6244B366043l3673k6938l5106k8234l6846l6270l8237k9352k9032m1080m0623
6233A990652m5717n6793n1827m1841k4682m4356m2556k5253k9721k3899j0309
6222A593698k4507j7169k1378k5944k0159J6669K0229J7809l4388m8069o9213
6211A387578m7086l0374L5335P0760R3647P9253M7842K3699J0982R104J3763j6523
6199A677980m7690q6015r7629q5349n1123n8757m9965l7143k4711l3698j9457
$$ y = [4083565, 3986779, 3908469, 3825753, 3767696, 3700825, 3665121, 3641715, 3629844, 3612863, 3586722, 3541934, 3493927, 3427182, 3363470, 3290800, 3226198, 3155398, 3100945, 3044438, 3002433, 2960788, 2888619, 2798119, 2714916, 2650155, 2609585, 2567933, 2536109, 2496772, 2459610, 2434727, 2397262, 2366043, 2332370, 2305432, 2270326, 2242092, 2205246, 2168976, 2130739, 2101387, 2072355, 2031275, 1990652, 1944935, 1888142, 1836315, 1794474, 1769792, 1725436, 1682880, 1657627, 1627906, 1604007, 1593698, 1569191, 1552022, 1530644, 1504700, 1484541, 1501210, 1521439, 1539248, 1504860, 1456791, 1387578, 1340492, 1310118, 1345453, 1416213, 1509860, 1589113, 1636955, 1660654, 1671636, 1680740, 1694503, 1677980, 1630290, 1544275, 1446646, 1361297, 1310174, 1251417, 1201452, 1164309, 1139598, 1105900, 1086443]
6188A086443j2658k004k0069L167j7085l546l813l265j5133k3195k1963J0569
6176I77448J341J8371K959J1481J678o610p778l045k705J4888J0611K6325L5278
6163A080242L1888K5659J7467j1457k2605j7643j6772j4211m44j750j449l334
6151A065591o728j6024j3495j5309k0530j3367k1030k3207o832k175n18l456J3951
6138I36871J7053K5573J3181R031J9564L1073K4054K4692J7869K037Q261L881
6126A133140n428j4548k0568j6449j5192j9781l2019k8055l5577k7342j5576l4514
6114H68091j2448k3141j9844j9033j0966j4988j4676j7115j1739j9817q661j4384
6102F81279r757j5385k2963j1261j8118j6434j7441j1330l657j6355j014n749
$$ y = [1086443, 1073785, 1071781, 1051712, 1054879, 1037794, 1034248, 1030435, 1027170, 1012037, 988842, 966879, 977448, 978789, 997160, 1000119, 1011600, 1013278, 1006668, 998890, 995845, 993140, 1008028, 1018639, 1044964, 1080242, 1112130, 1137789, 1155256, 1143799, 1121194, 1103551, 1086779, 1072568, 1072124, 1070374, 1068925, 1065591, 1058863, 1042839, 1029344, 1014035, 993505, 980138, 959108, 935901, 929069, 926894, 926376, 922920, 936871, 953924, 979497, 992678, 1001709, 1021273, 1052346, 1076400, 1101092, 1118961, 1120998, 1129259, 1133140, 1127712, 1113164, 1092596, 1076147, 1060955, 1041174, 1009155, 981100, 945523, 918181, 902605, 868091, 855643, 832502, 812658, 793625, 782659, 767671, 752995, 735880, 724141, 704324, 695663, 681279, 671522, 656137, 633174, 621913, 603795, 587361, 569920, 558590, 554933, 538578, 537564, 531815]
6090E31815R65L1R702L701P600m935L393J1503N532n115J1787k44J2233J9063
6076F07031J6537J9078K4957J3298J5411K5094L2507K1035L7698L4818K9839K7971
6064I05274M1878K1647J2324J7816J2624K758j1609j2372j5821k1651l5910l8327
6052H78631l9413m3960m3775l6244l4079k7396k0805l9050j2235k3486j6929k3160
6040E18099k4545l0662j2698k0820k0883k5767j5477q530o516k938m508o841o521
6027C31393j31L394p504o448K550K339L911K753J060k091n700m85r631k689j069
6012C11652j943r0L785P567j2275l75M902q457p584j63j0402o728o918K25j350
5997B71846o795k649K644p705M225J760q702N271M617p060l19o455j688K319N978
$$ y = [531815, 532780, 532811, 542513, 546214, 553814, 548879, 552272, 563775, 569307, 564192, 575979, 575735, 587968, 607031, 623568, 642646, 667603, 680901, 696312, 721406, 753913, 774948, 812646, 847464, 877303, 905274, 947152, 968799, 981123, 998939, 1011563, 1014321, 1002712, 990340, 974519, 952868, 916958, 878631, 839218, 795258, 751483, 715239, 681160, 653764, 632959, 593909, 581674, 558188, 541259, 518099, 493554, 462892, 450194, 429374, 408491, 382724, 367247, 358717, 352201, 349263, 344755, 337914, 331393, 331262, 334656, 327152, 320704, 323254, 325593, 329504, 332257, 333317, 331226, 325526, 325041, 315410, 312721, 311652, 309709, 309619, 313404, 320971, 308696, 308321, 313223, 304766, 297182, 297019, 286617, 279889, 272971, 273196, 271846, 265051, 262402, 265046, 257341, 261566, 263326, 254624, 259895, 264512, 257452, 257133, 250678, 248990, 251309, 257287]
5982B57287O544M054N378l848n384O322o227m386j3435Q061R94n903J933Q196
5968B59586J129k117k480M892m883O353k338k095o787k170K174o338o502m395
5954B34029m980L217J77m147N897J310J857M747O911O074l643N295J2835J3487
5940B83066Q476Q837N775J5745J7506M670k187J1380K202P090N010J2628Q079
5927C88277j363L917L893p97J5376O249M435J660n32M090P283L685O21m239R383
5912D41938J808Q78N140N140n812O229L672n34o247Q25J4950J439N136R923P836
5897D92321R245O149O830M670N433J9347J0864j264O083J4378O330O163J714O897
5883E95160o356L196L916N12j319J037j0991N9J763L174q409j379l854r74m563
$$ y = [257287, 263831, 267885, 273263, 269415, 264031, 270353, 264126, 259740, 246305, 254366, 255360, 249457, 251390, 259586, 260715, 258598, 256118, 261010, 256127, 262480, 260142, 258047, 251260, 249090, 251264, 244926, 238424, 234029, 229049, 232266, 232443, 228296, 234193, 235503, 237360, 242107, 249018, 255092, 251449, 256744, 269579, 283066, 291542, 300379, 306154, 321899, 339405, 344075, 341888, 353268, 355470, 362560, 367570, 380198, 388277, 386914, 390831, 394724, 393927, 409303, 415552, 419987, 421647, 421115, 425205, 432488, 436173, 436794, 432555, 441938, 443746, 444624, 449764, 454904, 449092, 455321, 458993, 458459, 452212, 453037, 467987, 469426, 474562, 484485, 492321, 501566, 507715, 514545, 519215, 524648, 543995, 554859, 553595, 559678, 574056, 580386, 586549, 588263, 595160, 588804, 592000, 595916, 596428, 595109, 596146, 585155, 585214, 586977, 590151, 581742, 580363, 576509, 575535, 570972]
5868E70972R54J560m553m525l299J544M519Q790O331O37j119J602M047m776P99
5853E83483M77k796K723j2340j1835p428j6214j2624j0057j1084j2230p344l077
5840D79654J27q912l852K152j1373k015j71N147K111p512L028k007k824L895P992
5825D65440Q215J2601P520J2558O876R816J1510P141J3236K1648J5191J6106J3904
5812F21762K5959K0166K1635K4507K3681K1310K5562J1987K06L581n263q600q392
5799G78101j3999k2279k1708k4228l1872l2888k4894l4800l0858k8036l1488k2286
5787D58765k5673k6947j0782k3681j8076j2564k3777k0447j4490l912q183p653
5775B62580k411l227j4297Q87n02k32o599o280J314R16p944p060K723K604J1825
$$ y = [570972, 571926, 573486, 568933, 564408, 561109, 562653, 567172, 575962, 582293, 582930, 581811, 583413, 587460, 582684, 583483, 583960, 581164, 583887, 571547, 559712, 552284, 536070, 523446, 513389, 502305, 490075, 482731, 479654, 479781, 470869, 467017, 469169, 457796, 455781, 455610, 460757, 462868, 455356, 458384, 456377, 453553, 457448, 465440, 473655, 486256, 493776, 506334, 513210, 523026, 534536, 541677, 554913, 576561, 591752, 607858, 621762, 647721, 667887, 689522, 714029, 737710, 759020, 784582, 796569, 796775, 800356, 795093, 786493, 778101, 764102, 741823, 720115, 695887, 664015, 631127, 606233, 571433, 540575, 512539, 481051, 458765, 433092, 406145, 395363, 371682, 353606, 341042, 317265, 296818, 282328, 278416, 270233, 262580, 260169, 256942, 242645, 243532, 243030, 242798, 236199, 229919, 231233, 232149, 224205, 217145, 219868, 222472, 234297]
5760B34297j462j298R603j81Q38P386J4443J3749J2119O011J7284J8423J4813
5747C46025J4440K1367K1736J6808J0771J2570J4068J7710J2559J0874J696K974
5735E03598K42q956j2433j6888k0441j4918j0041k0876j6808j4107j7129k1897
5723C29346j9018j4526j1155j6494j2114j0895j2791o560k086o192n499j5085
5711A96931j33m265j2270j4508k815p079n723p132L302n946j1610o943k378R68
5697A20399O955q923K037r039q737l937M134k085J405l25j449M301l014m302j248
5682I6172J590n260k992k119o432O94l362L315n498o345K558k072n645N209r98
5667F8815O692P99m471n937K800k900L261Q229L619p988K265k382K537M247r196
$$ y = [234297, 232835, 231537, 241140, 240959, 241797, 249183, 263626, 277375, 289494, 295505, 312789, 331212, 346025, 360465, 381832, 403568, 420376, 431147, 443717, 457785, 475495, 488054, 498928, 500624, 503598, 503840, 494884, 482451, 465563, 445122, 430204, 420163, 399287, 382479, 368372, 351243, 329346, 310328, 295802, 284647, 268153, 256039, 245144, 232353, 225793, 223707, 217515, 212016, 196931, 196798, 192533, 180263, 165755, 162940, 155861, 150138, 143006, 146308, 140362, 128752, 121809, 119431, 120399, 127354, 118431, 120468, 111429, 102692, 98755, 102889, 100804, 102209, 101884, 100435, 104736, 101722, 97420, 96172, 97762, 92502, 89510, 87391, 80959, 81653, 78291, 81606, 76108, 69763, 72321, 70249, 64604, 69813, 68815, 75507, 76306, 71835, 65898, 68698, 65798, 69059, 77288, 80907, 72919, 75184, 72802, 75339, 79586, 70390]
5652G0390K351o434j139O615K195k914N635M99j843j440j701o91j566L41L996
5637G4294m02m69m999K702r46q244R763N616r052o067o044K229J735M93j038n145
5621E4426k099P152p72k554l870J057l731K953p382m619m576j217K787j433j561
5606C4561M948m36k477J376l156r94K399P996J855j5318R397m299K007M173M575
5591D6607o401k112p49N667J044q641j214J664L099j694p238R88N149M375j793
5576C8751J238q34j0358k741K775l654M399l007R109N019n068j012J181m222j703
5561B9873j279k702O289j446j144J3296j102j968p394o363O027j510J3731j212
5547D3096j1979K709R137k016m666L231J476j781o018m262l227n403Q960R257
$$ y = [70390, 72741, 66307, 65168, 71783, 73978, 71064, 76699, 77198, 75355, 73915, 72214, 71523, 69957, 70298, 74294, 73892, 73423, 68424, 71126, 70180, 61936, 71699, 77315, 68263, 62196, 56152, 58381, 60116, 60609, 59571, 54426, 52327, 59479, 58707, 56153, 52283, 53340, 49609, 52562, 45180, 40561, 35985, 34768, 37555, 36122, 34561, 39509, 39073, 36596, 37972, 34816, 33822, 36221, 44217, 46072, 30754, 40151, 35852, 37859, 42032, 46607, 40206, 38094, 37345, 43012, 44056, 35415, 34201, 35865, 38964, 37270, 30032, 31020, 36169, 40544, 38751, 39989, 39155, 28797, 26056, 28831, 25177, 29576, 26569, 35678, 40697, 35629, 34617, 35798, 31576, 29873, 28594, 25892, 32181, 30735, 29591, 42887, 41785, 39817, 32423, 26060, 32087, 30577, 44308, 43096, 31117, 33826, 42963, 40947, 36281, 39512, 40988, 39207, 33189, 28927, 25700, 20297, 29257, 38514]
5533C8514O969m611q735k183O899m243k409O70m274J432M105N164j83n190N307
5518C7232p16j535J118L345J152r855J712Q899j796q490N333M419N041K620k869
5503D5610L179M736k218o672N925P034j203P173J25j748K214J020M045N828M048
5488G9096k431l710j060P404l333N017J013k19P805L673j528L448L009M213K356
5473A04753O874k937J1191Q910J469K070J3029R302J0466J4072J836l81N083J3444
5459A99181J1277Q973L278q851Q421N738K505N288M577J973M789l097P307Q416
5445B59775J6991J2048R278J6121J1093K603J0543L738M225j956J355j315p467
5432C37032m864J261p306j1668o304n80q01k703N098n233K344L383k480K116P477
$$ y = [38514, 45483, 40872, 32137, 29954, 36853, 32610, 30201, 30871, 26597, 28029, 32134, 37298, 37115, 31925, 37232, 36516, 34981, 36099, 39444, 40596, 30741, 32453, 41352, 39556, 31066, 36399, 40818, 45859, 48479, 45610, 48789, 53525, 51307, 44635, 50560, 57594, 56391, 63564, 63689, 61941, 64155, 65175, 69220, 75048, 79096, 76665, 72955, 71895, 79299, 75966, 80983, 81996, 81777, 89582, 93255, 91727, 95175, 98184, 102397, 104753, 111627, 108690, 119881, 128791, 130260, 132330, 145359, 154661, 165127, 179199, 181035, 180654, 185737, 199181, 210458, 219431, 222709, 213858, 222279, 228017, 230522, 235810, 240387, 242360, 247149, 244052, 251359, 259775, 276766, 288814, 298092, 314213, 325306, 327909, 338452, 342190, 346415, 344459, 345814, 344499, 337032, 332168, 333429, 326123, 314455, 308151, 307571, 306770, 304067, 309165, 303932, 306276, 309659, 307179, 309295, 316772]
5417C16772P621K302r730Q720K606M960j8k182q145M125L682P890J4758O163r528
5402C49996J65Q561L033Q16P808n498l964k414L981L884K345J2825Q951R151J6485
5387D16125O956L858P327L669Q829M190k171K264n210n771r373j1806p539j0853
5373D00495m242j2608p418q933r645j1106n693o616o30j3185n744L687l147j1902
5359C03313j2036j7310r235q569j2731p243j3566j7350j6121j3112l255p526j3736
5346A51523J791j8947j3447J455k671j2560m390l311o704n698r77J960r38n616
5332H1470o043p596L565k867j38k51p607l406M395k017l330l701J1926j799p765
5317E4836j594Q05q468P920k512K383o60J750m749n237J965P288K128j0775j331
$$ y = [316772, 324393, 326695, 316965, 325685, 328291, 333251, 333233, 331051, 322906, 327031, 330713, 338603, 353361, 359524, 349996, 350161, 358722, 361755, 362571, 370379, 364881, 360917, 358503, 362484, 366368, 368713, 381538, 390489, 399640, 416125, 423081, 426939, 434266, 437935, 446764, 450954, 448783, 451047, 445837, 440066, 430693, 418887, 411348, 400495, 396253, 383645, 376227, 367294, 357649, 346543, 340850, 334234, 333604, 320419, 314675, 318362, 315215, 303313, 291277, 273967, 264732, 256163, 243432, 236189, 222623, 205273, 189152, 176040, 172785, 165259, 151523, 153314, 134367, 120920, 122375, 119704, 107144, 102754, 99443, 92739, 87041, 86064, 88024, 87086, 81470, 75427, 67831, 71396, 68529, 68391, 68140, 60533, 57127, 61522, 59505, 56175, 52474, 64400, 62601, 54836, 53242, 54047, 45579, 53499, 50987, 53370, 52710, 54460, 49711, 44474, 46439, 53727, 55855, 45080, 43749]
5302D3749p6n565N164m43j327Q619q063q892J1279r366j381N609j637K095R44
5287D0709L141j0676k787m815J0794R20k756J978J559N428j991M321m991n170
5273C5664j547k165R503r76m396J418L43M80l30L176M229N56j078P91O494l820
5257D8342l527n12K816m739R627n36L8N45O453o065j033K388j65k316N204M214
5241F0734o013k164r94L748O446L50K101R45K712p030l43M632J817M61M058M2
5225G1502m88O017M153j275J077m879J0011j115M03j511N675P60O366M605N223
5210A06524L388M966R76l422P151R777N091R867L757R486J6679Q252M526J3537
5196B00555m385L059J4934J130L145N691k566M968k769l148k354j3725J922Q948
$$ y = [43749, 43673, 38108, 43272, 42829, 41502, 50121, 42058, 33166, 44445, 35079, 33698, 39307, 37670, 39765, 40709, 43850, 33174, 30387, 25572, 36366, 37286, 34530, 36508, 38067, 43495, 41504, 45825, 40834, 35664, 34117, 31952, 41455, 40479, 36083, 37501, 37844, 38324, 37994, 41170, 45399, 45955, 44877, 45668, 52162, 48342, 44815, 44303, 47119, 42380, 52007, 51471, 51509, 52054, 58507, 52442, 51409, 53797, 53632, 51316, 56520, 60734, 54721, 52557, 51563, 55311, 61757, 62107, 64208, 65153, 67865, 60835, 60492, 65124, 66941, 67402, 71460, 71502, 71014, 77031, 81184, 79909, 80986, 76107, 86118, 85003, 85406, 83895, 89570, 90330, 96696, 101301, 106524, 109912, 114878, 115854, 112432, 119583, 129360, 134451, 144318, 148075, 157561, 174240, 182492, 187018, 200555, 196170, 199229, 214163, 215293, 218438, 224129, 221563, 226531, 223762, 220614, 218260, 204535, 206457, 215405]
5182B15405L412J008K015j991L065L171Q246L371J1497N274Q975J0890J6713O149
5168B97200K4833J4499J978Q510J8005K149K948O482R486J0965q093l182N765
5155C91545n80m053j0731n089o977k363m422j870j0490j318o748n904P659L278
5141C41937M604j21j478Q986J290J40N78L639p425K896N611R049l748j769J6672
5126C80861K397j449q12k214j1504J107K439j6833p713o033n841q48j113o230
5112C26214l882n004r88R39k720N50m259K538o61p665j22n363N945l346L75k831
5096B99720l091p299o414n198p501o891j4547r892l10r969n844l572p927M403
5082B15668r599m373P688Q111m049J431j23P625P637o38Q767J0048m691m107n794
$$ y = [215405, 218817, 219825, 221840, 219849, 222914, 226085, 234331, 237702, 249199, 254473, 263448, 274338, 291051, 297200, 322033, 336532, 338510, 347020, 365025, 367174, 370122, 376604, 386090, 397055, 388962, 385780, 391545, 390965, 386912, 376181, 371092, 364115, 361752, 357330, 355460, 344970, 343652, 336904, 331000, 338659, 341937, 346541, 346420, 344942, 353928, 355218, 355358, 355936, 359575, 352150, 355046, 360657, 369706, 365958, 364189, 380861, 383258, 381809, 380997, 378783, 367279, 368386, 370825, 353992, 346279, 340246, 334405, 333557, 332444, 326214, 322332, 317328, 316340, 317279, 314559, 315109, 310850, 313388, 312727, 305062, 304940, 299577, 305522, 302176, 302551, 299720, 296629, 289330, 282916, 277718, 270217, 263326, 248779, 238887, 238577, 228608, 222764, 219192, 211265, 215668, 206069, 201696, 209384, 217495, 213446, 214877, 214754, 222379, 230016, 229378, 238145, 248193, 243502, 239395, 233601]
5067B33601j817m305p976n195q531l103l203q362r296p648j6171m738M747k0791
5053A37212n184J0863m296r639m163q375l886k43o32k015m522K869J98q80q62
5038A06445q994J762K527q895N275P600M15r022K53P307l968k781K729l91j215
5023I9047j758n890P397l094N652l364N370n642k915m210Q07J2379j928J944m162
5008I9633L833K343j334J7431p977l330N507N075J743m666L434J0597n518n100
4994A21671O156k018R192k292J400L640j798O417L696K880k640M682J515OK837
4979A55344J279k630l129O30q46N071l565j324Q353n894n252j9J1337N820K830
4964A68005o001O710M392M434m709l158j060l59N319n921L396j471N67K562J472
$$ y = [233601, 231784, 227479, 219503, 214308, 205777, 202674, 199471, 191109, 181813, 174165, 157994, 153256, 158003, 137212, 132028, 142891, 138595, 128956, 124793, 116418, 112532, 112289, 111657, 109642, 105120, 107989, 108187, 107307, 106445, 97451, 99213, 101740, 92845, 98120, 105720, 106135, 97113, 97366, 104673, 100705, 97924, 100653, 100262, 99047, 97289, 91399, 98796, 95702, 101354, 97990, 103360, 97718, 94803, 90593, 91400, 103779, 101851, 103795, 99633, 103466, 105809, 104475, 121906, 113929, 110599, 116106, 121181, 122924, 118258, 121692, 132289, 126771, 121671, 127827, 125809, 135001, 132709, 134109, 137749, 135951, 142368, 146064, 148944, 146304, 150986, 152501, 152507, 155344, 156623, 153993, 150864, 151494, 150648, 155719, 152154, 150830, 159183, 153289, 148037, 148018, 159355, 165175, 168005, 162004, 168714, 173106, 177540, 172831, 169673, 168613, 168254, 173573, 167652, 171048, 169577, 170144, 172706, 174178]
4949A74178J427N897j55J764p570J737J420n153q389J0847K702k885R357k267
4935A82910P186R533j364n22R254L053N740O245P684R046O30p17J3548J3660J5519
4920B81405N441l4J8425P568j005O762J4748J4727J2605j179M296q8O953K598
4906C73222J044J541J5851J740L697J811N002n60N128O500k223K639O904N942
4892D28238J6264J5149L303J2052J3384J8768J2322J8847J6495J1038J1612J2613
4880E90085K0526J9509J0439J6809K3266R908J5592P207P503O831J5500J6296
4868G59471J2003L178O523k96P675M579Q105O901J856J4223O953J1900J0634L863
4854H57568J3420M843J5126O612m107J3271J3600K81j370M013k908l258n305L939
$$ y = [174178, 175605, 181502, 181347, 183111, 175541, 177278, 178698, 173545, 165156, 176003, 178705, 175820, 185177, 182910, 190096, 199629, 198265, 197743, 206997, 210050, 215790, 222035, 229719, 238765, 239395, 238678, 252226, 265886, 281405, 286846, 286812, 305237, 312805, 311800, 318562, 333310, 348037, 360642, 359463, 363759, 363671, 370624, 373222, 374266, 375807, 391658, 393398, 397095, 398906, 403908, 403348, 408476, 414976, 412753, 415392, 422296, 428238, 444502, 459651, 462954, 475006, 488390, 507158, 519480, 538327, 554822, 565860, 577472, 590085, 610611, 630120, 640559, 657368, 680634, 690542, 706134, 713341, 720844, 727675, 743175, 759471, 771474, 774652, 781175, 780879, 788554, 793133, 801238, 808139, 809995, 824218, 831171, 843071, 853705, 857568, 870988, 875831, 890957, 897569, 893462, 906733, 920333, 920614, 919244, 923257, 920349, 917091, 911786, 915725]
4840I15725j2201k1400p397r914j0058K596r479k5569k9328o96j8286j3948j4037
4827G46008k2699r066o959j3623j2327j2836j7682j0785j2400k1408j9145k278
4815E84800o736j8195n755j5867j7805q505r048m738j2135j2160r473j0167j2742
4802D41474o618j1096o728q22q642q219n822l407o721J882j0887j586j261O946
4788C78493r406q491K526K802P79R019M664M968N54M455J717N342K657J2114J4566
4773D26759J0427J6325J2369J1813J2469J5014K5851J7800J2827J0963j1687p491
4761E53439j8557k0236p400n836k336q483m114J898J966R31K853p67l70L94J5195
4746E08577J9166N129J2646P861P961Q720J6462J7088J7807K2944K1114J5804
$$ y = [915725, 903524, 882124, 874727, 864813, 854755, 857351, 847872, 822303, 792975, 792279, 773993, 760045, 746008, 723309, 714243, 707284, 693661, 681334, 668498, 650816, 640031, 627631, 606223, 587078, 584800, 578064, 559869, 554114, 538247, 520442, 511937, 502889, 498151, 486016, 473856, 464383, 454216, 441474, 434856, 423760, 417032, 416210, 407568, 399349, 393527, 390120, 383399, 385281, 374394, 372808, 371547, 378493, 369087, 360596, 363122, 365924, 366703, 375722, 380386, 385354, 385908, 390363, 392080, 397422, 400079, 412193, 426759, 437186, 453511, 465880, 477693, 490162, 505176, 531027, 548827, 561654, 572617, 560930, 553439, 534882, 514646, 507246, 501410, 499074, 490591, 486477, 488375, 490341, 491272, 494125, 493358, 492988, 493382, 508577, 527743, 532872, 545518, 553379, 561340, 570060, 586522, 603610, 621417, 644361, 665475, 681279]
4734F81279L2374K2767K1962L2849L6600L7130M2831N6630M8687M1653N2055P2553
4722A179370P3542R7279J00903J07130J36033J39252J74897K08821K25696K58715
4712B701638L03550L12643L00042K76259K01389R2955k3574j05139j51560k01087
4702C707116k44788k90976l01480k88906k59186k38397k03443j80314j42533j31931
4692A425162j14938r9299q3717p7423p3482n1571n0439m7377m6279m4348l5033
4681G01256l2494k9726k8374k7551k8239k4458l2965k1507j5967k1605k2243j5016
4669D01111j1669j9979l41j5832k0893r622m778r470k3297j2250p71p989r991
4656B54229k388o249j0092n037j839m011r106l542r08J355l224q595n43o068p661
$$ y = [681279, 713653, 736420, 758382, 791231, 827831, 864961, 907792, 964422, 1013109, 1054762, 1106817, 1179370, 1252912, 1350191, 1451094, 1558224, 1694257, 1833509, 2008406, 2217227, 2442923, 2701638, 3005188, 3317831, 3617873, 3894132, 4095521, 4188476, 4164902, 4059763, 3908203, 3707116, 3462328, 3171352, 2869872, 2580966, 2321780, 2083383, 1879940, 1699626, 1557093, 1425162, 1310224, 1210925, 1127208, 1049785, 976303, 924732, 874293, 826916, 780637, 736289, 701256, 668762, 639036, 610662, 583111, 554872, 530414, 497449, 475942, 459975, 438370, 416127, 401111, 389442, 369463, 369122, 353290, 332397, 322775, 317997, 308527, 285230, 272980, 272209, 264220, 254229, 251841, 245592, 235500, 230463, 228624, 224613, 215507, 211965, 211057, 212412, 209188, 200593, 200050, 193982, 186321]
4641A86321L2k770l5m057j2783n317n786J00J091k873j332p536q643m867l817
4626A27728K623q763j2218Q87o832k205l506K179k668j1748O110o40J311m400
4612H7858K01m402J13Q57o568n582n748l585j044l806N321L533p724K288r224
4597E2488O71j740J4848P974n127k369m674j0588j482j921M693O09q49j829m272
4582D6432o882J139l50N940k159J196O875L046j2178O55P46o684N030N684K04
4567D8694l673m475l939Q33o48O79n948J3027p545q821P424k75j2050k475Q116
4552B8924J135j572J120P306j511j5198R4l649P423K687q64N745m353o956J771
4537B2102m896j277M536j788N337j442l105j141j991J414K242q46j916L886P944
$$ y = [186321, 186353, 183583, 183548, 179491, 166708, 161391, 155605, 155705, 156796, 153923, 152591, 145055, 136412, 131545, 127728, 130351, 121588, 109370, 110257, 103425, 101220, 97714, 99893, 97225, 85477, 91587, 90947, 92258, 87858, 88059, 83657, 83770, 84627, 78059, 72477, 66729, 63144, 62100, 58294, 63615, 67148, 59424, 61712, 52488, 53159, 51419, 66267, 74241, 69114, 66745, 62071, 51483, 50001, 48080, 52773, 53382, 52533, 50704, 46432, 39550, 40689, 40339, 46279, 44120, 45316, 52191, 55237, 43059, 43714, 44460, 37776, 42806, 48490, 48694, 45021, 40546, 36607, 37440, 36792, 37471, 31523, 44550, 37005, 28184, 35608, 35333, 23283, 20808, 28924, 30059, 28487, 29607, 36913, 35402, 20204, 20298, 16649, 24072, 26759, 25895, 31640, 27287, 20331, 22102, 17206, 15929, 20465, 18677, 24014, 22572, 19467, 18326, 16335, 17749, 19991, 19145, 17229, 21115, 29059]
4522B9059n164n812m441P518kn603r74N8R042Q37j33L457j0033n917m4N270j379
4505A5739p919J2293r81k673j740j397m567L646L38l037M850m108m49N216J30
4490A5341j567N800q515l5p9o69J056l47J676O441L60l292q228L505m759m303
4474B385L623L518Q240k295o81j060j384L16N739K511j174Q1q105j760J1O307
4458A6272o923p555N830J793N788j886j0353j19P265n810n765M306N886o80J658
4443I707l821q9o197Q398K933K166k543J838p00Q94J990q882Q947j909j421N202
4427A6513o393j522m092L732o82j226p76J941R415M50j722r447L194L465N973
4412A8823o142m937J0954m817P643j928k503L758L394K083l331j465J265n124
$$ y = [29059, 23895, 18083, 13642, 21160, 21158, 15555, 14581, 14639, 23681, 24518, 24385, 27842, 17809, 11892, 11848, 17118, 15739, 7820, 20113, 19132, 16459, 14719, 13322, 8755, 12401, 12739, 9702, 14552, 10444, 9995, 15211, 15341, 13774, 19574, 11059, 11024, 10945, 10276, 11332, 10985, 12661, 19102, 19462, 16170, 7942, 11447, 6688, 2385, 6008, 9526, 17766, 15471, 14790, 13730, 12346, 12662, 18401, 20912, 19738, 19819, 11714, 9954, 9965, 16272, 9349, 1794, 7624, 9417, 15205, 13319, 2966, 2847, 10112, 4302, -1463, 2843, 8729, 8049, 9707, 5886, 5797, -400, 7998, 10931, 13097, 10554, 12392, 11692, 12586, 14576, 5694, 14641, 12732, 11311, 16513, 10120, 8598, 4506, 8238, 7556, 6330, 5554, 7495, 16910, 17360, 15638, 6191, 9385, 12850, 18823, 12681, 7744, 18698, 13881, 21524, 19596, 17093, 20851, 24245, 26328, 22997, 21532, 22797, 17673]
4398A7673K45L046K950L898N637P740o588L33P990K393R223O294K076k930m345
4383E5635l991J7578j329j053L183m28P645J4723Q791M343R228J3031K0563L395
4369A51314N663J051j1108j1999j5442j3599q075j0043k446k692j216O773M357
4356I2538r020o859j857P709q206j1650p254l595n513m637j0678n002K039p413
4342B0602K298N677o621N375l818j811m809j35k777J396J904j435L448L482m593
4327A8183l637o5j603l051l0j862or7J2467l732p047R23j909M053M48p043m154
4310A838M871J81k697M668N469k576J578L120m274q288P497K068o084k570k482
4295B319J95O504m140o561j98J1341J295n728L486m136K212J855l525P79n65Q328
$$ y = [17673, 17918, 20964, 23914, 27812, 33449, 41189, 34601, 34934, 42924, 45317, 54540, 60834, 62910, 59980, 55635, 51644, 69222, 67893, 66840, 70023, 69595, 77240, 91963, 100754, 105097, 114325, 127356, 147919, 151314, 156977, 158028, 146920, 134921, 119479, 105880, 97805, 87762, 85316, 82624, 81408, 88181, 92538, 83518, 76659, 74802, 82511, 74305, 62655, 55401, 51806, 46293, 41656, 30978, 25976, 28015, 20602, 22900, 28577, 21956, 27331, 23513, 21702, 16893, 16758, 13981, 15377, 17281, 15846, 19294, 22776, 18183, 14546, 14481, 12878, 9827, 9797, 7935, 7929, 7832, 20299, 16567, 9520, 10443, 8534, 12587, 13035, 5992, 1838, 6709, 6890, 4193, 8861, 14330, 11754, 13332, 16452, 12178, 3890, 11387, 13455, 7371, 4801, 2319, 2514, 9018, 4878, -1683, -1881, 9460, 10755, 5027, 8513, 4377, 6589, 8444, 4919, 5698, 5133, 13461]
4279A3461l56P05n639P2l591k48P05M662K215k565M294N1n106Q451m133j896L739
4262A4821n997L10J1229l202m370P858m978q378l160J0697N844P366N470r817
4248B3693m147N079Q42n635m35q745k547M040l41N433o70K17n551m404K31l821
4232C239R114L179m697K142n379m89q469K01Q545K641L719j050k879k43j81P94
4216A0187j607N818o891j684p87j908O356n41j943l664l06O88j516o335Q992k24
4200D635l44r60l824L516n36J842o34n21L084J0418O90n786r15n704n144L304
4184C121M59K289K746J329M277K352m296j7n419l046R020m648L422q6k926N456
4168A4033J616O374j053J52q499K81P703n377K971M679q506l666k029M590l656
$$ y = [13461, 13105, 13810, 8171, 8243, 4652, 4404, 5109, 9771, 11986, 9421, 13715, 13766, 8660, 17111, 12978, 11082, 14821, 8824, 9134, 20363, 17161, 12791, 20649, 15671, 7293, 4133, 14830, 20674, 28040, 33510, 23693, 19546, 24625, 25467, 19832, 19397, 10652, 8105, 12145, 11804, 17237, 16567, 16784, 11233, 6829, 7060, 3239, 12353, 15532, 10835, 12977, 7598, 7109, -1360, -1159, 7386, 10027, 13746, 12696, 9817, 9574, 9393, 10187, 8580, 14398, 7507, 5823, 5036, 3128, 9484, 8943, 7000, 3336, 3030, 3718, 2202, -4133, 4859, 4635, 4291, 3331, -493, 3023, 2487, 4329, 3695, 3174, 6258, 16676, 17366, 11580, 10665, 4961, -183, 3121, 3580, 5869, 8615, 9944, 14221, 16573, 12277, 12260, 6841, 3795, 12815, 8167, 11589, 11503, 8577, 14033, 15649, 22023, 20970, 21122, 12623, 12904, 20607, 15230, 18201, 22880, 14374, 10708, 8679, 13269, 9613]
4153I613j294q72k629P537k608K096k282J122j183M567K578p87j842K326l484
4138A2858Q226L389o802P262n53j0008r272j834M550Q621M054P3j0404k84J29
4123A0005l92J1450q984q753J1113M82J064p891N524R67K243J591l47N624q1N834
4107B9449j4309K335K504k677P951P089k811m612n586Q565K825K602O639m030
4093C5934n695R491q869p034P539L48M245J36J488J195j599m43N370L783P47J404
4077D8040l568l404K884N197M89p754m61J661K428K861L966N734L641j368k75
4062F0071q91o57P601n462L323K479K119O264k986L407m496N008K167J096j044
4047G7999L290Q538j428k993Q04J126Q884O568J625k533j769M614M329M417P294
$$ y = [9613, 8319, 7447, 4818, 12355, 9747, 11843, 9561, 10683, 9500, 14067, 16645, 15858, 14016, 16342, 12858, 21084, 24473, 17671, 24933, 24380, 14372, 5100, 3266, 7816, 16437, 20491, 20564, 10160, 9876, 10005, 9613, 21063, 12079, 3326, 14439, 14921, 15985, 8094, 13618, 14585, 16828, 18419, 18072, 23696, 23615, 29449, 15140, 17475, 19979, 17302, 25253, 32342, 29531, 24919, 19333, 27898, 30723, 33325, 39964, 35934, 30239, 39730, 30861, 23827, 31366, 31714, 35959, 36095, 37583, 38778, 37179, 36736, 42106, 45889, 46636, 48040, 44472, 41068, 43952, 49149, 49638, 41884, 41423, 43084, 45512, 48373, 52339, 58073, 61714, 60346, 60071, 59180, 58523, 66124, 60662, 63985, 66464, 68583, 74847, 71861, 75268, 70772, 75780, 77947, 79043, 77999, 81289, 89827, 88399, 85406, 86210, 87336, 96220, 102788, 104413, 101880, 100111, 104725, 109054, 113471, 120765]
4032A20765K739J204J489O140J1618L350n940p04M963J0932O689J217R783j76
4018A74069J0177N522K859L757L670Q395N299J4480N848P18J0604J4844O444J0847
4004B77533L834J2797J6028J3056J8070K0712O688K3193R144J7013J8730J6268
3992D53066K0048K1089L1914J7787K6132J7950K4251L4869K7518M0724K7142K9050
3980G71540M1198L2863L4656L7422M1464L5013M4432L6273L9545M8038M1159M7198
3968A250801M8577M0821M4792M4593M6524M4587M1700M3368M7159M0761M1317
3957A735000L5847L1599L8677L0990L2968K7704J7590L1458J6353J0665J4938
3946B023789J7198Q416J1215n992j2090k708j690j2222j6286n168k3776l6173
$$ y = [120765, 123504, 124708, 126197, 132337, 143955, 147305, 141365, 140661, 145624, 156556, 163245, 164462, 174245, 174069, 184246, 189768, 192627, 196384, 200054, 208449, 213748, 228228, 234076, 234794, 245398, 260242, 266686, 277533, 281367, 294164, 310192, 323248, 341318, 362030, 368718, 391911, 401055, 418068, 436798, 453066, 473114, 494203, 526117, 543904, 570036, 587986, 612237, 647106, 674624, 715348, 742490, 771540, 812738, 845601, 880257, 917679, 959143, 994156, 1038588, 1074861, 1114406, 1162444, 1203603, 1250801, 1299378, 1340199, 1384991, 1429584, 1476108, 1520695, 1562395, 1605763, 1652922, 1693683, 1735000, 1770847, 1802446, 1841123, 1872113, 1905081, 1932785, 1950375, 1981833, 1998186, 2008851, 2023789, 2040987, 2049403, 2060618, 2054626, 2042536, 2039828, 2038138, 2025916, 2009630, 2004462, 1980686, 1944513]
3934A944513k9216k8250l3087k0539k8827k9489l1347l9999m1654m1902l3063
3923A587140l7336l9671m4576l9548l7923m8886m4744m6058l7285k4597l1542
3912A154974l3013l9126l1924k7908j7877l0391j8081k3539k0433k2971j5402
3901H74309Q61m9N225K369J9617K3988L7995O6878R5399J38059J87831J87942
3889A640424J80036O8694j77597k67623k32058j91346j38960j07518o6737n6410
3879F50905m7960l3453k8172l7508k1774k5069j6621k4538k1230r543r869o641
3867C68527j2550q673k2802j1745j4081j0012k763j2685j1420m834j5258j0230
3855B31474N5p445q664n501j805o268n067N513N1r243m261M13j3472q914r09l105
$$ y = [1944513, 1915297, 1887047, 1853960, 1833421, 1804594, 1775105, 1743758, 1703759, 1662105, 1620203, 1587140, 1549804, 1510133, 1465557, 1426009, 1388086, 1339200, 1294456, 1248398, 1211113, 1186516, 1154974, 1121961, 1082835, 1050911, 1023003, 1005126, 974735, 956654, 933115, 912682, 889711, 874309, 875170, 875121, 880346, 882715, 902332, 926320, 964315, 1031193, 1126592, 1264651, 1452482, 1640424, 1820460, 1889154, 1711557, 1443934, 1211876, 1020530, 881570, 774052, 707315, 650905, 602945, 569492, 541320, 503812, 482038, 456969, 440348, 415810, 394580, 385037, 375168, 368527, 355977, 347304, 324502, 312757, 298676, 288664, 285901, 273216, 261796, 256962, 241704, 231474, 231529, 224084, 215420, 209919, 208114, 201846, 196779, 202292, 202343, 193100, 188839, 189252, 175780, 166866, 165957, 162852]
3839A62852l280L504K186q020l684l394m527p197M69l485p50K804k763K571M089
3824A41375Q249M223n129j2944l386P473p522j542q30M44k300l74l786k141n342
3809A16468N825k580o491J755Q071N49J456k203m895m627N752n86k819O352M076
3794A26103M45q77O274m913O03L632j553j56l033K797N618N84p095m497N976P32
3778A30640K298l391J257k996R84M771L487j57R470o769O084N595r471j918O132
3763A46016P403J798O870K406m71K777K370J325O053N078m028N098L51P446L70
3748A90862L956O396l03J3976Q413j96n442J0000J4839M326O03l00q610Q810R922
3733B57252K260p93N071P034J6193M242j019J1393M242P824J0710P28J1462J3559
$$ y = [162852, 159572, 163076, 165262, 157242, 153558, 150164, 145637, 138440, 138909, 135424, 134674, 137478, 134715, 137286, 141375, 149624, 153847, 148718, 135774, 132388, 139861, 132339, 130797, 129967, 130411, 128111, 127737, 123951, 121810, 116468, 122293, 119713, 113222, 114977, 123048, 123597, 125053, 122850, 117955, 113328, 119080, 118494, 115675, 122027, 126103, 126548, 125671, 131945, 127032, 127635, 131267, 129714, 129558, 126525, 129322, 134940, 135524, 128429, 123932, 129908, 130640, 132938, 129547, 130804, 127808, 128792, 133563, 137050, 136893, 146363, 139594, 145678, 151273, 141802, 139884, 146016, 153419, 155217, 162087, 164493, 164022, 166799, 169169, 170494, 176547, 181625, 177597, 182695, 183046, 190492, 190862, 194818, 201214, 200911, 214887, 223300, 223104, 217662, 227662, 242501, 246827, 247430, 247130, 238520, 247330, 257252, 259512, 258719, 263790, 270824, 287017, 291259, 290240, 301633, 305875, 313699, 324409, 325137, 336599, 350158]
3719C50158M48O314L670Q268O689J0863J4302Q782J2169J4705Q724J801J3846
3706D60739J4426M323J7918J9388J3161J9814J4470J6215J6162K1393J7716J8251
3694F53976J9057L1936K6875L1371K7334L3747L1711K9945L4179L9454M3207L8702
3682A041494M8878N2969O4628N5590O8071P1793Q6258Q8626Q2248R2950R7180
3671A850685J07690J08169J01374J03015R3764J02027Q2571O5269N2915M6162
3661B713641M4831L5344L4892K8954K9108K9812J4293K2839L1727J8606J2987
3650C017034Q396m274O15O102K906J2762K1212K9378N6108N9829P8276Q3725R8177
3637C470246J01019R6947Q1496P2861M9186L5638J3701O90j4775k6381k4245k7850
$$ y = [350158, 350606, 356920, 360590, 368858, 375547, 386410, 400712, 409494, 421663, 436368, 445092, 446893, 460739, 475165, 479488, 497406, 516794, 529955, 549769, 564239, 580454, 596616, 618009, 635725, 653976, 673033, 704969, 731844, 763215, 790549, 824296, 856007, 885952, 920131, 959585, 1002792, 1041494, 1090372, 1143341, 1207969, 1263559, 1331630, 1403423, 1489681, 1578307, 1660555, 1753505, 1850685, 1958375, 2066544, 2167918, 2270933, 2364697, 2466724, 2549295, 2614564, 2667479, 2713641, 2758472, 2793816, 2828708, 2857662, 2886770, 2916582, 2930875, 2953714, 2985441, 3004047, 3017034, 3025430, 3021156, 3021771, 3027873, 3030779, 3043541, 3064753, 3094131, 3150239, 3210068, 3288344, 3372069, 3470246, 3571265, 3668212, 3749708, 3822569, 3871755, 3907393, 3921094, 3921784, 3907009, 3880628, 3856383, 3828533]
3625C828533l1059m4675m1872m8159n8613o8771p5172j04605j28775j36921j50867
3614B939044j54891j54645j44640j43178j30996j26236j05131r6566r0400q3791
3604A708570p7147o7127n4345n2919n5407m2721m2829l6575k9689k9347k5471
3593A194993j8936k7298j6491l0547k2684k3643k0556j7819k1333j7260j6355
3582I62071k8065j0272j9309j3051k7619j7067k0410j7180k2528j8687j4376j0412
3570G43095j2901j2753j5242j5332r073o623n968O76o649r892O3j352L922m708
3556F47263N663O14j154J6473J0870J2057L45M422J6025J4781Q614P042J5669
3543G58684J8260J3878J1506J8995K1136L556K3678J3718L33J3382Q612J7127
$$ y = [3828533, 3797474, 3752799, 3710927, 3662768, 3604155, 3535384, 3460212, 3355607, 3226832, 3089911, 2939044, 2784153, 2629508, 2484868, 2341690, 2210694, 2084458, 1979327, 1882761, 1792361, 1708570, 1631423, 1564296, 1509951, 1457032, 1401625, 1358904, 1316075, 1279500, 1249811, 1220464, 1194993, 1176057, 1148759, 1132268, 1101721, 1079037, 1055394, 1034838, 1017019, 995686, 978426, 962071, 934006, 923734, 904425, 891374, 863755, 846688, 826278, 809098, 786570, 767883, 753507, 743095, 730194, 717441, 702199, 686867, 677794, 671171, 665203, 665879, 659230, 649338, 649401, 648049, 651971, 647263, 652926, 653540, 652386, 668859, 679729, 691786, 692131, 696553, 712578, 727359, 735973, 743015, 758684, 776944, 790822, 802328, 821323, 842459, 846015, 869693, 883411, 883744, 897126, 905738, 922865]
3531I22865J4816J0586k766J0152P447L584J2143O018O258P340K147j819q270
3518I90501R97J905p874n898j751j501M543L241k899Q338O479Q772M573P292J3445
3503A030163K0361J3633J4548L0105K2148K6663L5229K9727L9460M6195L8412
3492A346644M2243M2945N1746M9157N1612M4838N2491N0095N9591O0460O2867
3481A914689N5848N4392N1830N7850M0376L4912M5178M0382L4513K9979K4880
3470B384829K6407K5294K2003J9077J2799J0054J9296M469j744j1371j2083k0794
3458B478236j4726k6317k3684k3003j8026j7555k8917k0588j3743l0537k1244
3447B239896k4503k9478k5315l3680k3595l0185k3292k0327j4857k1428j5535
$$ y = [922865, 937681, 948267, 945501, 955653, 963100, 966684, 978827, 984845, 991103, 998443, 1000590, 998771, 990501, 991498, 993403, 985529, 979631, 977880, 976379, 980922, 984163, 981264, 989602, 996081, 1004853, 1009426, 1016718, 1030163, 1050524, 1064157, 1078705, 1108810, 1130958, 1157621, 1192850, 1222577, 1262037, 1308232, 1346644, 1388887, 1431832, 1483578, 1532735, 1584347, 1629185, 1681676, 1731771, 1791362, 1851822, 1914689, 1970537, 2024929, 2076759, 2134609, 2174985, 2209897, 2255075, 2295457, 2329970, 2359949, 2384829, 2411236, 2436530, 2458533, 2477610, 2490409, 2500463, 2519759, 2524228, 2522484, 2511113, 2499030, 2478236, 2463510, 2437193, 2413509, 2390506, 2372480, 2354925, 2326008, 2305420, 2291677, 2261140, 2239896, 2215393, 2185915, 2160600, 2126920, 2103325, 2073140, 2049848, 2029521, 2014664, 1993236, 1977701]
3436A977701j3288j1858p323p274j3649p231P666j4118r069o950r03j0620p717
3423A875367p874p061p065j1202l254j298j8798j2474p663j9401k1563l4530j9283
3410A703901l1342k5286k8985l1171l2674l1676l6241k1383l6082l8763k9502
3399A360796l9015m8129k7813l8032k8307l9888l8575k7485l5263k3034k9458
3388I85797k8335j9416k1972j9332j2920j5189j7557k4760j0990j5027m634p274
3376G88391j0616j409o243o102l144n248j2657j520J245j6399m823k249o933P215
3362G19508m557n525j6487q733j787p632r057j3116q552j1794r664j4259k6283
3349E82062j2526j3995j1501j8506j1817n636k2384k4532j4393j3635j0127j3762
$$ y = [1977701, 1964413, 1952555, 1945232, 1937958, 1924309, 1917078, 1924744, 1910626, 1901557, 1894607, 1893704, 1883084, 1875367, 1867493, 1860432, 1853367, 1842165, 1838911, 1837613, 1818815, 1806341, 1798678, 1779277, 1757714, 1723184, 1703901, 1672559, 1647273, 1618288, 1587117, 1554443, 1522767, 1486526, 1465143, 1429061, 1390298, 1360796, 1321781, 1273652, 1245839, 1207807, 1179500, 1139612, 1101037, 1073552, 1038289, 1015255, 985797, 957462, 938046, 916074, 896742, 883822, 868633, 851076, 826316, 815326, 800299, 795665, 788391, 777775, 776366, 770123, 764021, 760877, 755629, 742972, 741452, 742697, 726298, 721475, 719226, 712293, 719508, 714951, 709426, 692939, 684206, 682419, 674787, 665730, 652614, 644062, 632268, 622604, 608345, 582062, 569536, 555541, 544040, 525534, 513717, 508081, 485697, 461165, 446772, 433137, 423010, 409248]
3337D09248n981j6912j9171j4915j5432j7865j3073m912n886j1366j2135j1959
3325B59641l905p006r600n588r047r640q992J585R47j5886l521m971k252K70n460
3310A76575o874j31l837j6483M684M867o433k38j065o773p604j862r258L297J733
3295A30598j8148n686j381K419K548J340K421o009k822L526r066o9j298k192j3353
3280H2828K534Q10p47k293K728N492p325o874Q386k047K368o493o661m217l02
3265F8187K977k184M297J88m243K748n473J228k154L13K72n10k298k537j118M283
3249F3976N5p159J934K076O651k398j0230r928j126k435J497O877P086L506K33
3234F0615p124q92m032m64N343p109j176K605J76m519r44M008L994m020l235K402
$$ y = [409248, 403267, 386355, 367184, 352269, 336837, 318972, 305899, 300987, 295101, 283735, 271600, 259641, 255736, 248730, 239130, 233542, 224495, 214855, 205863, 207448, 208395, 192509, 188988, 184017, 181765, 182035, 176575, 169701, 169570, 165733, 149250, 153934, 158801, 152368, 152130, 151065, 144292, 136688, 134826, 125568, 128865, 130598, 112450, 106764, 105383, 107802, 110350, 111690, 114111, 108102, 105280, 108806, 99740, 99671, 98373, 96181, 82828, 85362, 86172, 85425, 83132, 85860, 91352, 84027, 77153, 85539, 83492, 85860, 79367, 72706, 68489, 68187, 71164, 68980, 73277, 73465, 69222, 71970, 66497, 67725, 65571, 65884, 66156, 65646, 63348, 60811, 59693, 63976, 64031, 56872, 58806, 60882, 67533, 65135, 54905, 44977, 43851, 41416, 42913, 49790, 56876, 60382, 60615, 53491, 52599, 48567, 48103, 53446, 46337, 45161, 47766, 47942, 43423, 42479, 46487, 50481, 46461, 43226, 45628]
3218D5628L337P1m84o350q1M998Q381m299k848j1428l822Q071M298k432j84m960
3202C7896m5j336j93Q339j419m920M091k139L919m482k846R544o214o813N768
3187C9150K012k854J361N798O223j0984k192K722o91N42M551M09k363N220O245
3172E5149m174k489j739K73l116m09N719p20l521m699n64Q502l728l442p616K335
3156C5761J2330l809k668K416p787l271o107P497K845N65l971K104l372M536L588
3141D0657M732J396j2002k663K911n87o90o677j779K696P797q758M128l410P18
3126B8469L146l361l695M377k512l961o4K230P00J1910p024k440N060m140R349
3111C8044m782k2J337J0576j0092q102P678l328M526o189j986J29n71l684p81
$$ y = [45628, 48965, 49036, 48552, 42202, 42121, 47119, 55500, 51201, 48353, 36925, 33103, 41174, 45472, 43040, 42856, 37896, 37851, 36515, 36322, 44661, 43242, 38322, 42413, 40274, 44193, 39711, 36865, 46409, 40195, 33382, 39150, 41162, 38308, 39669, 45467, 51690, 40706, 38514, 41236, 40545, 41087, 45638, 46047, 43684, 48904, 55149, 50975, 48486, 46747, 47020, 43904, 43495, 49214, 48494, 44973, 40274, 39710, 48212, 44484, 41042, 33426, 35761, 48091, 44282, 41614, 44030, 36243, 32972, 26865, 34362, 37207, 37772, 33801, 35905, 32533, 37069, 40657, 45389, 46785, 34783, 32120, 35031, 34444, 33754, 27077, 25298, 27994, 35791, 27033, 31161, 27751, 28469, 31615, 28254, 24559, 28936, 26424, 22463, 22399, 24629, 25329, 37239, 30215, 27775, 32835, 28695, 38044, 33262, 33240, 34577, 45153, 35061, 26959, 34637, 31309, 35835, 29646, 27660, 27789, 27218, 23534, 22753]
3096B2753Q208o447k787K381M881n861p291m583J564N254k749J2944p35m50q44
3081B6238m438k299M413l151o136j540P632J0591j1147L894n594M696l305k113
3067A7741o14m555Q1k805j790m73M025P581m812J424P72l0l752M370M7Q99J147
3050A9256j992J471O633j498l023J304O720p257j29j349Q940n943K924k386J233
3035B4904o776M311m023J716k424n344n08L075Q428j0907q77J1921o607n208n42
3020A1139m480j191M818P214k43L986k713n124p751n48n129O387L008l568L621
3005I426M023l441K41j1237L419N203o081J232P834j2106n681P102N870N71L235
2990I610l265N515L401m546m287L199o717R53M842m406j459K028M186j1035P813
$$ y = [22753, 30961, 24514, 21727, 24108, 28989, 23128, 15837, 11254, 12818, 18072, 15323, 28267, 27532, 27082, 26238, 21800, 19501, 23914, 20763, 14627, 13087, 20719, 31310, 20163, 24057, 18463, 23159, 19854, 17741, 17127, 12572, 12653, 9848, 8058, 7585, 11610, 19191, 14379, 15803, 16575, 16545, 12793, 17163, 17210, 18109, 19256, 17264, 18735, 25368, 23870, 20847, 22151, 28871, 21614, 21485, 20136, 29076, 23133, 26057, 23671, 24904, 18128, 22439, 18416, 20132, 17708, 12364, 11856, 14931, 23359, 12452, 11575, 23496, 16889, 11681, 11139, 6659, 5468, 10286, 17500, 17257, 21243, 18530, 13406, 5655, 5107, -22, 6365, 9373, 5805, 9426, 13449, 10008, 10249, -988, 2431, 7634, 1553, 2785, 10619, -1487, -7168, -66, 5804, 6375, 9610, 6345, 11860, 15261, 10715, 6428, 9627, 2910, 3863, 8705, 4299, 2840, 4868, 9054, -1981, 5832]
2975E832K854O61K145j4425k163M970K583m04L530j53q407n50Q407k702L038L448
2959H664j851O756q649N968Q190n903o649j778o448M334Q019k952Q365j2506j1871
2944h311K12M937k653K173R218M040J845j2247L209L939k154K132o13n5K502j618
2928F556l504M888l782j647p44M402k969n199P30N958J662j027m750O604N82l963
2912C797l634K720J758n889J601J743m862L889J097L289N974k370n660K067n034
2897D86N729n479j879j351P69n60k112L182Q415M159j5341j202K303K804p689
2882g766o82Q318k011L312K958R31Q74m402J246J69k890J174J2607l764L867l611
2866A0330m847l727M2J188l183M439J08M277j804l708N163o089k666j106M175
$$ y = [5832, 8686, 9347, 11492, -2933, -5096, -126, 2457, 2053, 5583, 5430, -2977, -3527, 4880, 2178, 5216, 8664, 6813, 13569, 4920, 10888, 19078, 13175, 6526, 4748, -1700, 2634, 10653, 7701, 16066, 3560, -8311, -8099, -3162, -5815, -3642, 5576, 9616, 11461, -786, 2423, 6362, 4208, 6340, 5727, 5672, 8174, 6556, 3052, 7940, 4158, 2511, 1767, 6169, 3200, -1999, -1269, 4689, 6351, 5324, 574, 7178, 7760, 3797, 163, 2883, 4641, -1248, 353, 2096, -2766, 1123, 2220, 5509, 11483, 9113, 3453, 5520, 486, 6215, 736, -1143, -2494, -1725, -2285, -4397, -1215, 7200, 11359, -3982, -5184, -2881, -77, -7766, -8448, -130, -2141, 1171, 4129, 5060, 5934, 1532, 2778, 2947, 57, 1231, 13838, 10074, 13941, 10330, 5483, 1756, 1798, 2986, -197, 4242, 4350, 8627, 6823, 3115, 8278, 2189, -477, -1583, 2592]
2851B592j545J001P88K086l558o70j760K195N927K573k078o91q113k38O595L962
2835I066k5o668L469M682j402o047k808L655J865m592n146J188j842j22O68J0647
2819F588k977p404M446k57L157K164M503J280p537m266k275l697J1043K000K185
2804H953j778l101o093N343L743m618k215p517M894O801l81k907L019L535m501
2789C177n369L076N36j248m544l30M511M431J597q446j558j174P060o467j902
2774f650Q153n903L747j383k644P475L644j378O09k724n446K830K725l87m393
2759a725k613M05R15m237N420M10L856N617m916j729J069O742k089j923J400L310
2743I912j358J644Q32n242j1075N40k976K123L603N468l585O35J138o385K040
$$ y = [2592, 1047, 2048, 2836, 4922, 1364, 694, -1066, 1129, 7056, 9629, 7551, 6860, -1253, -1491, 5104, 9066, 9041, 2373, 5842, 10524, 9122, 3075, 267, 3922, 5787, 1195, -3951, -2763, -4605, -4727, -4059, 6588, 3611, -3793, 653, 396, 3553, 5717, 10220, 11500, 3963, -303, -2578, -6275, 4768, 6768, 8953, 7175, 4074, -2019, 3324, 7067, 2449, 234, -7283, -2389, 4412, 4031, 1124, 4143, 7678, 3177, -2192, 884, 1420, 172, -4372, -4702, -191, 4240, 5837, -2609, -4167, -5341, 1719, -4748, -6650, 1503, -4400, -653, -2036, -4680, 2795, 6439, 5061, 5670, 2946, -2500, 330, 3055, 2668, -1725, -4338, -3933, -3018, -7255, -1835, -1425, 2431, 8048, 3132, 1403, 2472, 9214, 7125, 5202, 6602, 9912, 8554, 10198, 11030, 5788, -5287, -4747, -7723, -5600, -1997, 3471, -114, 521, 1659, -4726, -2686]
2728b686Q338O43p104J808N811j440O91n1K226J285p50j710O36m503L477Q619
2712A5290M068J597j2431p976l66L695K254k870K127K397r280M598M646K550J626
2697A1925l812l644J996M26j144L702K420o728O219R693K768m2K583p368L38r821
2681I511l58k708j112J867J225m664N935L623J1j1997l337J0027L177q600m038
2666a438P06J293K167n435Q887L118K441L66r118k932P531J399m998q066K697
2651a382M261L713j707j761k292J714P8r8l549M75k697L181L545L342N429n145
2635G107k572L851o355j487K349J073K07m001L242M117k865l088j1680J493J0102
2620A493o522n804J66O578N061k912j119k829j99K514l208O636n81O198m642n872
$$ y = [-2686, 5652, 6295, -809, 999, 6810, 5370, 6061, 6010, 8236, 9521, 8771, 7061, 7697, 3194, 6671, 15290, 19358, 20955, 8524, 548, 182, 3877, 6131, 3261, 5388, 7785, -1495, 3103, 7749, 10299, 11925, 8113, 4469, 6465, 6891, 5747, 9449, 11869, 5141, 11360, 21053, 23821, 23779, 26362, 18994, 19332, 9511, 9153, 6445, 5333, 7200, 8425, 3761, 9696, 13319, 13330, 1333, -2004, 8023, 11200, 2600, -1438, -732, 561, 2728, -2707, 6180, 9298, 11739, 12105, 2987, 55, 7586, 8985, 3987, -4079, -1382, 2879, 6592, 4885, 3124, 832, 2546, 2624, 2526, -1023, -548, -3245, -64, 3481, 6823, 12252, 7107, 4535, 8386, 2031, 544, 2893, 3966, 4173, 172, 3414, 7531, 4666, 1578, -10102, -8609, 1493, -5029, -10833, -10667, -4089, 972, -1940, -3059, -5888, -6087, -3573, -6781, -145, -726, 5472, 830, -5042]
2604e042k656K978N147j483K924M601r393m910L862O583j596j370n173m961J870
$$ y = [-5042, -7698, -4720, 427, -1056, 1868, 6469, -2924, -7834, -3972, 2611, 1015, -355, -5528, -10489, -8619]
$$ [...]
##END NTUPLES=NMR SPECTRUM
##END=
