##TITLE=1H_EC-3277x3H
 D2O
 8 sc, 
 29.09.2022
##JCAMPDX= 6.0         $$ Bruker NMR JCAMP-DX V2.0
##DATA TYPE= NMR SPECTRUM
##DATA CLASS= NTUPLES
##ORIGIN= UXNMR, Bruker Analytische Messtechnik GmbH
##OWNER= root
$$ XWIN-NMR		Version 3.5
$$ Thu Sep 29 13:48:31 2022 Russian Standard Time (UT+4h)  she@DPX200
##.OBSERVE FREQUENCY= 200.1313499994
##.OBSERVE NUCLEUS= ^1H
##.ACQUISITION MODE= SIMULTANEOUS
##.ACQUISITION SCHEME= undefined
##.AVERAGES= 8
##.DIGITISER RES= 18
##SPECTROMETER/DATA SYSTEM= spect
##.PULSE SEQUENCE= zg30
##.SOLVENT NAME= CDCl3
##.SHIFT REFERENCE= (INTERNAL, CDCl3, 0, 15.7645)
##AUDIT TRAIL= $$ (NUMBER, WHEN, WHO, WHERE, WHAT)
$$ ##TITLE= Audit trail, XWIN-NMR		Version 3.5
$$ ##JCAMPDX= 5.01
$$ ##ORIGIN= Bruker BioSpin GmbH
$$ ##OWNER= she
$$ F:/spectra/data/she/nmr/H-F/1/pdata/1/auditp.txt
$$ ##AUDIT TRAIL=  $$ (NUMBER, WHEN, WHO, WHERE, WHAT)
(   1,<2022-09-29 13:47:15.70 +0400>,<she>,<DPX200>,
      <created by zg, POWCHK disabled, PULCHK disabled
       configuration hash MD5:
       00 E9 B6 7A A2 85 ED C7 34 08 36 98 17 FE 4E 26
       data hash MD5: 16K
       93 1F 75 57 54 D2 F3 0C 5D 99 90 CA 4F A5 A4 F4>)
(   2,<2022-09-29 13:47:18.71 +0400>,<she>,<DPX200>,
      <Start of raw data processing
       efp BC_mod = 2 LB = 0.24 FT_mod = 6 PKNL = 1 PHC0 = -18034.37 PHC1 = 10.80069 SI = 16K 
       data hash MD5: 16K
       0F 52 05 B0 E9 D7 B1 44 0E 2C 61 04 19 59 BF 36>)
(   3,<2022-09-29 13:47:44.79 +0400>,<she>,<DPX200>,
      <pk PHC0 = -6.210115 PHC1 = 5.8 
       data hash MD5: 16K
       D2 D4 58 6D 5A A5 60 F4 8E B6 FD DD 66 CD AB 02>)
(   4,<2022-09-29 13:47:47.93 +0400>,<she>,<DPX200>,
      <abs ABSG = 5 
       data hash MD5: 16K
       D9 12 C6 01 FE C9 59 90 88 17 6E 0B 87 2F C5 85>)
$$ ##END=
$$ 
$$ hash MD5
$$ 99 E0 24 26 1C FB 2D 23 3F C8 2B 94 39 60 84 FA
##$RELAX= 
##$RELAX= 
##$RELAX= 
##$RELAX= 
##$RELAX= 
##$RELAX= 
$$ Bruker specific parameters
$$ --------------------------
##$DU= <F:/spectra>
##$EXPNO= 1
##$NAME= <H-F>
##$PROCNO= 1
##$TYPE= <nmr>
##$USER= <she>
##$AMP= (0..31)
100 100 100 100 100 100 100 100 100 100 100 100 100 100 100 100 100 100 
100 100 100 100 100 100 100 100 100 100 100 100 100 100 
##$AQSEQ= 0
##$AQ_mod= 1
##$AUNM= <au_zg>
##$AUTOPOS= <>
##$BF1= 200.13
##$BF2= 200.13
##$BF3= 200.13
##$BF4= 200.13
##$BF5= 200.13
##$BF6= 200.13
##$BF7= 200.13
##$BF8= 200.13
##$BYTORDA= 1
##$CFDGTYP= 0
##$CFRGTYP= 5
##$CHEMSTR= <none>
##$CNST= (0..31)
1 1 145 1 1 1 1 1 1 1 1 1 1 1 1 1 1 1 1 1 1 1 1 1 1 1 1 1 1 1 1 1 
##$CPDPRG= <>
##$CPDPRG1= <>
##$CPDPRG2= <>
##$CPDPRG3= <>
##$CPDPRG4= <mlev>
##$CPDPRG5= <mlev>
##$CPDPRG6= <mlev>
##$CPDPRG7= <mlev>
##$CPDPRG8= <mlev>
##$CPDPRGB= <>
##$CPDPRGT= <>
##$D= (0..31)
0 1.2 0 0 0 0 0 0 0 0.06 0 0.03 0 0 0 0 0.0002 0 0 0 0 0 0 0 0 0 0 0 0 
0 0 0 
##$DATE= 1664444835
##$DBL= (0..7)
120 120 120 120 120 120 120 120 
##$DBP= (0..7)
150 150 150 150 150 150 150 150 
##$DBP07= 0
##$DBPNAM0= <>
##$DBPNAM1= <>
##$DBPNAM2= <>
##$DBPNAM3= <>
##$DBPNAM4= <>
$$ [...]
##$SUBNAM3= <"">
##$SUBNAM4= <"">
##$SUBNAM5= <"">
##$SUBNAM6= <"">
##$SUBNAM7= <"">
##$SUBNAM8= <"">
##$SUBNAM9= <"">
##$SW= 18.0517283424941
##$SWIBOX= (0..15)
0 0 2 0 0 0 0 0 0 0 0 0 0 0 0 0 
##$SW_h= 3612.71676300578
##$TD= 16384
##$TD0= 1
##$TE= 0
##$TE2= 300
##$TE3= 300
##$TEG= 300
##$TL= (0..7)
0 120 120 120 120 120 120 120 
##$TP= (0..7)
150 150 150 150 150 150 150 150 
##$TP07= 0
##$TPNAME0= <>
##$TPNAME1= <>
##$TPNAME2= <>
##$TPNAME3= <>
##$TPNAME4= <>
##$TPNAME5= <>
##$TPNAME6= <>
##$TPNAME7= <>
##$TPOAL= (0..7)
0.5 0.5 0.5 0.5 0.5 0.5 0.5 0.5 
##$TPOFFS= (0..7)
0 0 0 0 0 0 0 0 
##$TUNHIN= 0
##$TUNHOUT= 0
##$TUNXOUT= 0
##$USERA1= <user>
##$USERA2= <user>
##$USERA3= <user>
##$USERA4= <user>
##$USERA5= <user>
##$V9= 5
##$VALIST= <valist>
##$VCLIST= <CCCCCCCCCCCCCCC>
##$VD= 0
##$VDLIST= <DDDDDDDDDDDDDDD>
##$VPLIST= <PPPPPPPPPPPPPPP>
##$VTLIST= <TTTTTTTTTTTTTTT>
##$WBST= 1024
##$WBSW= 4
##$XGAIN= (0..3)
0 0 0 0 
##$XL= 0
##$YL= 0
##$YMAX_a= 1022128
##$YMIN_a= -1059665
##$ZGOPTNS= <>
##$ZL1= 120
##$ZL2= 120
##$ZL3= 120
##$ZL4= 120
##$ABSF1= 15.76452
##$ABSF2= -2.28733
##$ABSG= 5
##$ABSL= 3
##$ALPHA= 0
##$AQORDER= 0
##$ASSFAC= 0
##$ASSFACI= 0
##$ASSFACX= 0
##$ASSWID= 0
##$AUNMP= <proc_1d>
##$AZFE= 0.1
##$AZFW= 0.1
##$BCFW= 0
##$BC_mod= 2
##$BYTORDP= 0
##$COROFFS= 0
##$CY= -3
##$DATMOD= 1
##$DC= 0
##$DFILT= <>
##$DTYPP= 0
##$F1P= 0
##$F2P= 0
##$FCOR= 1
##$FTSIZE= 16384
##$FT_mod= 6
##$GAMMA= 0
##$GB= 0
##$INTBC= 1
##$INTSCL= 3.70164e-10
##$ISEN= 128
##$LB= 0.24
##$LEV0= 0
##$LPBIN= 0
##$MAXI= 10000
##$MC2= 0
##$MEAN= 0
##$ME_mod= 0
##$MI= 1.114404
##$NCOEF= 0
##$NC_proc= -2
##$NLEV= 6
##$NOISF1= 3.799351
##$NOISF2= 2.8
##$NSP= 0
##$NTH_PI= 0
##$NZP= 0
##$OFFSET= 15.76452
##$PC= 1
##$PHC0= -18040.58
##$PHC1= 16.60069
##$PH_mod= 1
##$PKNL= yes
##$PPARMOD= 0
##$PSCAL= 0
##$PSIGN= 0
##$REVERSE= no
##$SF= 200.130001404204
##$SI= 16384
##$SIGF1= 3
##$SIGF2= 2
##$SINO= 5.538805
##$SIOLD= 16384
##$SREGLST= <1H.CDCl3>
##$SSB= 0
##$STSI= 16384
##$STSR= 0
##$SW_p= 3612.71676300578
##$SYMM= 0
##$S_DEV= 0
##$TDeff= 16384
##$TDoff= 0
##$TI= <>
##$TILT= no
##$TM1= 0
##$TM2= 0
##$TOPLEV= 0
##$USERP1= <user>
##$USERP2= <user>
##$USERP3= <user>
##$USERP4= <user>
##$USERP5= <user>
##$WDW= 1
##$XDIM= 16384
##$YMAX_p= 376104091
##$YMIN_p= -21026
$$ End of Bruker specific parameters
$$ ---------------------------------
##NTUPLES= NMR SPECTRUM
##VAR_NAME=  FREQUENCY,     SPECTRUM/REAL,   SPECTRUM/IMAG
##SYMBOL=    X,             R,               I
##VAR_TYPE=  INDEPENDENT,   DEPENDENT,       DEPENDENT
##VAR_FORM=  AFFN,          ASDF,            ASDF
##VAR_DIM=   16384,         16384,           16384
##UNITS=     HZ,            ARBITRARY UNITS, ARBITRARY UNITS
##FACTOR=    0.220516191357247, 1,           1
##FIRST=     3154.95334798995, 0,            0
##LAST=      -457.763415015831, 0,           0
##MIN=       -457.763415015831, -21026,      0
##MAX=       3154.95334798995, 376104091,    0
$$ Real data points
##PAGE= N=1
##DATA TABLE= (X++(R..R)), XYDATA
$$ [...]
10429d931L013M114l76K623r523N868N685l582Rj409K98n300n97N007K466l096
10413B69N262j747K641q65k073j712j672k833L384J424l444o36J314m979N285
10398c82N484k713R46K527k353o225j259N589J154M68J218j95o276k34P639N38
10382E926j195j726M81o112M637O61p628N972O872m598n625L979K556m23l816
10367c9Q00K068n216O79L376J189l779K80p57j186j087q50O70L417J672J093J657
10350C987O88J755l418j543k467q81P80j49N401J803m727M678L577m414l34K019
10334F755j330J119r06k784p21k623n699K858K044l325n383Q375k12N263J046
10319D477n241q6K360Q58n516K775n463L588m158K09j484O329M31R48K783L297
$$ y = [-4931, -1918, 2196, 1820, 4443, -5080, 788, 6473, 2891, 2900, 1491, 1789, -3511, -4108, 899, 3365, 269, 5531, 3784, 6425, 5560, 3487, 1775, 103, -2730, 654, 2078, -1366, -2002, -688, -5667, -382, 5102, 2389, 3335, 5862, 3509, -2716, -3975, 1614, 2768, 3236, 4454, 4259, -2017, -2251, 5388, 5926, 4731, 3005, 3486, -2626, 2011, 2672, -4956, 1016, 7888, 3290, -2335, 1644, 4200, 3777, -39, 761, 2829, -2387, -1708, 1668, 2857, -922, -642, -1399, -2585, -3672, -4522, -3852, -435, 1237, 2330, 3987, 4675, 6430, 3012, 1469, -998, -1879, -1099, -1248, 4153, 5956, 1229, 5907, 9484, 5070, 4736, 6755, 5425, 6544, 5638, 2854, 2133, -490, -6189, -3331, -1287, -4612, -9995, -1620, -1832, 3431, 4477, -764, -850, 1510, 2368, -3148, -373, -5836, -2248, -6406, -6197, -7681, -1352, -921, 27, 2810, 6107]
10303F107p188k162M627J646k675j012j297K511l29K068L494k898k000k466L973
10288B399L764n532j326K38j932J379L072K605k340l432n579O374L389J627N933
10273A0639m216m035J820l404o715K559K336l017M0j965K480R94l28j485L116
10258a181L145K321k016j532J180j536j485o531K927K314j461K945L945M64m151
10243f52K556j807m078j90J38O81J943j360k804P53K283k847j262J575k480o97
10227h248N584k468J444N701l926L99M410j413K817l408L085k78j776k925j726
10212b728K919J88k858R15j653p316N787K663p40O249J876m599l630n13M267J199
10196B026j353k131k885J634M859j995k71l098j371N968p12L090P98k085K301
$$ y = [6107, -1081, -3243, 1384, 3030, 355, -657, -1954, 557, 228, 2296, 5790, 2892, 892, -1574, 2399, 6163, 631, -695, -457, -2389, -1010, 2062, 4667, 2327, -1105, -6684, -310, 3079, 4706, 10639, 6423, 2388, 4208, 804, -5911, -3352, -1016, -4033, -3993, -5958, -3478, -2484, -2812, -4297, -1181, 1964, 4285, 2269, 737, 1917, 381, -1104, -7635, -4708, -2394, -3855, -910, 3035, 3499, -652, 1904, 97, -3981, -4171, -4033, -3352, -1409, -2769, -5573, -4820, -2537, -5384, -6646, -5071, -7551, -8248, -2664, -5132, -3688, 2013, -1913, -1514, 2896, 1483, 4300, 892, 3977, 3699, 1923, -1002, -2728, 191, 379, -2479, -1564, -3217, -10533, -4746, -2083, -2823, 3426, 5302, 703, -2927, -3440, 827, 2026, 673, -1458, -4343, -2709, 2150, 155, -116, -3214, -4585, 1383, 671, 3761, 4559, 2474, 4775]
10181D775J607o134k778j649k485N786R96p695K974M209J875N80m973j13n38k657
10165f220Q17P467j0243m832K331M283N897p491L562L20O515N37k982q75l22O017
10149D781M56n008k412J118P313k374o262m243R49K318L388L168m396k051J987
10134a268m96m486K372K260N09J920O019o834M62j344M400j0296j672L986M236
10119b32O338r293k018R251P02n855j837j966M62L515k725l344Q20K15O009m779
10103d737M432n038J670K071j825K429k336M171l393m447J503n68l349N274J863
10088b280L317k659M948k559l938K19J674r92l536K587O58O86J984l453N32M976
10072B164N674o751l25q05L082N375j1857L97K872m50j094L665l202L58j84N188
$$ y = [4775, 6382, 248, -2530, -4179, -6664, -878, 118, -7577, -4603, -394, 1481, 2061, -2912, -3025, -3563, -6220, -5403, 2064, -8179, -13011, -10680, -6397, -500, -7991, -4429, -4109, 2406, 2943, -39, -914, -1236, 4781, 5237, 229, -2183, -1065, 6248, 3874, -2388, -6631, -5682, -3364, 24, 3192, -1204, -3255, -1268, -1764, -6250, -3878, -1618, -1109, 811, 6830, -4, 458, -886, 3514, -6782, -8454, -4468, -232, 6106, -3187, -5205, 4046, 4748, -1107, -2944, -4910, -4448, -933, -3658, -7002, -6182, -5967, 42, -4737, -305, -5343, -3673, -1602, -3427, -998, -3334, 837, -2556, -7003, -5500, -6068, -9417, -4143, -2280, 1037, -1622, 3326, 767, -3171, -2952, -1278, -2270, -5806, -3219, -2561, -1875, 109, -3344, -2812, 2164, 7838, 1087, 762, -43, 3039, 8414, -3443, -3046, -174, -624, -1718, 1947, -1255, -897, -1081, 4107]
10056D107k883p506K10K589L033m692l3K501K24K44L218n185J975L821j653l713
10040c743j725L73k602J876L804L132L890J745L389J640N128J287j2459j043J4650
10025A9342J724r742p94n041J240j740L223o61l874m414k925K635P191N29q141
10010a448K189M909K22l38K075l138l24m148L368J020j893o235K617R731o334
9995B273r32j900R1J76J141L910k627K518J65n207J377K71J304M878j451n891
9979I6q29j303N662j488l56m637K069L246O421l181k441R40j808k619M558l763
9963E67J672j724j864J398p17k90M208L794o845q26n099K497j109J854R4j35m098
9946f623l131Q04M355L537k425M739j831l511R85r80k47J270M856m594m114L69
$$ y = [4107, 1224, -6282, -6072, -3483, -450, -5142, -5175, -2674, -2450, -2206, 1012, -4173, -2198, 1623, -30, -3743, -5468, -5095, -7697, -5821, -2017, 1115, 5005, 6750, 10139, 11779, 16907, 18194, 5735, 4692, 19342, 21066, 11324, 10530, 5489, 6729, 4989, 8212, 7551, 3677, -737, -3662, -1027, 6164, 6693, -1448, 741, 5650, 5872, 5534, 7609, 4471, 4147, -1, 3367, 4387, 2494, -3741, -1124, 8607, 2273, 1341, -559, -468, -292, 849, 4759, 2132, 4650, 4815, -392, 985, 1256, 2560, 7438, 5987, 96, -733, -2036, 3626, 2138, 1782, -2855, -786, 2460, 8881, 5700, 3259, 4199, 2391, -228, 4330, 567, 2239, 515, -1349, 49, -668, -958, 3250, 7044, 199, -627, -5726, -3229, -4338, -2484, -2390, -2525, -6623, -9754, -8950, -4595, -1058, -3483, 1256, -575, -4086, -3101, -4081, -4328, -3058, 1798, -2796, -6910, -6541]
9930f541j406J504J035q09L353M443j657m015K160J624L13K7L877o286m437K417
9914d398n23J256M532J38l965J383O313m657j863K818J492k512l330p64J162J309
9898a609L760k359j526j92k772J709J637K715K582m868K587k129m246j927L365
9883c273M954j94J226m87j827L145m220M69m972M610L44k285j90k727j880O597
9867g10L803n497J658k372L200P53j161L710K25n668p36m978L257j924m788j973
9851a3201O185L533k594K439K6N3k557N680p33j833M057l998N180J651k141o060
9835d313M631J77k340m55k303l909p73N959L791L146k341m082M114K284j285J34
9819B435k951m891N520j407j256l090k691O412O833k981j495j648N303M941l370
$$ y = [-6541, -7947, -6443, -5408, -6217, -2864, 1579, -78, -4093, -1933, -309, 4, 31, 3908, -2378, -6815, -4398, -4921, -3665, 867, 1005, -2960, -1577, 4736, 79, -1784, 1034, 2526, 14, -3316, -4080, -2918, -1609, 2151, -208, -1734, -1926, -4698, -2989, -1352, 1363, 3945, -923, 1664, -465, -4711, -6638, -3273, 1681, 1487, 2713, 2226, 399, 3544, -676, -207, -5179, -569, -225, -2510, -2700, -5427, -7307, -710, 3093, -2404, -746, -3118, 82, 835, -326, 3384, 3609, -2059, -2795, -7773, -4516, -6440, -11228, -13201, -7016, -3483, -6077, -3638, -3612, -3559, -6116, -436, -1169, -3002, 1055, -2943, 2237, 3888, 1747, -4313, 318, 495, -1845, -2300, -4603, -8512, -9285, -3326, 465, 3611, 1270, -2812, 1302, 3586, 2301, 2435, -516, -5407, 113, -1294, -2550, -5640, -8331, -1919, 4914, 1933, 438, -1210, 4093, 9034, 5664]
9804E664k29j0185K824L292J549K68l928k383K863L140J080n533p38O206n332
9789a442K472K872o92K775l634j967j885r25K773K817n526L126J596m960l368
9774e968l221P938J73m060J820R65j076K597k96l139j179l18n06L853M815N842
9758H240k114m551k180J263j149L777L70o518K8L554j67J017L813l900M619l893
9742B209jK307n528M508L023k280j438n784M89j689m159J386J380M871R750l103
9726E941r15L405n142l110J152P895j654n886n371L685j209k63M082n121l462
9711e973N086L317k46j436M180k292j388N186j137o037j385R34N661k574n22K026
9695C400M108q203o731L048O02L353k942n03L356O542J430o820m471M27j121L394
$$ y = [5664, 5435, -4750, -1926, 1366, 2915, 3183, -745, -3128, -265, 2875, 3955, -1578, -2316, 3890, -1442, 1030, 3902, 3210, 5985, 2351, 384, -1501, -2426, 347, 3164, -2362, 764, 2360, -2600, -5968, -9189, -1251, -1078, -5138, -3318, -2353, -3429, -832, -1128, -4267, -5446, -5764, -6270, -2417, 2398, 8240, 6126, 1575, -605, 658, -491, 3286, 3656, -2862, -2834, 720, 553, 1570, 5383, 1483, 6102, 2209, 2208, 4515, -1013, 3495, 6518, 4238, 2800, -2984, -2495, -4184, -8343, -6957, -5577, -706, 9044, 5941, 5026, 8431, 3289, 179, 1331, 9226, 7572, 1686, -3685, 0, -1209, -1472, 2610, -2511, -5973, -887, 2430, 2184, 748, 4928, 2636, 1248, 6434, 5297, -740, -2125, -1191, 4470, 1896, 1374, 3400, 7508, -695, -7426, -4378, -3776, -423, -3365, -3868, -512, 6030, 7460, 640, -3831, -3404, -4525, -1131]
9679a131k960K606N77K386m14l43L329r87j90m212k334J019N25N096J783l975
9663G75K067j796q639Q073N99k266M510J241o426m64J002R494m396p310N05M209
9647A178o02k268K423K836r78O35p713m01n448R939P71P94L003k305m01o059q56
9630e452J008j255J522K351o380O173M558l0j462m3R33k615k168m353j697L106
9614e804O228L136n312K694L522J904p264J257n259l93J086K337m168K870l725
9599f891L02k99M926k090J227K826m912j355o890M460K305R44J785j938o53P108
9583H55K413K722k072o701J145k392K628k243N22k637j591L768M726j463m69K460
9567A671k731k072L757k24j959l8J08L09M039k362l054m670J889L815L302L259
$$ y = [-1131, -4091, -1485, -908, 1478, 1064, 721, 4050, 3063, 2873, -1339, -3673, -2654, -2129, 2967, 4750, 775, 2842, 1046, -7593, 480, 1079, -1187, 3323, 4564, -1862, -2326, -1324, 8170, 3774, -3536, -3031, 1178, 576, -1692, 731, 3567, 2589, 3224, -4489, -4890, -10338, -399, 372, 1166, 4169, 1864, 1463, -4596, -5452, -4444, -5699, -4177, -1826, -8206, -2033, 2525, 2495, 1033, 990, 1923, -692, -2860, -7213, -8910, -5804, 424, 3560, -1752, 942, 4464, 6368, -896, 361, -4898, -5291, -4205, -1868, -6036, -3166, -6891, -6589, -6888, -1962, -4052, -2825, 1, -4911, -6266, -13156, -8696, -6391, -5447, -3662, -5600, -6253, 855, 3268, 5990, 3918, -2783, -1638, -4030, -1402, -3645, -3123, -5760, -7351, -3583, 1143, -320, -789, 1671, -1060, -3132, 625, 401, -1558, -1596, -1488, -1179, 2860, 498, -2556, -7226, -5337, -1522, 1780, 5039]
9551E039r060k865K328Q43o99L017J563j681j075k09m816k120J987N785O73l157
9535d447k057Q73P00J619J281n267M22K90M796P13j726m13m473q98M098j797l470
9518i756L506Q03J781k020L650n974N03L552o87l815r11K976L760P72j920J609
9502b171Q85J479M177k217k860k478n698J766q72q42K170O018K624Q29k781n438
9486e409L316n83l350N954n86n046Q360m334R98j977K361Q88o740P51O016M311
9470D930m459p383P17M293J460J63m917K555K869k48k907m60m99l194M693K777
9454C90n315K117O47l437O900L304J974p731k746o61M24N308l01n190l894J819
9438f392r56j226M774J335j30J581p710q63O415j206K87m55L239k356l672J0601
$$ y = [5039, -4021, -6886, -4558, -3715, -4414, -1397, 166, -1515, -2590, -2799, -7615, -9735, -7748, -1963, -1290, -4447, -6504, -5631, -4931, -3312, -2031, -7298, -6876, -6586, -1790, -1077, -2803, -3216, -7689, -8587, -4489, -6286, -9756, -6250, -5447, -3666, -5686, -2036, -8010, -7507, -3955, -4642, -8457, -9368, -6392, -2632, -1860, -3780, -2171, -1286, 193, 4370, 2153, -707, -3185, -8883, -7117, -7989, -8831, -6661, -643, 1981, 2810, 29, -5409, -2093, -2676, -6026, -72, -658, -5704, 2656, -1678, -680, -2657, -296, 592, -6148, -5397, 619, 4930, 471, -6912, -6195, -1902, -442, -279, -5196, -2641, 228, -20, -2927, -3387, -3886, -7080, -2387, 390, -4925, -2808, -2161, -5598, 1302, 4606, 6580, -1151, -3897, -4558, -4134, 1174, 873, -4317, -8211, -6392, -7348, -8574, -3800, -2465, -2595, -1014, -8724, -9587, -3172, -4378, -4091, -4546, -1307, -3663, -7335, 3266]
9422C266k439J201L245o518l17j225M343O86m316J763L05l910l468N124m78J79
9406b559p08K333m984P432m726j722l69L966k794m428J816l365n33L185K748q04
9390e512J280k86K685n979K087R32M22J471q822q57Q184L222P3p960j853J452
9374i461M517k536K019k182K6K226L752L597m040o837K814M279l809j342k853
9359i830J810L811l950J839K095k380k35L303L779m571n844l188Q582Q744n205
9344a240l357Q01o321M014j679K576K712P68L615k234K102j426m342L56M720k791
9328a726n01K187k785n208l522K638N494P006m008J018J073L914j774k126L447
9313E127j933l032k275k739j710p48M741L11p896J176N05O270l300k633p27j957
$$ y = [3266, 827, 2028, 5273, -1245, -1562, -2787, 1556, 2242, -2074, -311, -6, -3916, -7384, -2260, -2738, -2559, -3267, -934, -5918, 1514, -3212, -4934, -5303, -1337, -4131, -8559, -6743, -10108, -10641, -7456, -4708, -5512, -4232, -4518, -1833, -7812, -5725, -4793, -4371, -2900, -11722, -12579, -4395, -1173, -1100, -9060, -10913, -9461, -4944, -7480, -5461, -7643, -7617, -5391, -1639, 1958, -2082, -8919, -6105, -1826, -5635, -6977, -9830, -8020, -4209, -8159, -6320, -4225, -6605, -6840, -3537, 242, -4329, -10173, -13361, -4779, 3965, -1240, -4597, -3796, -10117, -6103, -7782, -5206, -2494, -1726, 1889, -345, 1757, 331, -4011, -3655, 1065, -1726, -2227, -40, -2825, -8033, -11555, -8917, -3423, 3583, -425, 593, 1666, 5580, 3806, 1680, 5127, 3194, 162, -2113, -4852, -6562, -7310, -2569, -2258, -10154, -8978, -8473, -2203, -5503, -8136, -8863, -10820]
9297a0820r92j6R642K34R8k315O774k69r74J167J182j347l010K879k222o816J510
9280e295P37L305Q197j030O26m009l721k424M705R50k676O47J145l000M128m834
9264b549o786M215M78J309k868k257R66k97M706q32j590P501l816l421m008q13
9248a0062M735m259L747L023N32J716j106l911N253L240m644J135M024K072o051
9233e56l06k270M12K307m97L856m095Q10l165J199L144j716m522O137M840j407
9217D171o000L33m741R63l498l491N450O124k500m471M853J552q60j241L927l30
9201B41J592J144k332m223m618J491J584M212k435o500L688O73l318L206L591
9186b004m388N78j909M252k45K42L595j579P941n020r726L039p197P612L369n13
$$ y = [-10820, -11812, -11828, -2186, -1952, -1854, -4169, 2605, 2336, 1362, 2529, 3711, 2364, -646, 2233, 11, -6805, -5295, -4558, -1253, 6944, 5914, 6540, 2531, -1190, -3614, 1091, 2041, -635, 12, 1157, -1843, 2285, -2549, -9335, -5120, -4642, -3333, -6201, -8458, -7492, -7789, -3083, -3915, -5505, 1996, -1820, -5241, -9249, -10062, -5327, -9586, -5839, -2816, -2284, -568, -1674, -5585, -332, 2908, -1736, -601, 3423, 5495, -556, -862, -3132, -2720, -413, -910, 2946, -1149, -339, -3504, -2305, 839, -877, -5399, 738, 5578, 4171, -1829, -1496, -6237, -5274, -8772, -12263, -6813, -689, -3189, -7660, -2807, -1255, -2115, -3356, 571, 241, 1833, 2977, 645, -3578, -8196, -6705, -5121, -909, -3344, -9844, -6156, -5483, -8801, -5595, -2004, -6392, -5814, -7723, -3471, -3716, -3474, 121, -1458, 6483, 1463, -8263, -5224, -12421, -4809, -1440, -1953]
9170a953P786k776p78k217o776R28j413J0255N501L327k015n617n17l993P09O97
9154A148k606K196l002p12J368k396J997M537k254n590M004L432j959K57j070
9139f50n250k406j462P996L486K564l864p064p373n38M471K846J239Q849K801
9124E645k444j494j84L408j972j509n960J141K263k507O437l288p95N412J793
9109E946j976j998Q83l444j491J703R5R22K26n47Q753n587O889n11k962J544K766
9092A1211k288k340n096k584N180O782L646j0407K736M36l163j818M845K179M07
9077I726m227j567k996l883N895j038J992P60M87L698O723l899K67N736k694l468
9061A1512n516k647J712P829k329K71k033l047L396m94K458l621r64M784l656
$$ y = [-1953, 5833, 3057, 2279, 62, -6714, -5786, -7199, 3056, 8557, 11884, 9869, 4252, 3735, -258, 451, 1148, -1458, 738, -2264, -2976, -1608, -4004, -2007, 2530, 276, -5314, -1310, 2122, 163, 420, -650, -5900, -8306, -9768, -1772, 1714, 4278, 414, -6650, -14023, -14561, -10090, -7244, -6005, 2844, 5645, 3201, 1707, 1523, 4931, 2959, 1450, -4510, -3369, -1106, -3613, 2824, -464, -1259, 4153, 5946, 3970, 1972, 2855, -589, -2080, -377, -282, 640, 866, 319, 9072, 3485, 10374, 9863, 6901, 8445, 11211, 8923, 6583, 1487, -1097, 4083, 10865, 14511, 4104, 6840, 7276, 4113, 2295, 7140, 9319, 9726, 5499, 3932, 936, -2947, 2948, 1910, 3902, 4662, 5149, 8847, 15570, 11671, 11938, 17674, 14980, 11512, 5996, 3349, 5061, 12890, 10561, 10832, 8799, 5752, 9148, 8654, 11112, 7491, 6527, 11311, 7655]
9046G655K814n395J529M129j636m324P31M078Q96L632K764j592L603M861O70J753
9030B6168l642m66j0136J406O929J406n1m931N200K382j000J1381q40l734L654
9015C3726K053o371n01L910j115P448K741m592K301J243Q09M7Q96J230M880K534
8999E1239l731O996L935P652R306R126K376L748P956J4596J0060O982J6183J5653
8985A62077L373K435m385p009j662n541p304j468q120n079J697N160J56l53J2710
8970A46687J0101J2617N594M247J057j860L901q991j5748k988j4127o055k555
8957A31880q80k856j268m199J953J575O118R525M514J3776J3533Q817P898R130
8943A99516j843j829l537o607p898j6373j2551k526p655j543n462Q917P444Q080
$$ y = [7655, 10469, 5074, 6603, 10732, 9096, 4772, 5503, 9581, 10477, 14109, 16873, 15281, 18884, 23745, 24415, 26168, 22526, 22060, 11924, 13330, 20259, 21665, 21614, 16683, 21883, 24265, 23265, 34646, 33806, 30072, 33726, 35779, 29408, 28907, 32817, 31702, 39150, 41891, 37299, 39600, 40843, 41652, 41699, 42595, 43825, 48705, 51239, 47508, 54504, 58439, 66091, 75397, 84523, 86899, 90647, 98603, 113199, 123259, 130241, 146424, 162077, 165450, 167885, 163500, 156491, 154829, 149288, 141984, 140516, 132396, 127317, 129014, 134174, 134330, 133977, 146687, 156788, 169405, 174999, 179246, 180303, 178443, 182344, 173353, 157605, 154617, 140490, 134435, 131880, 131000, 128144, 126876, 122677, 124630, 126205, 132323, 141848, 146362, 160138, 173671, 182488, 190386, 199516, 197673, 195844, 192307, 185700, 177802, 161429, 148878, 146352, 138697, 137154, 131692, 140609, 148053, 156133]
8929A56133N345O772J1146M158j003k785r456q715j6187j5087r646j1060j3390
8916I6225j5127q94k365n783o960m589P21K321j543o617m396j881r723j510l30
8901C7549K752J619j923m524l563K133M829o896o371M480J04N051m252n050L506
8886B9444J61n692k892J459l82O523K292Nm60k328q074M239J019M061M67k39l201
8869B6402m866O174j975l990j960Q2K255K719j909j712Q78M573l725k127J333
8854B2152K19k332R95p028R83M505k237M155Q76J908J29j505j274R559k463J713
8838C0355j148n167M089J762n686k142Q66N823N843o876o104O90J813N548M67
8823C0133k806J146K91K459L04n036J11O911m628n21k774p11K993o578N100q92
$$ y = [156133, 161478, 168250, 179396, 183554, 182551, 179766, 170310, 161595, 145408, 130321, 120675, 109615, 96225, 81098, 80204, 77839, 72056, 65096, 60507, 61228, 63549, 62006, 55389, 50993, 49112, 39389, 37879, 37549, 40301, 41920, 39997, 35473, 31910, 34043, 38872, 31976, 25605, 30085, 30189, 35240, 30988, 25938, 29444, 29605, 23913, 21021, 22480, 22098, 28621, 30913, 30918, 30458, 28130, 20056, 24295, 25314, 29375, 29842, 29603, 26402, 21536, 27710, 25735, 21745, 19785, 19867, 22122, 24841, 22932, 21220, 22098, 26671, 22946, 20819, 22152, 22371, 20039, 21034, 14006, 14989, 19494, 17257, 21412, 22288, 24196, 24325, 22820, 21546, 31105, 28642, 30355, 29207, 24040, 28129, 29891, 24205, 22063, 22929, 28752, 34595, 27719, 21615, 22305, 24118, 29666, 30133, 27327, 28473, 28764, 31223, 31527, 26491, 26602, 33513, 28885, 28364, 25590, 24879, 27872, 21294, 26394, 25502]
8807B5502m052k276O152L06k200P267L702j325p34k668N272J210k009k376j763
8792C0008P515J601K499k369L557k66k330p533M413L512k023J354j27Q30J463
8777D2104j533j88O382n353j721L554L123K815L5L119m913L369j7O338L177J0558
8761G0849m13j337K67N156L64J373j22L652O57O083K097N330R579l74O601k71
8745A09491L208K597J1838Q715P897J3766J4615J5665J5336J6942J7416J2279
8733B49765K0321J3550l31o332j5101j0168j3354r602j4862k635M117l76O570
8720B21562j0418J1157J8542J7899J1382J4818J4024N451k033m888j0663j8505
8708B68328j5046j3530m281m649p620k781L65M120N560N550R121K2206K0065J9359
$$ y = [25502, 21450, 19174, 25326, 25632, 23432, 30699, 34401, 33076, 32342, 29674, 34946, 36156, 34147, 31771, 30008, 37523, 39124, 41623, 39254, 42811, 42545, 40215, 32682, 37095, 40607, 38584, 39938, 39811, 40641, 42104, 40571, 40383, 46765, 41412, 39691, 43245, 46368, 49183, 49218, 52337, 47424, 50793, 50776, 57114, 60291, 70849, 70436, 69099, 69366, 74522, 74886, 76259, 76137, 79789, 80446, 86529, 88626, 93956, 103535, 103161, 109762, 109491, 112699, 115296, 127134, 135849, 143746, 157512, 172127, 187792, 203128, 220070, 237486, 249765, 270086, 283636, 283305, 276973, 261872, 251704, 238350, 228748, 213886, 211251, 215368, 214992, 221562, 211144, 222301, 240843, 258742, 270124, 284942, 298966, 304417, 302384, 297496, 286833, 268328, 253282, 239752, 235471, 230822, 223202, 220421, 220786, 224906, 230466, 236016, 245137, 267343, 287408, 306767]
8694C06767J9246J8018J2140J3680M524j3780j9366j4660k0288j2085j3134q421
8682B72641l225j1219l03M666J3406J0601J0348K1410J7528R781m399p671j1019
8669C22545k3741k4158k3056k4012k2319j4305j3284j1207q062o169l933r012
8657A39287j436l034r650o896N555n978j2414j012n730n694j785J45K295k574
8643I1079l783k477k237l364K390K457O35N415N471P10K961K425j562n408o844
8628H7868K776o038m680K315l264l265n855j0931L528J0050M966k932n767j0610
8614E8161J211N626O713R11J110K953m578K388l09m221j156O069O83l806K47O858
8598G8860j134m575M444j683P434J589k246N344M9M38m37o026P484K064o177P31
$$ y = [306767, 326013, 344031, 356171, 369851, 374375, 360595, 341229, 326569, 306281, 294196, 281062, 272641, 269416, 258197, 257894, 262560, 275966, 286567, 296915, 318325, 335853, 345634, 341235, 333564, 322545, 298804, 274646, 251590, 227578, 205259, 190954, 177670, 166463, 158401, 152232, 148299, 139287, 137851, 134817, 125167, 118271, 123826, 117848, 105434, 104422, 98692, 92998, 91213, 91358, 93653, 91079, 87296, 84819, 82582, 79218, 81608, 84065, 84700, 90115, 95586, 96296, 99257, 101682, 100120, 94712, 87868, 90644, 84606, 79926, 82241, 78977, 75712, 69857, 58926, 62454, 72504, 77470, 74538, 68771, 58161, 59372, 64998, 71711, 72622, 73732, 76685, 72107, 74495, 74186, 69965, 68809, 74878, 75561, 71755, 72002, 78860, 77726, 73151, 77595, 75912, 83346, 84935, 82689, 88033, 88082, 88520, 88083, 82057, 89541, 91605, 85428, 86159]
8582H6159J746m841M249P826L84n85m65P927P781k869N85M342L690k334Q45J513
8566A15953Q950O334p313N757N905Q577M769j160N022R732N301k91Q561J4641
8552A90738J6020P196J9676J9282R187J1039K0805J8192J5251P336M054O703K637
8539C48116J1666J1476J8840K4615K0727L2309L0347K4119J2862J562P35j2119
8527E25255k4584j8167k0647j7728j944j267P253J3005J3847N321k272j5205k2705
8514D40162k8696l1619k9877r994j2401l148r11J0129M658J1593J4305Q426M897
8501C77524R109K336L484K890J67J1364J2878J1967K1897K7759K4417K6737J7479
8488E50008L043l095j0207k1205l2662k2019j7371j5343k719Q90J4389P318J56
$$ y = [86159, 87905, 83064, 87313, 95139, 95523, 94938, 94473, 102400, 110181, 107312, 107897, 112239, 115929, 113595, 114440, 115953, 124903, 131237, 123924, 129681, 135586, 144163, 148932, 147772, 152794, 162526, 167827, 167536, 176097, 190738, 206758, 213954, 233630, 252912, 262099, 273138, 293943, 312135, 327386, 334722, 338776, 345479, 348116, 359782, 371258, 390098, 414713, 435440, 467749, 498096, 522215, 535077, 536639, 537374, 525255, 500671, 482504, 461857, 444129, 442185, 440918, 448171, 461176, 475023, 480344, 478072, 462867, 440162, 411466, 379847, 349970, 339976, 327575, 324427, 323516, 333645, 338303, 349896, 364201, 372627, 377524, 386633, 388969, 392453, 395343, 395510, 406874, 419752, 431719, 453616, 481375, 505792, 532529, 550008, 553051, 549956, 539749, 518544, 485882, 463863, 446492, 431149, 428430, 429320, 443709, 451027, 451183]
8475D51183o108k2044k9402l1864l3241k2880k3842j5339j7195q954o028n695
8463B28591m184M026k462j603k947J1257P266N282N992N265l398r227M79m019
8449B40318n881J840q81P269O21K885N482q713K553L498J776m568J682p8N554
8434B53357P091N102J6274J3912J2232J6965J3833N249R87l064m067q91l606J694
8420C35068J3597J1928R859K0301J8406J1650R125l220j4345j3854j4846p198
8408C76471r568j1331o000n781J024O295k432J368J193q547o300J65L055J896
8394C41508k17N125M079O627J4264K4818J9468J7818J7102J0540N2j3265j3568
8381D34351j8134j3602l963l905K443L477J4915J577k823n305j7996k2400j8970
$$ y = [451183, 445075, 423031, 393629, 361765, 328524, 305644, 281802, 266463, 249268, 240314, 234286, 228591, 224407, 228433, 225971, 224368, 221421, 232678, 239944, 245226, 251218, 256483, 253085, 243858, 244337, 240318, 234437, 236277, 235396, 242665, 243286, 246171, 251653, 242940, 245493, 248991, 250767, 246199, 247881, 247803, 253357, 260448, 265550, 281824, 295736, 307968, 324933, 338766, 344015, 345002, 341938, 337871, 336980, 333374, 335068, 348665, 360593, 370452, 390753, 409159, 420809, 429934, 426714, 412369, 398515, 383669, 376471, 366903, 355572, 349572, 343791, 344815, 351110, 348678, 350046, 351239, 342692, 336392, 336557, 339612, 341508, 341291, 346416, 350495, 357122, 371386, 396204, 415672, 433490, 450592, 461132, 461184, 447919, 434351, 416217, 402615, 398652, 394747, 397190, 400667, 415582, 417159, 414336, 409031, 391035, 368635, 349665]
8368C49665k3056j8109k0508j0337j2694r853m579o829j87j2052L279q479j1362
8355B14899m021j855j1868j433N896L174q68N523J174R168O603K826O859m476
8341B31601q753r484r761R05o811n760j140m465j012k575o514j2129q726j3050
8327A42326j7793j0203j0156o474r713n164j572o663L383j138r857K605l392k870
8313F3319J481j475j719k380K402l059M900k098J267n602j532L645j338n367o456
8298D5988K325K512m20M85q080l079J045M673l420j822o235j580N932m78q910
8283B8936m968K253k810L077l48K084L033k606n46J830J19m163l237K826M246
8268B9726o93l227J977P078M907p499k893j945m676p85J892k752L162j247p89
$$ y = [349665, 326609, 308500, 287992, 277655, 264961, 255108, 250529, 243700, 243513, 231461, 234740, 226261, 214899, 210878, 209023, 197155, 195722, 201618, 204792, 203924, 209447, 210621, 219789, 226392, 229218, 236077, 231601, 222848, 213364, 203603, 204508, 197697, 191937, 190797, 186332, 185320, 182745, 176231, 164102, 155376, 142326, 124533, 114330, 104174, 97700, 87987, 82823, 81251, 74588, 77971, 76833, 66976, 69581, 66189, 63319, 64800, 63325, 61606, 59226, 61628, 58569, 63469, 61371, 62638, 57036, 55504, 59149, 57811, 52444, 45988, 48313, 50825, 50405, 50890, 42810, 39731, 40776, 45449, 42029, 40207, 33972, 32392, 38324, 37846, 28936, 23968, 26221, 23411, 26488, 26140, 28224, 31257, 28651, 28105, 29935, 30054, 25891, 22654, 25480, 29726, 29033, 25806, 27783, 34861, 39768, 32269, 29376, 27431, 22755, 21970, 23862, 21110, 24272, 23025, 22236]
8253B2236L10j986j908J605p219N207q54m031K610J097J522M90j470k028Mk874
8237A2711o834l91P713j612k751l83N403o818P67J987k787M655k834l611L520
8222H735M891O245m11m242n683J170K297l861J381K028o113O97N84N407J258m591
8206I792L36n83L873k578K209M12l653M110R20J1997r272K930M725J5373j6992
8191B3599l3736J5218K815QJ885m70o98J678p065P838l395K746k285M235K612
8176A4985o498L703J093o263m55k819M455O658j1052l718M693N128l91k047r98
8161F474k47K83N679j685J730m62n085N7O267J033q84N15m153N488K509l588J34
8144A4065m967J807M619M042l25o445j117j954O853M430m997m296n717N444n497
$$ y = [22236, 22546, 20560, 18652, 20257, 13038, 18245, 17391, 13360, 15970, 17067, 18589, 19079, 17609, 15581, 15585, 12711, 5877, 5486, 13199, 11587, 8836, 8453, 13856, 7038, 7805, 9792, 7005, 11660, 8826, 5215, 8735, 13626, 19871, 19460, 15218, 9535, 10705, 13002, 9141, 10522, 12550, 6437, 7134, 7718, 13125, 14383, 9792, 10128, 9545, 13418, 10840, 13049, 13461, 9808, 13918, 14838, 26835, 17563, 20493, 25218, 40591, 23599, -10137, 5081, 7896, 7904, 9789, 9319, 8621, 10299, 3234, 11072, 7677, 10423, 8138, 12373, 14985, 8487, 12190, 13283, 7020, 6565, 3746, 8201, 14859, 3807, 89, 4782, 9910, 9519, 7472, 6474, 6227, 6510, 12189, 10504, 12234, 11772, 6687, 6744, 13011, 14044, 13160, 13675, 9522, 15010, 17519, 13931, 14065, 9098, 10905, 15524, 19566, 19241, 12796, 11679, 9725, 16578, 21008, 16011, 11715, 5998, 11442, 5945]
8129E945K872N805j597J131M29L061n945m192L698l979P492l337k261L25j532
8114G915p23o89o46L578O72l69L568M068n713n532J268k025L616O1M64l123P506
8097A3896l589J986k782K412k234j449m829n10K691L049L622l218m092q26j136
8082B991q90K236k48R830j9n549J326J062r89m862l891P955q77Q81O67K272K878
8065A4773K4Oj4J744o857r93K765n152j491P80L46r2M447J869m033j376K921L954
8047A3621n09m2R052r054o318Q08m919M659m708m707R696K990R67K293l193L9
8031A0675l937R09N163o698k974J217l295L470L728J948J181l083m3l052O38P705
8015A3552k637J38L157J47k120K317m358J910n600J482Q101j1470L099K750j973
$$ y = [5945, 8817, 14622, 13025, 14156, 14585, 17646, 11701, 7509, 11207, 7228, 14720, 11383, 9122, 9447, 7915, 7192, 6503, 5857, 9435, 10107, 9738, 13306, 17374, 11661, 6129, 7397, 5372, 8988, 9049, 9513, 6390, 13896, 10307, 12293, 9511, 11923, 9689, 8240, 3411, 2901, 5592, 8641, 12263, 9045, 4953, 4127, 2991, 2101, 4337, 4089, 13919, 13900, 8351, 9677, 10739, 9750, 4888, 997, 8952, 8075, 8956, 9623, 11895, 14773, 14797, 14803, 14789, 16533, 9676, 8683, 11448, 6296, 4805, 5585, 5931, 5839, 10286, 12155, 8122, 6746, 9667, 13621, 13112, 13070, 22122, 13068, 6750, 7558, 2639, 7298, 2590, -2117, 7579, 10569, 11536, 13829, 10636, 10675, 6738, 7647, 12810, 6112, 3138, 4355, 1060, 4530, 8258, 10206, 11387, 8304, 8261, 5209, 5847, 13552, 10915, 11053, 14210, 14357, 12237, 14554, 10196, 12106, 6506, 7988, 16089, 4619, 7718, 10468, 8495]
8000H495L747L449K012k200n881j591M259j044j933K285l238j931M793n669K295
7985G848K287L642n262k220K078j817M361K081R29J153n730N22K11l453J731M515
7969A2876R21m429r626K874J313J53M320M204l5k967J263J083N479k091q71n251
7953I216O919j127O48L887m846m077l998J514J671L488N449r314n96M931k668
7938A1097o611K843k046q65J0049j753j937m051m057M52L227K246L895j965j70
7923A0354P999m543j556M331J237n876o616j086J1338M436k086j1129K675l596
7909E882M224J604L445l991k124J961o33O020p96K247j006L004m872l723N612
7894A6854R49k525J540p204J116j13r64N86M220Q39J129p103J369K946o050N98
$$ y = [8495, 12242, 15691, 17703, 15503, 9622, 8031, 12290, 11246, 9313, 11598, 8360, 6429, 11222, 5553, 7848, 10135, 13777, 8515, 6295, 8373, 6556, 10917, 12998, 13927, 15080, 9350, 9872, 10083, 6630, 8361, 12876, 13797, 9368, -258, 2616, 3929, 4082, 8402, 12606, 12571, 9604, 10867, 11950, 17429, 15338, 14467, 9216, 16135, 15008, 15656, 19543, 14697, 10620, 6622, 8136, 9807, 13295, 18744, 9430, 8834, 13765, 11097, 4486, 7329, 5283, 4418, 14467, 12714, 10777, 6726, 2669, 3121, 6348, 8594, 12489, 10524, 10354, 18353, 13810, 12254, 16585, 17822, 11946, 5330, 4244, 15582, 20018, 17932, 6803, 9478, 5882, 10106, 11710, 15155, 11164, 9040, 11001, 10368, 16388, 15592, 17839, 16833, 19837, 14965, 11242, 16854, 17803, 15278, 16818, 9614, 10730, 10617, 9653, 10239, 14459, 15298, 16427, 9324, 10693, 13639, 7589, 8187]
7878H187R28K586l622M474M267p30l898L07k028l4N108l247J456j952R49O682
7862A9433M498j1006o451Q177k589Q498J061l178M851m208M433q515J893k359
7848A4538m143J724J113m347J669j179J383l362P59M480m176N057n863o147o510
7833e004L584P110K983K808j691l14M564j180n237k148J007J3153m85j491J807
7818A9466p453n957J127M234J660l50o060j1140O984P729J599M026j406p24k240
7803A1495L717J63o22J241l379p80j612J31O46l404K864L759O315J139l509k342
7787A5822K388m173r164J260R3R96P470q25J703j471m059m98K135L571j143r44
7771A3161j503M591L503k784J366l774q970J85K423K774L929J343j117L13k919
$$ y = [8187, 9115, 11701, 8079, 12553, 16820, 16090, 12192, 12499, 10471, 10437, 15545, 12298, 13754, 11802, 12751, 19433, 23931, 12925, 6474, 14651, 12062, 20560, 21621, 18443, 23294, 19086, 23519, 15004, 16897, 14538, 10395, 12119, 13232, 8885, 10554, 9375, 10758, 7396, 8155, 12635, 8459, 13516, 7653, 1506, -5004, -1420, 5690, 8673, 11481, 9790, 9476, 14040, 12860, 7623, 5475, 6482, 19635, 19150, 17659, 19466, 12013, 6056, 7183, 11417, 13077, 12727, 6667, -4473, 2511, 10240, 11839, 15865, 14459, 13735, 11495, 15212, 15375, 14753, 15994, 12615, 11835, 10223, 10354, 11000, 7596, 10460, 14219, 20534, 21673, 18164, 15822, 18210, 14037, 4873, 6133, 6226, 7222, 14692, 13867, 15570, 14099, 10040, 9542, 11677, 15248, 14105, 13161, 11658, 16249, 19752, 16968, 18334, 14560, 5590, 5775, 8198, 10972, 14901, 16244, 15127, 15440, 12521]
7756A2521O42K683j574J857o789N082L979l555J837%O868J070N81r792o309L924
7740A3025M226O632l043l097k935o450j029N451L19l210K995K918j58J325J233
7725A8202J169o246L20j406K461J014o873M50l195O059J0260j688l559j117k605
7710A3246J050o84m334L692L867Q486k011k153l032o691N78J185O50R764K839
7695B6452q122j473n194Q38Q64J772%l9K252K910j532k202M2J186m283l032N069
7678A5508J813J860j85p507n75J52k16M906J52M035K355k710O13K759m604O38
7662A8994K183M57k017J515p446k403J267L135J938j67K710L006l202j140k727
7647A6103M830q173K06K185r88R27k31K400m761J0636M499o993r73K427R10l59
$$ y = [12521, 13163, 15846, 14272, 16129, 9340, 14422, 18401, 14846, 16683, 16683, 23551, 24621, 25202, 15410, 9101, 13025, 17251, 23883, 20840, 17743, 14808, 8358, 7329, 12780, 13099, 9889, 12884, 15802, 15644, 16969, 18202, 19371, 13125, 13445, 12039, 14500, 15514, 8641, 9091, 5896, 11955, 22215, 20527, 16968, 15851, 13246, 14296, 13612, 9278, 12970, 16837, 25323, 23312, 21159, 18127, 11436, 12014, 13199, 13849, 23613, 26452, 18330, 16857, 11663, 12501, 13365, 15137, 15137, 15098, 17350, 20260, 18728, 16526, 16568, 17754, 13471, 10439, 15508, 17321, 19181, 18996, 11489, 10914, 11066, 10850, 15756, 15908, 19943, 22298, 19588, 20201, 22960, 18356, 18994, 21177, 21634, 19617, 21132, 13686, 11283, 12550, 15685, 17623, 17456, 20166, 23172, 19970, 18830, 16103, 20933, 12760, 12966, 15151, 14163, 15090, 14859, 17259, 12498, 23134, 27633, 20640, 19667, 22094, 23004, 22645]
7631B2645m178L895K222k741q714M829J789R63k50J914l322k545K263N747J502
7616B6019O51n821k981m245O205J628J451P923K24j547k467j1205O98N690J201
7601B3424L541l159N937p874L337Q77k065j088j637k33j901N739N21n22k099O355
7585B9153J819n26o221K046l208J082r0K287m352l394L110l663O089M755k708
7570B6179j0084k586M221J293L887N226l196m888L033p28j474M481j024k942p09
7555B0689k502P08K554k639m425M184L389J413P728j587j758o265K931l589m495
7540A6336J377m455q7R89k641Q627O824j891o253N006k414L135J738k274l444
7525B0573J236J849m771M414K078J975j2205L133J1157l171K311n111l608O25
$$ y = [22645, 18467, 22362, 24584, 21843, 13129, 17958, 19747, 20710, 20460, 22374, 19052, 16507, 18770, 24517, 26019, 26670, 20849, 17868, 13623, 19828, 21456, 22907, 30830, 31054, 29507, 27040, 15835, 16533, 22223, 23424, 26965, 23806, 29743, 21869, 25206, 26083, 24018, 22930, 21293, 21060, 19159, 24898, 25419, 24897, 22798, 29153, 30972, 30446, 24225, 26271, 23063, 24145, 24055, 26342, 21990, 18596, 21706, 18043, 24132, 28887, 26179, 16095, 13509, 17730, 19023, 22910, 28136, 24940, 20052, 23085, 22357, 20883, 25364, 24340, 21398, 20689, 18187, 18895, 21449, 18810, 14385, 18569, 21958, 23371, 31099, 29512, 27754, 21489, 24420, 20831, 16336, 17713, 13258, 13171, 14160, 11519, 20146, 26970, 25079, 18826, 23832, 21418, 24553, 26291, 24017, 20573, 21809, 23658, 18887, 23301, 25379, 27354, 15149, 18282, 29439, 26268, 28579, 23468, 19860, 20485]
7511B0485L606k87O316j190n243j630L81P740k460q98k736M513K495k100K536
7496C1528k974n71k069L644K650j788l392R46N967l866j1701L198J14K219N080
7481B8985l805m232j262M038j439m2K317j229q553M940J56K983O550O26o313r77
7465B2743q82n436j794N528k246K431M276K657J79Q15j316p361N791k38L179K506
7449C0832n343n581O147M399l627k236l527L809O492j094r299N480K913K233K235
7434C3833k570J15n711L706L73m013p159L034k275M620M650n14k138n47Q314p132
7418B6586m424K989j743j274M35K652L423J951k846j795n872m265M382O123K05
7403B6527m205N212K966k960n826k95M333j454R071j813m954k281M19P260K498
$$ y = [20485, 24091, 23804, 30120, 28930, 23687, 22057, 22438, 30178, 27718, 26820, 24084, 28597, 31092, 28992, 31528, 28554, 27983, 25914, 29558, 32208, 30420, 27028, 27974, 33941, 30075, 18374, 21572, 21686, 23905, 28985, 25180, 20948, 19686, 23724, 22285, 22243, 24560, 23331, 14778, 19718, 19874, 22857, 29407, 30033, 23720, 22743, 21861, 16425, 14631, 20159, 17913, 20344, 24620, 27277, 27456, 28271, 26955, 19594, 25385, 25147, 28326, 30832, 25489, 19908, 26055, 30454, 26827, 24591, 21064, 24873, 31365, 30271, 20972, 26452, 29365, 31598, 33833, 31263, 31378, 25667, 29373, 29746, 25733, 18574, 21608, 19333, 23953, 28603, 28089, 25951, 25404, 33718, 26586, 22162, 25151, 23408, 22134, 22569, 25221, 28644, 30595, 27749, 25954, 20082, 15817, 20199, 26322, 26527, 22322, 27534, 30500, 27540, 21714, 21419, 25752, 24298, 33369, 31556, 26602, 24321, 24740, 32000, 34498]
7388C4498j811Q61m39m223K609j105P69o57M317j621R42l396k368Q99J569O04
7372C1448J010l670j858M456J935J728m52r8J573l315k41l291k32N291K62j462
7356C3084k617o78L377K524l228N04Q67J297M447p128m310j571K849J632K439
7341C3488j500m158J2k448O686q29J992O18J2p004L327N875K324l509j588L677
7325C6975m343J20K177J900k856n60k35L141K770L222o973l357K524R193K024
7310D5722m019p41L324N241l284j718l919j638K534R0L606j723r26k050Nl302
7294C7202j552P981l182l337n527K540K479j586k018l61L901j187O899r64l319
7279C7969J505K087k13j0763n76O57M154N940m25j095L99j187k472J286J801P656
$$ y = [34498, 32687, 33548, 33109, 28886, 31495, 30390, 31159, 30502, 34819, 33198, 34140, 30744, 28376, 29275, 30844, 31448, 32458, 28788, 26930, 31386, 33321, 35049, 34597, 34499, 36072, 32757, 32516, 29225, 28993, 34284, 34546, 33084, 30467, 29789, 33166, 35690, 32462, 32966, 33833, 35130, 39577, 32449, 28139, 26568, 29417, 31049, 33488, 31988, 27830, 27842, 25394, 32080, 31251, 33243, 33861, 33873, 26869, 30196, 36071, 38395, 34886, 33298, 36975, 32632, 32752, 34929, 36829, 33973, 33413, 33178, 36319, 39089, 42311, 35338, 31981, 34505, 43698, 45722, 41703, 40962, 44286, 49527, 46243, 44525, 40606, 38968, 41502, 41592, 45198, 43475, 42549, 40499, 40504, 37202, 35650, 43631, 40449, 37112, 31585, 34125, 36604, 35018, 33000, 32639, 36540, 35353, 42252, 41288, 37969, 39474, 41561, 41348, 30585, 30009, 30666, 34820, 40760, 40335, 39240, 39639, 38452, 35980, 37266, 39067, 46723]
7263D6723R51o854k648K874j586K56P963p597j010o911O971L873k631R65m745
7248C6594J2J572M741k818n363M821m32L923N899l831j37J629M896q13k75M022
7232E4440l045o278j147K996n611L451Q93K646K889m260m22k935k205N780O91
7217D7883J125L141J970K342j901q985l914K235K765J922l59j467k293M466M94
7202D9424l936N7O883L453N54o749J40M03K201K847m123P6o71Q55J80K858J896
7185E6348n14q607L694N595j683L205J042J960j515q01J353N98k043L135k233
7170E9534R90O312Q21l202n529J64o08m840m114N674L955o788O532J494n428N435
7154F0402M003m624o67j0488N321O62L612N815K810n89q544l622K726O609L330
$$ y = [46723, 47674, 40820, 38172, 41046, 39460, 39716, 47679, 40082, 39072, 32161, 39132, 43005, 40374, 41339, 36594, 36606, 38178, 42919, 40101, 34738, 39559, 39127, 43050, 48949, 45118, 44981, 46610, 51506, 50693, 50418, 54440, 51395, 45117, 43970, 46966, 41355, 44806, 45699, 48345, 51234, 46974, 46552, 43617, 41412, 47192, 47883, 49008, 52149, 54119, 56461, 54560, 45575, 41661, 43896, 46661, 48583, 48224, 46757, 44464, 48930, 49424, 45488, 45545, 52428, 55881, 56435, 49686, 49826, 50229, 52430, 55277, 51154, 51230, 50559, 51414, 51594, 54452, 56348, 55834, 47227, 50921, 56516, 54833, 58038, 59080, 61040, 59525, 58724, 60077, 60675, 58632, 61767, 59534, 60524, 66836, 67657, 64455, 58926, 59090, 58482, 53642, 49528, 55202, 59157, 52369, 58901, 60395, 54967, 60402, 64405, 59781, 59114, 48626, 53947, 54609, 58221, 64036, 66846, 66257, 57713, 54091, 56817, 63426, 66756]
7139F6756m417O86J062J58l56j872J234m913m761O037Q162m337j672n067K983
7124E9683M845l416k564P91K208J086M225m051n857P481J71P88K9k706l238n318
7108E4157K543M693p47l797k356N962O726l822l194J694M19j762L868l472k256
7093E8656J516n46m120L925L812p883K862o62n37K709k963j265j21J493k759P333
7077F1450m45M131J923O63o01k683l194k090N24M716P110m897J78j547k253L558
7061F6543o409l039n75k062N339k995P10l634k94O796M959M016n711k480O601
7046F7765O59j552l167j952L264j970L110M813l576p4O3N519p846N243m054K388
7030F8633J088j429J725K450o307J869P550p88m86N67J488K486k994k416L621
$$ y = [66756, 62339, 63025, 64087, 64245, 63889, 62017, 63251, 58338, 53577, 59614, 67776, 63439, 61767, 56700, 59683, 64528, 61112, 58548, 59339, 61547, 62633, 66858, 62807, 56950, 64431, 64602, 65390, 65419, 62713, 59475, 54157, 56700, 61393, 60646, 56849, 54493, 60455, 67181, 63359, 60165, 61859, 62278, 60516, 64384, 60912, 58656, 60172, 59626, 55506, 59431, 63243, 55360, 58222, 57560, 57023, 59732, 56769, 55504, 55383, 56876, 54117, 61450, 61005, 65136, 67059, 67722, 67121, 64438, 61244, 59154, 59678, 64394, 71504, 66607, 66785, 65238, 62985, 66543, 60134, 57095, 56520, 54458, 59797, 56802, 57512, 53878, 53584, 60380, 65339, 69355, 63644, 61164, 67765, 68424, 66872, 63705, 61753, 65017, 63047, 66157, 70970, 67394, 67320, 67383, 72902, 65056, 70299, 66245, 68633, 69721, 68292, 70017, 72467, 66160, 68029, 75579, 74791, 74305, 74872, 76360, 78846, 75852, 73436, 77057]
7015G7057J453n82K822N920N733l666r873L704N209l145M639K549K34j35o72L910
6999I5157J421k205m746M431N608j04j939m105L52M234l651j370Q194L835p95
6984A04317J450k85J922J853N1j587K095l440m521j762M536M605j510N983O904
6969A20611m041o062K031R615R43j519K651L944K395Q500M390o050K830O099k750
6954A43587j815j527N708k549N918J117l14J388K880K357p394J023P382M703K818
6939A65282M955m16q78Q437j089L559O194O706K155N619K758N487P597k129P878
6924B22115J1012R378L173P426R983M762O530Q746K899j017o499m54K188J949
6910B82191m715n310o71m375l626J269N31o365J428R59l158q49J822J0853L58
$$ y = [77057, 78510, 77928, 80750, 86670, 92403, 88737, 78864, 82568, 87777, 84632, 89271, 91820, 92054, 91919, 91247, 95157, 96578, 94373, 89627, 94058, 99666, 99562, 97623, 93518, 93870, 98104, 94453, 93083, 101277, 105112, 104317, 105767, 105482, 107404, 109257, 109308, 107721, 109816, 106376, 101855, 100093, 104629, 109234, 107724, 113707, 120611, 116570, 110508, 112539, 122154, 123097, 121578, 124229, 128173, 130568, 139068, 143458, 137408, 140238, 146337, 143587, 141772, 140245, 145953, 143404, 149322, 150439, 150125, 151513, 154393, 156750, 149356, 150379, 157761, 162464, 165282, 170237, 169821, 168943, 177380, 176291, 179850, 186044, 192750, 194905, 200524, 203282, 208769, 216366, 214237, 222115, 233127, 242505, 245678, 253104, 263087, 267849, 274379, 283125, 286024, 285007, 278508, 278054, 280242, 282191, 277476, 272166, 271495, 267120, 263494, 264763, 265294, 258929, 260357, 261316, 258158, 257309, 259131, 269984, 270342]
6895B70342K374Q758J747p15Q241R615O297Q438L899P578J1651O290J0925J5449
6881C70889R578J0548J1304J1335M82N813K429n893p94n403j1453o310j1420r710
6867C71395p07p694k701j1793r080q693o108j457o675J021j167l71m45m1l097
6852C12387Q905Q466P64M931o4K172J4925J1643O777R174P029J1975Q382o04J659
6837D08521Q693j159J779l891j3981j0638j0266j2047p092m839j5556r446j0467
6824C19611m682m037p144l511j859k604j248M311n481M82P266j580k094k089O161
6809C01502J0179N487K347P510N924M944P933J1503J3081J912N512K747q46m075
6795C75660j4957j2130l323j1455j4412r639o48j2205n908q534k883J764p019
$$ y = [270342, 272716, 281474, 283221, 282506, 290747, 300362, 306659, 315097, 318996, 326574, 338225, 344515, 355440, 370889, 380467, 391015, 402319, 413654, 414136, 419949, 422378, 416485, 415691, 410288, 398835, 392525, 381105, 371395, 370688, 362994, 360293, 348500, 339420, 330727, 324619, 323162, 316487, 317508, 316341, 315970, 315525, 315484, 312387, 321292, 329758, 330522, 335453, 335389, 337561, 352486, 364129, 370906, 380080, 387109, 399084, 407466, 406862, 408521, 417214, 416055, 417834, 413943, 399962, 389324, 379058, 367011, 359919, 355080, 339524, 330078, 319611, 314929, 310892, 303748, 300237, 298378, 295774, 294526, 298837, 293356, 293838, 301104, 299524, 297430, 295341, 301502, 311681, 317168, 319515, 327025, 332949, 337893, 345826, 357329, 370410, 372322, 377834, 380581, 379735, 375660, 360703, 348573, 345250, 333795, 319383, 309744, 309096, 296891, 290983, 282449, 279566, 281330, 274311]
6782B74311l686j501N636L61q383l452j023K903M017K953Q16K165R203Q216j362
6767B91174M179m344R47O578J716P336M460K507N74L234o590p031K377l732J33
6752C03518o347m733o332l521k529L02j0529l159p073q413p45n222J970k614m672
6737B39901o100M30n66k6L884R9o415J111O954k04L132l224m630J428L300J1918
6721B50992j994k821J110j234L532Q4M044n979l778Mm800l980k144L58k185M770
6705B35979p297J209p91O201n300k650o948O691R37q174P794P065j597m011L267
6690B32375l788n164M018P196Q209j680O531J6847P578J01O835Q684k372J332
6676B86702o74l254K151n07J335j217j191L637k473M275Q742P216J419Q192L005
$$ y = [274311, 270625, 269124, 274760, 275121, 266738, 263286, 262263, 265166, 269183, 272136, 272952, 275117, 284320, 292536, 291174, 295353, 291009, 291956, 298534, 300250, 307586, 312046, 314553, 315127, 318361, 311771, 304740, 307117, 303385, 303518, 297171, 292438, 286106, 282585, 280056, 280358, 269829, 266670, 259597, 251184, 250439, 245217, 247187, 244573, 239901, 233801, 234231, 233665, 233639, 237523, 237622, 231207, 232318, 239272, 239068, 242200, 238976, 234346, 235774, 239074, 250992, 248998, 246177, 247287, 246053, 249585, 249669, 253713, 247734, 243956, 243960, 239160, 235180, 233036, 233394, 231209, 235979, 228682, 229891, 229100, 235301, 230001, 227351, 220403, 227094, 228031, 219857, 227651, 234716, 233119, 229108, 232375, 228587, 223423, 227441, 234637, 242846, 241166, 247697, 264544, 272122, 272223, 279058, 287742, 285370, 286702, 286028, 282774, 284925, 284418, 285753, 284536, 283345, 286982, 284509, 288784, 297526, 304742, 306161, 314353, 317358]
6661C17358L330L798l284r08m325l617O50J0528M812K909K233J1697p43P710q59
6646C51289o193j769k638j524j430O296j715p83K745M042M763m775O740L352M539
6631C62939M961J2062J3260J2153J3720J1249M791P442O561O425J0979j682m31
6618D64429j891R79J0352J1055Q449R768j039N636L154Q120J1506R902O762J1582
6604E58764R657O132L555P278O457O745P642N814O452Q308O688K767P788J3021
6590F57068N618J4255J7065J2884J6290J5745J0732R194R060J2020J1800J2859
6578H04590J2997J0373M353J3437N785O785R798M213Q265J6111Q323R767J4842
6565I29639J7016J5375J1405J5210K0637K0077J4022J8042J7888J3927J6160O810
$$ y = [317358, 320688, 324486, 321202, 320294, 315969, 312352, 313002, 323530, 328342, 331251, 333484, 345181, 344438, 352148, 351289, 345096, 343327, 340689, 339165, 337735, 344031, 342316, 341533, 344278, 348320, 353083, 348308, 355048, 358400, 362939, 367900, 379962, 393222, 405375, 419095, 430344, 435135, 442577, 449138, 455563, 466542, 464860, 464429, 462538, 463517, 473869, 484924, 493373, 503141, 502102, 507738, 510892, 519012, 530518, 540420, 547182, 558764, 568421, 574553, 578108, 585386, 591843, 598588, 606230, 612044, 618496, 626804, 633492, 636259, 644047, 657068, 662686, 676941, 694006, 706890, 723180, 738925, 749657, 758851, 767911, 779931, 791731, 804590, 817587, 827960, 832313, 845750, 851535, 858320, 868118, 872331, 880596, 896707, 905030, 914797, 929639, 946655, 962030, 973435, 988645, 1009282, 1029359, 1043381, 1061423, 1079311, 1093238, 1109398, 1116208]
6553A116208R043L870J5485K2360K3210K6630L2539L5878M1689L7100L6162J8987
6541A419161M094j0631j2748j5544k8416m2688m0048j6653q509m50J2680J5575
6529A275823J0972J1095K1216K3831J1464L122J5992M025K556P768K967N806K0713
6516A417350K2908L8241N4315N2569M9551M0984M5357M9925M2198L9539L9513
6505A892450L3253L0780K6721L2241K4972K1856K6975L2538K9940J8908K305R442
6493B182381J1899K1219L2281M0305M1635M2697N5308N4736N1789N1295M1755
6482B627300M8047M4657M5045M8678N3333N9610O0186N7602P4755P7653Q4062
6471C280928P2696P5012O6116O1656N1302L5322L2650K7937K2732L5055N0353
$$ y = [1116208, 1125251, 1129121, 1144606, 1166966, 1190176, 1216806, 1249345, 1285223, 1326912, 1364012, 1400174, 1419161, 1423255, 1412624, 1399876, 1384332, 1355916, 1313228, 1273180, 1256527, 1248018, 1247568, 1260248, 1275823, 1286795, 1297890, 1319106, 1342937, 1354401, 1357523, 1373515, 1377540, 1380096, 1387864, 1390831, 1396637, 1417350, 1440258, 1478499, 1532814, 1585383, 1634934, 1675918, 1721275, 1771200, 1813398, 1852937, 1892450, 1925703, 1956483, 1983204, 2015445, 2040417, 2062273, 2089248, 2121786, 2151726, 2170634, 2172939, 2182381, 2194280, 2215499, 2247780, 2288085, 2329720, 2372417, 2427725, 2482461, 2534250, 2585545, 2627300, 2675347, 2720004, 2765049, 2813727, 2867060, 2926670, 2986856, 3044458, 3119213, 3196866, 3280928, 3353624, 3428636, 3494752, 3556408, 3607710, 3643032, 3675682, 3703619, 3726351, 3761406, 3811759]
6460C811759N7160O1618O5735O2091P2161O9417P2027O1167O8069P1704P9950
6449D552858R1417J01436J11458J35046J43330J60476J71187J75686J66386J58575
6439E967855J72306J67436J49729J72899K00799K09397K09814K26509K41949K52700
6429G971393K45815K46226K27879K27973K41668K40490K36078K42675K33498K22147
6419A0335842K13369K04138J99208K14666K39117K59621K71441K98141L13264
6410A2548807L29464L41662L33091L15360L26848L22474L31585L48949L63858
6401A5562098L89185M13597M43383M81108N21497N66200O29321O72033P10752
6392B0389174P47766P61974P99770Q82833R67625J048012J090831J143777J222804
$$ y = [3811759, 3868919, 3930537, 3996272, 4058363, 4130524, 4199941, 4271968, 4333135, 4401204, 4472908, 4552858, 4644275, 4745711, 4857169, 4992215, 5135545, 5296021, 5467208, 5642894, 5809280, 5967855, 6140161, 6307597, 6457326, 6630225, 6831024, 7040421, 7250235, 7476744, 7718693, 7971393, 8217208, 8463434, 8691313, 8919286, 9160954, 9401444, 9637522, 9880197, 10113695, 10335842, 10549211, 10753349, 10952557, 11167223, 11406340, 11665961, 11937402, 12235543, 12548807, 12878271, 13219933, 13553024, 13868384, 14195232, 14517706, 14849291, 15198240, 15562098, 15951283, 16364880, 16808263, 17289371, 17810868, 18377068, 19006389, 19678422, 20389174, 21136940, 21898914, 22698684, 23581517, 24549142, 25597154, 26687985, 27831762, 29054566]
6383B9054566J273267J294535J362672J437538J520634J560215J655483J790442
6375D0949352J876755K051902K314172K610205K959774L326034L753338M334445
6367F4175977N041599N884581O878894P848104R062791J0637295J3003308J6526983
6359A39059532K1317004K7912418L6440604M4271310M8671640M4106728J4324855
6352C76104091l0850070n3903109n5163176m6413051l3365346k4879029j9155632
6345A12374678j4723891j1447730r160514p416440o164570n162657m409160l791314
6337E0098402l364367k945639k611943k299138k057760j829391j687629j555765
6329C1746770j437934j315544j273338j300187j231232j102216j025758r57721
$$ y = [29054566, 30327833, 31622368, 32985040, 34422578, 35943212, 37503427, 39158910, 40949352, 42826107, 44878009, 47192181, 49802386, 52762160, 56088194, 59841532, 64175977, 69217576, 75102157, 81981051, 89829155, 98891946, 109529241, 122532549, 139059532, 160376536, 188288954, 224729558, 269000868, 317672508, 361779236, 376104091, 345254021, 291350912, 236187736, 189774685, 156409339, 131530310, 112374678, 97650787, 86203057, 77042543, 69626103, 63461533, 58298876, 53889716, 50098402, 46734035, 43788396, 41176453, 38877315, 36819555, 34990164, 33302535, 31746770, 30308836, 28993292, 27719954, 26419767, 25188535, 24086319, 23060561, 22102840]
6321B2102840r21180q69364q23530p59009p11920o62455o31923o08260n87980
6312A5527219n56017n21810m78176m53590m27250m10014l79119l69475l48783
6303A1582985l31403l14378l00979k85819k90644k73677k65935k51719k32761
6294I035670k18330k08565j98309j88725j89309j98344j86313j77481j62236j50577
6284G157481j37816j16625j24989j87719k18737k03092j90668j85941j77150j66319
6274E448425j47973j42761j37949j25957j33481j30320j19846r9416r5148q2402
6264D233172q0631p8408o9297o7599o5644o5859o7950p9175q8087q7227q4282
6253C399013p3643p2544o3774n2392m8894l2489k3097l3642l7971m6264n7590
$$ y = [22102840, 21181660, 20312296, 19488766, 18729757, 18017837, 17355382, 16723459, 16115199, 15527219, 14971202, 14449392, 13971216, 13517626, 13090376, 12680362, 12301243, 11931768, 11582985, 11251582, 10937204, 10636225, 10350406, 10059762, 9786085, 9520150, 9268431, 9035670, 8817340, 8608775, 8410466, 8221741, 8032432, 7834088, 7647775, 7470294, 7308058, 7157481, 7019665, 6903040, 6778051, 6590332, 6371595, 6168503, 5977835, 5791894, 5614744, 5448425, 5300452, 5157691, 5019742, 4893785, 4760304, 4629984, 4510138, 4410722, 4315574, 4233172, 4152541, 4074133, 4004836, 3937237, 3871593, 3805734, 3737784, 3658609, 3570522, 3483295, 3399013, 3325370, 3252826, 3189052, 3136660, 3087766, 3055277, 3032180, 2998538, 2960567, 2914303, 2856713]
6242B856713o9677p3396p5682n2321n4893m0243l8747l3981k8810k8088l0319
6231B330556l6549l7752l4770m4776m2711l2880l4836k1418j9581k1037j1232
6220A993014o738N466R99p148j393j367j3965j8457l4756m5413l7837k4980k3149
6207A784276l3243l2328l7442m1281l9709m9895m4420l3304k0380n911o643j0575
6195A429145m186k039M84q89o375o916j7986l8341l5549l5530l6213l5907l0698
6182A179000k5806k8861k0424j1046j4425j7321k6823k0788k2434k7482l8556
6171I25034m7619o3041n9528m7017l6524k9162r817n643J4275K4376L7199L9498
6159G42031L2324K8811K7542J7088K6660K5755K1597K3229K5245K6338L1233L2697
$$ y = [2856713, 2787036, 2713640, 2637958, 2585637, 2530744, 2490501, 2451754, 2417773, 2388963, 2360875, 2330556, 2294007, 2256255, 2221485, 2176709, 2133998, 2101118, 2066282, 2044864, 2025283, 2004246, 1993014, 1986276, 1991742, 1992741, 1985593, 1984200, 1982833, 1968868, 1950411, 1915655, 1870242, 1832405, 1807425, 1784276, 1751033, 1718705, 1681263, 1639982, 1600273, 1550378, 1505958, 1472654, 1452274, 1446363, 1439720, 1429145, 1424959, 1422920, 1423404, 1422515, 1416140, 1409224, 1391238, 1352897, 1317348, 1281818, 1245605, 1209698, 1179000, 1153194, 1124333, 1103909, 1092863, 1078438, 1061117, 1034294, 1013506, 991072, 963590, 925034, 877415, 814374, 754846, 707829, 671305, 642143, 632326, 626683, 640958, 665334, 702533, 742031, 774355, 803166, 830708, 847796, 874456, 900211, 921808, 945037, 970282, 996620, 1027853, 1060550]
6147A060550K8999J8312R435P048R04j6367k2864l1468l5117m0645l6664l8068
6135I04055m7063l9819l7131k9012l6047l0117l0135k4243j9321j1551m182j5645
6123E79789j4654q245r660l166o895p215o250n829m685o677q436p993j2483p374
6109D70227j1246k290r302o486j3712p009j406m807r409n412o288o396j072k045
6095C83347j2894j064m889Q79l251k242m144l322m309o043m010m341N210N871
6081C44798k332P022j178O097J3736O308k206K977n008n092k398o936o787j1025
6067C37976L304m601q748j1873n560q85j3326q324n385o953o641L402m813j0800
6053B56773k911L711k26l250l156j4697j010j326j037j329J715p06K182J0207
$$ y = [1060550, 1089549, 1107861, 1117296, 1124344, 1125248, 1108881, 1086017, 1054549, 1019432, 978787, 942123, 904055, 856992, 817173, 780042, 751030, 714983, 684866, 654731, 630488, 611167, 599616, 595434, 579789, 565135, 556890, 547230, 544064, 537169, 529954, 523704, 517875, 513190, 506513, 498077, 490084, 477601, 470227, 458981, 456691, 447389, 440903, 427191, 420182, 418776, 413969, 404560, 399148, 392860, 386464, 385392, 383347, 370453, 369389, 364500, 365379, 362128, 359886, 355742, 352420, 348111, 342068, 338058, 333717, 338927, 344798, 342466, 349488, 348310, 354407, 368143, 374451, 372245, 375222, 370214, 365122, 362724, 355788, 349001, 337976, 341280, 336679, 327931, 316058, 310498, 309613, 296287, 287963, 282578, 275625, 268984, 272386, 267573, 256773, 253862, 257573, 257347, 254097, 250941, 236244, 235234, 233908, 232871, 231542, 233257, 232551, 234733, 244940]
6039B44940J547L517o092L191j560j3584k680N912Q13k495k463M542N465Q036
6025B49089J0813R121P10J2143J2831O333N401P375J662L37N205n189J563N851
6011C23245l498M52J03L631N347n011J2981K225L513M095J5458N241Q031P294
5997C83107R3J432M119J473R896l15J840N719M413m89J234K682O703M517l29M236
5981D30331P841J367j216O487N482K435N957N214P481J7936N675Q652J0441N707
5967E19790J5356L543M733J0636M92J87n126m421k900q083k147n592N008q74m675
5952E25927o220q851N338O69j478l969l305o32m818N4l395n991P499O673N97K680
5936E10778Q004P416J342J0326L430r179l097j52n403p521n846q385j617j739
$$ y = [244940, 246487, 250004, 243912, 247103, 245543, 231959, 229279, 235191, 236004, 233509, 231046, 235588, 241053, 249089, 259902, 269023, 269733, 281876, 294707, 301040, 306441, 313816, 315478, 315815, 321020, 315831, 317394, 323245, 319747, 320199, 320302, 323933, 329280, 324269, 337250, 339475, 342988, 347083, 362541, 367782, 375813, 383107, 383200, 384632, 388751, 390224, 400120, 399805, 401645, 407364, 411777, 411288, 412522, 415204, 421907, 426424, 426095, 430331, 438172, 439539, 438323, 444810, 450292, 452727, 458684, 463898, 471379, 489315, 494990, 503642, 514083, 519790, 535146, 538689, 543422, 554058, 554550, 554737, 549611, 545190, 542290, 534207, 532060, 526468, 531476, 530602, 525927, 519707, 510856, 516194, 516863, 515385, 511416, 508111, 507479, 502661, 502715, 499320, 493329, 500828, 507501, 508098, 510778, 518782, 526198, 527540, 537866, 541296, 532117, 529020, 528868, 523465, 515944, 510098, 501713, 500096, 498357]
5922D98357q005M43o493O227J221m150k271O493Q846j776J166J3160J6220M480
5908E33918J2026K2450K2057K0682K9750K1816K5193J5530K2186K4899J5034J1632
5896G77173J3504J869q52q709j2394p407j8681k0710k4286k1826k4548k3008l1398
5883E98727l9555l0473k9818k8859k8985k3001k4628j5106k2349j7419j8364j6576
5871C03594j1759j5538j1218n687o291m990l432n354j2758n795n625n273j841
5858B08033R9j583l349M6J419L71n230j569K292j653Q485N075K861L391Q896J6339
5842B43923J3844R904J1185J1025J0226K1704J0994J5051J5418K0821J7573J4506
5830D16174J7390R864m669n839K260j0431j5866j2070j3358j3983j5150j5763
$$ y = [498357, 490352, 490795, 484302, 490529, 491750, 487600, 485329, 491822, 500668, 498892, 500058, 513218, 529438, 533918, 545944, 568394, 590451, 611133, 640883, 662699, 687892, 703422, 725608, 750507, 765541, 777173, 790677, 792546, 791694, 782985, 770591, 763184, 744503, 723793, 699507, 677681, 653133, 630125, 598727, 559172, 528699, 498881, 470022, 441037, 418036, 393408, 378302, 355953, 338534, 320170, 303594, 291835, 276297, 265079, 259392, 253101, 248111, 244679, 239325, 226567, 220772, 215147, 209874, 208033, 208132, 206549, 203200, 203246, 204665, 205036, 199806, 198237, 200529, 198876, 207361, 212436, 215297, 218688, 227584, 243923, 257767, 267671, 278856, 289881, 300107, 321811, 332805, 347856, 363274, 384095, 401668, 416174, 433564, 443428, 438759, 432920, 435180, 424749, 408883, 396813, 383455, 369472, 354322, 338559]
5818C38559j8292k1277j9191k0135j8364j4859p107j3519j7437j1941q588p036
5806A60813o295K942j0756r89P2j0382l89l812q501k523o257o448L324j296n697
5791A03806k327m913q725m086k830m743k621j067k558k830n147K67o189k629O20
5776E4028n88M755K18p230l882j892Ko2K026j430k331L298j452N788K022J227
5760E4497m070j976L218l42p189J969L40J213Q282j562J109j970m074j865k697
5745D4883O29l88l402j314L535p34J207j031o640p94K392J684l55j383n59N084
5729D2814K949o161no494j638o31R01n100K584j535k75m124r93M065m709K14L414
5712B5276J697N808n104l722L762O49k878j335J468q315K687L674m012j444K901
$$ y = [338559, 320267, 298990, 279799, 259664, 241300, 226441, 219334, 205815, 188378, 176437, 167849, 160813, 154518, 157460, 146704, 145715, 145787, 135405, 135016, 131204, 122703, 120180, 113923, 107475, 110799, 109503, 103806, 101479, 96566, 87841, 83755, 80925, 76182, 73561, 72494, 69936, 67106, 61959, 62226, 56037, 53408, 54028, 53440, 58195, 58413, 51183, 47301, 45409, 45411, 45349, 47375, 45945, 43614, 46912, 45460, 51248, 53270, 54497, 50427, 48451, 51669, 51327, 44138, 46107, 46447, 47660, 55942, 54380, 55489, 53519, 49445, 47580, 44883, 45512, 45124, 41722, 40408, 43943, 43209, 44416, 43385, 36745, 35951, 38343, 40027, 39672, 38289, 37730, 42814, 45763, 39602, 39597, 33103, 31465, 30834, 31735, 26635, 29219, 27684, 27409, 23285, 22292, 26357, 21648, 21862, 25276, 26973, 32781, 27677, 23955, 27717, 28366, 25488, 24153, 25621, 17306, 19993, 23667, 19655, 18211, 21112]
5697B1112m080m067J950P692q49k175j253m73l784M174L443n840K421K445n607
5682A5109o56p156M408Q045K929J731R53m712L373L531j883m700P82m764r563
5667G427N859k004J700n915n787N474N570k486m157j232k013j598N996K335l195
5652E974L69r32M381L605k99m538q45j055J77k734j418L481j556k268K917L65
5636E624j896k658J459L717l195k130J487K391k067L177j994J598M201n20j059
5621H135n29m328k73k112o490j195N086P537j29O164m272K781n72j557Q21L9n865
5604C241O140M480Q67m342p779R14L62j716L811J869p948L10l463N650K624J155
5588F175K734j697n78j323N306r06o329M386k105j559N777O592k060N168m159
$$ y = [21112, 17032, 12965, 14915, 22607, 21758, 19583, 18330, 17857, 14073, 18247, 21690, 15850, 18271, 20716, 15109, 14453, 7297, 11705, 19750, 22679, 24410, 25363, 20651, 24024, 27555, 25672, 20972, 21754, 16990, 7427, 13286, 11282, 12982, 7067, 1280, 6754, 12324, 9838, 5681, 4449, 2436, 838, 6834, 9169, 5974, 6343, 5411, 9792, 13397, 13098, 8560, 7715, 6660, 6837, 4103, 2685, 6166, 4610, 2342, 5259, 5624, 3728, 1070, 2529, 6246, 3051, 921, 2408, 4799, 2732, 5909, 3915, 5513, 9714, 9194, 8135, 7606, 3278, 3005, 893, -5597, -6792, -1706, 5831, 5702, 11866, 7594, 10375, 9803, 8246, 9067, 9106, 3241, 9381, 13861, 14728, 10386, 2607, 3521, 3883, 2167, 5978, 7847, -101, 209, -3254, 2396, 5020, 6175, 8909, 7212, 6634, 5311, 10617, 9711, 3382, 7768, 5663, 4104, 9881, 16473, 14413, 19581, 15422]
5573A5422k510M346J719J076r54j322L570N898m608M451M174K409J732L100M468
5558D2971L706P498l051m35N054O515K55m85n666K187P980N734O596L343M394
5543H6596Q822m206L410P756Q906J3081L208P867Q254M655P761Q053K692Q761
5529A75616o534j159Q647O373J210L601R990Q771L577P642J0274P910J6311J6071
5515B68300R869J826L793K595j201k948K477k203j1228n584r182j0181l444m128
5501B38761k669K323K318K186p02J564L759J922K224O202N889L522m74L273J792
5486B71890k73j268N028m01k589k825R468J1637N725P749L516n77m158j914l424
5471B97584K857m45K506L230P060R686O990J4759J0869Q507J1570M680P657L315
$$ y = [15422, 12912, 17258, 18977, 20053, 19099, 17777, 21347, 27245, 22637, 27088, 31262, 33671, 35403, 38503, 42971, 46677, 54175, 51124, 50689, 55743, 62258, 62513, 62028, 56362, 58549, 66529, 72263, 78859, 82202, 86596, 95418, 91212, 94622, 102378, 111284, 124365, 127573, 135440, 143694, 148349, 156110, 164163, 166855, 175616, 169082, 167923, 176570, 182943, 184153, 187754, 197744, 206515, 210092, 217734, 228008, 235918, 252229, 268300, 278169, 279995, 283788, 286383, 285182, 282234, 284711, 282508, 271280, 265696, 256514, 246333, 242889, 238761, 236092, 238415, 240733, 242919, 242217, 243781, 247540, 249462, 251686, 257888, 263777, 267299, 266825, 270098, 271890, 271617, 270349, 275377, 274976, 272387, 269562, 279030, 290667, 296392, 304141, 307657, 307080, 302922, 301008, 297584, 300441, 299996, 302502, 305732, 312792, 322478, 329468, 344227, 355096, 363603, 375173, 379853, 387510, 390825]
5457C90825k173O563L72q155n413l199j2445j2016q957r07j1437r818q869j0858
5443C03513p719m624n088l75o118l205J564j3636p305o920j477j4055j0705r687
5429B14163k977j0989j5816j1761r735j2746j1798j1276m968o537p180n351n663
5416I7366q289k700Q68n344q165j058K906k183o950j0469L392k331n128N264J241
5401E8420j34p39j871n252J218K642J440q611p31n89J924M200n378l837M51J742
5385D4895m569k452M91j957n540P899q9p016m052L851O122L649m509n184j176
5370C0363R09J682k287J610l030L614J887n059r94j629L961l140k151L015O66
5355B9417K714p463J59L977n255M455p058m487P69L077Q44Q886n998l894l101
$$ y = [390825, 388652, 395215, 395587, 387432, 382019, 378820, 366375, 354359, 345402, 344495, 333058, 323240, 314371, 303513, 295794, 291170, 286082, 285707, 279589, 276384, 277948, 264312, 257007, 250087, 248610, 234555, 223850, 214163, 211186, 200197, 184381, 172620, 162885, 150139, 138341, 127065, 122097, 115560, 108380, 103029, 97366, 89077, 86377, 87245, 81901, 73736, 72678, 75584, 73401, 66451, 55982, 59374, 57043, 51915, 57179, 58420, 58286, 57547, 55676, 50424, 51642, 54284, 55724, 47113, 46382, 45793, 47717, 51917, 46539, 42702, 43153, 44895, 40326, 37874, 38365, 36408, 30868, 38767, 38678, 31662, 27610, 31461, 37583, 41232, 36723, 31539, 30363, 31272, 32954, 30667, 32277, 29247, 32861, 34748, 29689, 28695, 27066, 31027, 27887, 25736, 28751, 29417, 32131, 24668, 24827, 28804, 23549, 28004, 20946, 16459, 17228, 20305, 21149, 30035, 24037, 20143, 17042]
5340A7042q40M517J494n113M103j815l909J2021M438l445k055L159K104j965q09
5325B8927L558k572l740K062p58m00O354r53n932J266N749O136l726l319j605
5310C1047l46J901K323J270j522O668L304l838K407L951L887L64O685L87o846
5295E1642R889L965M38K176N809M058J911M01M517K276O962O813O702J2612J0155
5280A30326L761O689O178J0692N459O410L976L386n40j0217k279J551M624p386
5266A62630j765O131qN06n123L535j140q17J282K265P029J2972J1928O590J2453
5251B18468P007J2304J1843J2176J3258J3948J5320P961P537N783Q042Q103O881
5238C48631o823k737k530l144n268m244j3804j1443k510q399j2066l102m002k018
$$ y = [17042, 16202, 20719, 22213, 17100, 21203, 19388, 15479, 27500, 31938, 28493, 26438, 29597, 31701, 29736, 28927, 32485, 29913, 26173, 28235, 27477, 27077, 33431, 32478, 26546, 27812, 33561, 39697, 35971, 32652, 31047, 30701, 32602, 34925, 36195, 34673, 41341, 44645, 40807, 43214, 47165, 51052, 51416, 58101, 58488, 51642, 61531, 65496, 65934, 68110, 73919, 77977, 79888, 80289, 84806, 87082, 94044, 100857, 107559, 120171, 130326, 134087, 140776, 146954, 157646, 163105, 169515, 173491, 176877, 176337, 166120, 163841, 165392, 170016, 162630, 160865, 166996, 166988, 167494, 162371, 165906, 164766, 163949, 165231, 167496, 174525, 187497, 199425, 206015, 218468, 225475, 237779, 249622, 261798, 275056, 289004, 304324, 312285, 319822, 325605, 333647, 341750, 348631, 341808, 339071, 336541, 333397, 328129, 323885, 310081, 298638, 296128, 287729, 275663, 272561, 268559, 266541]
5224B66541j771j883m10l19M84N844L382R69R092L913N465k86O769L186K334L989
5208C07299O592J009j48r61J326q650j0540o304j1557m020o762o159j155n097
5194B54873R0L494j689j199n080K93J627J98L827l245o532k214p10N36R6k125
5178B42240m736o751m589k619r076n620m711j2209p455r605q180o595N602l753
5164A61943p481p843O536N970k8N723K813J065n20K097R262R776k111k513r40
5149A83749p42K980j447r908k054n667o030r205r222j4773p924J536o862r999
5135A04432r834n75j865r07p498l778k49o258m603m977L178j532K62k441j869
5120F1486P47k223k259O91k656K416L739L199k825n138L914L118O89J168J423
$$ y = [266541, 264770, 262887, 262477, 262158, 262642, 268486, 271868, 272837, 281929, 285842, 291307, 291021, 297790, 300976, 303310, 307299, 313891, 314900, 314752, 313791, 315117, 306467, 295927, 289623, 278066, 274046, 267284, 261125, 259970, 254873, 254963, 258457, 256768, 255569, 250489, 250782, 252409, 252607, 256434, 253189, 246657, 244443, 243733, 244269, 244365, 242240, 237504, 230753, 226164, 223545, 214469, 208849, 204138, 191929, 184474, 174869, 166689, 160094, 165696, 161943, 154462, 146619, 153155, 159125, 159097, 164820, 167633, 168698, 168178, 170275, 179537, 189313, 187202, 184689, 183749, 183007, 185987, 184540, 174632, 172578, 166911, 160881, 151676, 142454, 127681, 119757, 121293, 114431, 104432, 94598, 94023, 92158, 91251, 83753, 79975, 79726, 73468, 68865, 63888, 67066, 65534, 65796, 63355, 61486, 62233, 60010, 57751, 58442, 55786, 58202, 61941, 65140, 62315, 57177, 61091, 64209, 64898, 66066, 67489]
5105F7489k181N997l980o64J975J189N20J100K413o388n541j277K49M252j039
5090F4114m43K805n15J464M892l05K732L329K494l569O67K436n444L087O538j133
5074H3149K238M359l39L61K430R95K542N510M755j844p759K551J980P802O842
5059A15572j879j9J852J261k5L144K96K338L298p829l879J915l173j830K914P022
5043A20978o72R120J995m285N20l035J0154L622m80m860L227K249r80L015J567
5028A42135L196J72q28n366q03L660L552K483j665j77k7j630r55l309L218N701
5012A49357K552Q12M660N853J774Q097N442O606Q210J619O539J1171J0011Q592
4998B31295M685O785L193R378P575J2557J0580Q564J1189N608J910O915M247M044
$$ y = [67489, 65308, 71305, 67325, 66661, 68636, 69825, 70345, 71445, 73858, 67470, 61929, 60652, 60901, 65153, 64114, 63671, 66476, 65961, 67425, 72317, 72012, 74744, 78073, 80567, 76998, 77665, 80101, 74657, 77744, 84282, 83149, 85387, 89746, 89407, 89768, 92198, 93193, 95735, 101245, 106000, 104156, 96397, 98948, 100928, 108730, 115572, 113693, 113674, 115526, 116787, 116762, 119906, 120202, 122540, 125838, 118009, 114130, 116045, 112872, 111042, 113956, 120978, 120306, 129426, 131421, 127136, 127656, 124621, 134775, 138397, 137917, 133057, 136284, 138533, 137553, 140568, 142135, 145331, 145503, 144675, 139309, 138506, 142166, 145718, 148201, 146536, 146359, 146332, 144702, 143747, 140438, 143656, 149357, 151909, 152721, 157381, 163234, 165008, 173105, 178547, 185153, 193363, 194982, 201521, 212692, 222703, 231295, 235980, 242765, 245958, 255336, 262911, 275468, 286048, 294612, 305801, 311409, 313319, 320234, 324481, 328525]
4984C28525Q702j550j731L823P87Q371j524K262M238P776K487P657J2116J0229
4970C92168O936P089J5359J4114J5636J4421J1256J5488J0840J7751K4350J1839
4958E57247J0801O296J8856K5397J7268P030J5679J3915P228R599J2569Q788l754
4945G06919L457R309K447R11P215L131J523O885R628Q770L657Q175J3364O723
4931G92114J622K967n663O121L931L957m214O7M544n872n774j0450j0768L897
4917G76479p407j6101j1307j1654j2441j0254j2349j0584p616j2875j8961j2671
4905F32259j7779j2371j4409j9842j3843r949j0063j1673k0253k0226r560j2321
4893D59970p610r238n766o093j3580j5295k436n939o121k301m683j6408p649q002
$$ y = [328525, 337227, 335677, 333946, 337769, 338556, 346927, 345403, 347665, 351903, 359679, 362166, 369823, 381939, 392168, 399104, 406193, 421552, 435666, 451302, 465723, 476979, 492467, 503307, 521058, 545408, 557247, 568048, 574344, 593200, 618597, 635865, 642895, 658574, 672489, 679717, 689316, 701885, 710673, 706919, 710376, 719685, 722132, 723043, 730258, 733389, 734912, 741797, 751425, 760195, 763852, 772027, 785391, 792114, 793736, 796703, 791040, 797161, 801092, 805049, 800835, 800902, 805446, 799574, 793800, 783350, 772582, 776479, 769072, 752971, 741664, 730010, 717569, 707315, 694966, 684382, 676766, 663891, 644930, 632259, 614480, 602109, 587700, 567858, 554015, 544066, 534003, 522330, 502077, 481851, 472291, 459970, 452360, 443122, 437356, 431263, 417683, 402388, 399952, 394013, 387892, 385591, 380908, 364500, 356851, 348849]
4879C48849l083l451m176o728j0789m950k819l481p045l212K050o253n388j799
4865B87725r732k135n838O593O446Q077k191k717N232O241p12O106P842M002N223
4850C20162J390p66O359L97L271M606K86P003J6508M469J2133J5857J0315K0053
4836D22043J5654P538L935k757p282q593j4449o264k403j8063J302N906N712L91
4822D02670k513M829M996J1220P618P789J1326J8244J5524N737L672K0934J9199
4809E31245K2655J9988K3361K0028K1758K9675L3043K3152L7856L7624M1584M8088
4797H90057N5825O4698P0386P2764Q4694J06485J15324J34201J58411J68506K08425
4786B129776K36425K77238L01387L07108K87527K29792J26533J4357r7225j97942
$$ y = [348849, 345766, 342315, 338139, 331411, 320622, 315672, 312853, 309372, 302327, 299115, 301165, 294912, 289524, 287725, 277993, 275858, 270020, 276613, 283059, 291136, 288945, 286228, 291460, 297701, 296989, 303095, 310937, 314939, 320162, 321552, 320786, 327145, 327542, 330813, 335419, 335705, 342708, 359216, 363685, 375818, 391675, 401990, 422043, 437697, 445235, 449170, 446413, 439131, 430538, 416089, 409825, 407422, 389359, 390661, 396567, 402279, 402670, 400157, 404986, 409982, 421202, 428820, 436609, 447935, 466179, 481703, 487440, 491112, 512046, 531245, 553900, 573888, 597249, 617277, 639035, 668710, 701753, 724905, 762761, 800385, 841969, 890057, 945882, 1010580, 1080966, 1153730, 1238424, 1344909, 1460233, 1594434, 1752845, 1921351, 2129776, 2366201, 2643439, 2944826, 3251934, 3539461, 3769253, 3895786, 3910143, 3812918, 3614976]
4776C614976k64546k97508l15489k97084k68141k35514k02786j76927j48151j30165
4766A278665j05109r6633q2146o6367o4360o0781m5126m1606l5277m0643l4503
4755F06114l1068k9266k3890k4033k0149k3674k1560k0141k5327j9255j1890j1876
4743C43985j0943j2042j2776j7116j3472o396j0948q236o153m110j0062r076n39
4730B22116n528j0918R11m030r553m440r782q96K733k735r992m545N366N0o065
4715A62692o001n050p142o973k320l807m31o61j3118q399l396Qq050k096n223
4700I0033K382J747p165j0010L573K10j554K630r387m919M699L631n217r822r30
4685E9901r547J818N498p370o839O286j924j265Q810l654q959K018J007k984l137
$$ y = [3614976, 3350430, 3052922, 2737433, 2440349, 2172208, 1936694, 1733908, 1556981, 1408830, 1278665, 1173556, 1076923, 994777, 928410, 864050, 803269, 758143, 716537, 681260, 640617, 606114, 575046, 545780, 521890, 497857, 477708, 454034, 432474, 412333, 387006, 367751, 355861, 343985, 333042, 321000, 308224, 291108, 277636, 271240, 260292, 252056, 245903, 241793, 231731, 222655, 222116, 216588, 205670, 206581, 202551, 192998, 188558, 178776, 177880, 180613, 177878, 167886, 163341, 168707, 168757, 162692, 156691, 151641, 144499, 137526, 135206, 131399, 130968, 130307, 117189, 108790, 105394, 105402, 97352, 95256, 90033, 92415, 94162, 86997, 76987, 80560, 80770, 79216, 81846, 72459, 67540, 72239, 75870, 70653, 60831, 59901, 50354, 52172, 57670, 50300, 43461, 49747, 47823, 46558, 55368, 51714, 42755, 44773, 45780, 42796, 39659]
4670C9659k439l448N94K39k131j559j765L38J3181m35p557j279J204l141l575
4655B7886n85N256J823p436r17l455K633J191k791l363K050n433L419k441N53
4640A8390j152p048N295M919l184k221L797J836m023N58K310l470m864j070r03
4625I170k037P898L580m563K380l259PL083o05m475n254Q75R81K801J920N21q57
4608A2166l966K120k261k11M291K304l922m73o161J945n772L051j072m155J674
4593d42n161M261M253Q994l122n598k806L352K169n339l524l17M223L069k452
4578A560j449P542q253j963O196M31o029l82n08j348N448k240o199N99L260J963
4562a372L976J345m87l334n567L852k260k112K104m662J766J601O421K544r157
$$ y = [39659, 37220, 33772, 34366, 34605, 32474, 30915, 29150, 29488, 42669, 42234, 34677, 33398, 34602, 31461, 27886, 27301, 32557, 34380, 26944, 26027, 22572, 25205, 26396, 23605, 20242, 22292, 16859, 20278, 17837, 18390, 17238, 10190, 15485, 20404, 17220, 14999, 18796, 20632, 16609, 17167, 19477, 16007, 11143, 10073, 9170, 7133, 15031, 18611, 14048, 16428, 13169, 13176, 16259, 15654, 11179, 5925, 6800, 7781, 10582, 12502, 13023, 12166, 8200, 10320, 8059, 7848, 12139, 14443, 10521, 10048, 3887, 5832, 60, 3111, 2039, -2116, -442, -5603, -1342, 2911, 11905, 8783, 3185, 379, 3731, 5900, 561, -2963, -3280, 943, 4012, 1560, 111, 7653, -600, -2563, 3633, 4064, -1965, -2347, -2855, -4203, 1245, -995, -7194, -6595, -3335, -1372, 2604, 3949, 3462, 128, -5439, -1587, -3847, -5959, -3855, -8517, -6751, -5150, 1271, 3815, -5342]
4547e342m250L890P500K263j718m120M881L79j652n395l136K423M711j295r888
4532a0749k691M195L087N9j186N50M484m14k604R3M182j482p6p83J578j580O048
4515B711o95j889Q49O598j226m724L532J449M93n442o702R99n87p58M31k471k494
4498i926Q541k93k864K433J360l040L669j241k548M862P88m729L069l436K102
4483a253N780r3p84l629L221n73K698L34j705k91N967j307K995P27K110m030o66
4466I501M079M42K932l267J12Q60O635O045j52l233P021N529j46M091J3226P191
4450F0866q90J455O780K228P421r42K322J6370P400J498Q866J3874N19j891r326
4435A16550l049o327j2640j0743l023l025L447J327J23o956j1947q047L590k608
$$ y = [-5342, -9592, -5702, 1798, 4061, 2343, -1777, 3104, 3483, 1831, -3564, -6700, -4277, 434, -861, -10749, -13440, -9245, -6158, -6099, -7285, -6735, -2251, -2665, -5269, -5176, -994, -2476, -2552, -3335, -1757, -3337, 2711, 2016, 127, 976, 7574, 6348, 1624, 5156, 6605, 7098, 1656, -5046, -4047, -4634, -5392, -4961, -7432, -9926, -1385, -1678, -4542, -2109, -749, -3789, -120, -1361, -3909, 953, 1741, -2988, 81, -3355, -1253, 4527, 4434, 3650, 21, 3242, 2669, 5367, 5701, 3996, 3705, 9672, 8365, 11360, 12087, 14197, 10167, 9501, 13580, 14022, 16954, 13687, 13799, 14659, 21294, 27339, 27187, 23954, 30975, 36504, 36358, 40449, 53675, 60866, 59976, 61431, 68211, 70439, 77860, 76918, 79240, 95610, 103010, 104508, 113374, 127248, 127767, 125876, 116550, 113501, 107174, 94534, 83791, 80768, 77743, 81190, 82517, 82640, 75684, 63737, 55690, 59280, 56672]
4421E6672j0390n336j4544Q172k306o013o529j529J232j655m48k286j037l565
4407A0438k425m780L022j588l449K756J139n673M60J225m628Q948J654K039O42
4392I780n888l091J374R17m231j304k880P697l435n050N131k49k424J008O712
4377D067l448n382K026j109j436K534l78j461J81J635O327q962l868l250J395
4362a1129J1478P12n943j152l14J727O275L143k636n182m416M409n20R713l343
4347B822n046j211N240o775r14L461j676M260L283J26p287K268J393m803K285
4332b574L083m542K746K662K235RK563o960O04r54l388M471N312j296k133K408
4316D246k210l134m501r49n16l899M598L484K846j316l297m909J809L338O126
$$ y = [56672, 46282, 40946, 26402, 34574, 32268, 26255, 19726, 18197, 19429, 17774, 17326, 15040, 14003, 10438, 8013, 3233, 6255, 4667, 1218, 3974, 5113, -560, -100, 1125, -3503, 5445, 7099, 9138, 9780, 3892, 801, 2175, 3092, -1139, -2443, -5323, 2374, -1061, -6111, -980, -1229, -3653, -2645, 4067, 619, -4763, -2737, -3846, -5282, -2748, -3126, -4587, -4406, -2771, 3556, -5406, -9274, -12524, -11129, 349, 1061, -4882, -6034, -6348, -4621, 1654, 4797, 2161, -3021, -7437, -3028, -3548, 6165, 2822, -2224, -3435, 1805, -4970, -5884, -2423, -4099, 161, 3444, 3570, -3717, -1449, -56, -4859, -2574, 509, -4033, -1287, 1375, 3610, 3619, 6182, -778, -174, -1128, -4516, -45, 5267, 3971, 1838, 4246, 2036, -1098, -5599, -6548, -7064, -10963, -6365, -2881, -35, -1351, -4648, -9557, -7748, -4410, 1716]
4301A716o538k747L658l445m575r13K087N483Q005p58j0406l314M157R283l325
4286a632o898N571K316L57k264k900m036M423J486l481K55L535N615k871n961
4271f485Q71J579K205k434K718n566j908n9m120J733M523Q457J774o985K22n46
4255d021o401Q100p99k045j134M362j929K170R183q27j488l531Mk305L162L845
4239F346k707k978M48O377J455j5148J267l774k636N604K876L901P848k936n121
4224H22j813n794L284K492N83M916j079k665K232k584O807Q187n456q504L168
4209D596N95M499j352p644K193R10m567P168J391m76K134m044K165k562m251P354
4193H109J879k229p36J037N83m52j0253R518N076k608j525k874K062l089O92K343
$$ y = [1716, -4822, -7569, -3911, -7356, -11931, -12844, -10757, -5274, 2731, 1973, -8433, -11747, -7590, 1693, -1632, -8530, -2959, -643, -286, -2550, -5450, -9486, -5063, -3577, -7058, -6803, -3268, 2347, -524, -6485, -5614, -4035, -1830, -4264, -1546, -7112, -9020, -9079, -13199, -11466, -6943, 1514, 3288, -3697, -3475, -4021, -10422, -2322, -3121, -5166, -6300, -1938, -3867, -1697, 7486, 6659, 5171, 1640, 1644, -661, 2501, 6346, 3639, 661, 1109, 7486, 8941, -6207, -4940, -8714, -11350, -5746, -2870, 1031, 8879, 5943, 822, -991, -6785, -3501, -1009, -426, 4490, 3411, 746, 2978, 394, 7201, 15388, 9932, 1428, 4596, 5191, 9690, 8338, 694, 2887, 3797, -770, 6398, 7789, 7313, 9447, 5403, 7568, 5006, 755, 8109, 9988, 7759, 7023, 8060, 8643, 8191, -2062, 7456, 12532, 9924, 8399, 5525, 7587, 4498, 5190, 7533]
4177G533J0339n566k921K887l912J865K256j713J918k805M32O561L548K593l568
4162A9447K832k99K267o16r085L580K641J761R72J4K324M510M860l605J34M368
4146C6105n367m958J650J930R968K213n459k66K489M882k60K723k373L183N174
4131E1634L24R31k131Q218j729J438P028m064l055q01P169R99L760L936K605o05
4115G5657K790O865r92j917P010M787J942P664M986L183L675K528j92L960N146
4100A27092O248Q161j010j01K514Q726O613R318J3584L269K379Q456K975Q446
4086B06670O415j373R361J3632Q882J2198J3062J5476Q654J1337O340J8262J8514
4073C47430J5629J1263J4055K0858K3764J7681K3916K2884K2733K3291K5011K7877
$$ y = [7533, 17872, 12306, 9385, 12272, 8360, 10225, 12481, 10768, 12686, 9881, 10313, 16874, 20422, 23015, 19447, 22279, 21980, 24247, 23631, 14546, 18126, 20767, 22528, 23500, 23514, 25838, 30348, 35208, 31603, 31737, 36105, 30738, 25780, 27430, 29360, 39328, 41541, 36082, 35816, 38305, 43187, 42927, 45650, 43277, 46460, 51634, 51958, 52889, 50758, 58976, 57247, 58685, 65713, 61649, 58594, 57793, 64962, 65961, 69721, 73657, 76262, 75657, 78447, 85312, 84320, 82403, 89413, 94200, 96142, 103806, 108792, 111975, 115650, 118178, 117986, 121946, 127092, 133340, 141501, 140491, 140390, 142904, 151630, 158243, 167561, 181145, 184414, 186793, 195249, 198224, 206670, 213085, 211712, 221073, 234705, 243587, 255785, 268847, 284323, 292977, 304314, 310654, 328916, 347430, 363059, 374322, 388377, 409235, 432999, 450680, 474596, 497480, 520213, 543504, 568515, 596392]
4061E96392K7426L4358K8929L4935L1963L4181L2732L5735L5878M2408L7111L8568
4049A010616L9269M0599L6863M1350L5794L7119M2285M3734M8045M1102L8234
4038A455010L1782K8477M0253L7707L4795K2895K3412K9206J9356J8061J7526
4027A758480J4826J1279R795Q426K569o67l082K581j3542o111j0818k7167k4235
4014A722334j4235k4628k9934k2696k6004m0808l3907k6900l8571l7117l8253
4003A389281l1747l8072l3317l8508m9144l7335l8115m4424l4888k8456m4191
3992I71084l7208k6897k9467l5685k5496k7980k7924k2455k4971l0740k5938j1021
3980F45302j9326j8712j4479j3954j2759o465r853j020J014L40M44P142J0461
$$ y = [596392, 623818, 658176, 687105, 722040, 754003, 788184, 820916, 856651, 892529, 934937, 972048, 1010616, 1049885, 1090484, 1127347, 1168697, 1204491, 1241610, 1283895, 1327629, 1375674, 1416776, 1455010, 1486792, 1515269, 1555522, 1593229, 1628024, 1650919, 1674331, 1703537, 1722893, 1740954, 1758480, 1773306, 1784585, 1794380, 1802806, 1805375, 1804708, 1801626, 1804207, 1790665, 1784554, 1773736, 1746569, 1722334, 1708099, 1683471, 1653537, 1630841, 1604837, 1564029, 1530122, 1503222, 1464651, 1427534, 1389281, 1357534, 1319462, 1286145, 1247637, 1198493, 1161158, 1123043, 1078619, 1043731, 1015275, 971084, 933876, 906979, 877512, 841827, 816331, 788351, 760427, 737972, 713001, 682261, 656323, 645302, 625976, 607264, 592785, 578831, 566072, 559607, 549754, 548734, 549748, 550088, 550532, 557674, 568135]
3967E68135J9742J9451K0888L8948N7815Q7554J22585J54652J86777J85035L4844
3956A496426j49313k16428k02966j53505j16107q0435o3501m2107m0210k8660
3946D03194k0917j6490j7471k3895j0973n987j6630j0187l520p51j0960j6719
3934B48694p155q196q153j6928p580r036j121p614n804n735k508o262n674n067
3920A51861n41m751m624l486m289j422j233l887j896K389o529O335q3l681m946
3905A19217m385m45j771k332K233l423n190K600j502o83l77o883m5j154Q173m093
3889I9940k704j949O559l652m366O592l64o645j743J288p832M634R17K472Q88
3874I4035J162L205j003Q92j154l526L03J00K431j049K788K506m873N787L365
$$ y = [568135, 587877, 607328, 628216, 667164, 724979, 812533, 935118, 1089770, 1276547, 1461582, 1496426, 1347113, 1130685, 927719, 774214, 658107, 577672, 514171, 472064, 431854, 403194, 382277, 365787, 348316, 324421, 313448, 307461, 290831, 280644, 277124, 276373, 265413, 248694, 241539, 233343, 225190, 208262, 200682, 191646, 190525, 182911, 177107, 171372, 168864, 162602, 156928, 151861, 151320, 146569, 141945, 138459, 134170, 132748, 131515, 127628, 125732, 128121, 121592, 127927, 127844, 124163, 119217, 114832, 114387, 112616, 110284, 112517, 109094, 103904, 106504, 105002, 104319, 103942, 97059, 97014, 95860, 104033, 99940, 97236, 95287, 101846, 98194, 93828, 100420, 100056, 93411, 91668, 92956, 85124, 89758, 90675, 93147, 94035, 95197, 98402, 97399, 98291, 97137, 93611, 93914, 94014, 96445, 95396, 98184, 100690, 95817, 101604, 104969]
3859A04969j674K42J360j384L122j963N912M373j380K814m740J942N679n048j047
3844A13177N443l192J2431M154o668l53L279O4J15J0559M426P71J297L572P523
3829A56598n383K90K139Q671L183m084K346N890P908L487m341l992J4111J0224
3815A97047j054N798J3877P472N424Q7L290R738N842K280J0320L346J264R277
3801B74008J120P644P749R516O337J0831P586M336J3935N801L729Q008P088J1844
3787C79532J8201J4653Q167P176J1139J3778J3991J6487J2927K0410K0929K7110
3775E64500J8895J1819K0459K6578K4807K2174K9522K5061L0537L2824L9442L8119
3763H84737L4741M7672M9317N0086N4078N7878O7271P1295O8579Q4063Q8899R5020
$$ y = [104969, 103295, 103537, 104897, 103513, 106635, 104672, 110584, 114957, 113577, 116391, 111651, 113593, 119272, 114224, 113177, 118620, 115428, 127859, 132013, 125345, 124992, 128271, 128335, 128450, 139009, 143435, 144206, 145503, 149075, 156598, 151215, 151505, 153644, 162315, 165498, 161414, 163760, 169650, 177558, 181045, 176704, 172712, 186823, 197047, 195993, 201791, 215668, 223140, 228564, 228651, 231941, 241679, 247521, 249801, 260121, 263467, 264731, 274008, 275128, 282772, 290521, 300037, 306374, 317205, 324791, 329127, 343062, 348863, 352592, 360600, 367688, 379532, 397733, 412386, 420553, 427729, 438868, 452646, 466637, 483124, 496051, 516461, 537390, 564500, 583395, 595214, 615673, 642251, 667058, 689232, 718754, 743815, 774352, 807176, 846618, 884737, 919478, 967150, 1016467, 1066553, 1120631, 1178509, 1245780, 1317075, 1385654, 1469717, 1558616, 1653636]
3751A653636Q9604J02470R8384Q8315P2737Q5481Q1600N8968N8113M8474L9877
3740B477659L6389M5159M0892L8438L7080L1667K9436L0227L4013K8011K1429
3729B850400J2090K3155K2418K6595L8578M4013O2055N9302P0750P5169P0454
3718C354979O2297O2813L9897L2966J3811j212k1163k0299l0275l4912l8232l5967
3706C384703l4316m7363m7230n8452p9396r0119r3822j12094j18046j28471j33304
3695B442090j35563j32839j24388j18764j03611r6558q5268p7554p3797o6285
3685A427463n6939n7572m7742m4753l2003l8058l2078l0215l2521k5473l1891
3674I98218k4940k9067k4774l0218j7696l1643k3010j8130k4018j4248j9293j5911
$$ y = [1653636, 1743240, 1845710, 1944094, 2032409, 2105146, 2190627, 2272227, 2331195, 2389308, 2437782, 2477659, 2514048, 2559207, 2600099, 2638537, 2675617, 2707284, 2736720, 2766947, 2800960, 2828971, 2850400, 2862490, 2885645, 2908063, 2934658, 2973236, 3017249, 3079304, 3138606, 3209356, 3284525, 3354979, 3417276, 3480089, 3519986, 3552952, 3566763, 3565551, 3544388, 3524089, 3493814, 3458902, 3420670, 3384703, 3350387, 3303024, 3255794, 3197342, 3117946, 3027827, 2934005, 2821911, 2703865, 2575394, 2442090, 2306527, 2173688, 2049300, 1930536, 1826925, 1730367, 1645099, 1567545, 1493748, 1427463, 1370524, 1312952, 1265210, 1220457, 1188454, 1150396, 1118318, 1088103, 1055582, 1030109, 998218, 973278, 944211, 919437, 889219, 871523, 839880, 816870, 798740, 774722, 760474, 741181, 725270]
3662G25270j3569j0946j6100j8867j9491j9081j6503j5412j5776j0830j2734q103
3650E47858q288n871l717p224p921o004J973n83j032k515j788Q965k928J276Q491
3635E20692Q20M780J2096O664M146Q048N738J5971J5010R071J0565J1357J4667
3622F39625J0905J4768J6033K0283J7266Q493J5950J9278P060P356R271J3000
3610G99288R091J2014J0409J826O051J128O699M17O234K59j035j883j340p915
3596H41243M141M105k741j760l361k484o351k485O507L169R502P663J0057O610
3582H73815J2255J2326J5991K7572K8031K6810K7504K6511K9509L5505L5995M0194
3570A192018L9960M7394M1223N2882N8212M3952N1288N4658N2933M8045N0928
$$ y = [725270, 711701, 700755, 684655, 665788, 646297, 627216, 610713, 595301, 579525, 568695, 555961, 547858, 539570, 533699, 529982, 522758, 514837, 508833, 510806, 510223, 509191, 506676, 504888, 513853, 510925, 512201, 520692, 521512, 526292, 538388, 545052, 549198, 557246, 562984, 578955, 593965, 603036, 613601, 624958, 639625, 650530, 665298, 681331, 701614, 718880, 727373, 743323, 762601, 769661, 777017, 786288, 799288, 808379, 820393, 830802, 832628, 838679, 839807, 846506, 846923, 853157, 853416, 852381, 850498, 849158, 841243, 845384, 849489, 846748, 844988, 841627, 839143, 832792, 830307, 836814, 839983, 849485, 857148, 867205, 873815, 886070, 898396, 914387, 941959, 969990, 996800, 1024304, 1050815, 1080324, 1115829, 1151824, 1192018, 1231978, 1279372, 1320595, 1373477, 1431689, 1475641, 1526929, 1581587, 1634520, 1682565, 1733493]
3559A733493N4321N0221M1978M4717M2300L4016L2952K6681K5923K1955K3951
3548B132508K3135Q950J7358J1348L478N894o257k651j0218j1996j7540j9354
3536B134655k1998j9122k2382k4173j9965k1351k2069k5521j9889j7621j7595
3525A902969k4225k5799k4212j9157k2037j1925q831j7756q055r341r303j0220
3513A712108l267L78l594m736m997J34l535q924J110L24m478j1356o492p305r94
3498A654376j1483j0715j2665r029j3427j9793k3366k4906k7498k7297j4040k9519
3486A430638l5681l0551k7723l6149l2502k7317l0928l4064l5658l3796k8053
3475A078216l2396l1861l1096k9345l3943l1016k1622j9927j9038k2467j6792
$$ y = [1733493, 1787814, 1838035, 1880013, 1924730, 1967030, 2001046, 2033998, 2060679, 2086602, 2108557, 2132508, 2155643, 2164593, 2181951, 2193299, 2196777, 2202671, 2196414, 2193763, 2183545, 2171549, 2154009, 2134655, 2112657, 2093535, 2071153, 2046980, 2027015, 2005664, 1983595, 1958074, 1938185, 1920564, 1902969, 1878744, 1852945, 1828733, 1809576, 1787539, 1775614, 1766783, 1749027, 1740972, 1731631, 1722328, 1712108, 1708841, 1709219, 1705625, 1700889, 1695892, 1696026, 1692491, 1683567, 1684677, 1685001, 1680523, 1669167, 1662675, 1655370, 1654376, 1642893, 1632178, 1619513, 1610484, 1597057, 1577264, 1553898, 1528992, 1501494, 1474197, 1460157, 1430638, 1394957, 1364406, 1336683, 1300534, 1268032, 1240715, 1209787, 1175723, 1140065, 1106269, 1078216, 1045820, 1013959, 982863, 953518, 919575, 888559, 866937, 847010, 827972, 805505, 788713]
3464G88713j0902j7416j2484j0109j3039q829l814j0907q222p105j2896J830n330
3451F69490j291L48q166n393l46n308j635m166P00n814p161m686o070j0326j0447
3436E99729n137o500o511j1206j6434j7036o806j4728j1086j5667j7734r649j2612
3423D48623j2604j6059r616j2162k1679j2332j4699j5947j0935j2636j6592j4856
3411B78506n657j3741k492l718j4751q938q180r841q514l706m724o195p770n387
3397A74892j0316J282j3885j54K936l301l457r846o137N71J192l374K012J628
3383A34043j2660m644M109p452L93k769n782M120Rk936k889m836k178o097p267
3368H3164K649M77l321n452j940N864j587j550n590P73J634M740k095o317r52
$$ y = [788713, 777811, 760395, 747911, 737802, 724763, 715934, 712120, 701213, 692991, 685886, 672990, 674820, 669490, 668199, 668547, 660381, 654988, 654642, 649334, 647699, 643533, 644233, 638419, 631258, 626572, 620502, 610176, 599729, 594592, 588092, 581581, 570375, 553941, 536905, 530099, 515371, 504285, 488618, 470884, 461235, 448623, 436019, 419960, 410344, 398182, 376503, 364171, 349472, 333525, 322590, 309954, 293362, 278506, 272849, 259108, 256616, 252898, 238147, 229209, 221029, 211188, 202674, 198968, 194244, 188049, 180279, 174892, 164576, 165858, 151973, 151819, 154755, 151454, 147997, 138151, 132014, 132585, 133777, 130403, 132415, 134043, 121383, 116739, 120848, 113396, 113789, 111020, 105238, 109358, 109367, 106431, 103542, 98706, 96528, 90431, 83164, 85813, 86290, 82969, 77517, 75577, 81441, 79854, 78304, 72714, 73487, 75121, 79861, 77766, 71449, 70497]
3353G0497M310K5o655n08k495O78o309N296j655l086O20J197m472L218j866J460
3337F0255J301m889j319J560J327o932M958J692j274m303k493l969k505O218K72
3322D9899l707k523p19R83j014p45n800j230m44J739L710J606k374j777N92M292
3306D2488J007J302k642J408p641J279M403j0914r141N324M303k384K936K353
3292C4081j080r07l812O416K771p584M034k081k382J0428o088j151J264m454K116
3277C1571J472M377j485m985K244M204l369k52J973P79m744k105j423M437l635
3262B9059J146J005j746k368M640M380j726P38N20j114n918M266J250p425K280
3247B8987O83o62m152n08N131j950L04k763K783K837J542Q13L550o216j294m443
$$ y = [70497, 74807, 74832, 68177, 67669, 65174, 65852, 59543, 64839, 63184, 60098, 60718, 61915, 57443, 60661, 58795, 60255, 61556, 56667, 55348, 56908, 58235, 51303, 56261, 57953, 56679, 52376, 49883, 45914, 43409, 49627, 49899, 46192, 43669, 42950, 43933, 42919, 42174, 36374, 35144, 34700, 36439, 40149, 41755, 39381, 37604, 38196, 42488, 43495, 44797, 42155, 43563, 35922, 37201, 41604, 30690, 21549, 26873, 31176, 28792, 31728, 34081, 33001, 32094, 28282, 34698, 37469, 29885, 33919, 31838, 29456, 39884, 33796, 32645, 33909, 29455, 31571, 33043, 37420, 35935, 30950, 33194, 37398, 34029, 33777, 35750, 36529, 31785, 29680, 28257, 32694, 29059, 30205, 31210, 29464, 27096, 31736, 36116, 34390, 35128, 35648, 34534, 28616, 32882, 34132, 26707, 28987, 29670, 29008, 24856, 24348, 29479, 27529, 27833, 25070, 27853, 30690, 32232, 33045, 36595, 30379, 29085, 24642]
3231B4642J749P151r17l098k562l626J992K664j265K633n051k780N096M962m82
3216C1108n254k403L923l360K338j728l489j603k206j674J175K508m025n685N605
3201A5230J0295m991M73k363K779k982M701J423p65O949j238j704k909r89m310
3186A9599p7m153o898O279J0339k945o637J236j50O86N879l256p38m300J605K735
3170A9204l589K44m021q5O534J543k565J425N04n140O79J524l259l56R13Q77Q47
3153A5279n53k113k924O732L055L530r651q382m300P437M346P80M568n291l954
3138H559R438R71l956j89k998M163M10r981J989j126J856O632J016m258k361L173
3122A3338m512J539m916j244N524k313o84R24L155j464j648R530J051k259O45
$$ y = [24642, 26391, 33542, 32625, 29527, 26965, 23339, 25331, 27995, 26730, 29363, 24312, 21532, 26628, 31590, 31108, 25854, 23451, 27374, 24014, 26352, 24624, 21135, 19532, 17326, 15652, 16827, 19335, 15310, 9625, 15230, 25525, 20534, 21007, 18644, 21423, 18441, 23142, 24565, 23800, 30749, 29511, 27807, 24898, 23909, 19599, 19522, 15369, 8471, 14750, 25089, 22144, 15507, 16743, 16593, 17279, 23158, 19902, 19164, 14864, 16469, 19204, 15615, 15859, 11838, 11753, 18287, 19830, 17265, 18690, 19194, 14054, 14733, 16257, 12998, 12642, 13555, 14432, 15279, 14726, 12613, 9689, 16421, 19476, 23006, 13355, 4973, 673, 8110, 12456, 13236, 17804, 12513, 8559, 17997, 18968, 15012, 14823, 11825, 15988, 16398, 6417, 8406, 7280, 9136, 15768, 16784, 12526, 10165, 13338, 8826, 10365, 5449, 4205, 9729, 7416, 6732, 7656, 10811, 9347, 7699, 17229, 18280, 16021, 16666]
3107A6666q66k166m198Q13j369M039m938J2O863L983j441p950L074j971l857P86
3091G480J996L692k856M511L654p545k104o353L049J638k747n66N38j926j498
3076I63L963J2467p473k987m611L38O833L861l530k159l034L705m663J565Q05
3061F043L548k649k575R57N077p748J77M684o501J186J830L075M624l897o639
3046A192pj437O959l394J316k360J048l579O918M195l099k735K322M968m121Q1
3030H267l520K212k829K681K208m367j677J148K606m305J830k548l940O239N003
3015I008m590R0J044M238N063j1662o535L694j818K837M081m702k468M937p204
3000c987K980K077J13K134K558j200N430j955m27k489R207j530q998l186J038
$$ y = [16666, 15800, 13634, 9436, 10249, 8880, 12919, 7981, 7993, 14856, 18839, 17398, 9448, 12522, 10551, 6694, 7480, 9476, 13168, 10312, 14823, 18477, 10932, 8828, 2475, 5524, 7162, 4415, 3849, 4387, 2461, 963, 4926, 17393, 9920, 6933, 2322, 2660, 9493, 13354, 9824, 7665, 4631, 8336, 3673, 5238, 6043, 9591, 6942, 4367, 5324, 10401, 2653, 2830, 7514, 1013, 2199, 4029, 7104, 11728, 7831, 1192, 1185, -252, 6707, 3313, 4629, 2269, 3317, -262, 6656, 10851, 7752, 5017, 7339, 12307, 8186, 8267, 4747, 6959, 4130, 6811, 9019, 4652, 2975, 4123, 6729, 2424, 4254, 1706, -2234, 4005, 9008, 4418, 4508, 5552, 9790, 14853, 3191, -3344, 350, -1468, 1369, 5450, 748, -1720, 3217, -3987, -1007, 1070, 1183, 3317, 5875, 4675, 10105, 8150, 7723, 5234, 14441, 12911, 3913, 727, 1765]
2985A765R86j394J042l202K549k295j576K682m912N13J126O403P438o590n49L060
2969G046o658m300l279l881L790Q30q68L408P931K359m844J390N731m706n128
2954a179M010p356J995L685k928p60L828M434R46m425n723K631J2O918m852k198
2938i62Q88J1263k676j1585Q98N229j119K279J72n081l205L167l707K702R167
2923G430r717l125M341k429P02k936m05N351P584n961n761J474Rj164Q35L402
2907c70K90J780o515O18m86m038Q008M519j259P24k899K481n034j026M799L523
2891E115j741k506j667n61o83O41M517p134K170Q12M650l32J918j954m413O70
2875d98k463m729L094R008n023K053K611k256N19K534k701k401M858K693p343
$$ y = [1765, 2751, 1357, 2399, -803, 1746, -549, -2125, 557, -4355, -3842, -2716, 3687, 11125, 4535, 3986, 7046, 388, -3912, -7191, -11072, -7282, -6452, -7320, -3912, 4019, 6378, 1534, 2924, 8655, 3949, -1179, 2831, -4525, -2530, 1155, -1773, -2533, 1295, 5729, 6675, 2250, -3473, -842, -830, 6088, 1236, -962, -74, 11189, 8513, -3072, -2174, 3055, 1936, 4215, 4387, -694, -3899, -732, -4439, -1737, 7430, -2287, -5412, -1071, -3500, -2798, -5734, -6139, -788, 6796, 835, -4926, -3452, -3443, -4607, -3772, -370, -80, 1700, -4815, -4197, -4683, -8721, -713, 3806, 2547, 3271, 372, 2853, -2181, -3207, 1592, 5115, 3374, 868, -799, -1360, -2043, -1402, 3115, -4019, -1849, -1037, 3613, 3281, 5199, 3245, -1168, -498, -2961, -7690, -4596, 4412, -611, 1442, 4053, 1797, 2316, 4850, 2149, -252, 4606, 7299, -44]
2860d4P051j401J269q574m224L774o131k23O71M071J988k003j644M304M167M425
2844G476q081k951J942O088o317p55L12L007J787J681o649K363k042j745K833
2829a051J348J858k826m65J1Q81n422J478N297n45m546Q73K204J492M311r41m205
2812b48M321K947k502q44K128k994k639j74K726n275K802n76J425o131K060R007
2796F033l450O3N506q595k162N401K608o259K896K099r401J549P462N510o52p285
2780A323k958K545M570m026l8L796O03M54q75N669K53l16j854k617O925j558m646
2763G250j706n41L135o567p311N936O671l273j072M909J086j768K372k235o357
2748E29k131J170K117K666K734K757j194p91l074J87k690P80k770l5j733l194
$$ y = [-44, 7007, 5606, 6875, -1699, -5923, -2149, -8280, -8503, -7832, -3761, -1773, -3776, -5420, -1116, 3051, 7476, -605, -3556, -1614, 4474, -1843, -2598, -2286, 721, 2508, 4189, -2460, -97, -2139, -3884, -1051, 297, 2155, -671, -1136, -1125, -244, -5666, -4188, 1109, 564, -3982, -3109, -905, 587, 4898, 3957, -248, 4073, 7020, 4518, 3674, 5802, 2808, 169, -5, 2721, -2554, 248, -328, 1097, -5034, -2974, 6033, 2583, 2646, 8152, -443, -2605, 2796, 5404, -855, 2041, 4140, -5261, -3712, 3750, 9260, 8608, 1323, -1635, 910, 5480, 1454, 1416, 5212, 5815, 6269, 5394, 11063, 11316, 11000, 9146, 6529, 13454, 11896, 7250, 5544, 5003, 8138, 1571, -5740, 196, 6867, 3594, 2522, 7431, 8517, 6749, 9121, 6886, 529, -1602, -432, 1685, 4351, 7085, 9842, 8648, 7857, 4783, 4970, 2280, 3060, 290, 255, -1478, -4672]
2732d672Q096J217j137J107N238j2561k532K170j100K199J337K396j582j448J757
2717D85M196O60J477j4815R541P40Q06L864r177m087j477M554M634N047l419r25
2701B104J4K96M63n771m004M883N460r13m708n445M796N508r01J106o763n89N95
2684c869N131j587J070K959J633j17j0138K382P142P202j468p807o034p95K249
2669b047L334o389J913r67l617K968N790J152l936J326L024l72k173j046K092
2654A052Q350j364n699j531l476M882l139m18N897k233r93M840l528o250K545
2639a065N691n111l994J567p75R52n91M662n79n378J368M6m854L954k790j973
2623h870M779J415P632L64l903j909l939M370m875k347J480K108J153k226l509
$$ y = [-4672, 3424, 4641, 3504, 4611, 9849, -2712, -5244, -3074, -4174, -1975, -638, 1758, 176, -1272, 485, 4681, 5341, 6818, -7997, 1544, 2284, 3090, 6954, -2223, -6310, -7787, -3233, 1401, 6448, 3029, 2104, 2118, 2414, 2877, -2894, -6898, -2015, 3445, 2532, -2176, -7621, -2825, 2683, 1782, 2888, -3875, -4464, -3869, 1262, -325, 745, 3704, 5337, 5220, -4918, -2536, 4606, 11808, 10340, 2533, -3501, -4296, -2047, 1287, -5102, -3189, -4156, -7773, -4805, 985, 2137, -1799, -473, 2551, 2179, 6, -1040, 1052, 9402, 8038, 2339, 808, -2668, 2214, -925, -1343, 4554, 2321, 1328, 6168, 2640, -3610, -1065, 4626, -485, -4479, -2912, -3687, -2735, -3326, 1336, 757, -4621, -3253, -3207, -8061, -4107, -6897, -8870, -4091, -2676, 4956, 5320, 1417, -492, -4431, -61, -4936, -7283, -5803, -3695, -2542, -4768, -8277]
2608h277K468M018j66k159M219K122o774J657r38l113K644J943N662p054k915
2593f663N577j303J605N219L278n852R41j284K074J49L533k304p078N704k815
2578G81l979l224l599R41L954J541j949Q03L537Q0j166l819p23k434N383M288
2562D15J323L828J356M86j2920k063P146k319k672J872k530M347r37j040j551
2547e259L585K540R28j608p281L640j830K445J840j149J910o87n15p75j451N069
2531A402k573k600K671l075k096L533o64O240O645M33o478l644K258J475o255
2516b728L744L110K602p331R0o82p19j367j445M620P499k026j0166k04O099K916
2500D012J532j939k976k401l954K482M906K622j543j642L610m865k909N020n488
$$ y = [-8277, -5809, -1791, -1957, -4116, 103, 2225, -4549, -2892, -3830, -6943, -4299, -2356, 3306, -3748, -6663, -1086, -2389, -784, 4435, 7713, 1861, 2802, 1518, 3592, 3741, 7274, 4970, -2108, 3596, 781, -3198, -6422, -10021, -9080, -5126, -3585, -5534, -4731, -1194, -1114, -2280, -6099, -6822, -9256, -3873, 415, 1738, 5566, 6922, 7408, -5512, -7575, -429, -2748, -5420, -3548, -6078, -1731, -2668, -3708, -5259, -1674, 866, 1794, 186, -7095, -3455, -5285, -2840, -1000, -2149, -239, -926, -1441, -2216, -3667, 1402, -1171, -3771, -1100, -4175, -6271, -2738, -3402, 2838, 9483, 9916, 3438, -206, 2052, 3527, -2728, 1016, 4126, 6728, -603, -513, -1195, -1914, -3281, -4726, -106, 7393, 5367, -4799, -5003, 1096, 4012, 5544, 3605, 629, -1772, -5726, -3244, 1662, 4284, 2741, 1099, 4709, -156, -3065, 1955, -3533]
2485c533o088l56O494L899R935o448p68o97o259P28j409l775q63L503M671k677
$$ y = [-3533, -9621, -9977, -3483, 416, 10351, 3903, 3135, 2438, -3821, -3093, -4502, -8277, -9140, -5637, -966, -3643]
$$ [...]
##END NTUPLES=NMR SPECTRUM
##END=
