##TITLE=1H_EC-3277x
 DMSO
 8 sc, 
 19.09.2022
##JCAMPDX= 6.0         $$ Bruker NMR JCAMP-DX V2.0
##DATA TYPE= NMR SPECTRUM
##DATA CLASS= NTUPLES
##ORIGIN= UXNMR, Bruker Analytische Messtechnik GmbH
##OWNER= root
$$ XWIN-NMR		Version 3.5
$$ Mon Sep 19 13:44:35 2022 Russian Standard Time (UT+4h)  she@DPX200
##.OBSERVE FREQUENCY= 200.1313499994
##.OBSERVE NUCLEUS= ^1H
##.ACQUISITION MODE= SIMULTANEOUS
##.ACQUISITION SCHEME= undefined
##.AVERAGES= 8
##.DIGITISER RES= 18
##SPECTROMETER/DATA SYSTEM= spect
##.PULSE SEQUENCE= zg30
##.SOLVENT NAME= DMSO
##.SHIFT REFERENCE= (INTERNAL, DMSO, 0, 15.7502)
##AUDIT TRAIL= $$ (NUMBER, WHEN, WHO, WHERE, WHAT)
$$ ##TITLE= Audit trail, XWIN-NMR		Version 3.5
$$ ##JCAMPDX= 5.01
$$ ##ORIGIN= Bruker BioSpin GmbH
$$ ##OWNER= she
$$ F:/spectra/data/she/nmr/H-F/1/pdata/1/auditp.txt
$$ ##AUDIT TRAIL=  $$ (NUMBER, WHEN, WHO, WHERE, WHAT)
(   1,<2022-09-19 13:43:16.18 +0400>,<she>,<DPX200>,
      <created by zg, POWCHK disabled, PULCHK disabled
       configuration hash MD5:
       00 E9 B6 7A A2 85 ED C7 34 08 36 98 17 FE 4E 26
       data hash MD5: 16K
       2E 04 0D 13 54 EC C2 64 66 AB BF E1 EC 2D AC 10>)
(   2,<2022-09-19 13:43:18.43 +0400>,<she>,<DPX200>,
      <Start of raw data processing
       efp BC_mod = 2 LB = 0.24 FT_mod = 6 PKNL = 1 PHC0 = -18114.62 PHC1 = 7.80069 SI = 16K 
       data hash MD5: 16K
       8F 91 D7 73 5D 30 52 AB A7 7A 9B 0B 9D E2 82 23>)
(   3,<2022-09-19 13:43:45.75 +0400>,<she>,<DPX200>,
      <pk PHC0 = 89.13936 PHC1 = -11.8 
       data hash MD5: 16K
       BF 61 37 1B C5 63 D6 79 8E 58 58 FB D6 1E 89 03>)
(   4,<2022-09-19 13:43:49.40 +0400>,<she>,<DPX200>,
      <abs ABSG = 5 
       data hash MD5: 16K
       E5 F3 C6 6A A5 77 FE 73 80 4D 3E 40 8F 3F 75 95>)
$$ ##END=
$$ 
$$ hash MD5
$$ 1B B2 92 DA 07 20 31 39 27 9D A2 FE EA A5 F8 36
##$RELAX= 
##$RELAX= 
##$RELAX= 
##$RELAX= 
##$RELAX= 
##$RELAX= 
$$ Bruker specific parameters
$$ --------------------------
##$DU= <F:/spectra>
##$EXPNO= 1
##$NAME= <H-F>
##$PROCNO= 1
##$TYPE= <nmr>
##$USER= <she>
##$AMP= (0..31)
100 100 100 100 100 100 100 100 100 100 100 100 100 100 100 100 100 100 
100 100 100 100 100 100 100 100 100 100 100 100 100 100 
##$AQSEQ= 0
##$AQ_mod= 1
##$AUNM= <au_zg>
##$AUTOPOS= <>
##$BF1= 200.13
##$BF2= 200.13
##$BF3= 200.13
##$BF4= 200.13
##$BF5= 200.13
##$BF6= 200.13
##$BF7= 200.13
##$BF8= 200.13
##$BYTORDA= 1
##$CFDGTYP= 0
##$CFRGTYP= 5
##$CHEMSTR= <none>
##$CNST= (0..31)
1 1 145 1 1 1 1 1 1 1 1 1 1 1 1 1 1 1 1 1 1 1 1 1 1 1 1 1 1 1 1 1 
##$CPDPRG= <>
##$CPDPRG1= <>
##$CPDPRG2= <>
##$CPDPRG3= <>
##$CPDPRG4= <mlev>
##$CPDPRG5= <mlev>
##$CPDPRG6= <mlev>
##$CPDPRG7= <mlev>
##$CPDPRG8= <mlev>
##$CPDPRGB= <>
##$CPDPRGT= <>
##$D= (0..31)
0 1.2 0 0 0 0 0 0 0 0.06 0 0.03 0 0 0 0 0.0002 0 0 0 0 0 0 0 0 0 0 0 0 
0 0 0 
##$DATE= 1663580595
##$DBL= (0..7)
120 120 120 120 120 120 120 120 
##$DBP= (0..7)
150 150 150 150 150 150 150 150 
##$DBP07= 0
##$DBPNAM0= <>
##$DBPNAM1= <>
##$DBPNAM2= <>
##$DBPNAM3= <>
##$DBPNAM4= <>
$$ [...]
##$SUBNAM3= <"">
##$SUBNAM4= <"">
##$SUBNAM5= <"">
##$SUBNAM6= <"">
##$SUBNAM7= <"">
##$SUBNAM8= <"">
##$SUBNAM9= <"">
##$SW= 18.0517283424941
##$SWIBOX= (0..15)
0 0 2 0 0 0 0 0 0 0 0 0 0 0 0 0 
##$SW_h= 3612.71676300578
##$TD= 16384
##$TD0= 1
##$TE= 0
##$TE2= 300
##$TE3= 300
##$TEG= 300
##$TL= (0..7)
0 120 120 120 120 120 120 120 
##$TP= (0..7)
150 150 150 150 150 150 150 150 
##$TP07= 0
##$TPNAME0= <>
##$TPNAME1= <>
##$TPNAME2= <>
##$TPNAME3= <>
##$TPNAME4= <>
##$TPNAME5= <>
##$TPNAME6= <>
##$TPNAME7= <>
##$TPOAL= (0..7)
0.5 0.5 0.5 0.5 0.5 0.5 0.5 0.5 
##$TPOFFS= (0..7)
0 0 0 0 0 0 0 0 
##$TUNHIN= 0
##$TUNHOUT= 0
##$TUNXOUT= 0
##$USERA1= <user>
##$USERA2= <user>
##$USERA3= <user>
##$USERA4= <user>
##$USERA5= <user>
##$V9= 5
##$VALIST= <valist>
##$VCLIST= <CCCCCCCCCCCCCCC>
##$VD= 0
##$VDLIST= <DDDDDDDDDDDDDDD>
##$VPLIST= <PPPPPPPPPPPPPPP>
##$VTLIST= <TTTTTTTTTTTTTTT>
##$WBST= 1024
##$WBSW= 4
##$XGAIN= (0..3)
0 0 0 0 
##$XL= 0
##$YL= 0
##$YMAX_a= 96292
##$YMIN_a= -178581
##$ZGOPTNS= <>
##$ZL1= 120
##$ZL2= 120
##$ZL3= 120
##$ZL4= 120
##$ABSF1= 15.74578
##$ABSF2= -2.306069
##$ABSG= 5
##$ABSL= 3
##$ALPHA= 0
##$AQORDER= 0
##$ASSFAC= 0
##$ASSFACI= 0
##$ASSFACX= 0
##$ASSWID= 0
##$AUNMP= <proc_1d>
##$AZFE= 0.1
##$AZFW= 0.1
##$BCFW= 0
##$BC_mod= 2
##$BYTORDP= 0
##$COROFFS= 0
##$CY= -3
##$DATMOD= 1
##$DC= 0
##$DFILT= <>
##$DTYPP= 0
##$F1P= 0
##$F2P= 0
##$FCOR= 1
##$FTSIZE= 16384
##$FT_mod= 6
##$GAMMA= 0
##$GB= 0
##$INTBC= 1
##$INTSCL= 3.70164e-10
##$ISEN= 128
##$LB= 0.24
##$LEV0= 0
##$LPBIN= 0
##$MAXI= 10000
##$MC2= 0
##$MEAN= 0
##$ME_mod= 0
##$MI= 1.114404
##$NCOEF= 0
##$NC_proc= -9
##$NLEV= 6
##$NOISF1= 3.799351
##$NOISF2= 2.8
##$NSP= 0
##$NTH_PI= 0
##$NZP= 0
##$OFFSET= 15.75019
##$PC= 1
##$PHC0= -18025.48
##$PHC1= -3.99931
##$PH_mod= 1
##$PKNL= yes
##$PPARMOD= 0
##$PSCAL= 0
##$PSIGN= 0
##$REVERSE= no
##$SF= 200.130004270349
##$SI= 16384
##$SIGF1= 3
##$SIGF2= 2
##$SINO= 5.538805
##$SIOLD= 16384
##$SREGLST= <1H.CDCl3>
##$SSB= 0
##$STSI= 16384
##$STSR= 0
##$SW_p= 3612.71676300578
##$SYMM= 0
##$S_DEV= 0
##$TDeff= 16384
##$TDoff= 0
##$TI= <>
##$TILT= no
##$TM1= 0
##$TM2= 0
##$TOPLEV= 0
##$USERP1= <user>
##$USERP2= <user>
##$USERP3= <user>
##$USERP4= <user>
##$USERP5= <user>
##$WDW= 1
##$XDIM= 16384
##$YMAX_p= 284745036
##$YMIN_p= -5087434
$$ End of Bruker specific parameters
$$ ---------------------------------
##NTUPLES= NMR SPECTRUM
##VAR_NAME=  FREQUENCY,     SPECTRUM/REAL,   SPECTRUM/IMAG
##SYMBOL=    X,             R,               I
##VAR_TYPE=  INDEPENDENT,   DEPENDENT,       DEPENDENT
##VAR_FORM=  AFFN,          ASDF,            ASDF
##VAR_DIM=   16384,         16384,           16384
##UNITS=     HZ,            ARBITRARY UNITS, ARBITRARY UNITS
##FACTOR=    0.220516191357247, 1,           1
##FIRST=     3152.08554816815, 0,            0
##LAST=      -460.631214837626, 0,           0
##MIN=       -460.631214837626, -5087434,    0
##MAX=       3152.08554816815, 284745036,    0
$$ Real data points
##PAGE= N=1
##DATA TABLE= (X++(R..R)), XYDATA
$$ [...]
8846 2961579 2828976 3396701 3297214 3701969 4399454 4629771 4364932 5219897 5523712 5737736
8836 5737736 6298333 7040128 7305344 6741155 5477165 5115515 5755311 5561881 4976981
8827 4976981 5056357 4821066 5943551 5898725 5592433 5348810 5450511 5755583 5129296 4880635
8817 4880635 6327368 7052859 6552342 7178624 7749191 8271061 7666308 7011769 7607737
8808 7607737 7029700 7156517 6837454 6434575 6268509 5961971 6634722 6805923 7395504 7471382
8798 7471382 7992737 8840209 9494931 9874827 9277336 9463073 8958161 8421570 8469883 7807133
8788 7807133 7360571 8058428 7723901 8280903 8250728 8424233 9081767 9035156 9489409 10146501
8778 10146501 10531973 11469791 12364766 12187544 13162870 13869473 14746563 14274006 13517134
8769 13517134 12723844 13058267 13088283 14245249 14759833 15325008 16009381 16469690 17715837
8760 17715837 18618427 19711800 20801197 22477333 24348484 27002497 31018232 33507903
8752 33507903 35308534 38224783 40454540 42173726 42788526 42671424 41985234 41660314 42114151
8743 42114151 42357470 42821890 43255683 44577968 46132817 45766569 44422648 41962861 39893623
8734 39893623 38515753 36595331 33562371 31500442 29306132 27843123 25782357 24904710
8726 24904710 24191113 23623133 23494776 23622365 23216532 22443217 22485293 23263442 23103225 23669473
8716 23669473 24180272 25708104 28391989 29559058 31886487 35251144 37476943 40310887
8708 40310887 42983964 45179466 46368742 46888126 46218776 45261282 45130094 43930885 42924900
8699 42924900 42544152 43311662 43506996 44439753 43991827 43652062 42050821 39951720 36666651
8690 36666651 34411648 31884779 29094650 27460444 25426766 22736699 20728874 19967040
8682 19967040 18669038 17636985 16956026 16414938 15820048 14866213 13701778 12681832 11814708
8673 11814708 11081476 11617772 11352909 11048840 10803936 9388553 9262398 8470342 8483686
8664 8483686 8650558 8281591 8548219 7905490 8161128 8803763 8188934 7972663 7844796 8195941
8654 8195941 6867858 6572837 6660493 6990208 7506586 6903913 6353566 6455527 6549985 6731549
8644 6731549 6743913 6589684 6140584 5100401 4931546 4416522 5637468 6022971 5283684
8635 5283684 4458641 4041755 4247922 5506532 5922764 5376778 4253194 3798202 3417220
8626 3417220 3526025 4224520 3884773 3602424 3572799 3437652 2954916 4080562 4067896 3102091
8616 3102091 3428191 3549921 3804412 3077959 3075095 3154954 3167936 2271153 1974884 2231967
8606 2231967 2940495 2678616 1971672 2538589 2530221 2222367 1917035 2636385 2035100 1895343
8596 1895343 2540362 3116621 3004248 2314039 2842820 2383770 1915391 2894929 2660578 2103429
8586 2103429 2310296 2358584 2553919 2502556 2293675 2075674 2142348 1914041 1906869 1900748 2055311
8575 2055311 1885119 2559510 3619889 3218198 2676534 2191763 2722933 3062397 3691922
8566 3691922 3634665 3352152 3329544 2722815 1803941 2106453 2790630 2522908 3030764 2939234
8556 2939234 2488957 2733051 1511693 1947870 2507951 2259431 2716664 2487223 3622074
8547 3622074 2906714 2868265 3624966 4133725 4205221 3388749 3801853 3592389 3551438 3142337
8537 3142337 3891516 3951399 4026985 3911435 3909150 4875471 5572113 5327379 6063088 5748572
8527 5748572 5757583 6682411 7075173 7733599 8060000 8893913 9631878 11376331 12235748 12513170
8517 12513170 12943157 12679420 13506864 13607799 14448135 14600863 13964472 13787589 14071373
8508 14071373 14604599 14611330 14723569 15061106 16371451 15998364 14644223 13927840 13798798
8499 13798798 14636464 14648081 14226108 13963582 14095126 14837018 15625122 15350801 15936015 16609946
8489 16609946 17087793 17584601 18753618 20352908 21382886 22213481 22704135 24147318 25439653
8480 25439653 26534639 27737846 28740244 30451599 32247906 33655021 34537849 35120438
8472 35120438 35588542 34259845 33146149 32655905 31226492 31313000 31835161 31499127 31119268
8463 31119268 31107015 30727440 29781007 29762762 28644835 27417095 26996627 26539425 25147503
8454 25147503 23668823 23995525 24313768 25159596 26174402 26495049 28697924 29798669 30784555
8445 30784555 31648218 32538809 32684109 33718743 33862439 34279296 34517817 34849717 35358335
8436 35358335 35487475 36200195 36540150 36751240 35611318 35058604 35155964 33335639 31743444
8427 31743444 30588771 29287123 29080040 28420969 26829963 26145323 24544878 23469925 23448505
8418 23448505 22617367 21354540 20775953 20374491 19496384 19602933 19304940 19447157 20881731
8409 20881731 21118567 21010288 20842538 21247933 21082911 21745428 22156688 22326680 21348120
8400 21348120 20959299 21705955 20916310 20317199 19952003 20249975 20417256 19362962 17457786
8391 17457786 16560844 15628121 15357205 14914580 15168258 14149663 13918152 13328583 12810480
8382 12810480 12016130 10888154 10063881 9057333 9495703 9508678 8738411 8195129 7719241
8373 7719241 7494333 7633174 7705330 7226993 7388657 8391722 8681246 8329760 7826680 8112682
8363 8112682 8276359 7988659 6998068 7198368 7196137 6562761 7485552 7209471 6275306 5643721
8353 5643721 5081202 4848721 5280771 4718867 4095511 3573644 4225674 3941928 3572898 3570612
8343 3570612 2672896 2450205 3106780 3203476 3273890 2581695 2093844 2040691 2374600 3114140
8333 3114140 2715107 1910764 2365715 2811575 2228473 1968873 1795039 2352632 2742051 2016725
8323 2016725 1963727 2425428 2160363 2672686 2905527 2913151 3286179 1960081 1615878 1931985
8313 1931985 2038760 1930098 1893087 1077176 723350 1932250 1743614 2421882 2140369 1805418
8303 1805418 1352412 995547 620063 310851 774399 1364255 985597 819225 1066980 1258629
8293 1258629 688331 241099 38978 672885 718287 426924 568558 476792 598085 -106378
8283 -106378 -356183 224445 526582 50296 -529551 14412 -23722 -218595 1037645 1055900
8273 1055900 1352842 1106275 468845 244191 301959 -39509 -111598 782861 615629 646281
8263 646281 899304 458127 196669 934173 1273662 116763 -108909 -400161 -380130 -127747
8253 -127747 -1737036 -897685 -155140 236797 925369 -130767 186791 813877 231487
8244 231487 -36502 206875 703075 523642 651216 537717 -564233 23073 -89511 -192092
8234 -192092 -369543 -278039 -473479 1884 194933 -722038 -251308 383270 262848 -223180
8224 -223180 -118256 2872 381520 -28803 -363461 2810 -327789 -87791 -673514 -1278153
8214 -1278153 -1255134 -980082 -469732 -246373 -446324 -255511 -327913 -90814 787184 303351
8204 303351 137751 -1076975 -1204355 -1347731 -1298055 -774986 -1393043 -1539977 -1395195 -3227772
8194 -3227772 -3224754 -5087434 907375 5211931 2547524 2191050 1825476 2081692 1955491
8185 1955491 1623180 1167295 1120338 961555 1038987 240127 920633 -14425 -597321 -315338
8175 -315338 -171344 534991 697707 381406 721318 -2727 468887 -129249 -627259 483600
8165 483600 882912 873493 1358458 285088 -114237 46533 -230347 -1092661 -876192 -1341935
8155 -1341935 -755031 473732 439028 -180612 -721037 -1040969 -180343 690257 901549 1136396
8145 1136396 434334 334040 -252202 -407214 199640 336388 202446 181389 118042 -166065
8135 -166065 -1162759 -991291 -744690 -574252 -62128 447221 -217805 -312260 -99135 73156
8125 73156 -1363472 -434345 -650881 -228948 354849 207823 -434851 -1952196 -1942839 -782932
8115 -782932 -1127920 -939682 -13224 -57517 -353270 -928737 -654742 -717981 385887 426705
8105 426705 -489396 -848682 516721 865605 -142461 151189 393594 -192648 -1332610
8096 -1332610 -806821 -310440 -717476 -1125195 -360789 -870851 -979202 -385879 -776029 401361
8086 401361 -391874 -131318 -483818 -254351 -596219 -1448744 -1354000 -639140 66161 198386
8076 198386 -359467 405178 41340 -340006 738625 687447 660839 -419765 -794808 -1542198
8066 -1542198 -1155319 -699461 -457641 -211680 -178147 -155467 -432505 189712 443069 -142262
8056 -142262 -1258184 -289621 329578 -103944 -236268 -195241 121328 36240 -9128 -198025
8046 -198025 -519674 -1232024 -1842148 -1191531 -315875 69526 104495 124811 58803 -501682
8036 -501682 -1030750 -646716 -267407 -63606 -213395 -188004 501760 -833016 -1675757 -1213838
8026 -1213838 -990343 -1083867 -489638 -449693 -818877 -843788 -289573 35580 -425551 -273081
8016 -273081 -531511 -214974 -287913 -869912 -203182 -1028529 -1046467 -879026 -1590423 -1907743
8006 -1907743 -1611026 -1586026 -1581123 -1309897 -1695392 -1143183 -942536 -976427 -1090140 -266790
7996 -266790 -410228 -1337230 -1416775 -847405 -298619 -365371 -826482 -408882 650752 171351
7986 171351 -987720 -839960 -142758 116393 -231319 -583046 -804262 -565340 -759875 -761422
7976 -761422 -582378 -483873 -103615 -306708 263693 272974 32019 373978 -1321434 -1403652
7966 -1403652 -617146 120999 131200 -419078 -433876 -293087 -525444 -607556 -1326489 -1268908
7956 -1268908 -503045 -865861 -596307 -488028 -877653 -1012541 -427081 -514911 -392265 -1374517
7946 -1374517 -269216 292041 -680359 -925866 -939052 -654702 -518038 -351950 -411915 -722675
7936 -722675 -939289 -1701561 -1697532 -1334742 -764623 -790718 -1308997 -529247 -137005 -360015
7926 -360015 -459558 -665595 -450221 -944781 -459484 -723689 -543688 -257708 -629752 -1334532
7916 -1334532 -1210162 -1094093 -382134 -594634 -986061 -472046 -454952 -705396 362261 -32901
7906 -32901 -33295 -674274 -1306868 -462301 -81081 -370346 -509420 -896097 -1468938 -872082
7896 -872082 -336054 -848726 -919886 119266 770018 1127104 562518 540288 -882290 -385830
7886 -385830 -55273 -336395 -1091708 -235332 -231038 -124978 -757803 -425909 -584614 -1512135
7876 -1512135 -1893699 -1179085 -103342 -786148 -1210661 -1317421 -1013220 -92064 -88443 8232
7866 8232 -731454 -108908 353421 -5846 -248586 -595493 -960694 -1580713 -1032482 -939095
7856 -939095 -186617 77783 132371 790408 22655 -247000 -401113 -495559 -227422 25086
7846 25086 -587772 -918909 -512355 -697634 -66191 -745721 -204938 -419672 239303 255353
7836 255353 -319700 -476346 -686658 -808800 -1086842 -493301 -235160 -702417 -488082 -1145862
7826 -1145862 -1911750 -811955 -409824 -579060 -1232970 -1347526 -1115217 -436355 -263405
7817 -263405 -148653 -845431 98368 231135 622344 919956 1584500 1451492 421241 -391297
7807 -391297 -847785 -650506 -1077121 -533000 522286 735889 211381 -379102 -1193097 -974037
7797 -974037 -672108 -193678 -363986 -231814 -761834 -538351 -152172 -364225 -365439 -686338
7787 -686338 -1296869 -881965 -715722 -879806 -703130 -346836 -349538 185825 270363 -530176
7777 -530176 -82147 314927 -566522 -1329602 -1442582 -642296 -1062563 -999899 -1073629 -332030
7767 -332030 -418750 -658816 -175047 236865 572610 396567 453492 -330839 -561 137279
7757 137279 -1313690 -904966 -704641 -656094 63616 -195898 -354510 -885481 -1197061 -967346
7747 -967346 -186069 335327 -28226 254493 443153 -424310 -341768 -236608 -80104 -440203
7737 -440203 -231767 -162070 -65363 -454064 -491436 404848 650980 -547917 -1154097 -1176512
7727 -1176512 -506807 -785426 -950744 -514985 -265378 -273609 -130837 -928893 -788202 -419443
7717 -419443 -903607 -692089 -429938 -55343 -109177 417857 275215 -324681 -685761 -699759
7707 -699759 -736362 -283362 241568 -160446 -536966 685703 469567 253038 83079 -543210
7697 -543210 92304 491339 1202898 1026983 302553 -52327 -619283 -1419414 -1380759 -755284
7687 -755284 -1203220 -261577 -165436 -462743 -332721 81912 -6379 -571742 -510743 -35355
7677 -35355 -757744 -379848 -196439 -21435 305520 278199 209967 740897 141423 -425476
7667 -425476 -384208 -513982 -269718 -118111 212417 -53691 -87354 531949 1171311 691595
7657 691595 350096 728528 1141655 1055955 663523 527071 140398 123793 375621 412217
7647 412217 773910 535537 476322 1138996 720650 -229434 279244 180046 -488999 -996424
7637 -996424 -21210 408132 693214 40514 -633337 -585926 -520150 -70399 -691041 -466698
7627 -466698 21273 86814 190130 587729 145649 -741437 -18012 162879 237360 -217911
7617 -217911 269432 -108842 -280499 -418524 -31997 203664 -30472 -924657 -1069882 -850676
7607 -850676 -1571877 -1652492 -187940 470779 575777 557644 -7888 -292010 -296215 104394
7597 104394 -77068 -487572 -339285 -755674 -188853 327296 27194 3166 -882850 -1163762
7587 -1163762 -659758 -1214941 -1635167 -877896 -1614970 -1845969 -705132 -1101503 -956864
7578 -956864 -400440 11472 -171443 -552803 -787285 -845838 -503021 -166394 -780598 -952606
7568 -952606 22025 13273 177324 168974 -220737 -715720 -246472 -523083 -409194 -557928
7558 -557928 -245497 -105499 -533831 -148760 -25248 -587830 -597641 -19929 481175 -243117
7548 -243117 260590 -391818 533068 670414 187914 373926 93374 -1425 -241299 -652175
7538 -652175 -926264 -85498 -302778 -441223 -294858 56978 51422 504066 268282 32751
7528 32751 -406355 -310991 -400171 -593989 -578666 -386644 -31344 -756352 -400601 -915520
7518 -915520 -123721 88881 588804 396085 -324151 -1073551 -1272868 -1113619 -601956 -363611
7508 -363611 -461422 -51761 -926267 -697356 -559511 107595 575513 1311307 1231335 1019725
7498 1019725 395251 -331568 5275 -1081129 -1271172 -571909 -1653781 -1620672 -770659
7489 -770659 -422439 -554412 -91359 -295128 -434517 -878112 -779502 -675961 -1078454 -1279197
7479 -1279197 -963169 -456805 -1349955 -920661 -490646 -366947 -471191 -423623 -310024 435686
7469 435686 788003 180964 -154497 271123 731684 801491 285700 -313002 -26859 -39133
7459 -39133 -149476 -226348 -435723 81405 -410369 -194754 -733020 -1291353 -745087 78053
7449 78053 -503181 -637109 -729688 -1272811 -738362 -865790 -1266327 -1370803 -950417 -319231
7439 -319231 108866 -405536 -44598 -192533 -530017 21906 89522 -529554 -312194 -769874
7429 -769874 -166222 51534 -690946 -184723 200243 348004 100640 -80180 -410090 -576983
7419 -576983 186798 625326 587637 222927 62110 92682 -590830 -1085068 -188005 638350
7409 638350 358680 -123323 -279545 -373883 -368599 -475131 272504 6840 514279 740690
7399 740690 -137196 -335585 -491185 -878152 -840475 -415185 190389 -441243 -737639 673391
7389 673391 402906 -555686 -394988 -245556 232414 323803 109038 -279575 -794084 -875508
7379 -875508 -986423 -586315 -79763 -19756 -5125 154681 882375 -46503 414358 629813
7369 629813 -8047 467225 906196 319124 -716991 -124939 1244334 689403 -138939
7360 -138939 310311 340230 262828 55576 -158051 211849 390834 -213737 -513100 -352658
7350 -352658 -179285 -217771 -813230 -105444 610199 950804 668989 59891 214421 324608
7340 324608 426257 1420624 1438439 74910 293744 344943 216181 -16027 -320228 -777608
7330 -777608 61810 -591532 -734999 581507 816234 653058 507318 435120 751333 718190
7320 718190 655383 558424 1034602 453816 26203 -78419 -121536 392717 441068 -360776
7310 -360776 37889 24204 376050 702861 781073 -4982 -584969 -409547 432789 299960
7300 299960 -314199 -42637 652310 478438 -124764 341728 -112498 607054 1221951 1234144
7290 1234144 526678 -64825 764505 158853 208543 -352155 -645199 287465 -131069 -24668
7280 -24668 542817 1103168 596476 847380 121797 -35659 937114 1824105 1667505 262813
7270 262813 1028049 1476973 1089466 870544 1212186 524627 -160020 526023 413110 385378
7260 385378 391240 534972 -326174 -371811 -495412 -24394 1065844 561708 -91909 -211600
7250 -211600 899056 340053 -17050 582495 1049537 1490750 1083458 693620 391437 25168
7240 25168 56033 -346090 -9867 849873 660518 467283 1216404 1096965 1038273 1259157
7230 1259157 893780 826084 975492 1544684 1222035 398090 1109742 1449858 1729746 1539864
7220 1539864 938886 1616859 905671 480829 836288 1295871 1110764 1315408 1227569 307065
7210 307065 -10377 -473586 213340 833684 955884 1007682 119468 -903165 -377590 200614
7200 200614 191227 1654380 1465477 1720959 1089527 184415 464680 1261780 1070979 1060314
7190 1060314 611440 -250001 -1530 567139 646206 1294972 941756 496904 423233 62034
7180 62034 -108204 4569 19959 403264 1007750 700683 343317 459778 495154 972070
7170 972070 715791 313736 873442 459697 344790 906949 1238080 -5826 -5935 966199
7160 966199 816425 951630 1929806 1649905 1358467 1960365 2343527 2341452 1914050 2114474
7150 2114474 2067085 1162290 1152269 1488053 636892 674987 1046899 753497 575527 274486
7140 274486 -23014 595514 821602 1606074 1948832 527180 340854 635566 51695 803985
7130 803985 733790 1292172 -92997 204812 769055 3896 479053 832794 1089618 1644928
7120 1644928 787991 1275302 1569184 623287 875767 -170756 132665 911205 1573875
7111 1573875 1496870 1051971 29337 1036032 1059912 7375 58874 1208831 1232035 1448169
7101 1448169 1061359 756735 598828 541498 246171 646379 1195756 1069828 1293421 1335489
7091 1335489 744959 1600497 1405561 1205615 596598 1359860 552120 1048542 2035337 1857195
7081 1857195 842315 861032 1686041 1477969 1484981 1364666 1520493 2444033 1655369 1107662
7071 1107662 1010547 1487706 1265060 1065547 1396864 1355498 1776250 1272208 642469 631533
7061 631533 1160168 1378162 1983218 1308248 834489 1246156 1425448 1336090 1373410 2705486
7051 2705486 2882539 2223318 1800862 600921 769327 466105 1257157 1306290 1505934 1501278
7041 1501278 1524678 1417173 1409566 673928 954697 932521 171137 19725 1117258 1284215
7031 1284215 743103 989367 1719760 2134804 1589212 1969411 1527830 1509565 2136411 2484915
7021 2484915 1858299 1373976 1954076 1917494 1258508 1545871 2496310 1919047 2133834 2126344
7011 2126344 2985841 2526785 1700195 1296394 1655327 1527181 2302473 2291237 2652287 2356916
7001 2356916 2163798 1647355 1887280 2535499 2302602 1862176 1778655 2122161 2188727 2016378
6991 2016378 1791891 837895 1306646 2334968 1567978 1698795 2093079 2051503 1919538 2093933
6981 2093933 2277916 1660676 1406676 1049917 753779 701540 991061 2754524 3074079 2564290
6971 2564290 2428554 2796661 3049415 2946539 2120928 2213521 1698501 1842610 2191630 1997769
6961 1997769 1679628 1425368 1881699 2865419 2073240 1910458 1844211 1932718 1563063 1789579
6951 1789579 2398425 2434263 2980150 1224513 896646 1286154 1520155 1765281 2318899 3106450
6941 3106450 2920157 2937239 1676530 2085048 1769865 1928929 2919936 3031212 2155044 2360321
6931 2360321 2589933 2716229 2625368 3327735 3285936 3384502 3135220 3814496 4244870 2557788
6921 2557788 2648109 2871860 2396044 2260292 2495857 2428218 2365148 2426692 3105024 3220028
6911 3220028 2741335 2583808 2487354 2836272 2685556 2697059 3763228 3345594 3100300 3491200
6901 3491200 3946122 3909246 4009407 3877191 3724782 3410699 3505327 4403438 4174074 3775032
6891 3775032 3795349 3960322 4304946 4699412 3950972 4046154 4197930 4680731 4811076 4879366
6881 4879366 4510716 5056173 4967656 5438934 5851578 5810914 6188082 5292920 6119530 6931754
6871 6931754 6410548 5661324 6452069 6984969 6599461 6153107 6469120 6356533 6757105 6124136
6861 6124136 6069116 6590150 6993402 6966956 7196760 7023921 7388707 7810800 8428863 8431027
6851 8431027 8648751 8737900 8731660 9233430 8862625 8570024 9207812 9677545 9938157 9522486
6841 9522486 9616457 10513928 10230837 9844148 10235107 10256268 10396443 10486386 9866766 9208205
6831 9208205 9317123 10254219 10552606 11205862 11804612 11374732 11226568 12227144 12021470
6822 12021470 12177732 12076891 11213273 11514830 11864891 11223498 11233881 12215545 13244440
6813 13244440 13193137 12448404 13179193 12780395 13107688 13246692 13076014 13048054 12666007 12599860
6803 12599860 12326367 12209030 12001236 11996757 12151277 11938150 12015302 12275771 12348574 12666411
6793 12666411 12091507 12234548 12609159 11569395 12178988 13047219 12363963 12942914 12325679
6784 12325679 12041682 11949076 11867782 11336709 11672628 12148842 11849789 11980352 11645603 11874942
6774 11874942 11706280 11753258 11845301 12370255 12447714 12105759 12186595 11620542 11216751 11357436
6764 11357436 11101477 10940293 10580219 10440751 10163294 9601598 10196388 10624769 11220263
6755 11220263 10494031 10751228 10786821 10081672 9684792 8895324 8980334 10122456 10277541 10001974
6745 10001974 9726858 9967884 9615733 9298922 9151792 9197582 9151098 8362500 8202642 8705393
6735 8705393 8609101 8215711 7950991 7526848 7820378 8534056 7760984 6197071 7611208
6726 7611208 7887269 7600204 6151344 5917938 6564865 6617092 7077162 6436634 6132560 6428386
6716 6428386 6190865 7501453 7272183 6836186 7128319 6993884 7566369 7675302 7828306
6707 7828306 7305813 7004277 6068744 6279754 6902427 7525408 7207905 7097573 6565075 6497858
6697 6497858 6451063 6420555 7191207 7560338 7178279 7559070 7235699 6763781 6646205 6879645
6687 6879645 7862296 8203678 8021492 7358329 6988005 6895499 6945480 7324700 7770047 7686177
6677 7686177 8092753 7588081 8406276 8810482 8219477 8553848 8142462 7708546 7900237 8950921
6667 8950921 9263113 8965580 9015349 9016699 9403561 8491925 8596071 8715645 8738228 8718073
6657 8718073 8405379 9696086 9088802 8902370 10406559 10105515 10301310 9794748 8823185
6648 8823185 9173643 9992133 9810265 10348998 11171787 11224541 10869975 11573377 11355370 11293265
6638 11293265 11597474 11447512 10587247 10802046 10788793 11424999 12176713 11361022 11918749 11816044
6628 11816044 10922138 11366658 11590828 11806221 11836752 10663643 11214149 13109460 12128302
6619 12128302 11233873 11470385 11055628 11205548 11175373 11274814 11413332 11423861 11405684 11724611
6609 11724611 11328700 11320944 11610002 12445136 12357348 11647079 11508217 11891066 11660576 12151849
6599 12151849 11874527 11014888 11387767 10926972 11569755 11313530 10411799 11484940 11473029
6590 11473029 11468181 11639552 11407574 11479216 10963816 10859777 10589807 10646482 11252951 11616354
6580 11616354 11011332 9961356 9831502 9533368 9754317 9899245 10535791 10366988 10064000
6571 10064000 9517684 9696162 9338160 9314224 9102988 9687805 9189534 8515980 8465292 8243638
6561 8243638 8045519 8121096 9662207 9653492 9151609 8964209 8230814 7932025 7064858 7236570
6551 7236570 7774462 7421410 7008769 6433122 6445447 7392133 7253238 6759133 6966819 6963095
6541 6963095 6421491 6430498 7041719 7404768 7792735 7312481 6486109 6768414 6825318 5969199
6531 5969199 5974156 5764909 5867402 6213737 6141235 5612191 5021954 5234319 5641039 6117662
6521 6117662 6456305 5718830 5539557 5121592 5205376 4995408 4957637 5562579 5505428 5590338
6511 5590338 5848575 5030742 4768394 5065192 5326803 5150974 5313925 4241878 4309560 5691662
6501 5691662 5471310 4959026 4541505 4893536 5393399 4505305 4423625 4698373 5190928 4970430
6491 4970430 4829285 4287725 4400039 4422115 4539825 5054832 5071792 5370552 4648778 4840199
6481 4840199 4573196 4752912 3982391 4100141 4156213 5320397 6271200 5321759 4861648 3971049
6471 3971049 4215529 4533143 4646196 4253343 4194717 5206535 5719739 5414784 5235351 4053710
6461 4053710 4586955 4451648 5329356 5480408 4929534 5096355 4652943 4787659 5060056 4938549
6451 4938549 5106193 4818770 4966536 5056994 5337900 5940289 5611623 5578217 5697695 5373981
6441 5373981 5612436 6026156 5394219 4914327 5849550 5862046 5132988 6032973 5380722 5973326
6431 5973326 5086463 5726231 6004097 5201587 6115577 7007014 6164381 5868325 6341959 6637335
6421 6637335 7581741 8085292 7603076 7326431 7868152 6981626 7130935 7884069 8686762 8733914
6411 8733914 7715230 7228520 7565761 8555173 8478855 8345929 8482753 8429248 9032372 9482523
6401 9482523 9375714 9793357 10444774 10949149 11145013 12306272 12060197 12164960 12305863
6392 12305863 12645091 13503605 14130996 14797254 15963271 16595720 18135997 18956619 18916296
6383 18916296 20041369 21190507 22823542 23044318 23364984 23980051 25303977 25696344 25040696
6374 25040696 24171468 24026680 22742060 21688847 20634437 20491063 19531024 18676409 17807148
6365 17807148 17029741 16050573 15772759 15037715 14184930 14719359 13770637 13503495 12418754
6356 12418754 11776699 11619613 11184886 11493561 10663185 10240429 10855709 9629980 10438011
6347 10438011 11152520 10468827 10353387 10118119 9738337 10372432 9278041 8721852 9336596
6338 9336596 9450578 9005567 9371333 9259304 8968949 9764472 9148306 7997230 8605301
6329 8605301 9588313 10176941 10236638 9730458 8906321 8560681 9270472 8837862 8580141 8942321
6319 8942321 8439414 7824124 8509601 8518017 8610550 8452659 8978405 8796310 9390716 9071950
6309 9071950 9587519 9470973 8913009 8440750 8240429 8975965 8368862 8508343 9502417 9381679
6299 9381679 8607547 8923839 8719280 8644007 9002074 8516233 8916463 9655800 9947735 10063918
6289 10063918 9277894 8932238 8547770 8431813 8815657 9648712 9588499 9028396 8810141 8986274
6279 8986274 9414925 10450040 10330193 10771973 9984098 10087355 10152480 10100932 10858082 11178223
6269 11178223 10617770 10807798 10758287 9752655 9592482 9997920 9299327 9523755 10198369
6260 10198369 10499755 10314332 10365457 11560752 12107655 12199223 11641815 11711493 11134771 10619995
6250 10619995 10917499 11788598 10862445 11514641 11573889 10990181 11857113 12742859 13006254 12980425
6240 12980425 13213774 12678390 13006424 13295087 13248209 13097450 14045291 13789874 13340819 13237497
6230 13237497 13192734 13639145 14633299 15777238 15763072 15723785 15616753 15791710 15833871 16234154
6220 16234154 16623446 17564908 17112472 17718030 17765204 17630076 18449959 19341520 20162012 20647108
6210 20647108 20908895 20942480 20952265 23164758 24066539 25018967 25304548 25943205 26539889 27121693
6200 27121693 27236346 26137183 25864851 25499155 26022886 26096735 26533871 27403332 27146190
6191 27146190 28285343 28784706 28186997 28049099 28774789 29107644 28870866 28865017 28653878 28247218
6181 28247218 27706933 27404811 27226985 26493421 26417166 26211534 25483458 25757339 25223603 25679090
6171 25679090 26323071 26346266 26729301 27129171 26855279 27422191 28018009 27758571 27973320 28555632
6161 28555632 28907851 29457480 29900441 30464457 31163059 32789081 34116773 35325001 35835198
6152 35835198 36747522 37120455 37218432 38145136 39050831 38969840 39391700 39094154 38989871 38538702
6142 38538702 38768404 39019629 38995610 39084903 38992139 39723541 39768552 39460218 39927703 39616139
6132 39616139 39528443 39418134 38965355 38116921 36801499 36450438 36739169 36544459 35957153
6123 35957153 34923334 34933588 34844109 34910026 34314706 33601358 33429997 33030299 32789099 32733547
6113 32733547 32156023 32369087 32721581 32326711 32316207 32021622 31111693 31065963 31580430 32217407
6103 32217407 32201425 32576993 33315702 32527357 32430000 33292307 33809353 33415884 33417033 33660846
6093 33660846 33327388 33831426 34416540 33972402 34878285 35193613 34588201 35077361 36002331
6084 36002331 35665494 35394174 36185685 36625630 37229213 36446491 36225843 36769775 37276139
6075 37276139 37924669 38195373 38734559 39139108 39199432 38476209 38485871 38751940 39660094 39815701
6065 39815701 40393174 40854788 40649212 40533541 40226584 41005341 40856357 41651086 42163922
6056 42163922 41296202 42476978 42538893 42714562 42023094 42846150 42715329 42020665 42211500
6047 42211500 41529147 40888159 41265945 41962876 41580061 41634370 42133996 41882643 41087570 41586416
6037 41586416 42516939 42443755 42877252 42580772 41730952 42054700 42066114 41661313 41195338 41253608
6027 41253608 41570850 41360511 42215011 42528517 42904086 43029029 43220954 43051186 43567777
6018 43567777 43441450 43453148 44898306 45172465 44997706 44989498 44861542 45385764 45551880 46094938
6008 46094938 46621374 47061197 47869571 49242666 48775237 48996448 50471124 51816889 52063666
5999 52063666 51651016 52325701 53017896 53236516 53417908 53802541 54294923 54352880 55424755
5990 55424755 55480357 55710591 56692633 57203172 56939230 56388208 57277042 57016973 56593250 56625493
5980 56625493 57321194 57580682 58162545 58150840 57977647 57481179 56794549 56901499 57921216
5971 57921216 57713941 58247367 57555216 57264676 57647514 58681396 58542538 58887683 59214493
5962 59214493 58977524 59544973 59192772 59408067 59960979 60500713 62528640 62884921 62486364
5953 62486364 62847776 64533359 64183292 64850531 66066027 67461765 67887218 68318541 69722788
5944 69722788 71616603 73217532 74268615 75789469 77367140 79069316 81145384 82997545
5936 82997545 84340539 86231346 87924611 89973814 91631513 93797626 94790925 96868375
5928 96868375 98414110 99954192 101748524 103470599 104277466 104587092 104919834 104336185 103579320
5919 103579320 102409374 101542138 100576351 98743392 97055363 95421457 93275572 90393496
5911 90393496 87781585 85349469 83457995 80966514 78263882 75875902 73670699 72490310
5903 72490310 71303582 68919373 65783649 64574092 63282294 61835380 60241894 58971700
5895 58971700 58126704 56495740 54988306 53740623 53365050 52953143 51239176 50902160 50324185
5886 50324185 49074884 48610774 47594795 46958091 45830844 46228079 46278978 46737579 46231225
5877 46231225 45699054 45091757 44669354 44926327 44630357 44433505 44082438 44404031 43289524
5868 43289524 42984237 42755504 42783923 41895789 41347041 41784432 41030579 41080733 40628391 40040446
5858 40040446 39784676 38925558 38579060 38108699 37286607 37109589 37147259 36871734 35998866 36155740
5848 36155740 36983568 36862349 35551317 35207107 34722911 34588529 34449408 33453565 33866103
5839 33866103 33136104 32342852 32309022 31925292 31594972 31640732 31819783 31629856 31296970 31349323
5829 31349323 31249946 30237999 30911667 30708585 30442079 31035930 30201197 30390323 30829673
5820 30829673 30318108 30094003 30089528 30950525 30440486 29170577 29528782 29934745 29918487 30195772
5810 30195772 30307324 29743829 29729174 30539816 29594496 28505715 27453836 27531749 28146643
5801 28146643 28043550 28396391 28092455 27941371 27301419 27352409 27516696 27370094 26984898 26569465
5791 26569465 25827792 25567454 26353334 25993935 25559904 25220376 24984780 24692140 24527231
5782 24527231 24343646 24515612 24587173 24257887 24175437 24125339 24429493 24238633 24211741 23659219
5772 23659219 23327216 23845496 22912072 22904092 23163187 23086983 22861770 22791689 22142365 21667005
5762 21667005 21675868 21633624 21243499 21631627 22292919 22168379 21590120 20871353 20789579 21037599
5752 21037599 20308904 19853137 20409465 19832506 20215096 20622168 20692813 20634542 20786552 20704759
5742 20704759 20660120 20800009 20771272 20575952 20696532 20306577 19806257 19929260 19576354 18622558
5732 18622558 18683747 19318830 19848080 19807293 20131305 20062027 19682461 19448758 19607601 19978528
5722 19978528 20741094 19765218 20032132 20540252 20171612 20620135 20509445 20405038 19870954
5713 19870954 19966240 19366939 19995633 20163437 19316448 19822689 19346466 20520916 20005478
5704 20005478 19708843 20625721 20248274 19888111 19535518 19898466 20096305 19569106 19868680
5695 19868680 19604002 19776535 20026315 19344863 19738858 19572259 20132670 20393940 20437871 19811042
5685 19811042 20371924 19944142 19716594 20075144 19072011 20111973 20563764 19965867 19226817
5676 19226817 19610869 19483399 19477654 19851764 18980054 18939379 19620124 20082311 20233691 20134095
5666 20134095 19970193 20192402 20307110 20928103 21015651 20011756 19142273 19906736 20937198
5657 20937198 20615422 19867082 21075234 22242445 22996357 22048433 21336378 22296600 21685667
5648 21685667 22060198 21820351 21139768 21039072 21634688 21628891 20670283 21135131 20727149 20225603
5638 20225603 21274452 21756055 22120139 22786475 21956667 21999278 21942253 21813406 21834907 22581107
5628 22581107 22513084 22256359 22455959 22640956 23098898 22910350 23098850 22763020 22460036 22832232
5618 22832232 23375466 23141181 23530698 23722482 23902568 23839545 23420150 24108716 24642062 24849254
5608 24849254 25191762 24676519 24550706 24617990 24167768 24478888 25534420 25245596 24683117
5599 24683117 25057355 25421508 24808623 25056885 25392810 25992689 25926172 26014846 25535214 25564891
5589 25564891 25919406 26002458 26404443 26026018 26157826 25535955 26472461 26692945 27166315 28410930
5579 28410930 28577061 27998744 27651869 28032546 28840745 28915559 29607477 29492648 30358148 28732111
5569 28732111 28413267 28875037 29182262 29686085 29780122 30244290 30320033 30472557 30671445 31172795
5559 31172795 30989656 31070555 31239767 31988938 32349873 32946837 33379435 33407701 33058026 33252412
5549 33252412 33311167 33647284 34289645 34619675 34413216 34801012 34885563 34942663 35848347 36149301
5539 36149301 36029757 36563258 37409940 37821027 38771833 39326285 38674275 39425536 39808379
5530 39808379 39715277 39329090 39322902 39612437 39854877 39774180 39386538 40109696 40607513 39728423
5520 39728423 39367780 40574491 41155342 41484994 42280629 42067729 42662528 42269113 42038856
5511 42038856 42693361 42975923 42939965 42682775 43085989 42813823 43488953 43921030 43835848 44747237
5501 44747237 45007646 45929716 45703085 45662826 45084453 45432400 46185152 46421969 47351091 46552401
5491 46552401 46030643 46670785 47743928 48292547 48580609 48281271 48425190 48629048 49332949
5482 49332949 48967374 49558322 49784718 50350230 51107714 50716176 50796743 51748241 52680312 52549384
5472 52549384 52506445 52677565 52786223 52812764 53142690 54035403 54000894 53671453 54459377 54890885
5462 54890885 55239853 55439693 55782386 56155011 56510393 56151009 56352522 56873237 57236448
5453 57236448 58391230 58893691 57803648 58100179 58827087 59405558 59920131 59232089 59273282
5444 59273282 59546278 60275548 60932287 59953987 59946355 60761389 60485708 60402526 61236327 61349616
5434 61349616 61787790 62582927 62810955 62814590 62560229 62458722 63064919 63444144 63939974 64181605
5424 64181605 64263325 64886637 64492365 63567963 64193281 64997834 65221325 65621086 65661238 66197616
5414 66197616 66601783 66822491 67146543 66943336 67728997 67677152 68774074 69127765 68794540
5405 68794540 68545694 68525168 69675842 70061337 70444150 70769667 70578049 70615873 71559136 72072449
5395 72072449 72831899 72712929 73170888 72519159 73402141 73763097 73810677 75759989 77115539
5386 77115539 76344214 76037279 77491768 77419842 77417836 78192789 78682618 79060962 79113801 80322164
5376 80322164 80362500 80695801 81316611 82437986 83678903 83996745 84256882 84151976 85846777
5367 85846777 86776073 86847416 87373227 87804735 88378390 88270940 88808061 89540628 90114508 91699347
5357 91699347 91848458 91999709 92820228 93517980 93889681 94692365 95799856 96401751 97047624
5348 97047624 97101708 97574602 98783569 99335487 99842416 100311865 100618478 101575830 101683827
5339 101683827 101488568 102359950 103300478 104121398 104581360 105571214 106358480 107819794 108459177
5330 108459177 107969563 108142591 108899474 109937772 110516861 110770500 110544520 111617996 112762575
5321 112762575 113665384 114758907 115090695 115289259 116353150 117326467 117883945 119124831 119919209
5312 119919209 120102366 121162257 122215561 123501147 124302088 124514049 125626612 126244846 126795693
5303 126795693 127243589 127990678 128702433 129426908 130042227 131379717 132604244 132721732 133871857
5294 133871857 134670196 135014777 136159386 137288142 137223827 137460712 139123420 140442407 141071194
5285 141071194 141620270 141253382 142008431 143300292 143441364 144279299 145449680 145970874 146866286
5276 146866286 147374888 148013450 149666988 150168199 150676529 151336161 151515210 151858800 152097936
5267 152097936 152344682 153695385 154810109 155244915 156050415 156679062 157977228 159430134 159845033
5258 159845033 160348539 159276663 160998134 162465177 162704222 163823674 163737600 165243753 166066310
5249 166066310 166909622 167162370 168251040 169303408 169495065 170346806 171166587 172339509 172433748
5240 172433748 173046251 174169391 175412201 176726539 176825510 177478018 179144811 180035402 179438423
5231 179438423 179822950 180257339 180691683 181594205 181965993 182907595 184039511 185252966 186603504
5222 186603504 187499162 187955969 188269001 188063178 188949481 190100087 190061717 190170261 190604828
5213 190604828 190703449 191164777 191060768 190162613 190367327 189828134 188287698 186946115 186261136
5204 186261136 185324361 184590309 183425079 182710311 182488537 181702307 180690569 180001319 179271522
5195 179271522 178264935 177266212 176713215 176246836 175481327 174853439 173725244 173018846 171747332
5186 171747332 170697077 169087625 167237434 165684512 165670903 163401967 160942827 159828300
5178 159828300 158933461 156895909 155788045 155382490 153037510 151395425 150694020 149334380
5170 149334380 148238721 146730380 146009522 144906999 143571093 142925612 142368835 140226400
5162 140226400 139587961 138996319 137369352 136830331 135967836 134386181 133283064 133049233 131990641
5153 131990641 130965540 130442272 129403660 128332212 127601427 126686861 125950072 124229030 123374211
5144 123374211 121801605 120290949 119614660 119502177 118030964 117539781 116320645 116000564 115591035
5135 115591035 115201058 114782640 113311443 111506212 110790910 109832353 109834028 109464321 108477415
5126 108477415 106660580 106106204 106397411 105590671 104437435 103267824 102541272 102160055 101725194
5117 101725194 100994252 100790875 99633111 98033573 97486280 96407734 96288983 96225470 95097626
5108 95097626 94755791 94248195 93373094 92734167 92983916 91508393 90953258 90932554 90062380
5099 90062380 89167971 88344010 87410391 86563671 85926353 85810532 86023069 84461983 84150496
5090 84150496 84208293 83673698 82925605 82504621 82435949 81860897 81469901 80488498 80270020 79543420
5080 79543420 79328446 79435896 78697421 78646493 77817128 77740496 78027087 76747416 75691123
5071 75691123 75484823 74877765 74814495 74559261 74207908 74112194 73666095 73668738 73634974 73247072
5061 73247072 73335684 72259827 71964532 72179426 71895283 72621365 71670685 70633968 70856505
5052 70856505 71322983 70763688 70890864 70544470 70932806 70404169 70160066 69805214 70110722
5043 70110722 70635023 71289681 71369819 71870450 72574621 71357066 71559291 72381106 72824177
5034 72824177 72946702 73256544 73905949 74267158 75197044 75249564 76426973 76639949 77087023
5025 77087023 76334471 76124273 76387609 76866245 77465191 77208770 77950858 78314544 78006072
5016 78006072 78051892 78658243 78436591 78673713 78908667 79184231 78968435 79661973 79809507 79829091
5006 79829091 80212187 80706159 80821398 80749993 81346033 81688138 81391659 81674608 81781523 81463174
4996 81463174 81272112 80722586 81216082 80237416 78895051 77663575 77237975 76339719 75772932
4987 75772932 75486930 74461507 73688618 72695307 72187785 70832977 70047585 68516971 68264701
4978 68264701 67544455 66778500 64750538 64066923 65085702 64552885 63799823 63455970 63008716
4969 63008716 61620153 61005995 61344057 60389891 59663224 58790611 58432172 57429666 57045165
4960 57045165 56435537 55238787 54304252 53763613 52828293 51764225 51416119 49902638 48698602
4951 48698602 48949875 49601558 48804574 47832521 48346202 47092273 46052303 46191163 46209550
4942 46209550 45931719 45206083 44581585 44631780 44950209 44077126 44376690 44023291 43346066 43244220
4932 43244220 43322894 43552322 43170534 43077301 42990924 43060156 43423402 42368062 41628455 41773138
4922 41773138 42040993 41562131 41878734 42148461 41454323 41201815 41015310 41532704 40790708
4913 40790708 40754670 41023575 40974958 41065554 41114658 41292249 40551627 40438568 40089560 40894514
4903 40894514 40633486 40755220 39666694 39522361 40033783 39618625 38944194 39157929 38460513
4894 38460513 37882244 38722256 39861795 39299697 38161004 38635295 38481373 38351421 38348363
4885 38348363 37535501 37097835 36763484 36933187 36647125 36931891 37838143 36802819 36558669
4876 36558669 36041689 36247022 35752004 35310619 36056015 35610529 34604468 34834142 35288740
4867 35288740 35332821 35443961 36008253 35620598 35826287 35824165 35532572 35145183 35466256 34672262
4857 34672262 34821526 35549001 35510097 35953467 36620056 36556102 35348235 34891809 35279136 35440928
4847 35440928 35890116 35979379 35832021 35592604 35518616 36349513 36151179 35297600 35163525 34899243
4837 34899243 35721231 35757881 36226039 36368050 36328549 35760030 35173457 35675134 36132648 36738253
4827 36738253 36060868 36426423 36979977 37209123 36801706 36486118 35630197 36138638 37167303
4818 37167303 37930475 38294948 38693996 38405817 37949415 38263740 38626843 39530783 39185381
4809 39185381 39474248 39762329 39704560 39364657 39423332 39279266 38145806 38704685 38604642 37634942
4799 37634942 37623577 38553580 37983700 38016580 38538622 38070359 37713585 38389027 38591939 38604316
4789 38604316 38715544 38852083 38580522 38891022 38943062 39500907 39321339 38309338 38644744
4780 38644744 38001211 37505739 36928153 36964692 35891702 35709348 35498155 36065053 35779214
4771 35779214 36086535 36221583 35419425 35033242 34499984 35013514 36099694 36427231 36087258
4762 36087258 36919850 36712854 36512602 37670241 37821870 37788183 38471016 38010221 37775227
4753 37775227 37953501 39321369 39225035 38779212 39190162 39395312 38822188 38939998 39437491
4744 39437491 39934496 39596409 39726231 40151411 40121526 40873105 40938841 40784911 42151902 42650376
4734 42650376 42931481 42869654 43202031 43797294 43958327 45088480 46043995 45346246 45584420
4725 45584420 46803281 46671830 46741525 47003164 46766922 47647360 48860340 49508385 50046488
4716 50046488 51404275 52614668 54422106 55768331 57851276 59498844 61168566 63187936
4708 63187936 64750999 66953144 68699261 71648670 74440308 78235477 81696500 86154242
4700 86154242 89360259 93445699 98338086 104713275 111277057 118821361 128240243 138273348
4692 138273348 148429454 159382068 170901609 182798350 194963313 206486756 216272373
4685 216272373 223302253 227836555 230274352 231677201 230954120 230448516 228541008 227215570
4677 227215570 226501987 224372522 219118802 210973662 201438495 190408474 178113161 165772260
4669 165772260 153658592 142169108 131488689 121412147 112063329 103767932 97782777
4662 97782777 91341500 85650126 79634581 75451413 71385999 68792619 65712752 62006231
4654 62006231 59177130 56664007 54394554 51595284 49340835 48213673 46242155 44598482
4646 44598482 43031679 40599678 40264579 38573227 37960757 37832063 36114975 34540341 32633738
4637 32633738 32316097 32424239 31364013 30199254 29560411 29298100 28780554 28248088 28137056
4628 28137056 27584455 26463701 25787629 25993993 25148235 24759699 23852086 22820998 23320051
4619 23320051 22870899 22848616 23383610 22648761 21747032 21365930 20854847 20649554 20301746 20066460
4609 20066460 20112727 19809168 19304240 19938463 19170731 19019412 18833695 18887982 18432410 17996466
4599 17996466 18085109 17983400 17242103 16808388 17085492 17354045 16910962 16478973 16031215 15214147
4589 15214147 15392526 15277911 14811566 15043172 15163251 15639420 14672812 14140669 14419619
4580 14419619 14222005 14345793 14427808 13998873 13543273 13698028 13790651 14292561 14536250 14389326
4570 14389326 13225879 13033796 13275228 13510970 13673106 13694656 13169457 12205047 12414550
4561 12414550 13018000 13371986 13022780 12627532 12786290 13015067 13010965 13207744 14105214 12749705
4551 12749705 12341883 12507668 12258612 12544191 12174465 12659015 12326622 12340397 11903770 11836198
4541 11836198 12499532 12260146 11830952 12512316 13479920 13198712 12659317 11468673 11192179
4532 11192179 11478186 11141042 11589481 11619392 10537384 10478305 10170852 10610808 11144736 10989196
4522 10989196 10733188 11611058 11547456 10485469 10833782 10956046 11333103 10492045 11007931
4513 11007931 11077347 11049734 11069201 11139026 11112902 11043748 10321935 10373406 10581635 10188725 10334275
4502 10334275 11114153 11251202 10754473 10970854 11484567 10808670 10220490 10461954 10686942
4493 10686942 11220366 11141063 10704520 11196736 11334582 11159867 10752588 10344386 10165524 10359944
4483 10359944 10716336 10821874 10843520 11054500 11138981 10882854 10677866 10062017 10019963 9742070
4473 9742070 10591340 10133347 10310672 10573282 10937964 11958938 11398774 11041872 11040645 11108679
4463 11108679 11899875 11544900 11423230 11567457 11395429 11404242 11884628 11482395 11888592 12026214
4453 12026214 12143775 11914605 11721189 11675904 12012577 11881148 12512700 12883377 12115221 12484423
4443 12484423 12139380 12323438 12999325 11635210 11869785 12725852 13081615 13004450 13436365
4434 13436365 13372556 13521214 13690340 13820415 14202308 13869501 13796100 13833269 14745433 15378562
4424 15378562 15226373 14847404 16072794 16225138 16414681 16844540 17043537 16896062 17457743
4415 17457743 18194648 18718488 18180982 17742278 18301203 19066296 19714576 20279387 20182508 21087796
4405 21087796 21092832 22188860 23370725 24109656 24404309 25060196 25307388 25542023 26822659
4396 26822659 28290665 30370434 31815613 33924567 35312793 37195986 39760456 42868182
4388 42868182 46328420 50348224 55196554 61430488 67032917 73160431 79402469 84664404
4380 84664404 88616686 92563276 97871457 105578730 113944665 123223636 131729414 137372765
4372 137372765 140282689 140951266 142001486 145620719 151462639 158973301 166581990 168762238
4364 168762238 166347653 161054718 154666796 147993113 143296842 141874179 141523912 139382950
4356 139382950 134761775 127519175 118288648 108702094 101900623 97472097 92397522 88537547
4348 88537547 84147495 78061908 72095887 65784672 59026940 54667494 50398938 47060982
4340 47060982 44709175 41615756 40259940 39009140 37925112 36890538 36275463 36114687
4332 36114687 35593337 35798585 36061253 36327078 36748879 37288292 38672992 40004107 42494927
4323 42494927 44486215 46888674 49564768 52534510 55605592 57024840 58919730 59471119
4315 59471119 57266700 54049628 50634600 46982735 43735721 40367947 37172747 34222176
4307 34222176 32207941 30820276 29082361 27604237 25827329 24316081 22828975 22369910
4299 22369910 22138562 21864683 20357209 20089042 19946417 19506132 18534976 17485970 16770695
4290 16770695 17357779 16842038 16546521 16926016 16294327 16590370 16379013 16058047 15028565
4281 15028565 14718143 15534272 15329272 15420968 15854427 15298405 14749353 14502126 14261266 14573081
4271 14573081 13782463 13922302 13817726 13971629 14005432 12980117 13215240 12634750 13186249
4262 13186249 13615475 13066375 13456962 12811071 12175058 12343705 12753870 12649097 11503721
4253 11503721 11416882 11121878 11597697 11929842 11871377 11544621 11893942 11694400 11463943 11511010
4243 11511010 10363484 10632917 11569803 11810829 10919862 10415779 10630735 10761843 10690488
4234 10690488 10335972 9940576 10396753 10963837 10829411 10532648 11082899 11990099 11570947
4225 11570947 11827934 10492773 10902226 10929619 11114715 10590982 11257915 11842622 11875115 11732282
4215 11732282 12039364 12387455 13267513 13491256 12540645 12752963 13381417 13021252 12429138
4206 12429138 12443972 12218087 11761624 11734535 11304358 11214653 12068546 12047698 11620387 10343191
4196 10343191 9512103 10467462 11035135 10618420 11056400 11059074 11604910 11498766 11324099 11726380
4186 11726380 10951883 10703562 10499537 11001064 11031248 11046135 11238228 12159321 11717599 11894419
4176 11894419 11964108 11654001 12084022 11779858 11952911 11391599 12165490 12625386 13077034 13235214
4166 13235214 13339932 13280646 13606206 13552060 13051147 13624502 14202598 13847453 13843237 12651042
4156 12651042 12574654 13412030 13280784 13253564 13810239 13827059 14505338 14136832 14204934 14518816
4146 14518816 14652459 13558296 14338512 14792528 14806851 15470293 16167720 15369543 14894661
4137 14894661 15309195 14794901 15911086 16397544 17195275 16977149 17660800 19167247 18820160
4128 18820160 17973456 19047404 19460539 19015970 19258182 19546124 20838356 21556696 21878593
4119 21878593 21540819 21919823 22502851 23440142 22623456 22189287 24088122 24989127 25087396
4110 25087396 24689100 25416241 26375770 27429002 28022116 29148478 29754709 30216827 30463204
4101 30463204 31220274 32106731 33041836 34360735 34850497 36723685 38199668 39131341 39512949
4092 39512949 40797084 41458539 42711455 44081777 45844695 46610010 48492840 49714720
4084 49714720 51534398 53429684 54372158 56616448 58391640 60384494 61757312 63721387
4076 63721387 65741567 68244761 70013203 71334620 74297281 75646805 77044841 79613437
4068 79613437 80923542 83193658 84905863 86728028 88750713 89750172 90650173 92320404
4060 92320404 94453744 95743071 96053104 97506365 98238076 98696609 98975794 100151361 100800334
4051 100800334 100416709 99772789 100289253 100793826 99839221 98813350 99341974 98979985 98618978
4042 98618978 97727270 97256015 95841351 95735983 95012860 94624220 93076705 91974317 91247630
4033 91247630 91129490 90545361 89253624 88958001 88529345 88817017 88644405 88317377 87990186
4024 87990186 88325060 87188205 87687194 88982873 89524912 89891273 90848624 92471954 93985722
4015 93985722 95408185 96648494 96993688 99491365 101405029 103328748 103995807 107480501
4007 107480501 109733932 110648692 111880708 113699771 115977764 118572949 121136670 124453653
3999 124453653 127594283 130429047 134033603 137857286 141023460 144591949 148660231 154063709
3991 154063709 161072961 170635867 184727040 203485680 227754783 261353706 284745036
3984 284745036 276384274 260437227 231562657 200743274 177790596 159734819 147291997
3977 147291997 137755618 129143051 121331090 115521890 109336095 105205547 101748139 98680873
3969 98680873 95092089 91574208 88313238 84968933 81995757 78825139 75792678 73569821
3961 73569821 70685324 68061619 65600490 63561627 61635353 59597240 58250510 57329537
3953 57329537 56111387 55136706 54143688 52659991 50573847 49426646 48416546 47966965 46637015
3944 46637015 46787547 45387595 43622029 43058408 42233178 41398216 40282889 39634997 38359929
3935 38359929 38601792 38440343 37976057 37828799 37054908 37458368 38112011 37434629 36756203
3926 36756203 35592778 35894523 36329728 35948178 35875876 35372113 35500400 36367523 36815506
3917 36815506 37110934 37131334 37656092 37750688 38077398 38965399 38559640 39877165 39477493 39887680
3907 39887680 40959376 41355126 41633399 41578031 42102665 42631454 43293394 43592188 43553999 44199906
3897 44199906 45077583 46169733 46580770 47006887 48361395 49475224 48919741 49312283 50246455
3888 50246455 51162233 51657313 53012741 54302775 55197076 55727426 56862749 57960775 59677343
3879 59677343 61396696 62757591 64146310 65476838 67386872 68587739 69798729 71450376
3871 71450376 74108877 75270071 77397545 79232265 80714093 83617354 86347232 89019898
3863 89019898 91673732 94512257 97055562 100697263 105138569 108943098 112081866 115319209
3855 115319209 119872331 124729193 129308076 134504573 140204227 145695085 152047715 157938648
3847 157938648 163589372 170733149 177539610 183949950 190517586 196394566 201811015 206705605
3839 206705605 211590855 215237985 219455951 222060421 223365825 224057131 226119647 226319742
3831 226319742 226002407 226009632 225175231 222515794 219540390 216644500 214551986 210104176 205991706
3822 205991706 202590020 196837939 191675526 186862996 181685441 176258018 171386210 166659337
3814 166659337 161588611 157382530 153989538 149337082 145594840 142535012 139194618 136667028
3806 136667028 133540946 130515643 129606956 127657964 126783570 125037109 123066645 122950200
3798 122950200 122234323 120969156 120265779 119433461 118112188 117975949 118162790 117778486 117385458
3789 117385458 117688282 117875123 118057691 118502884 118799488 118830064 119029905 120074834 120899802
3780 120899802 122125168 122144150 122436287 123819342 125228349 125739456 126286816 126102292 126818171
3771 126818171 127344296 128717444 129891750 129242883 129193024 128288441 128137073 128286538 126979822
3762 126979822 125399835 123259055 122050339 120905070 120542005 119100715 117446522 115863269
3754 115863269 113370339 110933857 108788699 107433983 106146901 104467798 102280258 99994255
3746 99994255 98340138 96997479 94272705 91923633 89327094 86913038 85663170 82859385
3738 82859385 80561248 79404257 78814718 77777043 75214208 73191934 71466070 70105378
3730 70105378 68867128 67454204 67023396 66624381 64579921 63301328 62149121 61394421 60059174
3721 60059174 59059840 57133218 57005893 55984083 55429870 55296276 54150063 53213580 51642754
3712 51642754 50894810 50399593 50442178 50395667 50033003 48646158 48288701 48555800 48500490 47425294
3702 47425294 46596041 46839005 45658408 45356221 45261096 44956329 45498810 44604990 44887925
3693 44887925 43934927 42947730 43045745 41659515 42039771 42105265 42291604 42524901 42627635 42368138
3683 42368138 42780551 43287831 43145424 42298073 42642450 43066046 43732060 43602060 43434219
3674 43434219 43532160 44311529 44878509 44553164 45418369 46504241 47369176 47448042 48319459 48325010
3664 48325010 48745639 49780633 49756146 49081993 49728907 50059039 51388952 52435428 53027894
3655 53027894 53809568 54389491 54848690 55601919 55987336 57134487 57087611 57271431 57492962
3646 57492962 58924947 59712218 60402313 61357043 62741782 63693620 64013414 64996264 66352866
3637 66352866 67651861 69784159 71510138 73122384 75178128 76879744 78375955 79659824
3629 79659824 81909372 85021742 88024738 90291536 92979532 95996233 98159314 100950033
3621 100950033 104361375 108307462 111527266 114642557 117638410 121486727 125141864 128986358
3613 128986358 132963379 135645977 139702969 143528907 147340127 150681718 155392751 159160417
3605 159160417 162171563 165216521 169365515 172139627 175936573 178470198 180729055 182918804
3597 182918804 185822039 188539143 190527301 191304473 192511960 194271192 195619931 197612463
3589 197612463 198521785 199868338 201515540 202122241 202700483 202391543 202457869 202297746 203879169
3580 203879169 203940992 203042931 204187196 203977680 203274172 202855845 202427409 202137068 201194841
3571 201194841 199597065 198523856 196938766 196553780 195389691 195020253 193408161 191534322
3563 191534322 190371490 188814469 187487405 185770710 183245153 181837134 179932713 177754275
3555 177754275 175258888 173430596 172039666 170850172 169084402 167500298 166231566 165032490
3547 165032490 163359658 161837471 160582077 159206912 158519615 157326985 155089097 154280910
3539 154280910 153170979 151466135 150268654 148509079 147512829 146700053 144848907 143281969
3531 143281969 141469320 139347954 138122387 136411310 134821209 131158824 128474437 126635404
3523 126635404 123543918 120808450 117533920 113501961 110620573 107422837 104967798 102223992
3515 102223992 98342409 94529807 91034691 87312223 85009304 81968129 78582044 75270836
3507 75270836 72775735 69995505 67275979 64868401 62457173 61153950 59609188 56868306
3499 56868306 55073691 55011322 53822471 52750372 50617333 50004108 49681542 48492037 47090720
3490 47090720 47172019 47694340 45706373 45031973 45184204 44702945 44405245 44345201 43742303 43031277
3480 43031277 43142724 43459508 42870600 42380602 42024985 41370389 40181595 40381860 39584416
3471 39584416 38482284 37716878 37609274 37295423 36382024 34793710 33800307 33131188 32375448
3462 32375448 31037109 29883176 29527403 28907410 28702758 27201936 26361735 24008005 23662116
3453 23662116 23008782 21930161 21727203 21490503 20865621 20924095 19615351 19415518 18336940
3444 18336940 17795506 18164280 17935046 16526988 15426062 14988541 14214273 14442186 14681164
3435 14681164 14412931 13340225 12632208 12775199 12726375 11900423 12348817 12626887 11458234
3426 11458234 11969896 12472878 11745100 11997371 11661337 10973165 10309501 10197142 9239944
3417 9239944 9640733 8850980 8569385 9163171 9568932 9225549 8717976 8797954 7806075 8775124
3407 8775124 8867027 8272768 8038186 8027723 8909934 8582280 8644914 7868089 7662359 7332065
3397 7332065 7815635 8802275 7365680 7199318 7606184 7506526 7155782 7411029 6950440 6992445
3387 6992445 6999188 6553660 6778200 6318411 5735197 6061175 5714545 5893854 5984307 6035289
3377 6035289 5975432 5250272 5008248 4422753 4462945 5101313 5545418 5237766 5165565 5330237
3367 5330237 5780999 5618304 4670166 4819415 5918413 6865426 6301043 5619605 4537180
3358 4537180 3305620 3971955 4367632 3273055 3823265 4559846 5319456 5188617 4010182
3349 4010182 4584570 4170775 4403344 4861443 5283436 5029740 4515680 4457868 4823389 4765524
3339 4765524 4376695 4137708 4509318 3693224 4047968 4216900 4879885 5166079 4180354 4180838
3329 4180838 3535247 3296448 3775343 3420998 3555884 3845998 4022903 3673169 4095777 4457663
3319 4457663 4765185 4625583 4911524 5057561 4029421 4178379 4852336 4820219 4538858 4697309
3309 4697309 4843546 4310129 3069716 3608437 4008214 4831739 4178982 4219709 4646900 3813043
3299 3813043 3322180 3150553 3051899 3359674 2874922 3782247 2990464 3170044 4146380 3746467
3289 3746467 3857159 4531273 4101118 3567877 3959413 3479727 3087585 3409336 4116064 3769999
3279 3769999 4325022 4090140 3640276 3521827 3475745 3551141 3806145 3807944 4158304 4319977
3269 4319977 4251337 4767611 3652662 3142854 2571393 3135511 3674873 3530414 3510431 2976057
3259 2976057 2829368 3690886 2821010 2558978 3754189 3048221 3056689 3348268 3714662 3347740
3249 3347740 3441360 3883342 2152514 2166992 3247957 2797245 2977966 3197806 3625165 3259561
3239 3259561 2956197 2811701 3014000 2737401 2918227 3458071 3138269 3190281 3227868 2577505
3229 2577505 2399896 3203624 2804615 2983650 3143924 3223340 3664849 3653969 4167898 4123223
3219 4123223 3935680 3781275 4114908 3658554 3402656 4245801 4658262 4483878 4921240 4868435
3209 4868435 3875580 3126021 3221829 3740033 3701888 4029991 3659028 2344251 2382870 1904798
3199 1904798 1995983 1818085 1923696 1877989 2156004 1624193 1439472 2262699 2792439 3791805
3189 3791805 3498445 2943307 2598898 3414934 3987381 2643223 2941960 3434805 3096898
3180 3096898 3527649 2113387 2296843 2257751 2149097 2244584 1761130 1602714 1754290 1373814
3170 1373814 2036189 1969635 1583851 1405095 1094351 1930221 2237023 1325892 923153 1733194
3160 1733194 2003567 2443213 2689155 2445975 1958103 2562874 2882116 2656763 2659190 1637465
3150 1637465 2491449 2800255 1489287 1639743 2386978 1792082 1313996 2081810 1626268
3141 1626268 1556134 2346254 2149179 1954010 2535084 3569239 3389141 3270632 3600698 4083431
3131 4083431 4231681 4252521 3933751 4214610 4630121 4866832 4633574 4720686 4455348 3815843
3121 3815843 3078987 2951641 2766902 2362566 1951926 1831935 2255025 1762114 1559324 1875289
3111 1875289 1830974 1482953 1721333 1100051 1070267 1256446 1174336 948468 914771 1136852
3101 1136852 1697174 1084630 1060361 1606194 2096242 1556610 1169246 1523661 1939960 1226593
3091 1226593 1111148 1782921 1111729 1523549 1637875 838765 781943 1453269 309807 410139
3081 410139 668474 -121822 607733 796844 1429544 1319234 785321 1664155 1709607 1248312
3071 1248312 610914 858450 1203595 874946 421028 -732001 -31735 778225 464559
3062 464559 352272 116759 318099 467409 1268136 1552630 983126 794260 418779 850938
3052 850938 754161 908044 1379151 1531042 1171105 1089272 927211 1614997 1079408 1253865
3042 1253865 1645158 1048116 685822 851386 103498 -314067 1111465 1074218 628428 774845
3032 774845 1219983 945725 804659 317021 657677 988179 1469105 1157229 921695 1270266
3022 1270266 492168 697342 770552 914667 676133 416324 333050 97748 709586 821030
3012 821030 612177 304750 522329 194069 288164 779240 1087859 1342021 240558 299898
3002 299898 868860 1564941 757599 -381906 -16602 1019446 737189 478790 799383
2993 799383 911784 979944 754440 861090 818953 740212 -283774 -124678 459798 840091
2983 840091 892252 769141 474715 264459 -85972 -32504 364566 501731 -204876 -37789
2973 -37789 512966 406238 800957 1306093 978108 885418 792646 841566 640473 1176096
2963 1176096 543486 -63451 45531 526680 1090768 70423 1048680 1455090 1368143 130066
2953 130066 408838 1076144 -65288 191919 494066 258175 370274 581592 61472 484965
2943 484965 586359 1237550 1737389 1486176 809076 853456 616009 441808 -429295 -598610
2933 -598610 368448 1282758 1522993 791688 1176952 753536 55477 979065 1250089 898577
2923 898577 1169477 744377 925383 523674 453880 245231 370744 760556 904942 1113511
2913 1113511 1005354 702101 210115 847308 1595750 714595 88530 357078 1081451 205008
2903 205008 -222068 765817 749973 1389445 1338357 925980 1202949 503945 -116733 701112
2893 701112 991199 871581 866264 901849 1257934 1383791 944511 1108170 1299586 741318
2883 741318 902044 2054548 1673729 901794 766893 1150236 1644224 311659 259082 888351
2873 888351 878925 1786983 1399369 1002372 583454 865795 862103 984585 973931 1157337 329562
2862 329562 -94706 538530 639138 1794589 1453590 1333553 1478957 1505945 1234155 1552934
2852 1552934 1403792 1219767 1050858 1301944 554405 831253 1483714 902021 859187 1227739
2842 1227739 822515 1262443 1406921 973070 839678 695995 1278178 1925123 1650443 1504150
2832 1504150 1124228 1473227 2057947 2139241 1906684 1539967 960473 1601593 1492494 740046
2822 740046 562532 1027283 568703 868327 965131 747744 727288 302965 777344 657981
2812 657981 40406 284945 658213 -111592 -92774 729687 1383218 359363 78609 1115668
2802 1115668 1311087 1072573 1388761 266676 879192 935038 329270 617065 406819 -295862
2792 -295862 541435 701266 615446 541708 -401706 72483 -155014 -112110 265590 817767
2782 817767 831046 168679 382562 134444 379184 96716 598349 501463 967318 1271558
2772 1271558 285741 283595 1330816 947954 1129144 913527 390471 713994 279829 775295
2762 775295 430294 320425 537117 546698 301439 -172400 -5342 -191837 -244973 1059213
2752 1059213 903031 -188033 59423 285463 146831 855600 424391 -172423 242951
2743 242951 117003 194168 -115636 -313949 -724058 -750524 -215613 -201749 312329 163162
2733 163162 468477 13355 34600 181244 1086419 1286816 485357 261271 422725 314597
2723 314597 351348 490870 7442 334395 627412 1009038 824015 692063 646441 74230
2713 74230 -627385 -1091020 -645956 -578564 -631623 -38452 150245 324466 389124 770199
2703 770199 1581678 713690 347982 621599 236578 724328 461975 -514553 -672251 619
2693 619 -32657 564155 318940 -303961 -132328 87690 -9936 994066 317661 -311235
2683 -311235 114142 845554 375874 441216 -359933 -938772 -1191239 -535780 374604 221860
2673 221860 242637 419417 411085 455933 236018 841218 897150 -76288 227752 -305491 233365
2662 233365 226318 -884384 -738260 -95519 -247727 -50965 77712 950283 679847 791099
2652 791099 442084 230874 598705 12575 -614681 369396 77139 -755245 -316539 401132
2642 401132 140845 -580596 -896560 371380 1177422 975962 346448 184906 183701 50656
2632 50656 462117 480655 955511 700192 210106 446968 150181 -257693 -44648 -339309
2622 -339309 -733142 93142 -399432 -78359 220546 386049 1092870 307712 -144404 192437
2612 192437 -203955 -167263 359651 26823 -17617 144078 119660 882422 493983 -218336
2602 -218336 143450 184785 452328 1002263 529760 1042271 1143205 392326 -114755 497013
2592 497013 454129 229827 480894 304657 126364 57229 -88787 -26552 -680113 -1016769
2582 -1016769 -271550 -433285 -491792 -819541 -568008 -738304 -106217 969512 57156 67466
2572 67466 153312 -382688 126268 -256634 219695 84156 -144091 -162085 -189076 -229117 228558
2561 228558 -81360 210387 60779 -560058 -651809 -365762 599350 573849 77527 1183929
2551 1183929 478671 -710212 -540655 -620226 -678169 -767277 -746651 -237359 -197504 -66335
2541 -66335 443242 284445 -26619 333220 500047 745455 357979 -277151 -90040 -39203
2531 -39203 -355530 -243134 -33720 -452831 -278396 -154539 -27250 -423263 60617 391794
2521 391794 967793 432436 -629159 196210 -58263 435901 60331 -127305 -542953 -482085
2511 -482085 119909 -185643 -260690 -345631 623082 535065 837483 -163479 -216342 -557445
2501 -557445 21814 88609 -22032 -235358 288817 829388 197886 219025 -265491 -210429
2491 -210429 113060 458333 357784 404323 -363198 -2555 -246560 -111318 -480091 42140
2481 42140 -667296 -491629 193490 321653 203073 -807658 -763557 -273825 323462 518685
2471 518685 7405 -82947 184527 305491 514363 162263 954456 558069 378050 207961
2461 207961 -125377 -331388 -130752 30913 199054 -332892 -1135435 -756190 124774 10463
2451 10463 -696487 407310 528944 -79348 -335064 -198491 168014 513544 293335 8503
2441 8503 -33345 248891 443274 533588 273697 405899 150624 131921 -304181 -287481 -481565
2430 -481565 402166 -111888 -523973 -43091 143593 491999 -260483 -394957 -959547 276081
2420 276081 394538 299018 -890808 -834371 -180623 798372 791999 754061 693308 -274202 -184192
2409 -184192 -241894 442475 268198 136776 415163 115713 478120 260158 5360 -61045
2399 -61045 141204 527676 764609 667198 915216 789489 791704 861235 972876 916725 1208307
2388 1208307 577351 344993 1408204 567944 -244331 38522 22255 830008 1514051 736534
2378 736534 399465 616066 527726 933620 636263 1065813 1291593 193682 -367713 -18466
2368 -18466 627318 460405 371007 989684 1401507 74357 -431059 -380762 264369 1218090
2358 1218090 912122 418028 865552 736174 -87393 152275 139800 285985 -18096 136298
2348 136298 540711 664607 347587 832926 861176 378148 789261 874198 597971 510339
2338 510339 498375 411279 486295 992996 724139 395009 598045 607281 1254313 708516 139775
2327 139775 52612 263001 -194714 485779 340394 -39348 -267267 502201 983451 806684
2317 806684 101010 268574 124074 -526003 -530392 -382697 -76813 76117 1037447 719452
2307 719452 139830 -327669 -290676 -510260 29323 541745 1057328 2243647 1537956 1231576
2297 1231576 820693 41738 660486 337312 -492058 -64974 371900 -113206 222512 127449
2287 127449 43762 201041 664791 1393307 601223 566113 1123413 1002519 1436413 1045299
2277 1045299 190355 1116092 408202 -224518 216143 625063 662340 651488 102620 915005
2267 915005 632574 1016601 1848015 2246307 1861285 1142089 1070996 1115896 864957 471246
2257 471246 226682 -148112 820992 697096 847762 858331 990720 1531675 935466 1055985
2247 1055985 1009820 2113945 1849202 358839 887634 635042 416948 776932 451402
2238 451402 918718 1519283 1170651 810037 613372 490053 269937 -169780 -389579 -125739
2228 -125739 57250 -82936 314894 807868 901547 1238626 1426855 2014667 1407438 1644572
2218 1644572 787478 511066 1476873 1012294 511279 1533150 1358052 1225799 1087194
2209 1087194 704081 570248 1317851 1544300 1130973 1873292 1962135 2860647 1878338 890904
2199 890904 1214350 861806 776671 908498 928129 945623 1522737 622802 58272 475016
2189 475016 1382787 1585607 1175208 1794404 1829571 1333668 1931841 1482478 1473966 1792734
2179 1792734 1781136 2022378 1914555 2631880 2522396 2117830 2653391 2265613 2489422 1987333
2169 1987333 2456212 2823810 2165390 2104151 2449643 2557556 2804488 2487745 3066543 3393953
2159 3393953 2860365 2553401 2620413 2497328 2026378 2160078 2781028 3278690 3846962 3339511
2149 3339511 2478964 2968576 3068819 2440004 2592399 2854825 3071669 3187658 3731888 4562852
2139 4562852 3481171 3490168 4250013 4251103 4508123 5263986 4174942 4262403 4826844 4128604
2129 4128604 4013108 5316755 5648983 4682304 4446599 4749618 5353994 6627601 7061042
2120 7061042 7098080 7722606 8549070 8731573 8933247 8895039 9606351 10156339 10768493 11440973
2110 11440973 12390070 11953193 13457454 15580714 15985227 17233580 19174433 19943219 20946012
2101 20946012 22197222 23793954 26195412 29487053 32880551 37683670 45410355 55867349
2093 55867349 68799672 86098131 107765954 133538868 141598169 132530475 117787273
2086 117787273 93735202 72925501 57597004 47169411 37939160 31658281 26889761
2079 26889761 24099863 21810826 20082652 19212425 18164048 16776029 15068946 14339356
2071 14339356 13100257 11602458 10717933 9266559 8282416 8558072 7592790 6822255 6488654
2062 6488654 6192482 5357750 5950338 5773657 4724546 4598518 4324239 4771041 3658859
2053 3658859 3407914 4073062 3762131 3330401 2936883 3599604 3861287 3639462 3011597 3684716
2043 3684716 3801168 3434000 2886590 1337704 1999852 2912470 2273915 1135839 1522625
2034 1522625 951036 1564525 1875050 1591347 882249 1114169 1501055 555821 1130142 1458448
2024 1458448 1736573 958438 423520 952548 733732 1173256 1456831 1022985 880881 698554
2014 698554 586414 157054 344612 866049 1817392 1702827 951135 485014 79238 696935
2004 696935 809109 985113 1534998 511879 203910 525889 426164 435762 483426 225839
1994 225839 431575 1086133 1566398 1860680 1579062 909984 -38304 340367 230115 396679
1984 396679 541190 236028 745727 145992 363258 468652 360139 133137 -165348 210274
1974 210274 123162 -35487 -421966 -1228277 -1518660 -862367 -1178850 -491880 260415 583003
1964 583003 571640 473456 -17728 -345290 270171 11807 67334 188734 60246 -297404
1954 -297404 -972225 -719521 204479 -189998 453571 564490 110903 -521431 -186102 108124
1944 108124 -530337 -249351 -767528 204608 721006 -195215 -290300 105585 804711 891356
1934 891356 233261 80282 -12483 70980 485 296523 246486 220429 414177 100737 45558
1923 45558 688123 466828 281041 -172702 312184 324445 -295102 -153670 406222 -167453
1913 -167453 151589 860390 805032 61195 21137 379784 275029 -68729 297945 417414
1903 417414 249599 326349 85397 545689 757411 550448 -306044 -377641 -542655 85594
1893 85594 -31980 -449016 -335497 278829 345264 249276 -28325 -718356 -467478 -236165
1883 -236165 -776493 -497178 -45887 -306846 -228633 -747819 -1552170 -139107 -580468 -927649
1873 -927649 -494898 -375704 -766046 -1249260 -1254123 -485542 -686680 -148047 -79110 404704
1863 404704 476762 -905530 -699634 -1056413 -1217076 -820985 -739356 -804737 -925192 -446372
1853 -446372 -89497 -961968 -499227 19794 -383963 -234706 -187421 -155077 -96381 147193
1843 147193 -285262 -62754 375728 639527 1137735 337354 -189640 64885 706124 348743
1833 348743 135764 291884 298044 651173 501142 -577495 -562674 -429637 605173 217029
1823 217029 -305028 -666984 -471633 765945 1543558 963907 893643 1661096 1115528 786444
1813 786444 536378 -134951 -362799 -199400 261168 202223 -244344 470213 -295865 -175439
1803 -175439 -467671 -168551 -608725 -285462 435499 -427971 146814 235096 -473449 -879372
1793 -879372 -492529 -320220 -182833 -268961 -355535 -815812 -428661 51193 -290807 -811679
1783 -811679 -813261 -491276 -371331 -298763 210738 705406 562238 281217 -678461 -1077513
1773 -1077513 -1204574 -636292 -89950 170294 -598345 -919591 -690573 -528554 -550254 -281265
1763 -281265 -59044 -894624 -106876 -278189 -792124 -317256 -493678 -512123 56319 452329
1753 452329 199151 22669 -736658 -1363126 -1098597 -411396 -460675 -534380 -591434 -974310
1743 -974310 -1144586 96259 -568339 -1155749 -1324601 -1553430 -958770 -954612 -387388 -741608
1733 -741608 -743502 -169995 127579 -634423 -1272553 -949133 -537646 -277763 416991 -343397
1723 -343397 -388471 -218408 287969 -33690 -117435 -228852 -118823 -699741 -335095 -606532
1713 -606532 -31467 318984 -725056 -1191254 -564757 -368014 -588240 -853641 -488078 62429
1703 62429 -608355 -45522 210955 -123023 -577112 161363 -443027 -1595634 -1518082 -1038189
1693 -1038189 -1768946 -1452194 -362876 -340559 -545742 -941710 -474057 -769708 -1050419 -1458236
1683 -1458236 -1104131 -393535 -528909 -1105138 -628310 -525212 -1048177 -1214006 -548768 -487381
1673 -487381 -408621 -641757 -1282883 -1641319 -848954 -343037 -827105 271921 494243 779982
1663 779982 708066 899436 481712 -170676 -493086 339609 -249435 93964 -628375 -658567
1653 -658567 175010 308453 -737044 -1108946 -1249924 112965 408999 240749 690993
1644 690993 551607 -100326 -321847 -720746 -290502 -534197 -1106494 -656876 -941273 -733740
1634 -733740 -682830 361116 223647 -334286 -156372 363366 -314620 -907582 -633191 -765852
1624 -765852 -1036836 574211 1344533 479112 652375 308892 -419877 281890 -267010 -586777
1614 -586777 -420797 -543254 713069 -605327 -900679 -204893 429832 693519 360887
1605 360887 585660 113380 42584 831097 365282 -288662 233861 -321280 -620036 -310896
1595 -310896 425035 -225345 -557918 -740567 -309232 -715062 -465746 -179591 262606 685424
1585 685424 502885 -256074 208103 137627 -569155 -492148 1011006 781051 -41078 -590213
1575 -590213 -291867 725667 331549 210258 492011 606750 534248 208806 -496963 -556788
1565 -556788 -466241 -533097 -224898 -471053 -486387 122564 -626621 -646967 -1008882 -1464155
1555 -1464155 -486531 537704 1027106 1162897 79103 228419 -659162 -463464 -98512
1546 -98512 -215610 142650 338174 -149244 -798714 -1265584 -1718123 -1607318 -1375258 -1037129
1536 -1037129 -359798 -164620 12237 -281760 -106895 -86423 230543 326638 -153426 7125
1526 7125 -686983 -737250 307764 526059 -26092 -52363 -481104 -359657 -829665 -871294
1516 -871294 7271 106825 -379746 -487543 -833779 -943406 -650323 -618030 -774385 -614034
1506 -614034 -35428 -213968 -732988 -449637 -94916 -927149 -477449 403481 337379 130951
1496 130951 -334162 -68788 472433 -261659 -273510 -292846 -973973 -825543 -1082246 -1138478
1486 -1138478 -530008 -507976 -652405 -776224 -302052 -54723 -800155 147929 752300 -85615
1476 -85615 -1194987 -573617 -347213 -282682 -755345 -411303 182162 249860 503577 -21996
1466 -21996 334662 640262 -583223 -321063 -136799 -748556 -25370 55614 -319745 -638268
1456 -638268 -618441 191242 139785 130259 381139 -448568 -643283 -569082 -737548 -799554 -443437
1445 -443437 236983 -104987 -796889 -584261 182109 -244810 -394336 -1303489 -1494966 -829321
1435 -829321 -445744 -753569 -826479 -634203 -482221 -286987 -35537 916174 553571 -3371
1425 -3371 -169877 -245658 -497117 -793171 -1203863 -902000 -112978 488021 719936 -113534
1415 -113534 -347277 14751 350760 304563 -302387 741767 254844 691585 -434290 -849572
1405 -849572 -50503 -333057 -1054001 -360857 364580 7735 577396 843214 368979 -91892
1395 -91892 -667502 -516895 210756 683243 544968 -137139 -512952 -737580 -984900 -1043776
1385 -1043776 -407609 -242483 1709 504105 -203313 -689270 -52338 153175 -408392 -369342
1375 -369342 -433642 -453024 128026 -140679 -1184069 -1358459 -878029 -267841 82419 518954
1365 518954 -437179 -1075282 -633230 -746493 -609143 -162296 62247 273517 -13479 -472982
1355 -472982 -11429 408875 580005 -86755 660638 319835 351802 118971 -526428 -1008490
1345 -1008490 -1474262 -1211296 -50136 -123654 -265404 361436 489344 172567 -391915 -140318
1335 -140318 -675952 -500363 -196608 -60924 115672 -1071388 -1317796 -537996 -306890 -688049
1325 -688049 -318301 30645 -206420 -353921 -1094012 -985372 -756760 -478442 93814 121665
1315 121665 377060 712165 314365 256363 320859 -5785 638021 814809 -146875 -578628
1305 -578628 -902948 -98502 -141920 141890 -34994 227396 250418 -761915 -1011074 -98044
1295 -98044 88463 145346 280787 468394 168789 -596881 56021 -266241 -634123 -757239
1285 -757239 -122430 469226 90860 -580366 -691656 -1036092 -1278270 -294582 551577 553737
1275 553737 827329 95456 -15407 602825 685819 -32370 24752 -479182 283217 824076
1265 824076 529504 662338 -404911 -780921 211518 412476 437984 507302 292306 -301135
1255 -301135 220715 62672 -7675 253831 -28454 -586156 -514215 -937824 -1221689 -448763
1245 -448763 276238 357144 409038 -80213 -757222 644305 1384915 584273 30054 -69891
1235 -69891 -56791 -8321 766257 1395800 651626 264367 -907036 -741586 110928 179136
1225 179136 -121703 -215584 292974 258026 -968777 -364523 -249585 163864 -68810 -817939
1215 -817939 -797495 -143401 -449092 -593028 370486 458739 -196483 -482353 -609463 -164373
1205 -164373 192509 -417515 -260181 -411471 -65614 -461776 -154218 -406016 -484476 -519360
1195 -519360 124673 -342455 -1324720 -1196838 -882160 -117480 440171 -112063 -660590 -378126
1185 -378126 -631138 -453156 -321461 -72560 -274961 -102411 -759782 -671862 -793792 -674149
1175 -674149 -34542 295419 -317754 -1005057 -396209 91964 71385 -289184 -157560 577671
1165 577671 -223945 -783329 -557368 382529 875637 520583 59062 -316358 -420377 -22974
1155 -22974 -246269 898243 1166271 409047 211054 -145871 -511319 -805253 -473158 -145949
1145 -145949 192037 -1087799 -241092 -586619 -706032 -642803 111400 248420 -533706 -1095889
1135 -1095889 -1165595 103751 259464 502392 282795 -556197 -713489 -941513 -409178 -77652
1125 -77652 -636662 -979602 -613352 -176880 -537201 60616 -915471 -1207734 -600135 193155
1115 193155 624820 594114 372962 630628 107188 -214602 -279318 -380972 216054 330424
1105 330424 -340015 -632093 -665358 199931 -418838 -306360 -61657 286108 -300552 -598207
1095 -598207 -133623 154877 -84345 -512941 -592053 -554849 96896 -410978 -579817 -720248
1085 -720248 -202577 -312550 211427 64248 706365 227233 -358462 -287486 -269129 -1013268
1075 -1013268 -365508 -33974 29994 148424 -73276 -559404 -551513 -95328 -1075031 88277
1065 88277 918238 -213957 -311312 -948359 -685080 -66542 -5499 -609409 -668125 -1045408
1055 -1045408 -1717160 -451488 -127155 -497001 765753 1341151 446082 -295198 5699
1046 5699 -195698 -434139 308829 -659585 -1116327 -525575 -383165 -639156 -1303121 -1102195
1036 -1102195 -421203 -152012 -239508 383923 -173045 208907 -229524 -29094 -202569 -772138
1026 -772138 -1404279 -707622 20068 -409285 -614536 204985 169769 -472114 -344001 -549382
1016 -549382 141721 -655159 -515594 -2044 -589127 -472036 550312 156158 -368886 11934
1006 11934 28234 -311288 -741447 -736413 -197409 -254450 804874 516273 -864014 -1359672
996 -1359672 -590764 -247983 -313157 -575885 -608247 384235 744428 625179 611808 -86159
986 -86159 -388145 -99653 252939 535007 284230 -101951 -632247 -464077 598856 16888
976 16888 -8951 -79614 -55620 305652 978697 732642 625023 553010 -238705 -673358 -85765
965 -85765 -432548 -222013 -500632 -258023 406039 652019 377586 -319695 -50610 -601918
955 -601918 -674353 -822693 -849675 -640887 -400530 -775327 -218450 65994 357583 1006938
945 1006938 588895 -179396 842978 284914 -829389 -393303 -51534 607349 740272
936 740272 392936 -670343 -577630 -800787 -416010 -968011 -629189 -231991 -25159 559200
926 559200 581190 108277 -471934 141765 648924 50849 -147050 -513349 -257858 -4105
916 -4105 582877 600385 -345947 -195212 522904 253408 -229418 -236258 -490684 -578096 -223882
905 -223882 -841162 27644 -401239 -438201 284132 746780 705330 -603142 -359402 43554
895 43554 515524 209261 228196 136923 -127628 -543277 -794839 -456526 237509 -76412
885 -76412 459657 333659 339215 -169788 -319556 -250801 25917 506640 751181 450492 426326
874 426326 -568389 114457 -22903 -1141156 -1189756 -402092 -734614 -477170 -452690 -514191
864 -514191 -548293 -314355 -455534 340054 17799 -78578 -425181 -690794 -685585 -148465 -740960
853 -740960 -663510 -906212 -21118 613406 -424094 -206675 -697046 -401250 -603572 -408120
843 -408120 -183992 -386672 -510306 -708244 -259032 -152686 -242540 -628170 -706057 -111876
833 -111876 -279145 146455 -264293 -194408 -475758 -26755 -460215 -71695 -160126 -258148
823 -258148 -152301 -530526 -703762 -677538 -271154 562788 -54506 -219393 535722 700096
813 700096 934363 708455 326420 398615 190176 -250275 -43534 -6576 77926 -149566
803 -149566 -135607 262262 -520633 217417 682419 990939 702120 110127 446865 350424
793 350424 -52961 -88869 76942 -196140 622 -104145 -640778 -130684 20455 -318868
783 -318868 -1621404 -1159761 -90573 581477 1005878 736034 242870 534275 150328 21802
773 21802 481197 604920 372693 -244041 -236438 -56812 -168247 -177660 70787 55748 -207912
762 -207912 39273 22529 -84458 156055 411775 760156 71872 -492454 430229 178392
752 178392 243413 436531 376478 510524 391667 441437 -464426 -103422 539335 436820
742 436820 259771 116628 316093 210271 682315 301486 -34122 49589 222087 1041682
732 1041682 836279 381203 -123777 -354190 189351 34427 -165172 196095 -102978 -295630
722 -295630 -1078263 50621 -703799 -950884 250955 -1382 -583640 -1125449 -795626 -758589
712 -758589 -188995 -362087 -53513 629710 -313261 163842 471698 433029 11351 -226904
702 -226904 -136843 -936330 -869588 -365056 288060 -115837 -100936 411963 324968 -350941 -595343
691 -595343 297777 119414 -112993 181213 -303974 -29941 256493 532012 1239969 888990
681 888990 285546 349471 222667 314627 -203515 -154581 -261319 -618421 -176892 -1190925
671 -1190925 -1077643 -1121834 356527 139513 -170956 -267074 292132 307798 -307847 -130358
661 -130358 380955 620296 402723 352705 211722 -9704 334526 407113 725390 91909
651 91909 -477204 251359 256136 699016 1470336 670768 116325 66314 -17806 -755248 -744053
640 -744053 -429535 -20912 -87382 -485276 -1059151 -1558348 -848174 -550282 -559408 -193542
630 -193542 -455223 -199057 374025 -179581 163800 -84538 -516820 -576916 374381 474450
620 474450 806121 832594 783334 613882 257995 191315 264141 190459 -54957 331944 576259
609 576259 866292 342908 -264781 776041 152084 285906 621283 1336098 1166032 824113
599 824113 620427 785756 654707 722425 269955 -428552 101765 -398650 -1576013 -863004
589 -863004 261691 570458 -67927 -68429 -393715 -80184 -35807 543151 -75965 -310854
579 -310854 -80103 361738 603681 -552008 -354426 -365048 -425719 -312138 378321 -147743
569 -147743 -209308 -870347 -1201578 -992709 -1136623 -596449 -129915 -482354 144841 -856918
559 -856918 -1211002 -585990 205732 438518 -95546 645323 617323 857247 6859 -207174
549 -207174 -206631 -85761 -109640 498661 392663 103563 224915 466119 605250 1059771 396794
538 396794 862756 1069160 -69413 -262589 -533699 -144453 -490388 189310 -141246 184801
528 184801 135563 399658 767239 462478 -55681 -9884 238224 -30617 460744 -6624
518 -6624 -391481 -14272 501101 1362312 1419633 942767 428312 413590 -348317 -128423 -97175
507 -97175 -406762 629370 739006 178246 184693 -583156 -1127430 -909254 -919282 -1043721
497 -1043721 2184 329486 805695 964039 1522895 1219798 836528 569574 462513 640904
487 640904 1152287 287473 202533 261426 -462770 -427439 -750606 -122849 448330 116576
477 116576 -4329 196575 562318 635542 340446 460067 -384283 -814872 445821 557694
467 557694 -98790 -35723 1061499 922511 404019 502678 145147 355483 -175922 -174848
457 -174848 -570904 -128037 209714 510636 316829 -362116 406715 416804 823588 357724
447 357724 -63671 -917610 -1159556 -543210 -782115 188013 22212 67891 -73164 -21189
437 -21189 406626 -105422 -96764 -61488 -521184 -816459 -370570 -195272 -63553 -150752 667257
426 667257 1136482 881467 235374 -296013 -3825 -91088 401194 655753 959477 999263
416 999263 600315 -261437 -272904 -166361 591095 -288455 82030 202074 701271 732961
406 732961 912532 1089767 1650534 1478887 902769 -381871 116263 462651 764137 444602
396 444602 -312236 189890 175311 268844 686781 236153 -179359 -966541 -1381708 -1306934
386 -1306934 -644311 -473506 265019 312887 -790821 -608531 -407683 -324702 -460183 -601027
376 -601027 -393018 657979 194316 516048 204571 15154 -340959 -53892 -18845 -110169
366 -110169 59718 14235 441185 842004 92379 -361704 -529144 265023 542318 652753
356 652753 1016634 556599 564640 900785 219372 1234839 906938 897746 681199 1368264
346 1368264 1236085 501413 -49278 245722 161894 1382451 413476 -246130 -393852 -371069
336 -371069 -241389 -410803 169562 103778 -548851 -257516 221496 -248508 991096 1020474
326 1020474 862473 1121258 754082 690365 842403 489521 683047 328942 532494 10921
316 10921 596163 776137 591688 1085209 909432 -36561 97306 255443 911468 54878
306 54878 -204250 125833 -193398 34953 358063 702274 515315 -279432 7228 -111915
296 -111915 647022 509188 -127215 285347 672377 690771 422421 225061 437542 280657
286 280657 453640 590897 353987 630553 232149 174495 513816 782880 1284238 1198448
276 1198448 179731 52314 278605 -676867 -675516 -86824 405220 920791 547047 850489
266 850489 -278070 -287785 107628 -402896 -34942 -94716 -318554 248148 124704 -157178
256 -157178 -163940 261711 1045890 968549 218282 656945 124124 -225731 -540715 -608419 -490965
245 -490965 -131535 -539838 -414035 -578881 -829325 -370600 50478 247713 408613 -17886
235 -17886 -273204 511330 168486 209763 -464788 -252288 66889 438190 -372207 -892889
225 -892889 -181106 390906 355985 -143180 -138328 636046 1084965 359591 -689214 -274042
215 -274042 375546 312786 286809 248435 -320880 283379 787208 886767 816599 754259 907839
204 907839 809707 460799 1148047 907461 371830 867451 1162514 801343 402462 554158
194 554158 407942 308154 -19628 645670 647936 -385296 -127980 274864 484312 950029
184 950029 739446 679617 413615 -126140 -14335 -105376 179930 6998 -261624 -213651
174 -213651 -200423 611242 573408 500847 426068 968451 939488 70112 -181686 595520 786105
163 786105 299193 -402995 -614246 76812 32019 -509405 87894 96865 -14908 -92338 -475182
152 -475182 11203 539319 846593 1169828 1192773 754743 -108078 -385077 328511 356552
142 356552 276331 487068 779046 53623 519292 1380639 179710 -14009 684853 328155
132 328155 500557 1231725 1341797 965328 388867 563184 -12437 253862 479468 -175615
122 -175615 -197327 -528718 -343770 -496798 -814263 -485775 267165 866529 694663 941706
112 941706 619097 718696 689825 195698 -107121 -192091 -318569 144456 557815 485985 693310
101 693310 528984 -55337 -266923 49238 -80087 194042 74412 918609 1172603 1084109
91 1084109 27247 -218734 170817 -9782 -2345 478830 735443 695882 -65700 -424087
81 -424087 -322949 -52924 273664 -198610 93562 187265 99661 588083 710776 720851 201300
70 201300 61048 578038 253649 -75220 -153730 38424 236299 397925 55299 487833
60 487833 655002 293675 -344666 137575 605788 583782 867722 559519 -361025 -419620
50 -419620 5118 473453 742474 744772 292061 656993 801091 1018487 268822 77348
40 77348 277460 76121 250701 456856 -159933 -836045 -408191 -494745 -256660 -181595 -563035
29 -563035 364385 1006897 601549 601914 79605 -249552 73851 103430 -170433 706101 1135504
18 1135504 625878 371896 737211 425082 522095 328041 41445 -182663 307744 1020831
8 1020831 1234657 324303 130858 437547 -289569 18719 361423 75596
0 75596
$$ Imaginary data points
##PAGE= N=2
##DATA TABLE= (X++(I..I)), XYDATA
16383 -3637592 -3621552 -3964128 -4004236 -4729843 -3787745 -4011328 -3847159 -3526249 -3890279 -3883711
16373 -3883711 -3368689 -3226766 -2783242 -3470490 -3005061 -3269115 -3450329 -2785248 -3096588
16364 -3096588 -2832466 -2912368 -2915031 -2662913 -2551774 -2318091 -2161131 -2524266 -2441913 -2327161
16354 -2327161 -2258480 -2087605 -2013636 -2160900 -1653346 -1545559 -1349805 -1667941 -2038486 -1533082
16344 -1533082 -1513956 -1481749 -1912728 -1677703 -1363649 -977859 -1020876 -1268685 -791251 -1104499
16334 -1104499 -973838 -912230 -692539 -660975 -305550 -187846 -27853 -43923 -28201 -145523
16324 -145523 -145150 320985 199078 520932 498688 -196512 -105100 -155971 -66706 495976 651806
16313 651806 595458 937019 -100331 -357219 675397 709394 858653 1139999 1262461 858869
16303 858869 822882 1173936 1128406 1532105 1656888 1818238 1910221 1961472 1020085 732613
16293 732613 1537563 1905571 1909436 1727365 1620060 1784224 2154402 1809026 2311601 2299037
16283 2299037 1778162 1512242 1739770 2165730 2229524 2320739 1886744 2691085 2656291 2801233
16273 2801233 2469697 2261614 2332247 2688334 3698710 2811135 2587461 2628512 2411261 3238434
16263 3238434 3182278 3266824 3737326 3067305 3593220 3358169 3418586 3613571 3353032 3251018
16253 3251018 2997771 3687695 2999203 2249539 2947568 3667454 3694763 4358244 5067870 4641888
16243 4641888 3978193 2803013 2986853 4035336 4526203 4245106 4335424 4946528 4817912
16234 4817912 4591724 5163857 4698848 4325826 4317228 4584014 4800339 4373058 4812766 5320952
16224 5320952 5832171 5775028 5545517 5074190 4175734 4566261 4913422 4904515 4772897 5192136
16214 5192136 5281924 5500931 5455530 4528151 4082196 4342345 4932106 4704008 4350819 4136801
16204 4136801 4559848 5100393 5209197 5476152 5903423 5934475 6416455 6264722 5438209 5073723
16194 5073723 5168567 5195308 4895673 4890719 5087292 5037695 5232628 5099268 4685524 4970687
16184 4970687 5426790 5494621 6247225 6620781 6329452 6394280 6460604 6257941 6400589 6212647
16174 6212647 5801997 6128685 6215758 5955553 5593680 6217407 6551103 7099702 7111383 7081326
16164 7081326 6600904 6248455 6275059 6657796 6563206 7514735 6602477 6130284 5514214 5659276
16154 5659276 6233086 5799627 6109826 5760167 6114545 6054867 6185066 5957994 5884701 5673845
16144 5673845 5332272 5325811 6193291 5905006 6640710 7107828 7699522 7869631 7336909 7000302
16134 7000302 6653762 6248412 5986939 6191195 6850603 7137941 6350156 6223215 5878993
16125 5878993 5643557 5782292 6257003 6181017 6227651 5884843 6156585 6321746 6679417 6820778
16115 6820778 7013188 7270348 7639718 7027584 6314645 6702059 7100252 6139246 5800031
16106 5800031 6359013 6824776 6945681 5951733 6134096 6297770 6629807 6232299 6089809
16097 6089809 5953378 6629122 6793028 7403650 7483401 7048084 7334635 7409114 6504812 6255410
16087 6255410 6314691 6567977 6777722 6042084 6656351 7478294 6571838 7070195 6931960 5908620
16077 5908620 5775695 6342663 6662618 6157098 5839048 6769415 7095146 7580136 7268430
16068 7268430 6556295 6989207 6758868 6993529 6392109 5913003 6142673 6828207 7114409
16059 7114409 7250124 7442111 7547434 6904142 6644605 7249488 7389513 7764248 6881436
16050 6881436 6715980 6968159 6361739 6833800 6404065 6726666 6502548 6583753 6688390 6746216
16040 6746216 6666701 6874474 7186162 6817239 6993995 6826842 6810712 6681198 7501105 7014848
16030 7014848 6936041 6426989 6369582 6460730 6437580 6409531 6696310 6975540 7007576 6250468
16020 6250468 5611566 6340973 7459604 7403389 6615726 6126346 6270065 6847230 6456313
16011 6456313 6066052 6968501 7201465 6560687 6473562 6583580 6536048 6733234 6705961 6647892
16001 6647892 6052410 6033485 6179477 6633669 7126640 6947579 7868737 7032149 7145327 7671388
15991 7671388 7474521 6659106 6755718 6317688 6606742 6666810 6675841 7358159 7333416 7389596
15981 7389596 7460553 6251913 6777387 6901245 7642450 7490924 7089013 6774316 7454026
15972 7454026 7099290 6450515 6520891 6560949 7541709 7098756 6960574 6923166 6266300 6311412
15962 6311412 6802237 7305059 7340301 7192461 7455526 6880521 5745999 6289228 7156365
15953 7156365 7389271 7446702 7251177 7209484 7181118 6956524 7228686 7332309 7361612 6920974
15943 6920974 7160215 7167838 6708128 7234728 6924861 6600567 6656695 7404034 7827179 7807222
15933 7807222 7434324 7247058 8220731 7692003 7114404 7350220 6090691 5667417 5486409
15924 5486409 5944179 6624139 6218259 6885108 6775127 6973874 7334210 7526300 7464423 6334314
15914 6334314 6114736 6378081 7475401 7974640 7955596 7144183 7912624 7287765 7840302
15905 7840302 7817932 8121281 7764789 6851655 6673766 6571727 6716097 6666032 6776837 7444487
15895 7444487 7966017 7237583 7614903 7644469 7712539 7723262 7721903 7648551 6306495 6112007
15885 6112007 6496829 6430695 6678481 7389346 6669368 6548200 6642184 7124584 7310412 6727574
15875 6727574 6016483 6521726 7421118 7077475 6190146 5887226 6199813 7337819 7589491
15866 7589491 7322819 7399147 7256367 6920385 7081629 7677144 7145969 6693158 7033258 6742648
15856 6742648 6765455 7028090 7377427 7800500 7129702 7165306 7490988 6937528 6748193 6868651
15846 6868651 7378252 7291791 7204322 7584034 7859244 7935026 7343221 6956156 7213903 7365314
15836 7365314 6916331 6443660 6932539 8070751 7395577 7127054 6355922 6656097 7505543
15827 7505543 7032712 6330978 6802749 7109056 7022121 7749302 7411853 6640116 6823574 6593429
15817 6593429 6956162 6834426 6906474 6802435 6595465 6552435 7268764 7731004 8019419 7494860
15807 7494860 7211760 6540877 6967278 6614074 7252923 7397328 7036239 6889564 7148185
15798 7148185 7820514 7803869 7575930 6824714 7325290 7139650 7455524 7680865 7560186 7697480
15788 7697480 7132420 7098467 7695592 7309949 6806903 6783054 6901556 7671146 7110192 6340326
15778 6340326 6732674 7304902 7679343 6937669 7098570 7163733 7189919 7326917 7011278 6580014
15768 6580014 7179064 6835961 6832403 6912009 6913348 6638226 7102523 8035235 7417571 7534222
15758 7534222 7677555 7432322 7420284 7716082 7788105 7248784 7646434 7364133 7325926 7739342
15748 7739342 7485312 7613316 7785422 7659402 7181094 7079896 6387489 6027290 6893533
15739 6893533 7229690 7017700 6626313 6572430 6705692 7098360 7577131 7697161 7771965 8398647
15729 8398647 8194973 6860765 6666765 6823246 6734384 6821750 6916874 6751392 6852507 6245110
15719 6245110 7228061 7225340 6977069 7026119 6714460 7210043 6701110 6685877 7828570 7143023
15709 7143023 6567338 6477993 6051722 6712378 6644393 6371919 6169444 6619321 6946653 7738324
15699 7738324 7524927 7117179 7208266 7034847 7122618 7365098 7050241 6465317 6337687 6332623
15689 6332623 6969768 6500171 6894045 6703293 6631173 6765222 6936704 7235346 6755739 7158813
15679 7158813 7342510 7813370 7156555 7904425 8146956 8027596 7334128 7375921 7217352 6532987
15669 6532987 6513468 7548132 8047214 7733138 7502423 6805353 7430054 7261728 6572647
15660 6572647 7059331 6921640 7611329 7781769 7787491 7829654 7584301 7436600 7759660 6946266
15650 6946266 6582589 7695563 7676797 7729589 8128748 8052839 7497446 7777210 7594174 6599770
15640 6599770 6576572 7080430 7362472 7979195 6922664 6402519 6962718 7132285 7150084 6855969
15630 6855969 6072655 6941758 7407900 6855996 6794527 7059099 7056664 7500067 7843834 7948746
15620 7948746 7702954 7135142 6869077 7445446 7099658 8214797 8973497 8232503 7958626
15611 7958626 8237667 8634296 7836213 7269826 6181665 6832845 7756184 7991442 7445940
15602 7445940 6942766 7407731 7549153 7053349 6234470 7330955 7897041 7691528 7965120
15593 7965120 8294538 8023168 6972160 6859478 6670799 7291985 7324026 7600389 7281067
15584 7281067 7147969 8029992 7411772 6922350 6984208 6099875 6537292 6975245 6780015 7368695
15574 7368695 7740098 7906876 8005654 8498777 7885994 7137921 7103597 6975132 7157084 6697584
15564 6697584 6553888 7394096 7993155 7749847 7445617 7459777 7446257 7417349 6970070 7033868
15554 7033868 7141059 7265475 7112535 7618628 6960333 7110994 7533425 7722383 7881398
15545 7881398 7450409 8237435 7155936 6744909 7195718 6835714 7820150 7939985 6972051
15536 6972051 7176321 7394394 7023015 6768373 7233018 7648206 7795945 7736386 7336152 6801896
15526 6801896 6885861 6531033 7053367 7223057 6234902 7177361 7856673 8324137 7636808 8171384
15516 8171384 7937542 8144506 7937860 7698192 7356760 7536951 7988138 7397839 6681081
15507 6681081 6350015 6590100 6815252 6049680 7190367 7159494 7258447 7777499 7459385 7116317
15497 7116317 7048625 7506721 6748621 6434996 7074165 7821427 7602712 7518356 7132912 7031573
15487 7031573 7874010 7874260 7380908 6979885 6333864 6971260 7286405 8358227 7763777 7596095
15477 7596095 7758564 7824878 7997208 8073908 7589552 8109485 7963637 7750875 7429271 7597449
15467 7597449 7609631 8442232 8283566 7678296 7794344 7717268 7246605 7385353 7441220 7182093
15457 7182093 7541040 7656294 7486874 6775321 6990478 6729541 7045195 7630072 7425635
15448 7425635 7176774 6586744 6618694 7471109 7731886 8306161 8780782 7593975 7708351
15439 7708351 7369514 7674328 8125318 7190471 7094542 6761769 6759912 6962442 6611402 5929208
15429 5929208 6041049 6910988 6646925 6686057 7087495 6937353 7970956 7597280 7755667
15420 7755667 7091571 7016427 7759386 8024309 7864535 7569244 7355357 7092963 7476446 7046176
15410 7046176 7288168 7253516 8363140 8075250 7710923 7741265 8060546 8075365 8232008 9364514
$$ [...]
##END NTUPLES=NMR SPECTRUM
##END=
