##TITLE=1H_EC-3277x-3y
 DMSO
 8 sc, 
 27.09.2022
##JCAMPDX= 6.0         $$ Bruker NMR JCAMP-DX V2.0
##DATA TYPE= NMR SPECTRUM
##DATA CLASS= NTUPLES
##ORIGIN= UXNMR, Bruker Analytische Messtechnik GmbH
##OWNER= root
$$ XWIN-NMR		Version 3.5
$$ Tue Sep 27 14:54:08 2022 Russian Standard Time (UT+4h)  she@DPX200
##.OBSERVE FREQUENCY= 200.1313499994
##.OBSERVE NUCLEUS= ^1H
##.ACQUISITION MODE= SIMULTANEOUS
##.ACQUISITION SCHEME= undefined
##.AVERAGES= 8
##.DIGITISER RES= 18
##SPECTROMETER/DATA SYSTEM= spect
##.PULSE SEQUENCE= zg30
##.SOLVENT NAME= DMSO
##.SHIFT REFERENCE= (INTERNAL, DMSO, 0, 15.7733)
##AUDIT TRAIL= $$ (NUMBER, WHEN, WHO, WHERE, WHAT)
$$ ##TITLE= Audit trail, XWIN-NMR		Version 3.5
$$ ##JCAMPDX= 5.01
$$ ##ORIGIN= Bruker BioSpin GmbH
$$ ##OWNER= she
$$ F:/spectra/data/she/nmr/H-F/1/pdata/1/auditp.txt
$$ ##AUDIT TRAIL=  $$ (NUMBER, WHEN, WHO, WHERE, WHAT)
(   1,<2022-09-27 14:52:50.98 +0400>,<she>,<DPX200>,
      <created by zg, POWCHK disabled, PULCHK disabled
       configuration hash MD5:
       00 E9 B6 7A A2 85 ED C7 34 08 36 98 17 FE 4E 26
       data hash MD5: 16K
       0A 48 7A A1 94 60 F2 30 04 42 24 A2 83 26 AB FB>)
(   2,<2022-09-27 14:52:53.31 +0400>,<she>,<DPX200>,
      <Start of raw data processing
       efp BC_mod = 2 LB = 0.24 FT_mod = 6 PKNL = 1 PHC0 = -18040.8 PHC1 = 14.20069 SI = 16K 
       data hash MD5: 16K
       5F 7B 4A AB 24 EF AD 76 47 BD 4E 9B D3 81 D9 FE>)
(   3,<2022-09-27 14:53:12.60 +0400>,<she>,<DPX200>,
      <pk PHC0 = 6.139078 PHC1 = -5 
       data hash MD5: 16K
       5A F7 1F A7 A7 B7 C3 6C 6B C8 CD 10 BB 5E 34 BC>)
(   4,<2022-09-27 14:53:16.46 +0400>,<she>,<DPX200>,
      <abs ABSG = 5 
       data hash MD5: 16K
       4B 41 0D 0D 40 FE DD 12 1D 4B 2B 41 DA EF D9 82>)
$$ ##END=
$$ 
$$ hash MD5
$$ F4 43 D5 77 4B 07 F4 A9 0B EE CB 66 8D D9 26 79
##$RELAX= 
##$RELAX= 
##$RELAX= 
##$RELAX= 
##$RELAX= 
##$RELAX= 
$$ Bruker specific parameters
$$ --------------------------
##$DU= <F:/spectra>
##$EXPNO= 1
##$NAME= <H-F>
##$PROCNO= 1
##$TYPE= <nmr>
##$USER= <she>
##$AMP= (0..31)
100 100 100 100 100 100 100 100 100 100 100 100 100 100 100 100 100 100 
100 100 100 100 100 100 100 100 100 100 100 100 100 100 
##$AQSEQ= 0
##$AQ_mod= 1
##$AUNM= <au_zg>
##$AUTOPOS= <>
##$BF1= 200.13
##$BF2= 200.13
##$BF3= 200.13
##$BF4= 200.13
##$BF5= 200.13
##$BF6= 200.13
##$BF7= 200.13
##$BF8= 200.13
##$BYTORDA= 1
##$CFDGTYP= 0
##$CFRGTYP= 5
##$CHEMSTR= <none>
##$CNST= (0..31)
1 1 145 1 1 1 1 1 1 1 1 1 1 1 1 1 1 1 1 1 1 1 1 1 1 1 1 1 1 1 1 1 
##$CPDPRG= <>
##$CPDPRG1= <>
##$CPDPRG2= <>
##$CPDPRG3= <>
##$CPDPRG4= <mlev>
##$CPDPRG5= <mlev>
##$CPDPRG6= <mlev>
##$CPDPRG7= <mlev>
##$CPDPRG8= <mlev>
##$CPDPRGB= <>
##$CPDPRGT= <>
##$D= (0..31)
0 1.2 0 0 0 0 0 0 0 0.06 0 0.03 0 0 0 0 0.0002 0 0 0 0 0 0 0 0 0 0 0 0 
0 0 0 
##$DATE= 1664275970
##$DBL= (0..7)
120 120 120 120 120 120 120 120 
##$DBP= (0..7)
150 150 150 150 150 150 150 150 
##$DBP07= 0
##$DBPNAM0= <>
##$DBPNAM1= <>
##$DBPNAM2= <>
##$DBPNAM3= <>
##$DBPNAM4= <>
$$ [...]
##$SUBNAM3= <"">
##$SUBNAM4= <"">
##$SUBNAM5= <"">
##$SUBNAM6= <"">
##$SUBNAM7= <"">
##$SUBNAM8= <"">
##$SUBNAM9= <"">
##$SW= 18.0517283424941
##$SWIBOX= (0..15)
0 0 2 0 0 0 0 0 0 0 0 0 0 0 0 0 
##$SW_h= 3612.71676300578
##$TD= 16384
##$TD0= 1
##$TE= 0
##$TE2= 300
##$TE3= 300
##$TEG= 300
##$TL= (0..7)
0 120 120 120 120 120 120 120 
##$TP= (0..7)
150 150 150 150 150 150 150 150 
##$TP07= 0
##$TPNAME0= <>
##$TPNAME1= <>
##$TPNAME2= <>
##$TPNAME3= <>
##$TPNAME4= <>
##$TPNAME5= <>
##$TPNAME6= <>
##$TPNAME7= <>
##$TPOAL= (0..7)
0.5 0.5 0.5 0.5 0.5 0.5 0.5 0.5 
##$TPOFFS= (0..7)
0 0 0 0 0 0 0 0 
##$TUNHIN= 0
##$TUNHOUT= 0
##$TUNXOUT= 0
##$USERA1= <user>
##$USERA2= <user>
##$USERA3= <user>
##$USERA4= <user>
##$USERA5= <user>
##$V9= 5
##$VALIST= <valist>
##$VCLIST= <CCCCCCCCCCCCCCC>
##$VD= 0
##$VDLIST= <DDDDDDDDDDDDDDD>
##$VPLIST= <PPPPPPPPPPPPPPP>
##$VTLIST= <TTTTTTTTTTTTTTT>
##$WBST= 1024
##$WBSW= 4
##$XGAIN= (0..3)
0 0 0 0 
##$XL= 0
##$YL= 0
##$YMAX_a= 158893
##$YMIN_a= -153967
##$ZGOPTNS= <>
##$ZL1= 120
##$ZL2= 120
##$ZL3= 120
##$ZL4= 120
##$ABSF1= 15.748
##$ABSF2= -2.303849
##$ABSG= 5
##$ABSL= 3
##$ALPHA= 0
##$AQORDER= 0
##$ASSFAC= 0
##$ASSFACI= 0
##$ASSFACX= 0
##$ASSWID= 0
##$AUNMP= <proc_1d>
##$AZFE= 0.1
##$AZFW= 0.1
##$BCFW= 0
##$BC_mod= 2
##$BYTORDP= 0
##$COROFFS= 0
##$CY= -3
##$DATMOD= 1
##$DC= 0
##$DFILT= <>
##$DTYPP= 0
##$F1P= 0
##$F2P= 0
##$FCOR= 1
##$FTSIZE= 16384
##$FT_mod= 6
##$GAMMA= 0
##$GB= 0
##$INTBC= 1
##$INTSCL= 3.70164e-10
##$ISEN= 128
##$LB= 0.24
##$LEV0= 0
##$LPBIN= 0
##$MAXI= 10000
##$MC2= 0
##$MEAN= 0
##$ME_mod= 0
##$MI= 1.114404
##$NCOEF= 0
##$NC_proc= -7
##$NLEV= 6
##$NOISF1= 3.799351
##$NOISF2= 2.8
##$NSP= 0
##$NTH_PI= 0
##$NZP= 0
##$OFFSET= 15.77333
##$PC= 1
##$PHC0= -18034.66
##$PHC1= 9.20069
##$PH_mod= 1
##$PKNL= yes
##$PPARMOD= 0
##$PSCAL= 0
##$PSIGN= 0
##$REVERSE= no
##$SF= 200.129999641669
##$SI= 16384
##$SIGF1= 3
##$SIGF2= 2
##$SINO= 5.538805
##$SIOLD= 16384
##$SREGLST= <1H.CDCl3>
##$SSB= 0
##$STSI= 16384
##$STSR= 0
##$SW_p= 3612.71676300578
##$SYMM= 0
##$S_DEV= 0
##$TDeff= 16384
##$TDoff= 0
##$TI= <>
##$TILT= no
##$TM1= 0
##$TM2= 0
##$TOPLEV= 0
##$USERP1= <user>
##$USERP2= <user>
##$USERP3= <user>
##$USERP4= <user>
##$USERP5= <user>
##$WDW= 1
##$XDIM= 16384
##$YMAX_p= 335614370
##$YMIN_p= -1128126
$$ End of Bruker specific parameters
$$ ---------------------------------
##NTUPLES= NMR SPECTRUM
##VAR_NAME=  FREQUENCY,     SPECTRUM/REAL,   SPECTRUM/IMAG
##SYMBOL=    X,             R,               I
##VAR_TYPE=  INDEPENDENT,   DEPENDENT,       DEPENDENT
##VAR_FORM=  AFFN,          ASDF,            ASDF
##VAR_DIM=   16384,         16384,           16384
##UNITS=     HZ,            ARBITRARY UNITS, ARBITRARY UNITS
##FACTOR=    0.220516191357247, 1,           1
##FIRST=     3156.7164741739, 0,             0
##LAST=      -456.00028883188, 0,            0
##MIN=       -456.00028883188, -1128126,     0
##MAX=       3156.7164741739, 335614370,     0
$$ Real data points
##PAGE= N=1
##DATA TABLE= (X++(R..R)), XYDATA
$$ [...]
13816c12320o4385K40079M465O003J73861j96496o8315J72851Q4737K3509k14370
13805a50381O0726O5414l73056J74359J44963O5017L2586j93370j5267J13104
13795g5905j82546m903o335J48061J89846k19765k13667l7072J84512R1794J92297
13784F6317l6716j72701J8577j83812j13910L12872j54151n7195K56503L26942
13774B62726m6949q9967l7012j02209o6403k13454m0647K08640J25267j89206
13764a89214k59j12271k80701J92164M43255J28155J49110l43248j34358q7281
13754b34648K48361o4701J9987l32368j00502L45598J35963j86505q9717m6621
13744c05153j0919n9428N7914K65835m7505k22338K00383P9334m40801o1304K30317
$$ plain form
13816 -312320 -376705 -136626 -132161 -126158 47703 -148793 -217108 -44257 40480 63989 -150381
13805 -150381 -89655 -24241 -397297 -222938 -77975 -12958 19628 -173742 -189009 -75905
13795 -75905 -258451 -263354 -269689 -121628 68218 -151547 -365214 -402286 -217774 -125980 66317
13784 66317 29601 -143100 -124523 -308335 -422245 -109373 -263524 -320719 -64216 262726
13774 262726 215777 125810 88798 -13411 -79814 -293268 -333915 -125275 -8 -189214
13764 -189214 -189473 -301744 -582445 -390281 52974 181129 330239 -13009 -147367 -234648
13754 -234648 13713 -50988 -31001 -363369 -463871 -118273 17690 -168815 -258532 -305153
13744 -305153 -316072 -375500 -317586 -51751 -99256 -321594 -121211 -41877 -482678 -543982 -313665
13733c13665L91389q9774k24473k44191N84426Q6149k88161k5493O5437j83047
13723b41403L84377j91450J09895j20126n1491m3444j05083J74560j08348J9950
13713a72563k3609J9126j77673L0326J62367J81385K32429j67975j93159o3923
13703a73269j21129K81563Q6481j91277l08646M7394J63912L13665j62553n8267
13693a22126J92075R7147j02281q3070k79233N8806o1298J91642M7147l12481
13683c73672L74057r3249k50633N2612K29998K48853Q9784K1176J2935l04242
13673G619k12159j4874j84320L30275o1656r1019K18547l22850K51505K37362
13663A58430j72035J11628p8779j45057j53696L70685P1821j832j98888m4521
$$ plain form
13733 -313665 77724 -12050 -236523 -480714 103712 189861 -98300 -123793 -58356 -241403
13723 -241403 142974 -48476 61419 -58707 -110198 -153642 -258725 -84165 -192513 -172563
13713 -172563 -196172 -177046 -354719 -324393 -162026 19359 251788 83813 -109346 -173269
13703 -173269 -294398 -12835 73646 -117631 -426277 -378883 -214971 98694 -63859 -122126
13693 -122126 69949 167096 64815 -18255 -297488 -238682 -299980 -108338 -61191 -373672
13683 -373672 385 -92864 -343497 -290885 -60887 187966 277750 298926 311861 7619
13673 7619 -204540 -219414 -403734 -73459 -135115 -226134 -7587 -330437 -78932 158430
13663 158430 -13605 98023 19244 -125813 -279509 91176 162997 161165 -37723 -82244
13653h2244J56875k02092K68997n7756j94130j21477L17827j30537l02833K62509
13643h4861J2198k31514K22376J95496j99538Q9776p2242q6799J67431o1265L781
13632d5161K23541j48603l16332M3563O1074J89309m7033p9461J44754j04320
13622g8669K39849q4954Q8649k55546K4925J28557l0803j82894k59016K95135
13612a14767o0312J82261L7083k2946l01978J66095Q7560j26890N9495M0984o0118
13601a13533K5937j1082k765j30815j95405J14089J08399J83202K4318m36727
13591d34382J19647l8420K06963j49088j98694J71225J52117q5863j90087L83971
13581f2611n5956m0510j08138j89617K741Q1955K10468r2717J85997J33789j48939
$$ plain form
13653 -82244 74631 -127461 141536 83780 -110350 -231827 86000 -44537 -347370 -84861
13643 -84861 -72663 -304177 -81801 113695 -85843 3933 -68309 -155108 12323 -48942 -45161
13632 -45161 178380 29777 -286555 -242992 -181918 7391 -39642 -119103 25651 -78669
13622 -78669 161180 76226 164875 -90671 -65746 62811 32008 -150886 -409902 -114767
13612 -114767 -175079 7182 44265 21319 -280659 -114564 -27004 -153894 -94399 -53415 -113533
13601 -113533 -87596 -98678 -101443 -232258 -427663 -313574 -205175 -21973 2345 -434382
13591 -434382 -314735 -353155 -146192 -295280 -493974 -322749 -170632 -256495 -446582 -62611
13581 -62611 -118567 -159077 -267215 -456832 -454091 -372136 -161668 -254385 -68388 65401 -83538
13570h3538R614n7312k952m1835K03624j14328M27341k76260j68269J21102k1076
13559c889k57930L92534J25970k55537j21559J13687k9783R4879J50164k83507
13549g4971j32582k1106K49296J5997l3916K2642J03401k54679j84911j31644
13539d42473J42721J74394n1130K09831N9506k30179Q4432j0352J68023j34258
13529b9485R3103l7190j74333j25188O8755m9563m3265J92858j09236j8702J07906
13518a24340l28132K10665L57687N5993j39526l17274O7166o3724n8560J38651
13508b01394m7965J83251p1596K6029J4516O5569p6801j2201r8378J19708J82138
13497H2876l80621q1804J46201L04081N8365N4130m1517l03555k64801J15620
$$ plain form
13570 -83538 -73924 -131236 -134188 -176023 27601 -86727 340614 64354 -103915 17187 -3889
13559 -3889 -261819 130715 256685 1148 -120411 -6724 -36507 58372 208536 -74971
13549 -74971 -207553 -228659 20637 36634 2718 25360 128761 -125918 -310829 -442473
13539 -442473 -299752 -125358 -176488 33343 92849 -137330 -52898 -63250 104773 -29485
13529 -29485 63618 26428 -147905 -273093 -204338 -253901 -297166 -104308 -213544 -232246 -124340
13518 -124340 -452472 -241807 115880 171873 32347 -284927 -217761 -281485 -340045 -201394
13508 -201394 -249359 -66108 -137704 -111675 -97159 -31590 -108391 -120592 -218970 -99262 82876
13497 82876 -297745 -379549 -233348 70733 129098 183228 141711 -161844 -426645 -311025
13487c11025r466P7368j91063K61980j95742J11705J72105k15224p2258l586L48302
13476b6904K44922J15288j05911p1614k30549L2892n7713K9460J14881p0944r9112
13465a25304k03944L13681l4583K8745o821n7434J15860M162O8427K78464r3551
13454B87702m05255j14635R99J7477K8934K1902J20983N9269k39123J16445K70081
13443A64779R6608j79331k24765K3016J09540j83842j7621P0345o5827r1584K91162
13432g520l1737j27631j089m7400o1325p5270n3074K28088j21674l5680k2696
13421c57008k2198L40996l69498k5529p1912M07562l2097O5919m6427L4392N5099
13410b0701j65159J4586J74564k8079L1371K15110k44239k21049J7319K2386n619
$$ plain form
13487 -311025 -320491 -243123 -434186 -172206 -367948 -256243 -84138 -299362 -371620 -375206 -26904
13476 -26904 218018 333306 227395 155781 -74768 -41876 -99589 -70129 44752 -26192 -125304
13465 -125304 -329248 -15567 -50150 -21405 -28226 -85660 30200 34362 102789 381253 287702
13454 287702 -117553 -232188 -231189 -213712 -184778 -162876 -41893 17376 -221747 -105302 164779
13443 164779 261387 82056 -142709 -119693 -10153 -193995 -211616 -141271 -207098 -298682 -7520
13432 -7520 -39257 -166888 -167977 -215377 -276702 -351972 -405046 -176958 -298632 -334312 -357008
13421 -357008 -379206 -38210 -407708 -433237 -505149 -97587 -129684 -63765 -110192 -75800 -20701
13410 -20701 -185860 -171274 3290 -24789 6582 221692 -22547 -243596 -226277 -203891 -209510
13399b09510K5209J23486R0191k01089J01180n4387J69724J774k07752m078L7777
13388a27475K04876K0224j23142J44092m8113j72315k07331M2693J98013L0625
13378c7853j13238J21997k5939J2097l7120k33160J31939L6964K527j04702k02123
13367d48611l2634L74229K99936m3010R6577l2240j76814j61540P8050l4042J50248
13356G0149P139K41547l18156j65191J02485J0111j25799j67679j7238q8380P0722
13345c80290J75743K05870k9111q1499Q3637p397J8516j5020q0950L0103R6872
13334A6474j96195N8239N8807o0517K36241k39481j71074j63367K09295L37289
13324H5711j23407M8530j7145k13923R806j1046m5549K02829J97466k38955K4514
$$ plain form
13399 -209510 -184301 -60815 29376 -171713 -70533 -124920 44804 46578 -161174 -165252 -127475
13388 -127475 77401 97625 -25517 118575 70462 -101853 -309184 -266491 -68478 -37853
13378 -37853 -151091 -29094 -55033 -42936 -80056 -313216 -181277 -144313 -141786 -246488 -448611
13367 -448611 -481245 -107016 192920 149910 246487 214247 37433 -124107 -46057 -80099 70149
13356 70149 77288 318835 679 -164512 -62027 -51916 -177715 -345394 -362632 -451012 -380290
13345 -380290 -204547 1323 -27788 -109287 -25650 -33047 -14531 -29551 -110501 -80398 16474
13334 16474 -179721 -121482 -62675 -123192 113049 -126432 -297506 -460873 -251578 85711
13324 85711 -37696 10834 -6311 -220234 -210428 -221474 -267023 -64194 133272 -105683 -81169
13313h1169L1800N4713L3603j63889J22200p6017l8992j5679J10827J06542k39639
13302a55700J5325J0480P3762j33822Q9392N0174j28673K6440J08541n8673q6119
13291a88873m2907j07585q1630J0865M5687M11758l0979k10795k2578O2401J2581
13280a42055q4555J60275N6956l87530p5627M61019K36563l08327j3958N486K9349
13269f2404L30112p7244l50987k19942K99552L97711l70614l6038j24616k49534
13259d64004R0652J34287k17530j03565j6412N73032K5438l93240K77688o2416
13249a56070L7216J48864O2581l71563L7126L19964Q1658m24616j65415J52923
13239b77332J41806Q3105J3695l10900l3770k3043p2949J37574J32595L37794
$$ plain form
13313 -81169 -49369 5344 38947 -124942 -2742 -78759 -117751 -133430 -22603 83939 -155700
13302 -155700 -140375 -129895 -56133 -189955 -100563 -50389 -179062 -152622 -44081 -102754 -188873
13291 -188873 -231780 -339365 -420995 -410130 -364443 47315 16336 -194459 -217037 -154636 -142055
13280 -142055 -226610 -66335 -9379 -396909 -472536 -11517 225046 -83281 -97239 -91753 -62404
13269 -62404 267708 190464 -160523 -380465 -80913 316798 -53816 -89854 -214470 -464004
13259 -464004 -373352 -239065 -456595 -560160 -576572 -3540 21898 -371342 -93654 -156070
13249 -156070 -118854 30010 92591 -278972 -241846 78118 159776 -264840 -430255 -277332
13239 -277332 -135526 -52421 -38726 -349626 -383396 -406439 -479388 -341814 -209219 128575
13229A28575O1558m16881J56563o234j46946k43323K07026j71677K54683r2173
13219b68829n2058o2600l9579J27050j1K53924r1143J452M9002p324j52074j29229
13207c71419q1170J41591L32679J8568k23647k0308j79897o7386K44474N2401
13197a54114K96835P4049m36504K23419Q5744M8508J7k08276j08895J26876n4389
13186a06730N6887q0258j07606q90419K27249M59450K4175J08360P8353L09696
13176G9157R4312l1206k46299O3355R9361L4656k49579p0386j03549J53149J64575
13165a2454P1792Q9152j50424P3031J14556o5460p9836m00728p8269L15044K03200
13154G9604j28742l11453J07365K56481J64835N8608k0118n4550j28422J72025
$$ plain form
13229 128575 190133 -226748 -70185 -76419 -223365 -466688 -259662 -431339 -176656 -268829
13219 -268829 -320887 -383487 -423066 -296016 -296027 -42103 -133246 -131794 -82792 -90116 -242190 -371419
13207 -371419 -452589 -310998 21681 40249 -183398 -203706 -383603 -450989 -206515 -154114
13197 -154114 142721 216770 -219734 3685 89429 137937 137954 -70322 -179217 -52341 -106730
13186 -106730 -49843 -130101 -237707 -1128126 -900877 -441427 -417252 -308892 -230539 79157
13176 79157 173469 142263 -104036 -40681 58680 93336 -156243 -226629 -330178 -177029 -12454
13165 -12454 59338 148490 -1934 71097 185653 120193 40357 -360371 -438640 -123596 79604
13154 79604 -49138 -360591 -253226 3255 168090 226698 206580 152030 23608 195633
13144A95633k19052j88353J78047j12833K34077j54267j91721O8383J52008K86325
13134B48247m4389j59860n5518j29743J02835j33676J0241k43549J61871N03775
13124B60234o2595R732j59578j55104j07887N9697J98915K34227j78601l38494
13114b39454N4258Q8950K7629k11902Q0788R7996l83344J05870J75671j23898
13104c27436K6752N7497j94743j62242K23088k93723J21200J57082J56716j12084
13094c47893k00898L16305k716P745J48632K280k6461m8843P7461j38052K18151
13083E711J46961j07909L9928j30617j29078J18449K19206k0927m37138N0273
13073b45141J56941M0134J75083k74049p375J25346L4945j64878L82226r3675
$$ plain form
13144 195633 -23419 -211772 -33725 -146558 87519 -66748 -258469 -190086 -38078 248247
13134 248247 203858 43998 -11520 -141263 -38428 -172104 -161863 -405412 -243541 260234
13124 260234 197639 207371 47793 -107311 -215198 -155501 43414 277641 99040 -239454
13114 -239454 -185196 -96246 -68617 -280519 -199731 -101735 -485079 -379209 -203538 -327436
13104 -327436 -300684 -243187 -437930 -600172 -377084 -670807 -549607 -392525 -235809 -347893
13094 -347893 -548791 -232486 -235202 -227457 -78825 -76545 -103006 -151849 -74388 -212440 5711
13083 5711 152672 44763 84691 -45926 -175004 -56555 162651 141724 -295414 -245141
13073 -245141 -88200 -48066 127017 -147032 -154407 -29061 5884 -158994 223232 129557
13063A29557j81775J74910k28516m21534R4083Q9137K52248J40856J8915l22119
13053b54238J29107j34462J72632K31450k195K44589m64721k68900m5963M6736
13043c45965Q6838j07141M2174K84960L16646k61065j48814j80304L15576j64423
13033a61518r4364O3249J20070N6991J06956L23247q5821k40830R8445k4953k82469
13022a20997k64747L2760J33105J25791K5051j58074L0252L33973J3807k90590
13012a39669J6068K0086L09520k37136j62868m34431j82371L35531J48911p3291
13002c99650L4125j6235R1983K08302k56804m3718K21182J49104r8467J37493
12992B7315l4252q7587J65308r0316j08096m4180K2468r961J64477J460M1701
$$ plain form
13063 129557 -52218 122692 -105824 -527358 -433275 -344138 -91890 48966 67881 -254238
13053 -254238 -125131 -259593 -86961 144489 142294 386883 -77838 -346738 -392701 -345965
13043 -345965 -259127 -366268 -324094 -39134 277512 16447 -132367 -312671 2905 -161518
13033 -161518 -255882 -192633 -72563 -15572 91384 414631 328810 87980 186425 161472 -120997
13022 -120997 -385744 -352984 -219879 -94088 -69037 -227111 -196859 137114 150921 -139669
13012 -139669 -123601 -103515 206005 -31131 -193999 -628430 -810801 -475270 -326359 -399650
13002 -399650 -365525 -381760 -289777 -81475 -338279 -381997 -160815 -11711 -110178 27315
12992 27315 -6937 -94524 70784 -19532 -127628 -171808 -149340 -159301 5176 6636 48337
12981D8337l82040J01491J64549J04995k72995n5403L48000n3232k13680K21896
12971A1918n9144r2129j47260M9714L9186J36265k62501j7817J28718J6194L32588
12960A35732R2367j13720k8331j88940k15342j57103J28155N2205N5265Q1660
12950a58052L80911k44148J4628k8637k3904R5352K43308j65394k70370K42671
12940H6365J03188k99146k27401K05234J18812o240m7581J50949k07024M9487
12930g3357j42616m2828L39428K9431k59268J88995r1119j90801K49673m9595
12920d2057J48333L43199l10997K55798m916k33745l5458Q6706J22713K5842k16203
12909A39215O7224l20289q0074k7574J85383J62006j21051p8170L5969J81926
$$ plain form
12981 48337 -333703 -232212 -67663 37332 -235663 -291066 56934 3702 -209978 11918
12971 11918 -47226 -139355 -286615 -236901 -197715 -61450 -323951 -341768 -213050 -196856 135732
12960 135732 228099 114379 86048 -102892 -318234 -475337 -347182 -294977 -239712 -158052
12950 -158052 222859 -21289 -6661 -35298 -59202 36150 279458 114064 -156306 86365
12940 86365 189553 -109593 -336994 -131760 -12948 -19188 -66769 84180 -122844 -73357
12930 -73357 -215973 -258801 80627 110058 -149210 39785 -51334 -242135 7538 -42057
12920 -42057 106276 449475 138478 394276 389360 155615 120157 206863 329576 355418 139215
12909 139215 206439 -113850 -193924 -221498 -36115 125891 4840 -73330 -37361 144565
12899A44565j67725j38653J92181k21942j89077j01007K39961L27039k30817j74601
12889c20076L33466l371k66518K04870K46370k32139L6410O08804j87721l22379
12879I7716p2046K3324Q2623j92142L33732J00898k15647j85298J44546j53583
12869c5877Q5358j45661Q5211J23337o9982Q6995J96860l22411J41405L5399j6135
12858A64499j03919k36995K06570j04280J47648l12k28j88179K70479j26121p8197
12847d9035j29707k39610K29767P5510O691J5711J52400k3340K56071j77044l17148
12836a99734p1965j52303J39107Q2978J81689J101J27275j85588K28132j23623
12826B7069M1242J20018j68884l1910J41276n5099j52648L55124J7613j10442
$$ plain form
12899 144565 -23160 -161813 30368 -191574 -380651 -481658 -241697 85342 -145475 -320076
12889 -320076 13390 10019 -256499 -51629 194741 -37398 -988 607816 420095 97716
12879 97716 25670 48994 131617 -60525 273207 374105 158458 -26840 117706 -35877
12869 -35877 49481 -96180 -10969 112368 42386 129381 326241 3830 145235 180634 164499
12858 164499 60580 -176415 30155 -74125 73523 73211 72983 -115196 155283 29162 -49035
12847 -49035 -178742 -418352 -188585 -113075 -106384 -90673 61727 38387 294458 117414 -199734
12836 -199734 -271699 -424002 -284895 -201917 -20228 -19127 108148 -77440 150692 27069
12826 27069 68311 188329 19445 -12465 128811 73712 -78936 276188 293801 183359
12816A83359K43721k38650k23239k36284J90918J58617J02781L2391k20784J75358
12806A68188l7534j10374k62108O3723K1755K21563j18114j239L03166j8013j11691
12795A19322k43697p0682L96057J8404j11509j86719j07440K98557j71357K42461
12785A83397n385R8100j89743j02116k52785J63798P814J15368J39805K4381K21859
12774D04493l13540j35834J62882P3071j11031j2469L4908P8589J07189J93906
12764D82164k2058l43806n1815J64398j7890j67256J36586J09849l06617p5813
12754i2258o8262J79859K50662L0415J44578p8626k35928K6404J37763J99184
12744D93791l0974j74313O3002j3950q3273k80689L653q7559N6194M8228K43199
$$ plain form
12816 183359 427080 188430 -34809 -271093 -80175 78442 181223 213614 -7170 168188
12806 168188 130654 20280 -241828 -178105 -156350 65213 -52901 -54140 249026 231013 119322
12795 119322 -124375 -195057 201000 219404 107895 -78824 -186264 112293 -59064 183397
12785 183397 178012 276112 86369 -15747 -268532 -104734 -96920 18448 158253 182634 404493
12774 404493 90953 -44881 118001 191072 80041 67572 102480 181069 288258 482164
12764 482164 460106 116300 64485 228883 210993 43737 180323 290172 -16445 -92258
12754 -92258 -160520 19339 270001 300416 444994 366368 130440 156844 294607 493791
12744 493791 462817 288504 351506 337556 254283 -26406 -22753 -110312 -54118 -5890 237309
12733B37309K98002n3136j44737j1838L2715k896n1442Q8846r7636l59304p891
12722g2008Q9049J05703Q4657q5521m4667N3411J26888J66222l65968j37396p2511
12711a52141Q7823J62441K54640j78660P2331J10196k14951j43317J74335q0594
12701I2103M5564K02383j16817K66066J27632j85072K94653k42748m9940O5840
12691D99664k04392Q9218R8245M3424J03545k14836j28498J02387K26778J38067
12681G53602J02645P7396k93399K55299j33871j51983J38975K78629K05692k84255
12671I48730l8833k26950N4959O2062N7996K5701O281n5178L04284M7867l00732
12660H86187R8860M16983K34867j40836j46814k85387J73975L09706N5077k85154
$$ plain form
12733 237309 535311 482175 337438 325600 358315 355419 303977 392823 295187 -64117 -72008
12722 -72008 17041 122744 207401 121880 77213 130624 257512 423734 57766 -79630 -152141
12711 -152141 -64318 98123 352763 174103 246434 356630 141679 -1638 172697 92103
12701 92103 137667 340050 223233 489299 616931 431859 726512 483764 433824 499664
12691 499664 295272 384490 482735 526159 629704 414868 286370 388757 615535 753602
12681 753602 856247 933643 640244 895543 761672 609689 748664 1027293 1232985 948730
12671 948730 909897 682947 737906 799968 857964 883665 889946 834768 1139052 1186919 886187
12660 886187 985047 1402030 1636897 1496061 1349247 1063860 1237835 1547541 1602618 1317464
12650A317464l29710J52331K72330n5073m18867K29213K17422Q6242J74344j48435
12640A497261r5856p2938M7243J46919J25656M6251m0493j43369J01192K74533
12630A886399J00949L6639n2421J71831K63232k21412k15832J54801J56593j19242
12620B161537j08245m9227L94014L5891o5689M2015J96097m1145J28769r9414
12610B594603O4473J14323n9776J35136j99271l4563L74008J9185O7700j04142
12600B971676k94801m9593r2095j16827L51387J43573L3488j02490J46351J72426
12590C163095j82701K35761k13197l5301J51054J11446q0855J00984o3470J82661
12580C369477K14365k91418l7672o2288N8513j33839n7449n2895K40666k26555
$$ plain form
12650 1317464 987754 1140085 1412415 1357342 938475 1167688 1385110 1471352 1645696 1497261
12640 1497261 1401405 1328467 1375710 1522629 1648285 1694536 1654043 1510674 1611866 1886399
12630 1886399 1987348 2023987 1971566 2143397 2406629 2185217 1969385 2124186 2280779 2161537
12620 2161537 2053292 2004065 2398079 2433970 2368281 2410296 2606393 2565248 2694017 2594603
12610 2594603 2659076 2773399 2713623 2848759 2649488 2614925 2988933 3008118 3075818 2971676
12600 2971676 2676875 2627282 2535187 2418360 2769747 2913320 2946808 2844318 2990669 3163095
12590 3163095 2980394 3216155 3002958 2967657 3118711 3230157 3149302 3250286 3186816 3369477
12580 3369477 3583842 3292424 3254752 3192464 3250977 3117138 3059689 3006794 3247460 3020905
12570C020905J75550K76791r8690R7386n00848n0327J96804j06922j23568Q311
12560B895392j72262J23594j26060k43757L5545j22485K44345M3786q0201k69624
12550B328273n0596J37067J5440J77049j63667J03197q8085j16377k82635J11231
12540B170897J68126k29957j29139p6043k0894Q3934o3840l20478p5144J65136
12530A672598k67916J41601j16306K21364J79999o7400j0798k20051k83222J31019
12520A380888J66496l55201k6398J33418M5964l55588N0183l82449M00924O9625
12510A127862k24257L4273l9641o9193Q7310j08475m02549Q8340K20083j94501
12500E19252m0114K53921q7969j0596N866j81949J39031J50069k59156l82468
$$ plain form
12570 3020905 3196455 3473246 3374556 3471942 2971094 2920767 3117571 3010649 2887081 2895392
12560 2895392 2723130 2846724 2720664 2476907 2512452 2389967 2634312 2678098 2597897 2328273
12550 2328273 2277677 2414744 2430184 2607233 2443566 2546763 2458678 2342301 2059666 2170897
12540 2170897 2339023 2109066 1979927 1903884 1882990 1966924 1903084 1582606 1507462 1672598
12530 1672598 1404682 1546283 1429977 1651341 1831340 1763940 1753142 1533091 1249869 1380888
12520 1380888 1547384 1192183 1165785 1299203 1345167 989579 1039762 657313 1058237 1127862
12510 1127862 903605 937878 898237 829044 916354 807879 405330 493670 713753 519252
12500 519252 479138 733059 645090 634494 640360 458411 597442 747511 488355 105887
12490A05887K33258K14442l1525m0241o7195J90181L116k770P6965j06961j12438
12479D62719J1543j61967j14349K80384k83047k41382K88998K4187m6582J63187
12469C83691K11338l75899J0680n5829q3780J86833L96701j7468m0896m46295
12459A69076M9489K2976O96j90992K32010k24621l09781J69110K15452K08326
12449C41741k47199K01516J58639l80423J45180j76507k5135K07087j66325k0540
12439C8034j3614o659j07308N3685J67396O168j97989Q2952k43875N56082j16027
12428B18845P1012k05454J15284O9524J70045j73202l59385R0571K25787l2540
12418A90487k11799k80097J78186N1603r9132K04625M0015Q277Q2713L5097J54517
$$ plain form
12490 105887 339145 553587 522062 481821 414626 604807 607923 605153 682118 575157 462719
12479 462719 474262 312295 197946 478330 195283 -46099 242899 267086 220504 383691
12469 383691 595029 219130 229810 173981 90201 277034 673735 656267 615371 169076
12459 169076 218565 241541 242237 51245 283255 58634 -251147 -82037 133415 341741
12449 341741 94542 296058 454697 74274 219454 42947 17812 224899 58574 38034
12439 38034 24420 17761 -89547 -35862 131534 137702 -60287 22665 -221210 334872 218845
12428 218845 289857 84403 199687 269211 439256 266054 -93331 -2760 223027 190487
12418 190487 -21312 -301409 -123223 -71620 -170752 33873 73888 82165 164878 199975 354492
12407C54492K3934k07622J68249k19699K79096k39705j00242m0584k55513O8718
12397a68876L2009J42542L54958R054Q2827m08113l6423o0936l02125L63963N0113
12386E8993k35160P7790L68096j79885J19081l68892K60850l170p1831j50759
12376a24887j92644J81432L46255K0972k01167k4556j92205J62762K2539k1934
12366b3433l64689M02647l8897k7888r2861j38070K23438j22443j22546l2573
12356c37315O2262K46841n9392O7633j09805K28757j16729M6632Q7510J2115j86975
12345e8466p5723m6408l19910N424K55018J52837J12774k84887J54439J58276
12335E3374j1807r1556M73131o2999l84809o6715o4141K90975K1942o1369K55414
$$ plain form
12407 354492 378426 170804 339053 119354 398450 158745 58503 17919 -237594 -168876
12397 -168876 -136867 5675 360633 369687 452514 44401 7978 -52958 -355083 8880 58993
12386 58993 -176167 -98377 269719 89834 208915 -159977 100873 97703 25872 -124887
12376 -124887 -317531 -136099 210156 231128 29961 5405 -186800 -24038 -1499 -23433
12366 -23433 -388122 14525 -24372 -52260 -145121 -283191 -59753 -182196 -304742 -337315
12356 -337315 -275053 -28212 -87604 -19971 -129776 98981 -17748 28884 116394 128509 -58466
12345 -58466 -134189 -180597 -500507 -495083 -240065 -87228 25546 -259341 -104902 53374
12335 53374 41567 -49989 423142 360143 -24666 -91381 -155522 135453 157395 96026 351440
12324C51440l02314j38632J70842k20173J51171k08147K39940n1004J36629P4470
12314B04222q7209l96299j40982L73433N8319k32391L49372J52149p2694r7371
12304A10549o8593J854K60162o1022J65385j73522J22544l32243J52610J66585
12294C44309l62699n9023J56972J41660l28308J44051K43005j29208l14182j20176
12284b83599K48713K5224j7278r0284K30757l8940r1767J58749j28627Q4881M3732
12273A41561R3675j68975J01744j75270l298n792k21786J06107p9487Q5148m7748
12262a74121M1012K30200j32735k02733r4910K81562k59322J58166K78022k49437
12252a24296K91163j1629j64899L53827k43375l09105J00861J44723J1215j46298
$$ plain form
12324 351440 49126 -89506 81336 -138837 12334 -195813 44127 -6877 129752 204222
12314 204222 117013 -279286 -420268 -46835 11484 -220907 128465 280614 207920 110549
12304 110549 41956 43810 303972 242950 408335 234813 357357 25114 177724 344309
12294 344309 -18390 -77413 79559 221219 -107089 36962 279967 150759 -163423 -283599
12284 -283599 -34886 -9662 -26940 -117224 113533 74593 -17174 141575 12948 97829 141561
12273 141561 235236 66261 168005 -7265 -10563 -16355 -238141 -132034 -211521 -126373 -174121
12262 -174121 -133109 97091 -35644 -238377 -333287 -51725 -311047 -152881 125141 -124296
12252 -124296 166867 155238 -9661 344166 100791 -208314 -107453 37270 48485 -97813
12242i7813J96502k5512K60201P767l82545Q3540J18015j25986J62116J32288
12232C28573k00011n5000j02978L6057J41123l7078m8029k04142M0724J36242
12222C5481J14601l5919j07912M70833P3122l22577j6997j73246j50612K9118
12212h4108L30509N0691k33728R2455J52245j07353J65096J50434k74402K09919
12202D51758M2393k59063l29773J42429P4752M0576k6938k73406J08356O6468
12192C7552O2873N8370K0727r6143j30108K82582q9486l0112j16733J98863J98
12181A98583j7114K23792K5362l32412M8055j70395p8554K65740J47826j47647
12171A63236k5973r2997J53696K77181j49566j44967J81826J59642k73902l60363
$$ plain form
12242 -97813 98689 73177 333378 341145 -41400 42140 160155 34169 196285 328573
12232 328573 128562 73562 -29416 6641 147764 110686 62657 -141485 -100761 35481
12222 35481 150082 114163 6251 477084 550206 227629 210632 37386 -113226 -84108
12212 -84108 246401 297092 63364 155819 308064 200711 365807 516241 241839 451758
12202 451758 494151 235088 -94685 47744 122496 163072 136134 -137272 -28916 37552
12192 37552 100425 158795 179522 83379 -46729 235853 146367 116255 -478 198385 198583
12181 198583 181469 405261 430623 98211 146266 -24129 -102683 163057 310883 163236
12171 163236 137263 44266 197962 475143 325577 180610 362436 522078 248176 -112187
12161a12187K22713N5132j35525J57572J32722k32854k89137M1731M82101N7102
12151C79370m1287P2116k8602p0569j18151J36363j2802k85662R8788J84485l59980
12140d5931o7349J88533l5726N0054J76886q6435r147K1765P0150m33950q9777
12129b60927K17906M99813J938m42309N4677J48123j8416J83781k15840J12340
12119B81086j9304j27059j36926k55131P5214M03711j42076K04145L3745P9570
12109C96975o4757q3909r5771J5747N4834K963K8546o5850k33902K25866L4796
12098B15538j40415p5592k26286J08612j50775P0438M70437j04960j27653J56186
12088A95530n6967K46289n1754P4732k76107m47693J86335L35599p56M9100j89447
$$ plain form
12161 -112187 110526 165658 30133 187705 320427 87573 -201564 -159833 322268 379370
12151 379370 338083 410199 381597 311028 192877 329240 316438 30776 129564 314049 -45931
12140 -45931 -113280 75253 39527 89581 266467 180032 170885 192650 262800 -171150 -260927
12129 -260927 -43021 456792 458730 16421 71098 219221 200805 384586 168746 281086
12119 281086 261782 134723 -2203 -257334 -182120 221591 79515 283660 317405 396975
12109 396975 332218 248309 152538 168285 223119 226082 254628 188778 -45124 180742 215538
12098 215538 75123 -469 -226755 -118143 -268918 -198480 271957 166997 39344 195530
12088 195530 138563 384852 333098 407830 131723 -315970 -129635 205964 205208 254308 64861
12077F4861L00113L70363j32439j92749l15902J00757K20868o0008j59304J4835
12067B11395k26046O8277Q9165J79466k98933j51652K72950P445R6196Q6499O9932
12056D04694j42433k23916o1883L03597K71895j67729O7144K26959l40455J69543
12046E07416j23451p7916P1523J73718j77984j40697r731P1065j67675K06457
12036C32725J86987j44423m2344J83357J36476O1186l48352k36509K30505J72804
12026E32412l88026o5031J80883J17393R0499j76130K6708J36652Q023j11086
12016C52297J64386j07987k27338j60320K72241j65708J55944L95680j61387M1226
12006E59034O4617j99611O6628k10065l9628p0784M07848r9468j28955K4403L4918
$$ plain form
12077 64861 364974 735337 602898 410149 94247 195004 415872 355864 196560 211395
12067 211395 -14651 53626 142791 322257 23324 -128328 144622 152067 248263 334762 404694
12056 404694 262261 38345 -23538 280059 551954 384225 451369 678328 337873 507416
12046 507416 383965 306049 377572 551290 373306 232609 222878 293943 126268 332725
12036 332725 519712 375289 332945 516302 652778 713964 365612 129103 359608 532412
12026 532412 144386 79355 260238 377631 468130 292000 318708 455360 463383 352297
12016 352297 516683 408696 181358 21038 293279 127571 283515 679195 517808 559034
12006 559034 623651 424040 490668 280603 240975 170191 578039 478571 349616 374019 408937
11995D08937P8162P1018k7526Q806O5559k46863m8403J10333Q8616k75988n0636
11984A82015o1637J73103J55797O7220J60202J41596j83490K32643k00897k38166
11974D28386K51763J71783k24612k00249q3939J6971L58206l0591k35147k19548
11964B33023J52326J40380o0944M31650o0679K11024J06621k51371o87802J87921
11954D02149M13103k33556l8835J84844l7986k02927J81821N7081J37048p5953
11944G86789J85372n9440K177P5327j3733o347L85791k03416J01499j6247k60836
11933I76936L9592k5776J81548M4053J78314L225k9085r6180k2709Q6829n0283
11922A286464R424k3728m0564M12853j5503N0269j49752K77948J54718l81602
$$ plain form
11995 408937 487099 558117 530591 539397 604956 358093 309690 420023 508639 232651 182015
11984 182015 120378 293481 449278 516498 676700 818296 634806 867449 666552 428386
11974 428386 680149 851932 627320 427071 343132 360103 718309 687718 452571 233023
11964 233023 385349 525729 464785 896435 835756 1046780 1153401 902030 214228 402149
11954 402149 815252 581696 542861 727705 689719 486792 668613 725694 862742 786789
11944 786789 972161 912721 914898 990225 976492 970145 1355936 1152520 1254019 1237772 976936
11933 976936 1016528 990752 1172300 1216353 1394667 1397892 1368807 1272627 1249918 1336747 1286464
11922 1286464 1295888 1272160 1231596 1644449 1628946 1679215 1529463 1807411 1962129 1580527
11912A580527J87348Q7815k10093K0568K5927r8917K34728J67335J47237k17500
11902A924975n5863j02852J11657J46558M7355J13954J76600J60062O0820L7516
11892B620782k10927l8000j20082N9223R3199J66235k69322N9662M0334K9931
11882B431035Q4371j85544O7371J22610Q3308M2024J92891J96493J58243j88477
11872C004325j32066K91245L46534k64055p6133p1031j76279R0622L31117j53886
11862C190393k35696j3787K15576J16977j75317M4473J13365j65060q9052Q052
11852C009924L44513j24243m7291J08343N4894J57025N454J17985k02114j22611
11842C301879K99896O5020k00612j91099J92515J60069r1330K1374j157k67799
$$ plain form
11912 1580527 1767875 1855690 1645597 1666165 1692092 1593175 1827903 1995238 2142475 1924975
11902 1924975 1869112 1766260 1877917 2024475 2071830 2185784 2362384 2522446 2583266 2620782
11892 2620782 2409855 2371855 2251773 2310996 2404195 2570430 2301108 2360770 2401104 2431035
11882 2431035 2515406 2329862 2397233 2519843 2603151 2645175 2838066 3034559 3192802 3004325
11872 3004325 2872259 3163504 3510038 3245983 3169850 3098819 2922540 3013162 3344279 3190393
11862 3190393 2954697 2940910 3156486 3273463 3098146 3142619 3255984 3090924 3001872 3009924
11852 3009924 3354437 3230194 3182903 3291246 3346140 3503165 3508619 3626604 3424490 3301879
11842 3301879 3601775 3666795 3466183 3275084 3467599 3627668 3536338 3557712 3556555 3288756
11832C288756j4102n7731J36816N3986j1971n158m3432m9345P3063J71827l09991
11821C232718m4037k9641J73819p5876K57821J48738N0897l65521P1594j57626
11811C262886j13367K3347p8752J7022p0253l4449Q4794j54580k72777J21298
11801B785169R2331k7238j72676P2041p8336J12475L5215J04948k33507k00596
11791B489826J17114l8914k01005j5312j02598J34407J02315j48938j50551J19665
11781B306009n4859k72302K19231k39554m2502L54349r425j60373l26128O0192
11771A834638J74021p7090o7469p416k13259K25182j92257r9134q8422j52367
11761A336427J20908o471L4986k62417O7915l817L98658r1538l4286j88833m5280
$$ plain form
11832 3288756 3274654 3216923 3353739 3407725 3395754 3390596 3347164 3297819 3370882 3542709 3232718
11821 3232718 3188681 3159040 3332859 3256983 3514804 3663542 3714439 3348918 3420512 3262886
11811 3262886 3149519 3172866 3094114 3111136 3040883 3006434 3091228 2936648 2663871 2785169
11801 2785169 2877500 2850262 2677586 2749627 2671291 2783766 2818981 2923929 2690422 2489826
11791 2489826 2606940 2568026 2367021 2351709 2249111 2383518 2485833 2336895 2186344 2306009
11781 2306009 2251150 1978848 2198079 1958525 1916023 2270372 2260947 2100574 1774446 1834638
11771 1834638 2008659 1931569 1864100 1856684 1643425 1868607 1676350 1577216 1488794 1336427
11761 1336427 1457335 1450864 1485850 1223433 1291348 1287531 1686189 1594651 1560365 1371532 1326252
11750A326252k61490o0639j48678J20564J47019R7397N0302j98494J54459K75376
11740A502068m8159j13393o2962j36806k24777p1173J65161k87488Q2529J98805
11730A003805M3543L4309k38213l8538K84084m80412l6878p45L3825Q731j0737
11719F02774M09656k88749o7838N0449M5080K23793L7162l40351r3081L78294
11709I57189m32358l00775J79067L08935l49563j44027K37255K13204K77081l43703
11699F02305j85482K51694j93505J03870Q3552j29299m336K97960J79959l00140
11689G06578R0514O6793J0832j27765j45778j46046J64560K02238N622k38588
11679E88960L0820J63368k48505k3309Q1781q6448O3293K9062k5595j15747M0635
$$ plain form
11750 1326252 1064762 1004123 855445 976009 1123028 1220425 1270727 1072233 1226692 1502068
11740 1502068 1453909 1340516 1277554 1140748 915971 844798 1009959 722471 805000 1003805
11730 1003805 1047348 1081657 843444 804906 1088990 608578 571700 570955 604780 613511 602774
11719 602774 1012430 723681 655843 706292 751372 975165 1012327 671976 578895 957189
11709 957189 524831 224056 403123 712058 362495 218468 455723 668927 946008 602305
11699 602305 416823 668517 475012 578882 662434 533135 528799 826759 1006718 706578
11689 706578 797092 863885 874717 746952 601174 455128 619688 821926 827548 588960
11679 588960 619780 783148 534643 511334 593115 506667 569960 599022 573427 457680 498315
11668D98315m2362M390k04142K1153Q5263l0282J52676J67619O14980k82434j86447
11657G98729L9064k59069O2009K41905l4894L9314j19931m52989R6225K35669
11647F46032r4504K44652P8478p5261K70599k54277k89956L8313J35979J69218
11637H69273l51789J95033P8313l3261K11521k5106n8025j52191o7785l4741Q7025
11626G18267L4373J25287Q4200L9332j85871j47781L01062p280k71771j00066
11616E89752m7220L5344O4706j37313R994P1841K10245J03024j05606J66590j40348
11605H21009K1861j50056j65194N0020J93716Q4034j73843J40716j43271o5269
11595F13723L98630J34106j24910k5008J97157p2246k3157Q3419m6125j32360
$$ plain form
11668 498315 455953 460343 256201 277354 362617 332335 485011 652630 1267610 985176 798729
11657 798729 837793 578724 640733 882638 847744 887058 767127 314138 410363 646032
11647 646032 551528 796180 874658 799397 1069996 815719 525763 564076 700055 869273
11637 869273 517484 712517 790830 757569 969090 943984 885959 733768 665983 631242 718267
11626 718267 752640 877927 962127 1001459 815588 667807 968869 961589 689818 589752
11616 589752 542532 577876 642582 505269 515263 587104 797349 900373 794767 961357 821009
11605 821009 842870 692814 527620 577640 771356 855390 681547 822263 678992 613723
11595 613723 1012353 1146459 1021549 996541 1193698 1121452 1098295 1181714 1135589 1003229
11585A003229K3687Q193n6633j14364J05906K74142r4525j75001j12845j00202
11575G61587N05298k07519K46224L2375p1425J70975m40990L09845j777J94564
11565A499157m21739j2156N7870M1312K38556K5714J6662l9931j55229l9541k35834
11554I74841J89117l2602q1527R6441R6318L20140k55365J28831K83584n2931
11544A666847o9733l4063m1144J11687L7755J41832m45531k60296J1792j82435
11534I36711k7674O8590K82902L9985P1600L0695J94829k76215p6307P9380n4931
11523A269565J70028k6839l26466J53428L32918k72355j31030M6089J60122J04588
11513A480048N5580l24213j6904K5955m7516L78310l70772m51737K84408L69756
$$ plain form
11585 1003229 1026916 1035109 978476 864112 970018 1244160 1149635 974634 861789 761587
11575 761587 1266885 1059366 1305590 1337965 1266540 1437515 996525 1306370 1304593 1499157
11565 1499157 1077418 1065262 1123132 1164444 1403000 1428714 1445376 1405445 1250216 1210675 974841
11554 974841 1163958 1131356 1049829 1146270 1242588 1562728 1307363 1436194 1719778 1666847
11544 1666847 1597114 1563051 1521907 1633594 1671349 1813181 1367650 1107354 1119146 936711
11534 936711 909037 977627 1260529 1300514 1372114 1402809 1597638 1321423 1245116 1324496 1269565
11523 1269565 1439593 1412754 1086288 1239716 1572634 1300279 1169249 1215338 1375460 1480048
11513 1480048 1535628 1211415 1194511 1220466 1172950 1551260 1180488 728751 1013159 1382915
11503A382915k18906m34205L9574M57115p9925k76637l37372K43538J43643l38472
11493E81268L81967j7775m6757J26295J31317j04860k009k31331K91867k09854
11483I00128k1362R6883j18999L22609j09539o7562P6663K31873o7194q5608o935
11472A150957K4108R5696p1971R4548j95519j12175K48004L9449m82346R9873
11462H90624l838K44033Q7939j60160l0098l21824O4382j03164r7518M81087k29
11451A051234q3632j75443M7779P5635r1578M9444K53728o5837j71878k91484
11441E97968N77706R9673k42044J39731k99973l36279j415M30441J01880J43285
11431A210973j4410L3278J00208J8550k85708l5915K1224R5131K9353j75195J47340
$$ plain form
11503 1382915 1164009 729804 769378 1226493 1146568 869931 532559 776097 919740 581268
11493 581268 963235 945460 898703 1024998 1156315 1051455 1049446 818115 1109982 900128
11483 900128 878766 975649 856650 1179259 1069720 1002158 1078821 1310694 1243500 1157892 1150957
11472 1150957 1175065 1270761 1198790 1293338 1097819 985644 1233648 1273097 790751 890624
11462 890624 886786 1130819 1218758 1058598 1028500 706676 771058 667894 570376 1051463 1051234
11451 1051234 967602 792159 839938 915573 823995 873439 1127167 1061330 889452 597968
11441 597968 1175674 1275347 1033303 1173034 873061 536782 535367 965808 1067688 1210973
11431 1210973 1196563 1229841 1330049 1348599 1062891 1026976 1048200 1143331 1172684 997489 1144829
11420A144829P4665k08309j9167j8378J20855r7803M5151l2650L84452k42726
11410A150919r4774L00711R3351l18220k33469K02069M26929l60673L2561k73195
11400I26209K74548K52087k81254J3166o2330K24471K26288m77187n7166J4527
11390A053359j77549p7349L42133R4451j94456K01902J06700J32204j85212K81024
11380A577207l12887j74273L12375J65964J81141m1140k87527k00723M1817j0247
11370A251707j02257M1374J26305J45931j12622l21919M5579M18135J52120k76226
11360A368127K50966J26060o7395k36900j62009J15210j24539N3670j7823K10984
11350A516351j70509K08586K36350l43867j25275N645k15069P3600J5283k55994
$$ plain form
11420 1144829 1219494 1011185 992018 973640 1094495 996692 1041843 1009193 1393645 1150919
11410 1150919 1056145 1356856 1450207 1131987 898518 1100587 1527516 1166843 1199404 926209
11400 926209 1200757 1452844 1171590 1184756 1122426 1346897 1573185 1095998 1038832 1053359
11390 1053359 875810 798461 1140594 1235045 1040589 1242491 1349191 1481395 1296183 1577207
11380 1577207 1264320 1090047 1402422 1568386 1749527 1708387 1420860 1220137 1261954 1251707
11370 1251707 1149450 1190824 1317129 1463060 1350438 1028519 1074098 1492233 1644353 1368127
11360 1368127 1619093 1745153 1677758 1440858 1278849 1394059 1269520 1323190 1305367 1516351
11350 1516351 1345842 1554428 1790778 1446911 1321636 1327281 1112212 1185812 1201095 945101
11340I45101K10285K63461k326R4715k23910L27372p9415N1916j3514L22017p0492
11329A825210m06547N5869k65171N3392K43585j28617n1241K01370J20456j2388
11319A635918J2861K05315j20751K56476J94996m05939k98145J10738J13973J13469
11309A818911K05088j89299n19502m7755K25397L9177M8706K76878J08917l43790
11299A622728J57119J86044j13009R689k08677k7912J65435L95470l13237Q5380
11289A959030L1072k9768K44066P3695k1267k49917k0486p9536j55088k4698K30572
11278A957675k22989K23852L8805j39884J92265N1061p8283Q52M2334j47947J60093
11267B077834N1540q0943K68188L6268l1168K90796k16426J06425j10263m28395
$$ plain form
11340 945101 1155386 1418847 1416521 1511236 1287326 1614698 1535283 1587199 1573685 1895702 1825210
11329 1825210 1418663 1474532 1209361 1262753 1506338 1377721 1326480 1527850 1648306 1635918
11319 1635918 1648779 1854094 1733343 1989819 2184815 1778876 1480731 1591469 1705442 1818911
11309 1818911 2023999 1834700 1315198 1267443 1492840 1532017 1580723 1857601 1966518 1622728
11299 1622728 1779847 1965891 1852882 1862571 1653894 1625982 1791417 2186887 1873650 1959030
11289 1959030 1990102 1960334 2204400 2278095 2256828 2006911 1986425 1906889 1751801 1727103 1957675
11278 1957675 1734686 1958538 1997343 1857459 2049724 2100785 2022502 2023354 2065688 1917741 2077834
11267 2077834 2129374 2048431 2316619 2352887 2321719 2612515 2396089 2502514 2392251 1963856
11257A963856K74727L11801j8479n5219K58140k64389k77202j9669L36551K21707
11247B731824l06473N6547j82934k2916K05648P080r2865K76513k8760j38069
11237B505595J96177K7822L09097k51380l64083J82841L13057j46004J66790l85081
11227B554831N7162J42306L8060K0031R6050L64622j03608j95696k9583L8881
11217B983056K69284p4840j31598k55577J60648m1210L08810K69270l48929J61809
11207C300723K09138j52529l16282l1806j92597L04085M51340R5752l46225N7274
11197C378873j05874K22287j62423m3919j34076j08248K81387K20140k475K48737
11187C794409l4653l6533K02997j26341j356k13040L1932J5950n0112J06076L9138
$$ plain form
11257 1963856 2238583 2550384 2531905 2476686 2734826 2470437 2193235 2173566 2510117 2731824
11247 2731824 2425351 2481898 2298964 2276048 2481696 2488776 2395911 2672424 2643664 2505595
11237 2505595 2701772 2729594 3038691 2787311 2423228 2606069 2919126 2773122 2939912 2554831
11227 2554831 2611993 2754299 2792359 2812390 2908440 3273062 3169454 2973758 2944175 2983056
11217 2983056 3252340 3177500 3045902 2790325 2950973 2909763 3218573 3487843 3138914 3300723
11207 3300723 3509861 3357332 3041050 3009244 2816647 3120732 3572072 3667824 3321599 3378873
11197 3378873 3272999 3495286 3332863 3288944 3154868 3046620 3328007 3548147 3545672 3794409
11187 3794409 3759756 3723223 3926220 3799879 3798523 3585483 3617415 3633365 3583253 3689329 3728467
11176C728467R6771p9923L10445P9338k28858k71672K63279J60014q4304K8082
11166D001639j87982l1300J18433j69560K77166J38114M05559K21628l17330k10438
11156D245929j55844n3995M63746j996k82799l7132K09368p7463r9192M14780
11146D625402j18201M163L04757P259k14783R6458K20931J96980j12154K12040
11136E222852K8839J60971K1899m41083k40264O2047L04897M33802J31215o7067
11126E618108n1518Q1985p903J58724M1860m2083k38077k51864L73044K02920
11116E885196J14305N2625j34072j03556j4356J51313J23218J74252K14090j772
11106F461243O9018k1033Q1979r9514P0911L67972P1908l12849M1627k5944Q672
$$ plain form
11176 3728467 3825238 3745315 4055760 4135098 3906240 3634568 3897847 4057861 3973557 4001639
11166 4001639 3813657 3782357 3900790 3731230 4008396 4146510 4552069 4773697 4456367 4245929
11156 4245929 4090085 4036090 4499836 4497840 4215041 4177909 4387277 4309814 4210622 4625402
11146 4625402 4507201 4511364 4816121 4823380 4608597 4705055 4925986 5122966 5010812 5222852
11136 5222852 5251691 5412662 5434561 4993478 4753214 4815261 5120158 5553960 5685175 5618108
11126 5618108 5566590 5648575 5640672 5799396 5841256 5799173 5561096 5309232 5682276 5885196
11116 5885196 5999501 6052126 5918054 5814498 5800142 5951455 6074673 6248925 6463015 6461243
11106 6461243 6530261 6509228 6591207 6491693 6562604 6930576 7002484 6689635 6731262 6705318 6713990
11095F713990M55334J8036J79131L2451J86547k73679O0501K4488j1394K84576
11085G669981p0551R6585L29940J69458q0066n2334L57708L08900k09714j18420
11075H401487R2787J80791o8618k87511O24794o9874j54512M75294K29865k11651
11065I212852j72220J89338J6948K44778J61805l2727R9362Q5088J12939J80866
11055A0099029J04520j07874l3447k8730K99018K11466l5100J66210L67840K66742
11045A1309674k40611K65071K44965Q1501J77423j04025K09590n0029j42189K21008
11035A1972378J72787K33574j43776M29194L00998k49205K86816K32696J88017
11026A3423479N73444J3946k45927J10029K26567L29720K01980k731o5077M38369
$$ plain form
11095 6713990 7169324 7187360 7366491 7398942 7585489 7311810 7372311 7396799 7385405 7669981
11085 7669981 7599430 7696015 8025955 8195413 8115347 8063013 8420721 8729621 8519907 8401487
11075 8401487 8494274 8675065 8606447 8318936 8943730 8873856 8719344 9194638 9424503 9212852
11065 9212852 9040632 9229970 9246918 9491696 9653501 9620774 9720136 9805224 9918163 10099029
11055 10099029 10203549 10095675 10062228 10033498 10332516 10543982 10508882 10675092 11042932 11309674
11045 11309674 11069063 11334134 11579099 11660600 11838023 11733998 11943588 11893559 11751370 11972378
11035 11972378 12145165 12378739 12234963 12664157 12965155 12715950 13002766 13235462 13423479
11026 13423479 13996923 14010869 13764942 13874971 14101538 14431258 14633238 14630507 14565430 15003799
11016A5003799K13282J51575J16860K4867K73911L21288K81784K23610L84853
11007A6995829K27792o537J42348M72438O2770l2839J10751J18786M2896L83513
10997A8517747L60483o772L51609M04596K31435M4353R5273L45234K70455K50667
10987B0865080J16467M18218L71709K21387K18926J19128J67105L78080M62845
10978B3338945J14806L04655L09573M92288M67732L10030M68766L42224O0889
10969B6209908L88292O27959M12069J73789L53837L43298M48796M14229K96179
10960B9668356L33136J24738N06168O18912Q59242O81075N51695L00492L57373
10951C4001187P00166O65470P4504N77769Q21523P90289M23885L90827O56691
$$ plain form
11016 15003799 15217081 15368656 15485516 15510383 15784294 16105582 16387366 16610976 16995829
11007 16995829 17223621 17217084 17359432 17831870 17894640 17861801 17972552 18091338 18134234 18517747
10997 18517747 18878230 18871458 19223067 19627663 19859098 19903451 19998724 20343958 20614413 20865080
10987 20865080 20981547 21399765 21771474 21992861 22211787 22330915 22498020 22876100 23338945
10978 23338945 23453751 23758406 24067979 24560267 25027999 25338029 25806795 26149019 26209908
10969 26209908 26598200 27226159 27638228 27812017 28165854 28509152 28957948 29372177 29668356
10960 29668356 30001492 30126230 30632398 31251310 32110552 32791627 33343322 33643814 34001187
10951 34001187 34701353 35366823 35441327 36019096 36840619 37630908 38054793 38445620 39102311
10942C9102311O82472M46622P48944P58220Q33395N72076N56262R99792Q13750
10933D5513844P49512R90380R39688P15377P97551J071383J093648Q21075Q76062
10924E3568520O67711J397982J193590R32964J130999J098580J362548J381979
10916F2734873J194745J190719J235066J469849J552870J393139J451034J815342
10908G4037637J544455J302745J724441J957612J469286J950306J857149J728651
10900H7572282J786012K198834K321874J893309K096570K149063K487379K359199
10892A04864522K545187K633254K635037K755562K611855K722550L191994L265607
10884A27225568L263548L256079L393437L337789L330656M125903M111891L893125
$$ plain form
10942 39102311 39784783 40231405 40980349 41738569 42571964 43144040 43700302 44700094 45513844
10933 45513844 46263356 47253736 48193424 48908801 49706352 50777735 51871383 52692458 53568520
10924 53568520 54236231 55634213 56827803 57760767 58891766 59990346 61352894 62734873
10916 62734873 63929618 65120337 66355403 67825252 69378122 70771261 72222295 74037637
10908 74037637 75582092 76884837 78609278 80566890 82036176 83986482 85843631 87572282
10900 87572282 89358294 91557128 93879002 95772311 97868881 100017944 102505323 104864522
10892 104864522 107409709 110042963 112678000 115433562 118045417 120767967 123959961 127225568
10884 127225568 130489116 133745195 137138632 140476421 143807077 147932980 152044871 155937996
10876A55937996L946169M209900M182307M230286N038863M529496M793917N071761
10868A91940695M653301N503030N480578N374984N677153N708640N342858O175432
10860B35856671N807116N630906O323648N854388O317648O119595O087162N861979
10852B83859113N394957N436264N443286N207900M744019M569573M124291L712300
10844C22491703L668629L179857K092031J637940J557437O92301K94472l47340
10836C35267030q66490j502194k090856k121601l273375l648924m073649m236225
10828C13453716m632697n137461n295857n546861n785717n715043n846681o153308
10820B69340091o354676o022363o061869o056172n782686n660824o047787o242700
$$ plain form
10876 155937996 159884165 164094065 168276372 172506658 177545521 182075017 186868934 191940695
10868 191940695 196593996 202097026 207577604 212952588 218629741 224338381 229681239 235856671
10860 235856671 241663787 247294693 253618341 259472729 265790377 271909972 277997134 283859113
10852 283859113 289254070 294690334 300133620 305341520 310085539 314655112 318779403 322491703
10844 322491703 326160332 329340189 331432220 333070160 334627597 335319898 335614370 335267030
10836 335267030 334400540 332898346 330807490 328685889 325412514 321763590 317689941 313453716
10828 313453716 308821019 303683558 298387701 292840840 287055123 281340080 275493399 269340091
10820 269340091 262985415 256963052 250901183 244845011 239062325 233401501 227353714 221111014
10812B21111014n649758n825022n511313n597085n268440m932433n279951m988477
10804A78058535m515706m546885m554816m212385m074168m114068m094510l770701
10796A44175296l763874l752836l557176l358279l392205l439328l111109k911036
10788A16889453k963434k430785k810433k777949k529947k555611k420738k300676
10780I6099880k420433k264583j990367k042396j516321k147863k212649j758271
10772G9746997j562290j788208j459153j451600j711066j658585j706022j219277
10764F7190796j570256j533071j053660j450659j038310j195841j333335j033788
10756E6981876j039815j016768j205785j345059j143310j042210o94275j134617
$$ plain form
10812 221111014 215461256 209636234 204124921 198527836 193259396 188326963 183047012 178058535
10804 178058535 173542829 168995944 164441128 160228743 156154575 152040507 147945997 144175296
10796 144175296 140411422 136658586 133101410 129743131 126350926 122911598 119800489 116889453
10788 116889453 113926019 111495234 108684801 105906852 103376905 100821294 98400556 96099880
10780 96099880 93679447 91414864 89424497 87382101 85865780 83717917 81505268 79746997
10772 79746997 78184707 76396499 74937346 73485746 71774680 70116095 68410073 67190796
10764 67190796 65620540 64087469 63033809 61583150 60544840 59348999 58015664 56981876
10756 56981876 55942061 54925293 53719508 52374449 51231139 50188929 49494654 48360037
10748D8360037r10938r23871q05652p70558q04859o79980j008831n02449r21908
10739D1030991j074529m38310l53557j084107r12694m83400l50696o05593o15192
10730C5112913n51870p18333q50125n89477k63249k42547l87161m95500j085316
10721B9929335m15065r7183n84916m89837m82532l76719m81269k85759n39068
10712B6176987n59948j07131l87680o86192l46822n02461j33812k85082l74539
10703B2793320m09401k79720k29518l86825j77960k05956k66561k83168l64401
10694B0189810j93985p94129l19066l4794k52499k22491m69155j38467j51839
10685A7613385k71739j0414l92478m64069k62724l00812j87247N4848j82364n52123
$$ plain form
10748 48360037 47449099 46525228 45719576 44949018 44144159 43464179 42455348 41952899 41030991
10739 41030991 39956462 39518152 39164595 38080488 37167794 36684394 36333698 35728105 35112913
10730 35112913 34561043 33842710 32992585 32403108 32139859 31897312 31510151 31014651 29929335
10721 29929335 29514270 29417087 28832171 28342334 27859802 27483083 27001814 26716055 26176987
10712 26176987 25617039 25509908 25122228 24436036 24089214 23586753 23452941 23167859 22793320
10703 22793320 22383919 22104199 21874681 21487856 21309896 21103940 20837379 20554211 20189810
10694 20189810 19995825 19201696 18882630 18847836 18595337 18372846 17903691 17765224 17613385
10685 17613385 17341646 17331232 16938754 16474685 16211961 15911149 15723902 15778750 15596386 15044263
10675A5044263K0050j58189l06099j67230q2979l17451k58309r5606n7736j50989
10665A3469725j42737l64476k86746q8507J00548j94727p8316k77235n26534J57351
10655A1768346j45281k34997j82090m43348J22661q9252k76176r4210K59525j35376
10645A0549802k43943K20r9910k90624o362K01063K4580l97884l37081L2347j78808
10634I253400J80763j62615m9241m44974j34600Q970P6767k70671k12001k18944
10624H026854J06820J21304k79867j06689J51330m1622n40537k10045L18851J85439
10614G731838l6625l83055l80374R1275J52332j82706o625L01270n0046j23302
10604G113982l77258L24467j95360k48708j19598j4855q5741R9784o8181N5743
$$ plain form
10675 15044263 15064313 14906124 14600025 14432795 14349816 14032365 13774056 13678450 13620714 13469725
10665 13469725 13326988 12962512 12675766 12587259 12687807 12493080 12414764 12137529 11610995 11768346
10655 11768346 11623065 11388068 11205978 10762630 10885291 10796039 10519863 10425653 10685178 10549802
10645 10549802 10305859 10306079 10206169 9915545 9909183 10110246 10134826 9736942 9399861 9432208 9253400
10634 9253400 9434163 9271548 9222307 8777333 8642733 8651703 8728470 8457799 8245798 8026854
10624 8026854 8133674 8254978 7975111 7868422 8019752 7978130 7437593 7227548 7546399 7731838
10614 7731838 7695213 7312158 6931784 7023059 7175391 6992685 6986060 7287330 7237284 7113982
10604 7113982 6736724 7061191 6865831 6617123 6497525 6482670 6396929 6496713 6428532 6484275
10594F484275j85145p2035j85370k03296l54049j24512J98731k59707j25124K38728
10584E412496K14760l4352k8470k44554j9593k85705j70511J48995J30968j8966
10574E105068R3831j96771j97117L61332l63664k56799K0136O7167j40263l00582
10564D192338J01449K9322p7698q1691K87196q8073k67480j28205K06407j01482
10554D072083l08654k26805L0064L84390J04951N1992p1646l16053J92679j04592
10544C808409j00120J82271M2372O5022l99984k0179q9212j04844R8157q3810
10534C398082p8613M1419K86505k131j36215p4916j37251j80223K19464K4302
10524C360423r9201j12472K82595p232k50749J00250m0210K38963j87538j10994
$$ plain form
10594 6484275 6299130 6227095 6041725 5838429 5484380 5359868 5558599 5298892 5173768 5412496
10584 5412496 5627256 5592904 5564434 5319880 5300287 5014582 4844071 4993066 5124034 5105068
10574 5105068 5198899 5002128 4805011 5166343 4802679 4545880 4566016 4633183 4492920 4192338
10564 4192338 4293787 4323109 4245411 4163720 4450916 4362843 4095363 3967158 4173565 4072083
10554 4072083 3763429 3536624 3566688 3951078 4056029 4108021 4036375 3720322 3913001 3808409
10544 3808409 3708289 3890560 3932932 3997954 3597970 3577791 3488579 3383735 3481892 3398082
10534 3398082 3319469 3360888 3647393 3645262 3509047 3434131 3296880 3116657 3336121 3360423
10524 3360423 3261222 3148750 3431345 3424113 3173364 3273614 3233404 3472367 3284829 3173835
10514C173835j54942k95889k67870J20098K73650p11902J22772K51372K94482
10505B805606p4390m67609J38130R0984j75995K09840K39222j00143k8043j01462
10495B536140k00133J15872J24752q1626J63942N2783k99839j75058M24198J8421
10485B679452l78504J1131J25650p6434J60977q9839J27592k10313j25685K12552
10475B436579k71238P9934n1767r9587k79840l7268L1995R5366J09170M8499R0431
10464B152274L93500k96232j00476J09349l69839r06m8111K6996l1910l22824
10454A511821P7257L80823n4523K70337q8368K5588p5977Q5580p9025O8082r7015
10443B024580j49607J21901J19239j02598P1337L5348l38179P0672J32422m56337
$$ plain form
10514 3173835 3018893 2723004 2455134 2575232 2848882 2136980 2259752 2511124 2805606
10505 2805606 2731216 2263607 2401737 2492721 2316726 2526566 2765788 2665645 2637602 2536140
10495 2536140 2336007 2451879 2576631 2495005 2658947 2711730 2411891 2236833 2661031 2679452
10485 2679452 2300948 2312079 2437729 2361295 2522272 2432433 2560025 2349712 2224027 2436579
10475 2436579 2165341 2245275 2193508 2093921 1814081 1776813 1808808 1904174 2013344 2061843 2152274
10464 2152274 2545774 2249542 2149066 2258415 1888576 1887670 1839559 1866555 1834645 1511821
10454 1511821 1589078 1969901 1915378 2185715 2097347 2122935 2046958 2132538 2053513 2121595 2024580
10443 2024580 1874973 1996874 2116113 2013515 2084852 2120200 1782021 1852693 1985115 1528778
10433A528778o728L66972l2702m8814K92773r0049K19964k4387k82269M5429o1585
10422A907382J0754m39585J48480m1436K93702K1007j50986K38116P1300j86637
10412A872097k57208q7693K83350j02221j23907L5016j53452J14597k260r5827
10402A482492n5247J4913r3359J21370j76912K16747L5260J11399J69189k72634
10392A553218K29033N929M980n63778K47600L37998k76634q838K17623J849k16259
10381A532721j38218J8241k10298K50949K30917r0259j82092j71798K01568R1903
10371A533634K62664k21054r9278j42700L08212j71728J76929n1486j56476M58472
10361A897189p6180P1592l07586J96454L4397j98016q2866j10549J21840K3232
$$ plain form
10433 1528778 1522050 1889022 1856320 1807506 2100279 2010230 2230194 2205807 1923538 1968967 1907382
10422 1907382 1918136 1478551 1627031 1585595 1879297 1900304 1749318 1987434 2058734 1872097
10412 1872097 1614889 1527196 1810546 1708325 1584418 1619434 1465982 1580579 1578319 1482492
10402 1482492 1427245 1442158 1348799 1470169 1293257 1510004 1545264 1656663 1825852 1553218
10392 1553218 1782251 1788180 1793160 1229382 1476982 1814980 1538346 1529508 1747131 1748980 1532721
10381 1532721 1394503 1412744 1202446 1453395 1684312 1594053 1411961 1240163 1441731 1533634
10371 1533634 1796298 1575244 1475966 1333266 1641478 1469750 1646679 1595193 1438717 1897189
10361 1897189 1821009 1892601 1585015 1781469 1815866 1617850 1534984 1424435 1546275 1569507
10351A569507p3107J07617j02335m6570j27542k09703L28797j6880k02265J83332
10341A410851J45720p7035j6318K48316r989j82343q4785K60514m6638k23841
10331A424452k53953j11137J94764J25165k2657m6711l3927p5815j45800K18890
10321A273271J65934k82037L62538j73341R0170k3394j74418K9662J60766l60380
10311A068771j11661J47805Q680N3750L87219l50769l51939K90824O5011Q229
10301A215920K73682J82265j68695R788k24442j943j43925k4099n9647k08375
10291H50529K60350k05494K9181O99006K20895j46325k12563l5591Q9882r9421
10281A450449m99667j81501K61245J23247l15512l163J35079L3798M17051j82525
$$ plain form
10351 1569507 1496400 1604017 1501682 1455112 1327570 1117867 1446664 1429784 1227519 1410851
10341 1410851 1556571 1479536 1463218 1711534 1701545 1519202 1434417 1694931 1648293 1424452
10331 1424452 1170499 1059362 1254126 1379291 1356634 1309923 1275996 1200181 1054381 1273271
10321 1273271 1439205 1157168 1519706 1346365 1436535 1413141 1238723 1268385 1429151 1068771
10311 1068771 957110 1104915 1113595 1167345 1554564 1203795 851856 1142680 1207691 1215920
10301 1215920 1489602 1671867 1503172 1512960 1288518 1286575 1142650 1118551 1058904 850529
10291 850529 1110879 905385 934566 1633572 1854467 1708142 1495579 1459988 1549870 1450449
10281 1450449 950782 769281 1030526 1153773 838261 835098 970177 1003975 1421026 1238501
10271A238501k96412j11163J82422o1099N9368J1124j03879N0621k3681j70659
10261G75143q1031K95271L88761k98522j86530J43831l58795J7006K68678J41316
10251A105128j41516J2085k91874K91539N5379j86494j4401k82757l09281N91431
10241H29239j47825j2357m4968j54772N0267l9527L10156L3417L0854j60786l41606
10230C52092K93295N799K47943r500k76916p4340j90935K49347j2750J9042n613
10219E97464l4016J02019R9839P716j81350O981J92881j73103j12064J72402j34686
10208E44083J39310J81115p3933o4175l84963r1956N10885j9456k21640k57210
10198B62060Q1307O5976p8246J80367l59941j68822L450M40668K14924k7633R0012
$$ plain form
10271 1238501 942089 830926 1013348 952249 1011617 1022741 918862 969483 945802 775143
10261 775143 694112 989383 1378144 1079622 893092 1036923 678128 695134 963812 1105128
10251 1105128 963612 975697 683823 975362 1030741 844247 829846 547089 237808 829239
10241 829239 681414 669057 624089 469317 519584 480057 790213 823630 854484 693698 352092
10230 352092 645387 651186 899129 889629 612713 538373 347438 596785 584035 603077 597464
10219 597464 563448 665467 765306 773022 591672 598653 791534 618431 506367 678769 544083
10208 544083 683393 864508 790575 726400 341437 249481 760366 740910 519270 262060
10198 262060 343367 409343 331097 511464 151523 -17299 -13849 426819 641743 614110 704122
10187G04122j70082j82166j5125r0488l5630R0489J13304j27574k35084L8694
10177I0460K82245l71804K59302m8039l5033O5214j66051Q8411J16416J71796
10167D52917N6759J57073j00752n350j60352J44758j43103k42416L14439J57309
10157F31282k47095j47852j77419K40238K6024l55730j35604p0068L26377l80372
10147b90219K374L34213K51697J2808k18319J6924k89684L39762m1283l56017
10137b37744J90824K10167P8560k42771l295J75854N2398k02358l07209L61293
10127G5719K29092m4861o8392j7910J71498n5803k03621l39863l7315K72201M15035
10116C95780j31747o2472J44441J01201p1292p7001K90244l44667l19514J54630
$$ plain form
10187 704122 534040 351874 336749 246261 210631 301120 414424 286850 51766 90460
10177 90460 372705 901 260203 212164 177131 242345 76294 164705 281121 452917
10167 452917 509676 666749 565997 560647 400295 545053 401950 159534 473973 631282
10157 631282 384187 236335 58916 299154 325178 -30552 -166156 -236224 90153 -290219
10147 -290219 -287845 46368 298065 310873 92554 109478 -180206 159556 118273 -237744
10137 -237744 -46920 163247 241807 -964 -4259 171595 223993 21635 -285574 75719
10127 75719 304811 259950 191558 173648 345146 289343 85722 -254141 -291456 -19255 395780
10116 395780 264033 201561 346002 447203 375911 298910 589154 244487 -75027 79603
10106G9603M3200l8135N0815l1999k31465J88964J20784K12761j45963j81270
10096F7295L9824q4135j35156J15684R2849J48422J05524j43471m35713K570K07296
10085a9011j38696M04512P2775j34283k10223n2762L95627j45976l99565J06817
10075a20785N3580j41563J78172J2754J38389J23824k30926M7023J04567j17504
10065D7531N1399k10723k23889L38K93991j92970j10735K29771J63795r9626j72151
10054b23269K43027L3450j0895k1929R5393j5723k29065r3368R0682R8728j26309
10043a59278P1163o9854l0460J21591J2654K15611k63072L0349J9980n9209j5313
10032a25838R0173J29597R9727j52873j04079k48651K45921q3832L0607P1284
$$ plain form
10106 79603 122803 84668 135483 103484 -127981 60983 181767 394528 248565 67295
10096 67295 107119 22984 -112172 3512 96361 244783 350307 206836 -228877 -226307 -19011
10085 -19011 -157707 246805 319580 185297 -24926 -77688 317939 171963 -227602 -120785
10075 -120785 -67205 -208768 -30596 -17842 120547 244371 13445 60468 165035 47531
10065 47531 98930 -111793 -335682 -335344 -41353 -234323 -345058 -115287 48508 -51118 -223269
10054 -223269 19758 53208 42313 20384 115777 100054 -129011 -222379 -131697 -32969 -159278
10043 -159278 -88115 -157969 -188429 -66838 -54184 161427 -101645 -71296 -51316 -110525 -125838
10032 -125838 -35665 93932 193659 40786 -63293 -311944 -66023 -149855 -119248 -47964
10022d7964J16001j95648J12050R2011j52482j9388J67319j31821p2830J09656
10012b3096L9707L5333j6865m1058J99202K49859l08104r3949N6429m4285j76915
10001a23742J31655l20872l33533M78808M43578o5050j72919l14480J35601M10214
9991B69260J69574K0340j56882j40283k3383j70411p078K15264k21796J50052
9981A04657l303o24371m7903L22385r5456L81233R2317k18812j03501M7715o531
9970a51570j27556l1226k99720J08959K61039l066Q0407J45573J3900j03315J30073
9959B3498J51686k67330J01686k19570r1156N7229M27619R6584o0016k35339j02764
9948a17873J48246n5891Q2752M2761l748p1412Q0985j55706J12246J22574l43205
$$ plain form
10022 -47964 68037 -127611 -15561 76450 -76032 -95420 71899 -59922 -132752 -23096
10012 -23096 16611 51944 35079 -5979 193223 443082 134978 41029 97458 53173 -123742
10001 -123742 7913 -312959 -646492 -167684 275894 210844 37925 -276555 -140954 269260
9991 269260 438834 459174 302292 162009 138626 -31785 -38863 176401 -45395 104657
9981 104657 101354 -523017 -570920 -248535 -343991 37242 129559 -89253 -192754 -145039 -151570
9970 -151570 -279126 -310352 -610072 -501113 -240074 -243140 -162733 -17160 -3260 -106575 23498
9959 23498 175184 -92146 9540 -210030 -301186 -243957 183662 280246 220230 -15109 -117873
9948 -117873 30373 -25518 57234 99995 96247 24835 105820 -49886 62360 184934 -158271
9937a58271k30222n0705N46639l6078m26226O778J6862Q9868L71848P4525j71885
9926C3133j00518J30335l11885K4955J03301l1444K30362K5465m39904R411L59896
9915C3107j35421P3390j25655o4205j02313J77147j41538k83048J64081K53086
9905a51369L31458P6419J18062o9251m6641l73869k1062P4590J1148K36137k01154
9894a5532l20257K95781j63669m1507M7588j7943K25242j87885P6133q675Q507
9883a02217j54783J05999J13492J82851j07773q7903j58585N3568J26087k14816
9873b44080K28541J86421n9573k79045j12499M8600J11997k32796k0696K75527
9863i7603L4302K12019M3985k88068o377j54507J90648M8265J35950k95308j60704
$$ plain form
9937 -158271 -388493 -439198 107441 71363 -354863 -348085 -331223 -241355 130493 205018 33133
9926 33133 -67385 62950 -248935 -223980 -120679 -152123 78239 103704 -336200 -326789 33107
9915 33107 -102314 -28924 -154579 -218784 -321097 -143950 -285488 -568536 -404455 -151369
9905 -151369 180089 256508 374570 305319 258678 -115191 -136253 -61663 -50515 185622 -15532
9894 -15532 -335789 -40008 -203677 -245184 -197596 -215539 9703 -178182 -102049 -110724 -102217
9883 -102217 -257000 -151001 -37509 145342 37569 -50334 -208919 -155351 -29264 -244080
9873 -244080 -15539 170882 111309 -167736 -280235 -231635 -119638 -352434 -373130 -97603
9863 -97603 -63301 148718 192703 -95365 -101742 -256249 -65601 -17336 118614 -176694 -337398
9852c37398L52517J32727K58113k42846m96274L9429K49088K6126N1346K1213
9842E4041J94183r4166j41903L2365o0361j41267j43259n7692l586J69234M11487
9831B19076k33107J50932j69748o6302J63636k95820J87646j5222k53171J34468
9821a77612J04168K8019k46971J25069J09244j03638k9701J20734j24238J29133
9811f5793j47320m5165K9980K84020j61841l02633M6462R8160M1677L1946M8682
9800a41825M3605q02k42909K33235K58147k5917k41774Q6188k61268K78221k138
9789a7237m7451k23500P9685L73159n9935m06117k13738M1228K7564J06471r2024
9778d31895K55500p2378K14445m0838j1723j75621r8992J47341k6239N2331L8295
$$ plain form
9852 -337398 15119 147846 405959 163113 -333161 -293732 -44644 -18518 32828 54041
9842 54041 248224 154058 12155 44520 -15841 -157108 -300367 -358059 -361645 -192411 219076
9831 219076 -14031 136901 -32847 -99149 64487 -231333 -43687 -58909 -312080 -177612
9821 -177612 -73444 -45425 -292396 -167327 -58083 -161721 -191422 -70688 -194926 -65793
9811 -65793 -213113 -258278 -228298 55722 -106119 -408752 -362290 -264130 -222453 -190507 -141825
9800 -141825 -98220 -99022 -341931 -108696 149451 123534 -118240 -32052 -293320 -15099 -17237
9789 -17237 -64688 -288188 -208503 164656 104721 -301396 -515134 -473906 -446342 -339871 -431895
9778 -431895 -176395 -248773 -34328 -75166 -86889 -262510 -361502 -214161 -240400 -188069 -149774
9767a49774p1316K93959j06351j55233J59063l18415K178j75634J69881J24232
9757b27410k86457J41012m584J29544J5813p6653J5021J08562P665J59981j17410
9746a34916k16552J34861K57972P6635q3649p3514k49068L17757N6334k51092
9736a65232k32972L4514k6893o4932N8421J55221J38376k81802k20860K67215
9726c38944K05727L0810j43090J07558j92082J60640m391O2162J41382l27595
9716b97823j9073q5899J18955J73518j39722K68601j61515j21904J90307J51965
9706G7410j05348k31998J18593J64795l11180O2334J13757m59393j42527m7916
9696g61473L50032K75503K16023j44275k62774k76011J02149M17464k3537J71802
$$ plain form
9767 -149774 -221090 72869 -33482 -188715 -29652 -348067 -345889 -521523 -351642 -227410
9757 -227410 -513867 -372855 -377439 -247895 -232082 -308735 -293714 -185152 -177487 -17506 -134916
9746 -134916 -351468 -216607 41365 118000 34351 -39163 -288231 29526 85860 -165232
9736 -165232 -398204 -363690 -390583 -455515 -397094 -241873 -103497 -385299 -606159 -338944
9726 -338944 -133217 -102407 -245497 -137939 -330021 -169381 -173772 -111610 29772 -297823
9716 -297823 -316896 -402795 -283840 -110322 -250044 18557 -142958 -264862 -74555 77410
9706 77410 -27938 -259936 -141343 23452 -287728 -225394 -111637 -571030 -713557 -761473
9696 -761473 -411441 -135938 80085 -64190 -326964 -602975 -500826 -83362 -106899 64903
9686F4903k26287k06583L2549k14972O9581K96880r8228k63887J88955K91016
9676f6073j06155M2141k72377J5983O9004k6720J66160K30477j38308M7278O3908
9665B5318K03814l72923k59130J89512J11446l52775J49318M63088n2666j50855
9655d5853q8092J60100j44735j86975n5819L00697J25113P7026j59681j10898
9645a29117m00712J86479O8689m2837j97378J20353j07979L67335O5036k38306
9635c08437K92367K10402q4632l65407k54366K63316R5866J25623J20556k71557
9625a76269K16847M90427k41101O4446j48859k74537J96174j85138j3649J95930
9615A24271J97610p1528m33642m3582Q7306J03012J81843L99336j7321O8982l37839
$$ plain form
9686 64903 -161384 -367967 -335418 -550390 -480809 -183929 -282157 -546044 -357089 -66073
9676 -66073 -172228 -130087 -402464 -386481 -317477 -344197 -178037 52440 -85868 -38590 25318
9665 25318 229132 -143791 -402921 -213409 -101963 -454738 -305420 157668 105002 -45853
9655 -45853 -133945 26155 -118580 -305555 -361374 -60677 64436 141462 -18219 -129117
9645 -129117 -529829 -343350 -274661 -317498 -514876 -394523 -502502 -135167 -70131 -308437
9635 -308437 -16070 194332 109700 -255707 -510073 -246757 -150891 -25268 95288 -176269
9625 -176269 40578 531005 289904 354350 205491 -69046 127128 -58010 -71659 124271
9615 124271 321881 250353 -183289 -226871 -139565 -36553 145290 544626 527305 596287 258448
9604B58448n19083K56517P1140L10427J68316j29835K4673k90230j7030K04859
9594C38202J07739N8732j04952J36593n0780j20798j64362L53642K1387O5251
9584F40654O150N8896J99334K7922P8564J46758j38887L02950m3792J55146K93151
9573A726846J75028p0347K00526N43475p0799N7581M5709j52882k87611l43914
9563A823612K47683J25073P7572m4020k57267K50671L84130j61671o2682J6120
9553B399221J74244K46258l50826K9454K91775p6430k06379L4589q717J7955k47329
9542B303815j06612j38784J44795j25800l20556P0904j61532J65877M70957J08064
9532B411128K30378R9270K1745K96627J11882P5101j5526j40472K3764k78410
$$ plain form
9604 258448 -260635 -4118 67022 377449 545765 415930 440603 150373 133343 338202
9594 338202 445941 504673 399721 536314 485534 364736 200374 554016 575403 640654
9584 640654 646804 705700 905034 932956 1011520 1158278 1019391 1322341 1278549 1433695 1726846
9573 1726846 1901874 1831527 2032053 2575528 2504729 2562310 2608019 2455137 2167526 1823612
9563 1823612 2071295 2196368 2273940 2229920 1972653 2223324 2607454 2445783 2383101 2399221
9553 2399221 2573465 2819723 2468897 2498351 2790126 2713696 2507317 2541906 2533189 2551144 2303815
9542 2303815 2197203 2058419 2203214 2077414 1756858 1827762 1666230 1832107 2303064 2411128
9532 2411128 2641506 2740776 2762521 3059148 3171030 3246131 3230605 3090133 3113897 2835487
9522B835487n26395k35831m2420J56164J0185l2528Q7535m4549K2889r790K35625
9511B456372j154J36802m24964K9558O7470q609r8165q4537j79639n16924q3196
9500A293014j41491k64784j51904K56317k97562N9025L4356k42076L59082R043
9490I13020k56348j60621k24939K7936k6179J3280K82456n3803j18408o1635j16620
9479B18139O9445Q8577j11510J54446k5328k12901N2014l8135n05938K7434L19497
9468C5740k57979L88155l05038J72025R9247j25383m3902J04456J78317j07239
9458A38399k34906j52701J54608m8907k21225k16707K96650R2210K6712n6804
9448b22671q5810P7534j48238L97435l3262j05837K35978k42247j32379j20008
$$ plain form
9522 2835487 2309092 2073261 2030841 2187005 2197190 2164662 2252197 2207648 2230537 2220747 2456372
9511 2456372 2455218 2592020 2167056 2196614 2264084 2255475 2157310 2072773 1893134 1376210 1293014
9500 1293014 1151523 886739 734835 991152 693590 752615 786971 544895 903977 913020
9490 913020 656672 496051 271112 299048 272869 286149 568605 514802 396394 334759 218139
9479 218139 287584 376161 264651 419097 393769 180868 232882 194747 -311191 -283757 35740
9468 35740 -222239 165916 -139122 32903 132150 6767 -37135 67321 245638 138399
9458 138399 -96507 -249208 -94600 -143507 -364732 -581439 -284789 -192579 -165867 -222671
9448 -222671 -308481 -230947 -379185 18250 -15012 -120849 115129 -127118 -259497 -379505
9438c79505O8967J27R7474k64267K72490J21169m2156J49747K3849J41871k31152
9427d1386R9489j21806J25852j1763j86554j66160J01600j21083J63159J6514
9417a42138j58401j1467K18827n3609m8550J80912r7190L03236k24592M7079J70086
9406A84193l079n474p2099N205P7949K7090j59223j98656J44986l5243q3742L14912
9394A96819J62983r7749k36874j01174Q0384j47640l79108J73022K34194l31321
9384d46464K91120k825q5417q4695Q8062j0872o9019K14407j3014n9740j00602
9373b79059q2066r5579L88146J19583L21450j03596q7273k58292k65248K99491
9363d2443n7138J60283l9976j99114j25178l5132L79667O3434m72499k19442M54315
$$ plain form
9438 -379505 -310538 -310411 -212937 -477204 -204714 -83545 -125701 24046 47895 189766 -41386
9427 -41386 58103 -63703 62149 50386 -136168 -302328 -200728 -321811 -158652 -142138
9417 -142138 -300539 -312006 -93179 -146788 -195338 -14426 -111616 191620 -32972 14107 184193
9406 184193 181114 175640 103541 108746 186695 213785 54562 -144094 892 -34351 -118093 196819
9394 196819 359802 262053 25179 -75995 4389 -143251 -522359 -349337 -115143 -446464
9384 -446464 -155344 -158169 -243586 -328281 -240219 -251091 -320110 -105703 -118717 -178457 -279059
9373 -279059 -361125 -456704 -68558 51025 372475 268879 181606 -76686 -341934 -42443
9363 -42443 -99581 60702 20726 -178388 -303566 -338698 40969 104403 -368096 -587538 -133223
9352a33223r0878P1980K08755p024j51722M37892k2180l37188J07402n124J03284
9341A81974r4966k10198m7121P1209j35852J16315r1550o5600j45032P4399K18119
9330a28303L12268r1354j62160R6326m40349J24524K87217l75410n0902N0498
9320c77645J37403K4177p672j98925J19032l53178K14150j56709M84747J69247
9310E4627j62911K31009k75686j55097J11267o8077j53186Q5889K36830j02517
9300a97852K59814o2065N3631J49038n39805n3248K09771j53420R5216L12145
9290G3225k31102J12087J19465k9059k46378K7685l01613J28322K36616o087L00435
9279A83596p5384j40199K5807k6113m7256O8269J2637k13769L483L8515j35753
$$ plain form
9352 -133223 -224101 -152121 56634 49610 -102112 335780 313600 -23588 83814 78690 181974
9341 181974 87008 -123190 -170311 -99102 -234954 -118639 -210189 -275789 -420821 -346422 -128303
9330 -128303 183965 92611 -69549 26777 -413572 -289048 -1831 -377241 -428143 -377645
9320 -377645 -240242 -216065 -223737 -422662 -303630 -656808 -442658 -599367 -114620 54627
9310 54627 -108284 122725 -152961 -308058 -196791 -264868 -418054 -332165 -95335 -197852
9300 -197852 61962 -103 53528 202566 -337239 -390487 -180716 -334136 -238920 73225
9290 73225 -157877 -45790 73675 44616 -201762 -174077 -475690 -347368 -110752 -116839 183596
9279 183596 108212 -31987 -6180 -32293 -79549 -11280 1357 -212412 -208929 -170414 -306167
9268c06167j68240K21290L019J9241j2917L1383J16459K84581K36382n701o74125
9257b54795k7342K56179O5839j07581l45713L50843K94118l38538J01481j83564
9247a89073l4853J02102J05975R0523m69302j01479L85541J74995j0758l13762
9237b60091K93245J35885j95474m9482k40697M7392N05066k23066k00413o4234
9227b51869K10380l050j46830J07461j70495J57520j09224R697O7222J18562m07000
9216d17626M4793K42851j16475j0779P5271q9925l6816K06767J88141j5905j68255
9205i7958q9734J89498J91647j25466J14367N2102k62369M4371J98869l6213l37437
9194a58323R3086J77131j22683J09923j36421o4136J81496q4089j2132R4815K48506
$$ plain form
9268 -306167 -474407 -253117 -250098 -230857 -243774 -212391 -95932 188649 425031 419330 -254795
9257 -254795 -282137 -25958 39881 -67700 -413413 -62570 231548 -106990 -5509 -189073
9247 -189073 -223926 -121824 -15849 74674 -394628 -496107 -110566 64429 53671 -260091
9237 -260091 33154 169039 -26435 -75917 -316614 -269222 235844 12778 -187635 -251869
9227 -251869 -41489 -44539 -191369 -83908 -254403 -96883 -206107 -196410 -129188 -10626 -417626
9216 -417626 -372833 -129982 -246457 -257236 -181965 -271890 -308706 -101939 86202 70297 -97958
9205 -97958 -187692 1806 193453 67987 182354 234456 -27913 16458 215327 179114 -158323
9194 -158323 -65237 111894 -10789 99134 -37287 -101423 80073 -4016 -16148 78667 327173
9183C27173j54950J40431L03117K47926l27490P6810q1644l35425R1640K06269
9173D93857J98309k52501J5677K37642j38997J61761K43005j85365j91930K9344
9163F10802l21653J10612K59500k78470M00383K11345k64060K5306J42389J11591
9153A007745Q9378N2667o5815j24614L07260L2767k79885j98707K06536J33675
9143A161007l8925j66709K34340K03412K0127r5690k12814R00N7790j11467J80282
9132A232253n9120r7406O1353J72525q6140Q960M6567K18209J47530k59296j33852
9121A251583l04573K72470p0551J56091m2367j62493J49844l26112j27790L23722
9111A119824L3820j68887K4317j06195k2927r3097K85293L0411k86786q092J60738
$$ plain form
9183 327173 172223 312654 615771 863697 536207 613017 531373 195948 287588 493857
9173 493857 692166 439665 455342 692984 553987 715748 958753 773388 581458 610802
9163 610802 289149 399761 659261 380791 781174 992519 728459 753765 896154 1007745
9153 1007745 1097123 1149790 1083975 959361 1266621 1299388 1019503 820796 1027332 1161007
9143 1161007 1122082 955373 1189713 1393125 1413252 1317562 1104748 1105648 1163438 1051971 1232253
9132 1232253 1173133 1075727 1137080 1309605 1223465 1232425 1278992 1497201 1644731 1385435 1251583
9121 1251583 947010 1219480 1148929 1305020 1262653 1100160 1250004 923892 796102 1119824
9111 1119824 1153644 984757 1009074 902879 879952 786855 1072148 1102559 815773 807681 968419
9100I68419k39902j5009O0187j22146k00414J05404L56436l65877K4791J20541
9090F92430k09584j55Q1777j00146J08135m02984m4228Q9337K75669j92776j94872
9079A02603J074k2045j54788J06344K34682J42812J64785M9703m9434k99026L4895
9068C11605o1178j06510j30146j35560K26830k04072N2225O7729J9420q2282k4865
9057f6804q0006o3082j29224K23837L16869M2723J43554j41453J26305q6215K6423
9046C12927l5219m22162K3108R0525R4956l6435J32328k11502k62725O253J77923
9035a30023l9610r198M36117k45920J37559r4603O7418j61852k16302J35417K23119
9024A02122j07104N3243l6725L618J46321O2265j84853j82869o1662L49709P8185
$$ plain form
9100 968419 728517 713508 773695 651549 451135 556539 912975 547098 571889 692430
9090 692430 482846 482691 564468 464322 572457 169473 125245 214582 490251 297475 102603
9079 102603 103677 81632 -73156 33188 267870 410682 575467 625170 575736 276710 311605
9068 311605 250427 143917 13771 -121789 105041 -99031 -46806 20923 40343 -41939 -66804
9057 -66804 -146810 -209892 -339116 -115279 201590 244313 387867 246414 372719 286504 312927
9046 312927 277708 -144454 -121346 -30821 64135 27700 160028 -51474 -314199 -307946 -130023
9035 -130023 -169633 -178831 257286 11366 148925 54322 121740 -40112 -256414 -120997 102122
9024 102122 -4982 48261 11536 15154 161475 223740 38887 -143982 -205644 144065 222250
9013B22250j59015l29012L8049k49634J62691L17753K1449J0924j25306K46984
9003A57133K06036o2003k30980k32460K86994k0660l80920r1163J4701L76849
8993B3527M23706l54001m89972k19908L98475k7041L51J21730j93219M54646j52164
8982a3870k94804n6785K82465j02155j54868l5541J77229J48657J5352k55620
8972b89940L41330J27387j76702P1745k89754j30034L6885L01138K1052j41200
8962a28093M9354j46512P5502K53658j23628q2862K7606K70431J64073j32827
8952B26702j63846k54130O7845J62437J08538J97435k57824j8105P3517l42330
8942a99761K90597O4940l55226o4968K5828K08608p9438M0287J18917L210L66330
$$ plain form
9013 222250 63235 -265777 -227728 -477362 -314671 3082 24531 35455 -89851 157133
9003 157133 363169 301166 70186 -162274 124720 104060 -276860 -368023 -353322 23527
8993 23527 447233 93232 -396740 -616648 -218173 -245214 -244863 -123133 -316352 138294 -13870
8982 -13870 -308674 -365459 -82994 -185149 -340017 -375558 -198329 -49672 -34320 -289940
8972 -289940 51390 178777 2075 73820 -215934 -345968 -309083 -7945 13107 -128093
8962 -128093 -78739 -225251 -149749 103909 -19719 -102581 -74975 195456 359529 226702
8952 226702 62856 -191274 -123429 39008 147546 344981 87157 69052 142569 -199761
8942 -199761 90836 155776 -199450 -264418 -238590 -29982 -109420 -69133 49784 52994 419324
8931D19324p4591l76826Q3918r7478P8092j29707p3125K80779l567J58622m9985
8920B15456L96455J72586n6442l95940l47735P8260l4473L27602K06796K39408
8910H01973l81423k25258J6790k38173K03306K85175L4205J963K07139m4868R0672
8899G51501j27409K16910J204J01523r347j51636l03336j02331m3525K76703o418
8888F03839k0855o0459j56864J73451K29928j41446q2442M91544J18525j92659
8878I62562j2160J14304m5887N3191j21739k11804M5569l2234J0481L8327L13917
8867A114527M4357k0485j31071n2355K54139m3805J57538J57528N8529Q6406N1566
8856A676874r178K13377J99605M27550O8789m55844j47250k1429l12204L05526
$$ plain form
8931 419324 344733 -32093 51825 -45653 32439 -97268 -170393 110386 106819 265441 215456
8920 215456 611911 784497 728055 332115 -15620 62640 28167 355769 562565 801973
8910 801973 420550 195292 212082 -26091 177215 462390 496595 498558 705697 660829 751501
8899 751501 624092 841002 842206 943729 934382 782746 479410 377079 333554 610257 603839
8888 603839 582984 522525 365661 539112 769040 627594 545152 1036696 1155221 962562
8878 962562 950402 1064706 1018819 1072010 950271 738467 784036 751802 762283 800610 1114527
8867 1114527 1158884 1138399 1007328 954973 1209112 1165307 1322845 1480373 1538902 1625308 1676874
8856 1676874 1667696 1881073 2080678 2508228 2577017 2121173 1973923 1952494 1640290 1945816
8846A945816L8824j2816k52099l7798K79825J30523j64775j80265J89886K34177
8836B171298j22897n0157J97998K18177Q8352L2499J94941n57300j20397o0424
8826A992090J17505L48673k57614k25391j70299j50415n8165J21999M27669L55668
8816B501720k14850J9464K07219L89668J22255J89816j56935J30685j86079k06803
8806B796160k96467J41046K38667l3924k46001j43027K63215R302K20858J11024
8796C060853K66K22768K60265M36513J7313M6217J43834k92711r3569J83508J95502
8785D180759J68025K35595L27439M82547R3060M64062K07799M41103Q9152q7598
8775F601943q7606N05915M24256L05523K93938j43269J58261J62756K09277r4043
$$ plain form
8846 1945816 1984640 1971824 1719725 1681927 1961752 2092275 1927500 1747235 1937121 2171298
8836 2171298 2048401 1998244 2196242 2414419 2502771 2535270 2730211 2172911 2052514 1992090
8826 1992090 2109595 2458268 2200654 1975263 1804964 1654549 1596384 1718383 2146052 2501720
8816 2501720 2286870 2306334 2513553 2903221 3025476 3215292 3058357 3189042 3002963 2796160
8806 2796160 2499693 2640739 2879406 2845482 2599481 2456454 2719669 2728971 2949829 3060853
8796 3060853 3061119 3283887 3544152 3980665 3997978 4044195 4188029 3895318 3801749 3985257 4180759
8785 4180759 4348784 4584379 4911818 5394365 5487425 5951487 6159286 6600389 6689541 6601943
8775 6601943 6514337 7020252 7444508 7750031 8043969 7900700 8058961 8221717 8430994 8336951
8765H336951m53205l36240r2570J18715l74082k11551l88926j62502L2783m18530
8755F050843r304l96163o40000o12465p647o4530N8390P0194k21046k200k05382
8744D020690J91595J55245N64717M95215P9707K34026N7361J55331L63730M75728
8734F793345o0621J81818k5042J61174K68383K42499P4697N82281M32499l67802
8724H283231k03604o15621j54595k08231k4325j69258n13934j03595k72010l50967
8714E667091l49902m85689n04846k50058j9222n36618m12397m10325j73803J14528
8704B638759j00120p4644K48044j59242n60063r6264K49383k38337o73853J46937
8694A380600J30824r3069J04831L1155j64080l5395l54396r5188J49353l54823
$$ plain form
8765 8336951 7883746 7547506 7454936 7573651 7199569 6988018 6599092 6436590 6469373 6050843
8755 6050843 6041539 5645376 5005376 4392911 4385264 4320734 4379124 4449318 4228272 4226072 4020690
8744 4020690 4212285 4367530 4932247 5427462 5507169 5741195 5798556 5953887 6317617 6793345
8734 6793345 6732724 6914542 6889500 7050674 7319057 7561556 7636253 8218534 8651033 8283231
8724 8283231 8079627 7464006 7309411 7101180 7076855 6907597 6393663 6290068 6018058 5667091
8714 5667091 5317189 4831500 4326654 4076596 4057374 3520756 3108359 2698034 2524231 2638759
8704 2638759 2538639 2463995 2712039 2552797 1992734 1896470 2145853 1907516 1233663 1380600
8694 1380600 1511424 1418355 1523186 1554341 1390261 1354866 1000470 905282 1054635 699812
8684F99812j10824j72576J90878j81207K33838J02000k24142J14949J60342j57376
8674F55694l24121J21361k31503R4925J03450J53549l8467k70496N7591J83073
8664E05056j12460k02192J98688l9956R3803l09654o8544K24314K0315R3150O0170
8653D62690j40300m41034j25573L63574J28588J0071j08005K70791k79117L2398
8643A74083J05982K0566M542j01720m8949J19942n0085j19440N12368k77084l43053
8632b848J16699M04452j96426J98435m16370K00100k52962J61733P8481n4683
8622B36611n3663l17200J23159J78537M7552J72754N1950j81502q6727o2521J04729
8611B13679j1689J445j19554L07390R8902L0719k79239l20932L84358K0522j17314
$$ plain form
8684 699812 588988 416412 607290 426083 659921 761921 537779 652728 813070 655694
8674 655694 331573 452934 221431 316356 419806 573355 534888 264392 321983 505056
8664 505056 392596 190404 389092 349136 442939 133285 64741 289055 309370 402520 462690
8653 462690 322390 -118644 -244217 119357 247945 258016 150011 420802 141685 174083
8643 174083 280065 300631 305173 203453 154504 274446 224361 104921 617289 340205 -2848
8632 -2848 113851 518303 321877 520312 103942 304042 51080 212813 291294 236611
8622 236611 182948 -134252 -11093 167444 214996 387750 439700 258198 171471 108950 213679
8611 213679 201990 203435 83881 391271 490173 520892 241653 -79279 305079 325601 208287
8600B08287K87K12427l3687j79826J11168L2462j22238j18586N0261M0076L54014
8589E54645R4341J2424J97573m25818k07216J50334K17591Q197k09372K61929
8579F54628K0180K24394K72508L9876M0955o2849L03747L52040K20860k10132
8569A856207k55215L20842p5715J52179l99300J95702L16143Q8014j63673l9168
8559A996016j15646J1418J76202M28293l88991j18661J12061o8948k29538k01186
8549A601020J46948K6621J47363L9502k2595K1186J77377L13488l3745J68141
8539B585306K14859J30898R6013J74059L65946K94779L11286j88211N17639K665
8529D505239K40606J45303R3471K41863K38273j11136j00154j77911j22874j74438
$$ plain form
8600 208287 208574 421001 387314 207488 318656 351118 228880 110294 160555 200631 554645
8589 554645 648986 661410 858983 433165 225949 376283 593874 602071 392699 654628
8579 654628 674808 899202 1171710 1211586 1252541 1189692 1493439 1845479 2066339 1856207
8569 1856207 1600992 1921834 1846119 1998298 1598998 1794700 2110843 2198857 2035184 1996016
8559 1996016 1880370 1891788 2067990 2496283 2107292 1988631 2100692 2031744 1802206 1601020
8549 1601020 1747968 1774589 1921952 1961454 1938859 1960045 2137422 2450910 2417165 2585306
8539 2585306 2800165 2931063 3027076 3201135 3567081 3861860 4173146 3984935 4502574 4505239
8529 4505239 4745845 4891148 4984619 5226482 5464755 5353619 5253465 5075554 4952680 4778242
8519D778242O4946l6931j81220K33362J2340o24553p9712r501k39882O2449j60570
8508C818970Q7083j94011j82471k40070K93078R3904k59200M62349M80050K01664
8498D561346O6041J60561K96498L30034K96511j63762L9515K45085k78883O0771
8488E613717Q6280j52047m0763K00552L2713o5146k94850K30160j98839l75611
8478E036166o1647l47855m52798k202l35437L57122l06157j98308O2265l77262
8468C373887k43444k56741J24843j05544j12868k3030K0402j15741K40689k2180
8458B880273k3417L20365J23952K26770j32713j11872L75317O3206p6556n06611
8448C138714r7337L94344p1008l08763N7753R042K75829j15652m1865l23092j73956
$$ plain form
8519 4778242 4843188 4806257 4625037 4858399 4870739 4246186 4166474 4156973 3917091 3979540 3818970
8508 3818970 3906053 3712042 3529571 3289501 3582579 3676483 3417283 3879632 4359682 4561346
8498 4561346 4627387 4787948 5084446 5414480 5710991 5547229 5586744 5831829 5552946 5613717
8488 5613717 5699997 5547950 5507187 5707739 5740452 5675306 5380456 5610616 5411777 5036166
8478 5036166 4974519 4626664 4173866 4171664 3836227 4193349 3887192 3688884 3751149 3373887
8468 3373887 3130443 2873702 2998545 2893001 2780133 2757103 2777505 2661764 2902453 2880273
8458 2880273 2856856 3177221 3301173 3527943 3395230 3283358 3658675 3721881 3645325 3138714
8448 3138714 3041377 3435721 3364713 3055950 3113703 3122745 3398574 3282922 3241057 2917965 2744009
8437B744009j90178j84798j54710p4416l12518k68833l12252k00535J61998K48740
8427A456507n7896j89997J30161J05884m3285j71645l25391l2204J85799r6729
8417I61204l68856J24115J43588K0031m5859K22499J72314N8946l63033n9081
8407H65868J39448j77823K06209j05510k14573j9447o5944m9645L66122k5737
8397I18968m1292k35879j81830J48487k40857k586k07700R8671k00560L9913N307
8386A00642J22138J52825k06508j52631k78165K49518j8574K64689l17913J08834
8376B4855L23541p6884l17551j57566J49549K54269Q5697k38712l57007p6505
8366c86314Q2340P0414M181N23355J0113N2799j7527j74205J52784l67408m32458
$$ plain form
8437 2744009 2553831 2369033 2214323 2139907 1827389 1558556 1246304 1045769 1207767 1456507
8427 1456507 1398611 1208614 1338775 1444659 1401374 1229729 904338 872134 1057933 961204
8417 961204 592348 716463 860051 880082 834223 1056722 1229036 1287982 924949 865868
8407 865868 1005316 827493 1033702 928192 713619 694172 628228 578583 944705 918968
8397 918968 877676 641797 459967 608454 367597 365011 157311 255982 55422 95335 100642
8386 100642 222780 375605 169097 16466 -261699 -12181 -30755 233934 -83979 24855
8376 24855 348396 271512 -46039 -203605 -54056 200213 285910 47198 -309809 -386314
8366 -386314 -303974 -233560 -229379 293976 304089 356888 339361 165156 317940 -49468 -481926
8355d81926R2222K59880j88919J22968o5673j49179o1632Q0383P1754J52752J14673
8344e2697k09549Q0513K48196k32334j25671l38872m25801M37104L72942K48639
8334B470n43r0329J00879J64436j54442k09609l42557K17647k1063n5252J57024
8323b31339L73395L6067k23103J0844J94176l86712j31677n7425r923M75820J8864
8312F8987L4970j58159k20044r0384R4585J03740P5003l3434J09584m84381j64201
8301f63734L66318J21382j44075M1397l84812M0737K56724J0283K01052M9599
8291a05129j75636L8038Q8979m77456l6472J30214l7605J30874j30096J11133
8281d63156J9893P8052r4553N3831L8638J79114J81290k92837Q7595o4964j09380
$$ plain form
8355 -481926 -389704 -129824 -318743 -195775 -261448 -410627 -472259 -391876 -320122 -167370 -52697
8344 -52697 -262246 -181733 66463 -165871 -291542 -630414 -1056215 -619111 -246169 2470
8334 2470 1927 -88402 12477 176913 22471 -187138 -529695 -312048 -333111 -388363 -231339
8323 -231339 142056 178123 -44980 -34136 160040 -226672 -358349 -415774 -425697 50123 68987
8312 68987 103957 -54202 -274246 -364630 -270045 -166305 -91302 -124736 -15152 -499533 -663734
8301 -663734 -297416 -176034 -320109 -278712 -663524 -622787 -366063 -355780 -154728 -105129
8291 -105129 -280765 -242727 -153748 -631204 -667676 -537462 -575067 -444193 -574289 -463156
8281 -463156 -443263 -365211 -459764 -405933 -367295 -188181 -6891 -299728 -212133 -277097 -386477
8270c86477P6722q7952J6180M26314K15068l10424k38056l19077o8019L29029
8260c46692j94843L1153K96193j1642j78063q5492L6901k54504K24451L16290
8250a66248J51672P9552k13248J07462K4179K8686P7881j94484R7194l01959j35104
8239d44417J70901n9469j08623o4779K30248j9534k02700J96307j04509K36064
8229a70511J34718j81554K16856k76823j21698j35903K07000j32926J45002L2224
8219b83615l493J88946j95040J52725J14718N055k82181N1688J67531l33430K72
8208d16824J6213j83241J67869L27821l03732q2408K04982L59677j70822k51518
8198c31983k08422P8441j1409k29061L36688J21227J144951l54477m60272K5790
$$ plain form
8270 -386477 -309755 -397707 -381527 44787 259855 -50569 -288625 -607702 -675721 -346692
8260 -346692 -541535 -510382 -214189 -225831 -403894 -489386 -452485 -706989 -482538 -166248
8250 -166248 -14576 64976 -148272 -40810 -16631 12055 89936 -104548 -7354 -309313 -444417
8239 -444417 -273516 -332985 -441608 -506387 -276139 -295673 -498373 -302066 -406575 -170511
8229 -170511 -35793 -217347 -491 -277314 -399012 -534915 -327915 -460841 -315839 -283615
8219 -283615 -287108 -98162 -293202 -140477 -25759 -20704 -302885 -251197 -83666 -417096 -416824
8208 -416824 -400611 -583852 -415983 -88162 -391894 -474302 -269320 90357 -80465 -331983
8198 -331983 -540405 -461964 -473373 -702434 -365746 -244519 900432 545955 85683 111473
8188A11473k07504j88619J98204P4918r1517O1220m4863K97607m40502k85825
8178e15408K74599N5608j97697j73029L33052J66647k21897J17576K21264O4382
8168A25097j65749o7005k5747k12682j24018J27271K9785l8873j61811J79827
8158c33905Q175K1966M5465K8589M57104l4736n90560q1833J86882J29498j82428
8147c45783p1537J46176J06984J42372L69533j81242m10349j59109j06292K72278
8137b36969J6018J0888j12951K08921J00540k78471R1291L5286j60591j6039Q8063
8126b54014m9669J35631J3660m7934J69225J12335j64083k27550k25609P474p3621
8115f04155M54405L73317l45906j98667k70443n3789K17321n9708J24334L18529
$$ plain form
8188 111473 -96031 -284650 -86446 -11528 -103045 -41825 -86688 210919 -229583 -515408
8178 -515408 -240809 -185201 -382898 -555927 -222875 -56228 -278125 -160549 60715 125097
8168 125097 -40652 -107657 -133404 -346086 -470104 -342833 -313048 -351921 -513732 -333905
8158 -333905 -325730 -303764 -258299 -229710 227394 192658 -397902 -479735 -292853 -163355 -345783
8147 -345783 -417320 -271144 -164160 -21788 347745 166503 -243846 -402955 -509247 -236969
8137 -236969 -220951 -210063 -323014 -114093 -13553 -292024 -200733 -165447 -326038 -342077 -254014
8126 -254014 -303683 -168052 -154392 -202326 -33101 79234 -84849 -312399 -538008 -530534 -604155
8115 -604155 -149750 223567 -122339 -321006 -591449 -645238 -427917 -487625 -363291 -44762
8105d4762O1584l04677j28100K32308m5790k93674K61502K65509L838j56443k44881
8094c93586L67339p719k75569R2023r7446l1430J20195Q4534K88218l05945j78661
8083c38047O6556J35604l10471j05843J27802L74942J62434n36705j6186M5353
8073c94561R0668Q6336K449J53805Q2297k17777k18723K26419L4878J11627j78357
8062b20939k55696l397L92688j00988j90232Q0404P0358o1756P8059m5096J06940
8051a49655m8431k3321m0649k81650L14532j14077N2459j55841K14052L31418
8041I8837k99833j98697j32662J19388J34995N8381o8698J94678j83173l5849
8031c12633J50800q2602M4827J17235Q0933k49605j54287j07256K6521j90125
$$ plain form
8105 -44762 16822 -287855 -415955 -183647 -229437 -523111 -261609 3900 7738 -148705 -393586
8094 -393586 -26247 -33966 -309535 -217512 -314958 -346388 -226193 -141659 146559 -159386 -338047
8083 -338047 -271491 -135887 -446358 -552201 -424399 -49457 112977 -423728 -439914 -394561
8073 -394561 -303893 -217557 -215108 -61303 20994 -196783 -415506 -189087 -154209 -42582 -220939
8062 -220939 -476635 -480032 -87344 -188332 -378564 -298160 -227802 -289558 -211499 -256595 -149655
8051 -149655 -198086 -221407 -262056 -543706 -229174 -343251 -290792 -446633 -232581 98837
8041 98837 -200996 -399693 -532355 -412967 -277972 -219591 -288289 -93611 -276784 -312633
8031 -312633 -161833 -244435 -199608 -82373 -1440 -251045 -405332 -512588 -486067 -676192
8021f76192K5360L50329L78920l46699p0738R1929o7776l31318J33692r1764J52997
8010d51260J6384q8459L50853k2803l60071J66746K97559K53343k03282n6267
8000i7257k36051j44558J20898o0262j83858l8221J03042L16185K22618K2376
7990B4912k97374k49073M5685k4082K75244o05775N0682L74172K29561k9332o1985
7979b67365J28250n7609o682J36497j43506J08288R6452l27797m6974j84777K8136
7968e37087J83027l53054m6534L68412J10946m6688J33955j02892p6516q8728
7958d55159R8684j63917r0967J47496q0382p8030K19442r6590J55225k3674M4260
7947c23612j4740J35468j32854P8754n7441k47386J78395Q2035K47334j7321k15384
$$ plain form
8021 -676192 -650832 -300503 78417 -268282 -339020 -247091 -314867 -646185 -512493 -604257 -451260
8010 -451260 -434876 -523335 -172482 -195285 -555356 -388610 -91051 162292 -40990 -97257
8000 -97257 -333308 -477866 -356968 -417230 -601088 -639309 -536267 -220082 2536 24912
7990 24912 -272462 -521535 -475850 -499932 -224688 -830463 -779781 -405609 -176048 -205380 -267365
7979 -267365 -139115 -196724 -203406 -66909 -210415 -102127 -5675 -333472 -380446 -565223 -537087
7968 -537087 -354060 -707114 -753648 -385236 -274290 -320978 -187023 -289915 -366431 -455159
7958 -455159 -356475 -520392 -611359 -463863 -544245 -622275 -402833 -499423 -344198 -367872 -323612
7947 -323612 -338352 -202884 -335738 -256984 -314425 -561811 -383416 -301381 -54047 -71368 -286752
7936b86752j65857q725L5312K01629j44987L69773M1155k35703K98528m20215
7926c15842j17848K62655k4739O3483j87290k43566r9464K75817j61001q7632
7916f35427P0950L05258o5003k10622K48699j70178j28663N9780K44536Q4844
7906a95826K77827j37237l76511k46642R143K03509O8435m2656Q8317j13031k71775
7895g36447K73224K78979Q7616o5615k65650J86274K23231k52763J11155J72565
7885A2569k44524k72387k4362J77718K09637J06551j65989N2401k09671j91748
7875e49805l6151K83094L66338k96199O0356q1624N0532q2379O8565K27521m34494
7864d24246J25555L2394J91828J36413l86231n0411l12566L09238k43414N3286
$$ plain form
7936 -286752 -452609 -461334 -426022 -224393 -369380 393 41548 -194155 104373 -315842
7926 -315842 -433690 -171035 -195774 -132291 -319581 -563147 -662611 -386794 -547795 -635427
7916 -635427 -564477 -259219 -324222 -534844 -286145 -456323 -584986 -525206 -280670 -195826
7906 -195826 82001 -55236 -431747 -678389 -669246 -465737 -397302 -439958 -351641 -464672 -736447
7895 -736447 -463223 -184244 -96628 -162243 -427893 -241619 -18388 -271151 -159996 12569
7885 12569 -231955 -504342 -528704 -350986 -141349 -34798 -200787 -148386 -358057 -549805
7875 -549805 -585956 -302862 63476 -232723 -172367 -253991 -203459 -285838 -217273 10248 -424246
7864 -424246 -298691 -266297 -74469 61944 -324287 -374698 -687264 -378026 -621440 -568154
7854e68154K37476k36681m5059J06854J79771K77420k18781J53551K5517K2557
7844f5529K3938k58138O3247J7616j60301j75448J35747J77189j24281j32605
7834d98565r503k39730J55871J08346N1792K47439j48075l3484J42064K1230r2451
7823b95066O2953P1956l15103P894K1207J65024k4762l7354l7516j52834K62264
$$ plain form
7854 -568154 -330678 -567359 -612418 -505564 -325793 -48373 -267154 -113603 -88086 -65529
7844 -65529 -41591 -299729 -236482 -218866 -379167 -554615 -418868 -241679 -365960 -498565
7834 -498565 -508068 -747798 -591927 -483581 -431789 -184350 -332425 -365909 -223845 -202615 -295066
7823 -295066 -232113 -160157 -475260 -467366 -446159 -281135 -305897 -343251 -380767 -533601 -271337
$$ [...]
##END NTUPLES=NMR SPECTRUM
##END=
